##TITLE=31Pdec_LR-713_CR2
 CDCl3, 124 sc
 8.7.2020
##JCAMPDX= 6.0         $$ Bruker NMR JCAMP-DX V2.0
##DATA TYPE= NMR SPECTRUM
##DATA CLASS= NTUPLES
##ORIGIN= UXNMR, Bruker Analytische Messtechnik GmbH
##OWNER= root
$$ XWIN-NMR		Version 3.5
$$ Wed Jul  8 10:10:34 2020 Russian Standard Time (UT+4h)  she@DPX200
##.OBSERVE FREQUENCY= 81.013821
##.OBSERVE NUCLEUS= ^31P
##.ACQUISITION MODE= SIMULTANEOUS
##.ACQUISITION SCHEME= undefined
##.AVERAGES= 124
##.DIGITISER RES= 17
##SPECTROMETER/DATA SYSTEM= spect
##.PULSE SEQUENCE= zgpg30
##.SOLVENT NAME= CDCl3
##.SHIFT REFERENCE= (INTERNAL, CDCl3, 0, 182.463)
##AUDIT TRAIL= $$ (NUMBER, WHEN, WHO, WHERE, WHAT)
$$ ##TITLE= Audit trail, XWIN-NMR		Version 3.5
$$ ##JCAMPDX= 5.01
$$ ##ORIGIN= Bruker BioSpin GmbH
$$ ##OWNER= she
$$ F:/spectra/data/she/nmr/P31/1/pdata/1/auditp.txt
$$ ##AUDIT TRAIL=  $$ (NUMBER, WHEN, WHO, WHERE, WHAT)
(   1,<2020-07-08 10:09:39.07 +0400>,<she>,<DPX200>,
      <continue with go, POWCHK disabled, PULCHK disabled
       configuration hash MD5:
       00 E9 B6 7A A2 85 ED C7 34 08 36 98 17 FE 4E 26
       data hash MD5: 32K
       E1 E7 EB 0E 26 BA 26 9D 91 8F 61 93 ED A0 B8 E1>)
(   2,<2020-07-08 10:09:43.40 +0400>,<she>,<DPX200>,
      <Start of raw data processing
       efp BC_mod = 2 LB = 1 FT_mod = 6 PKNL = 1 PHC0 = -1627.98 PHC1 = -16.39803 SI = 64K 
       data hash MD5: 64K
       A0 D8 5B C8 84 E5 49 D6 C2 E4 D1 25 BC 12 49 C2>)
(   3,<2020-07-08 10:10:07.26 +0400>,<she>,<DPX200>,
      <pk PHC0 = 21.40621 PHC1 = 49 
       data hash MD5: 64K
       38 65 31 5E 84 3D AD 72 EB FB E8 46 9E 72 29 7C>)
(   4,<2020-07-08 10:10:10.34 +0400>,<she>,<DPX200>,
      <abs ABSG = 5 
       data hash MD5: 64K
       6B 5E 66 2C 03 CA BF 73 6E 39 6D C1 E2 85 0D 4B>)
$$ ##END=
$$ 
$$ hash MD5
$$ 06 8C 5A 86 FB 8B 9F 18 F7 50 F9 D9 5A 9F E4 B9
##$RELAX= 
##$RELAX= 
##$RELAX= 
##$RELAX= 
##$RELAX= 
##$RELAX= 
##$RELAX= 
##$RELAX= 
$$ Bruker specific parameters
$$ --------------------------
##$DU= <F:/spectra>
##$EXPNO= 1
##$NAME= <P31>
##$PROCNO= 1
##$TYPE= <nmr>
##$USER= <she>
##$AMP= (0..31)
100 100 100 100 100 100 100 100 100 100 100 100 100 100 100 100 100 100 
100 100 100 100 100 100 100 100 100 100 100 100 100 100 
##$AQSEQ= 0
##$AQ_mod= 1
##$AUNM= <au_zg>
##$AUTOPOS= <>
##$BF1= 81.014009
##$BF2= 200.13
##$BF3= 200.13
##$BF4= 200.13
##$BF5= 200.13
##$BF6= 200.13
##$BF7= 200.13
##$BF8= 200.13
##$BYTORDA= 1
##$CFDGTYP= 0
##$CFRGTYP= 5
##$CHEMSTR= <none>
##$CNST= (0..31)
1 1 145 1 1 1 1 1 1 1 1 1 1 1 1 1 1 1 1 1 1 1 1 1 1 1 1 1 1 1 1 1 
##$CPDPRG= <waltz16>
##$CPDPRG1= <>
##$CPDPRG2= <waltz16>
##$CPDPRG3= <>
##$CPDPRG4= <mlev>
##$CPDPRG5= <mlev>
##$CPDPRG6= <mlev>
##$CPDPRG7= <mlev>
##$CPDPRG8= <mlev>
##$CPDPRGB= <>
##$CPDPRGT= <>
##$D= (0..31)
0 1 0 0 0 0 0 0 0 0 0 0.03 2e-05 3e-06 0 0 0 0 0 0 0 0 0 0 0 0 0 0 0 0 
0 0 
##$DATE= 1594188391
##$DBL= (0..7)
120 120 120 11 120 120 24 19 
##$DBP= (0..7)
150 150 150 150 150 150 150 150 
##$DBP07= 0
##$DBPNAM0= <>
##$DBPNAM1= <>
##$DBPNAM2= <>
$$ [...]
##$SUBNAM3= <"">
##$SUBNAM4= <"">
##$SUBNAM5= <"">
##$SUBNAM6= <"">
##$SUBNAM7= <"">
##$SUBNAM8= <"">
##$SUBNAM9= <"">
##$SW= 369.568048894756
##$SWIBOX= (0..15)
0 1 3 0 0 0 0 0 0 0 0 0 0 0 0 0 
##$SW_h= 29940.119760479
##$TD= 32768
##$TD0= 1
##$TE= 0
##$TE2= 300
##$TE3= 300
##$TEG= 300
##$TL= (0..7)
0 120 53 12 22 120 120 120 
##$TP= (0..7)
150 150 150 150 150 150 150 150 
##$TP07= 0
##$TPNAME0= <>
##$TPNAME1= <>
##$TPNAME2= <>
##$TPNAME3= <>
##$TPNAME4= <>
##$TPNAME5= <>
##$TPNAME6= <>
##$TPNAME7= <>
##$TPOAL= (0..7)
0.5 0.5 0.5 0.5 0.5 0.5 0.5 0.5 
##$TPOFFS= (0..7)
0 0 0 0 0 0 0 0 
##$TUNHIN= 0
##$TUNHOUT= 0
##$TUNXOUT= 0
##$USERA1= <user>
##$USERA2= <user>
##$USERA3= <user>
##$USERA4= <user>
##$USERA5= <user>
##$V9= 5
##$VALIST= <valist>
##$VCLIST= <CCCCCCCCCCCCCCC>
##$VD= 0
##$VDLIST= <DDDDDDDDDDDDDDD>
##$VPLIST= <PPPPPPPPPPPPPPP>
##$VTLIST= <TTTTTTTTTTTTTTT>
##$WBST= 1024
##$WBSW= 4
##$XGAIN= (0..3)
0 0 0 0 
##$XL= 0
##$YL= 0
##$YMAX_a= 74073
##$YMIN_a= -8561
##$ZGOPTNS= <>
##$ZL1= 120
##$ZL2= 120
##$ZL3= 120
##$ZL4= 120
##$ABSF1= 182.463
##$ABSF2= -187.1042
##$ABSG= 5
##$ABSL= 3
##$ALPHA= 0
##$AQORDER= 0
##$ASSFAC= 0
##$ASSFACI= 0
##$ASSFACX= 0
##$ASSWID= 0
##$AUNMP= <proc_1d>
##$AZFE= 0.1
##$AZFW= 0.5
##$BCFW= 0
##$BC_mod= 2
##$BYTORDP= 0
##$COROFFS= 0
##$CY= -3
##$DATMOD= 1
##$DC= 0
##$DFILT= <>
##$DTYPP= 0
##$F1P= 0
##$F2P= 0
##$FCOR= 1
##$FTSIZE= 65536
##$FT_mod= 6
##$GAMMA= 0
##$GB= 0
##$INTBC= 1
##$INTSCL= 5.30512e-09
##$ISEN= 30
##$LB= 1
##$LEV0= 0
##$LPBIN= 0
##$MAXI= 10000
##$MC2= 0
##$MEAN= 0
##$ME_mod= 0
##$MI= 50
##$NCOEF= 0
##$NC_proc= -9
##$NLEV= 6
##$NOISF1= 182.463
##$NOISF2= 159.3651
##$NSP= 0
##$NTH_PI= 0
##$NZP= 0
##$OFFSET= 182.463
##$PC= 4
##$PHC0= -1606.574
##$PHC1= 32.60197
##$PH_mod= 1
##$PKNL= yes
##$PPARMOD= 0
##$PSCAL= 0
##$PSIGN= 0
##$REVERSE= no
##$SF= 81.0140089999434
##$SI= 65536
##$SIGF1= 159.3651
##$SIGF2= -187.1042
##$SINO= 113.3802
##$SIOLD= 16384
##$SREGLST= <1H.CDCl3>
##$SSB= 0
##$STSI= 65536
##$STSR= 0
##$SW_p= 29940.119760479
##$SYMM= 0
##$S_DEV= 0
##$TDeff= 32768
##$TDoff= 0
##$TI= <>
##$TILT= no
##$TM1= 0
##$TM2= 0
##$TOPLEV= 0
##$USERP1= <user>
##$USERP2= <user>
##$USERP3= <user>
##$USERP4= <user>
##$USERP5= <user>
##$WDW= 1
##$XDIM= 65536
##$YMAX_p= 329287513
##$YMIN_p= -154147807
$$ End of Bruker specific parameters
$$ ---------------------------------
##NTUPLES= NMR SPECTRUM
##VAR_NAME=  FREQUENCY,     SPECTRUM/REAL,   SPECTRUM/IMAG
##SYMBOL=    X,             R,               I
##VAR_TYPE=  INDEPENDENT,   DEPENDENT,       DEPENDENT
##VAR_FORM=  AFFN,          ASDF,            ASDF
##VAR_DIM=   65536,         65536,           65536
##UNITS=     HZ,            ARBITRARY UNITS, ARBITRARY UNITS
##FACTOR=    0.456856943014862, 1,           1
##FIRST=     14782.0589164792, 0,            0
##LAST=      -15158.0608439998, 0,           0
##MIN=       -15158.0608439998, -154147807,  0
##MAX=       14782.0589164792, 329287513,    0
$$ Real data points
##PAGE= N=1
##DATA TABLE= (X++(R..R)), XYDATA
$$ [...]
$$ plain form
31275 -36028185 -61818625 -61750923 -20666386 34183583 60576392 49740079 26742648
31268 26742648 9376146 -8375798 -29803594 -37445066 -16378692 18240228 34725424
31261 34725424 22640822 2507116 -3832378 461717 -1988350 -14606822 -22006798 -12537846
31253 -12537846 5527184 15208621 11309074 3597441 3745142 15635555 36354470 58957081
31245 58957081 72243537 64004156 31409692 -10489006 -35310639 -27253337 1295581
31238 1295581 19677904 12062264 -3596036 2570862 35118727 69131609 81930992
31231 81930992 74298176 57237718 35350971 14323409 9468804 28794920 55781495
31224 55781495 67419285 64444049 63763866 63626780 42775745 2954238 -13704519 26444901
$$ packed form
31275c6028185k5790440O7702M1084537N4849969K6392809j0836313k2997431
31268B6742648j7366502j7751944k1427796p641472K1066374L4618920J6485196
31261C4725424j2084602k0133706o339494M294095k450067j2618472p399976R468952
31253a2537846J8065030R681437l899547p711633J47701J1890413K0718915K2602611
31245E8957081J3286456q239381l2594464m1898698k4821633Q057302K8548918
31238A295581J8382323p615640j5658300O166898L2547865L4012882J2799383
31231H1930992p632816j7060458k1886747k1027562m854605J9326116K6986575
31224E5781495J1637790k975236o80183j37086k0851035l9821507j6658757M0149420
$$ plain form
31216 26444901 94188525 119571861 71457243 -6556680 -49548997 -42846273 -22814460
31209 -22814460 -18549737 -20912890 -13705565 -7448488 -20256353 -40407212 -36666931 -4864684
31201 -4864684 22313332 20108334 4205371 4197230 20762886 27747361 9588441 -19032384
31193 -19032384 -28974321 -3532220 45501191 82096785 75316140 33463493 -301152
31186 -301152 4310410 33098507 54345900 60966497 66282140 71663078 65020971 45695115
31178 45695115 24544493 1245494 -32331029 -65375664 -71823373 -46031744 -10420075
31171 -10420075 17787369 41914313 61608712 62949761 46404938 36913610 47729853
31164 47729853 59084337 53296721 45655909 53423219 56937432 26610937 -24926527 -54492199
$$ packed form
31216B6444901O7743624K5383336m8114618p8013923m2992317O702724K0031813
31209b2814460M264723k363153P207325O257077j2807865k0150859L740281L1802247
31201d864684K7178016k204998j5902963q141J6565656O984475j8158920k8620825
31193a9032384r941937K5442101M9033411L6595594o780645m1852647l3764645
31186c01152M611562K8788097K1247393O620597N315643N380938o642107j9325856
31178D5695115k1150622k3298999l3576523l3044635o447709K5791629L5611669
31171a0420075K8207444K4126944J9694399J341049j6544823r491328J0816243
31164D7729853J1354484n787616p640812P767310L514213l0326495n1537464k9565672
$$ plain form
31156 -54492199 -47094041 -28647270 -21090060 -19569262 -18905096 -27657527 -42571926 -39412600
31148 -39412600 -8648232 23054413 27881156 14170506 5766418 991972 -17874157
31141 -17874157 -41948543 -36989816 4673227 41296574 30418564 -14414784 -38188027
31134 -38188027 -12646880 30846283 43345922 17016416 -12692689 -15019957 5079078
31127 5079078 25175497 35769467 41616464 45847493 48504663 54553195 66852167 72647794
31119 72647794 53745281 13913676 -18254805 -21393650 -5703970 3184429 -3789148
31112 -3789148 -13371313 -10915288 3879190 20752168 28646396 20298083 -4325013 -34261768
31104 -34261768 -52345856 -50184399 -37118029 -28525347 -25058292 -11316794 19695591
$$ packed form
31156e4492199P398158J8446771P557210J520798O64166q752431j4914399L159326
31148c9412600L0764368L1702645M826743j3710650q404088m774446j8866129
31141a7874157k4074386M958727M1663043L6623347j0878010m4833348k3773243
31134c8188027K5541147M3493163J2499639k6329506k9709105k327268K0099035
31127E079078K0096419J0593970N846997M231029K657170O048532J2298972N795627
31119G2647794j8902513l9831605l2168481l138845J5689680Q888399o973577
31112c789148r582165K456025J4794478J6872978P894228q348313k4623096k9936755
31104c4261768j8084088K161457J3066370Q592682L467055J3741498L1012385
$$ plain form
31097 19695591 48358139 47071830 16580850 -10129566 -6182872 18598420 34861172
31090 34861172 31097840 19796353 12654698 7169242 -1155632 -8330729 -8856607 -3151969
31082 -3151969 6214921 17311710 24417832 18796632 -2180575 -31903111 -60605963 -77769002
31074 -77769002 -71607084 -39411062 581944 21894547 18540930 8341212 4644527
31067 4644527 1281409 -7894482 -13291071 -6253717 4330819 7755491 10735238 23762363
31059 23762363 39428169 43296695 37673760 34933777 34484947 27230316 17085832 15640654
31051 15640654 19599613 17406368 14691889 24947716 35399252 16291519 -27344669
31044 -27344669 -48326735 -19886450 26055080 48305750 55012688 77544994 106892060
$$ packed form
31097A9695591K8662548j286309l0490980k6710416L946694K4781292J6262752
31090C4861172l763332j1301487p141655n485456q324874p175097n25878N704638
31082c151969R366890J1096789P106122n621200k0977207k9722536k8702852j7163039
31074g7769002O161918L2196022L9993006K1312603l353617j0199718l696685
31067D644527l363118r175891n396589P037354J0584536L424672K979747J3027125
31059B3762363J5665806L868526n622935k739983m48830p254631j0144484j445178
31051A5640654L958959k193245k714479J0255827J0451536j9107733m3636188
31044b7344669k0982066K8440285M5941530K2250670O706938K2532306K9347066
$$ plain form
31037 106892060 101437129 54293466 9013047 -2122516 1244633 -12154382 -33378334
31030 -33378334 -29897318 1750748 30270331 34674965 29444170 36881144 53181655 57503827
31022 57503827 45945026 37299351 41954626 42234141 17460564 -21196876 -40487494 -28853566
31014 -28853566 -10443704 -10304877 -25633968 -41645332 -54882344 -63486113 -53858753 -22304732
31006 -22304732 3387529 -6664224 -39516248 -52393244 -27664612 13549983 49970935
30999 49970935 79009737 94968278 85618501 61023379 50192909 54340395 39775229
30992 39775229 -2674266 -29579569 -6493716 36626866 49657324 33831542 25457166
30985 25457166 30474294 25422918 11278048 13447636 29643720 28487647 6098413 -4005591
$$ packed form
31037A06892060n454931m7143663m5280419j1135563L367149j3399015k1223952
31030c3378334L481016L1648066K8519583M404634n230795P436974J6300511M322172
31022E7503827j1558801q645675M655275K79515k4773577l8657440j9290618J1633928
31014b8853566J8409862J38827j5329091j6011364j3237012q603769R627360L1554021
31006b2304732K5692261j0051753l2852024j2876996K4728632M1214595L6420952
30999D9970935K9038802J5958541r349777k4595122j0830470M147486j4565166
30992C9775229m2449495k6905303K3085853M3120582J3030458j5825782q374376
30985B5457166N017128n051376j4144870K169588J6196084j156073k2389234j0104004
$$ plain form
30977 -4005591 10495576 17954878 -2746870 -25906459 -21039914 2759144 19068795
30970 19068795 21687323 16632747 3761558 -10815094 -10087608 4297972 5472433 -13818477
30962 -13818477 -22183393 -2369630 13418021 -1407342 -13002572 21789214 76399282
30955 76399282 87514601 54021225 37750771 63121812 80716496 49665979 -716411
30948 -716411 -23364523 -23177769 -34728040 -58379586 -59081158 -18678581 39695188 76748782
30940 76748782 70846845 32504077 -4953209 -16748492 -12297543 -17012827 -30722475
30933 -30722475 -29242882 -10288993 -4109707 -23739529 -38074208 -19006871 12689549
30926 12689549 18488822 -2622284 -21616701 -24972187 -19969222 -7941335 13311702
$$ packed form
30977d005591J4501167P459302k0701748k3159589M866545K3799058J6309651
30970A9068795K618528n054576j2871189j4576652P27486J4385580J174461j9290910
30962a3818477q364916J9813763J5787651j4825363j1595230L4791786N4610068
30955G6399282J1115319l3493376j6270454K5371041J7594684l1050517n0382390
30948g16411k2648112J86754j1550271k3651546p01572M0402577N8373769L7053594
30940G6748782n901937l8342768l7457286j1795283M450949m715284j3709648
30933c0722475J479593J8953889O179286j9629822j4334679J9067337L1696420
30926A2689549N799273k1111106j8994417l355486N002965J2027887K1253037
$$ plain form
30919 13311702 28800158 21954177 6160578 7914083 21926538 17880559 -7364340
30912 -7364340 -20600749 -2639616 25577658 38478189 36739303 28584244 9361439
30905 9361439 -21128058 -44635578 -48125501 -42666577 -40708250 -33857354 -13625911 3765210
30897 3765210 -2619462 -26434699 -45030600 -51536441 -53319047 -49348058 -35159451 -22791489
30889 -22791489 -27521796 -38098072 -29530707 -6073953 18134 -20439021 -35756646
30882 -35756646 -22279652 -2860836 -12927723 -48240266 -73017159 -67652152 -42244937
30875 -42244937 -11015063 18881624 35433220 27252899 6613190 2852494 23463155
30868 23463155 42219569 36680479 17428395 5500761 -199120 -12162383 -24709306
$$ packed form
30919A3311702J5488456o845981j5793599J753505J4012455m045979k5244899
30912g364340j3236409J7961133K8217274J2900531j738886q155059j9222805
30905I361439l0489497k3507520l489923N458924J958327O850896K0231443J7391121
30897C765210o384672k3815237j8595901o505841j782606L970989J4188607J2367962
30889b2791489m730307j0576276Q567365K3456754O092087k0457155j5317625
30882c5756646J3476994J9418816j0066887l5312543k4776893N365007K5407215
30875d2244937L1229874K9896687J6551596q180321k0639709l760696K0610661
30868B3463155J8756414n539090j9252084j1927634n699881j1963263j2546923
$$ plain form
30861 -24709306 -20077301 1407038 20409672 26308769 23932772 12712499 -15929079
30854 -15929079 -54044814 -74827762 -68450281 -59483830 -70469445 -85637240 -74897125
30847 -74897125 -42880191 -25353862 -37265688 -52058482 -42185310 -18061028 -9930893
30840 -9930893 -24230800 -37474436 -30163066 -10081160 1474430 -4846930 -20821913
30833 -20821913 -33207346 -34434416 -24210012 -8719661 850323 -4005428 -18921235
30826 -18921235 -29028044 -26876954 -24091444 -37180083 -62705710 -75763776 -56591104
30819 -56591104 -12659119 28616577 43500160 26487409 -9437511 -40134308 -45079368
30812 -45079368 -25206203 -4423325 -5647914 -26107985 -43010985 -42539874 -34836461 -37759477
$$ packed form
30861b4709306M632005K1484339J9002634N899097k375997j1220273k8641578
30854a5929079l8115735k0782948O377481Q966451j0985615j5167795J0740115
30847g4897125L2016934J7526329j1911826j4792794R873172K4124282Q130135
30840i930893j4299907j3243636P311370K0081906J1555590o321360j5974983
30833b0821913j2385433j227070J0224404J5490351R569984m855751j4915807
30826a8921235j0106809K151090K785510j3088639k5525627j3058066J9172672
30819e6591104M3931985M1275696J4883583j7012751l5924920l0696797m945060
30812d5079368J9873165K0782878j224589k0460071j6903000M71111P703413k923016
$$ plain form
30804 -37759477 -52784899 -63683832 -58177049 -44640093 -41907473 -53825895 -62589478
30797 -62589478 -52794038 -33758235 -25706809 -28573349 -22654564 -3128638 5695847 -17193444
30789 -17193444 -56070014 -72186315 -44759300 11012818 58375805 63443881 19625228
30782 19625228 -37125935 -50543895 -2752595 56754090 62739245 9907851 -46246082
30775 -46246082 -60302388 -39118585 -9267470 23969536 64447385 94915595 88592898
30768 88592898 47231758 6045746 -4013357 12344968 25373993 15469968 -8092973
30761 -8092973 -22440378 -18808147 -8323241 -2032139 2672599 10098889 13632974 7433607
30753 7433607 1043191 7291860 22894595 36375992 46836100 56438029 53640052 28429296
$$ packed form
30804c7759477j5025422j0898933N506783J3536956K732620j1918422q763583
30797f2589478R795440J9035803Q051426k866540N918785J9525926Q824485k2889291
30789a7193444l8876570j6116301K7427015N5772118M7362987N068076m3818653
30782A9625228n6751163j3417960M7791300N9506685N985155n2831394n6153933
30775d6246082j4056306K1183803K9851115L3237006M0477849L0468210o322697
30768H8592898m1361140m1186012j0059103J6358325J3029025r904025k3562941
30761h092973j4347405L632231J0484906O291102M704738P426290L534085o199367
30753G433607o390416O248669J5602735J3481397J0460108R601929k797977k5210756
$$ plain form
30745 28429296 -1815218 -10132759 -1831055 -7830529 -34054409 -50486731 -38328866
30738 -38328866 -14920675 522218 13277397 28833331 33987888 22862419 12766786
30731 12766786 11985670 817155 -29843333 -50149243 -32709702 2571681 18381566
30724 18381566 13004043 9643664 14286952 21133365 39254908 71708292 85531014 49568282
30716 49568282 -9415167 -37166797 -30528244 -33323254 -56594498 -61079083 -29112512
30709 -29112512 1762817 -1968265 -23502807 -32405936 -27495399 -19407222 -7367608 2436853
30701 2436853 -9664522 -40044334 -52102635 -28774713 -796654 4481630 6025433
30694 6025433 26990766 45009093 27844749 -7782131 -19496000 -3829648 7489489
$$ packed form
30745B8429296l0244514q317541Q301704n999474k6223880j6432322J2157865
30738c8328866K3408191J5442893J2755179J5555934N154557j1125469j0095633
30731A2766786p81116j1168515l0660488k0305910J7439541L5281383J5809885
30724A8381566n377523l360379M643288O846413J8121543L2453384J3822722l5962732
30716D9568282n8983449k7751630O638553k795010k3271244m484585L1966571
30709b9112512L0875329l731082k1534542q903129M910537Q088177J2039614R804461
30701B436853j2101375l0379812j2058301K3327922K7978059N278284J543803
30694F025433K0965333J8018327j7164344l5626880j1713869J5666352J1319137
$$ plain form
30687 7489489 3285124 325679 2387005 -3804173 -12667840 -995307 30706465 53731632
30679 53731632 53211167 42469061 30865841 9815779 -21253565 -44825139 -51341303
30672 -51341303 -50442386 -48652703 -40686833 -29704034 -29415025 -36620923 -28412476 675760
30664 675760 23930708 20145001 2934158 -5687398 -10553721 -29803839 -59584360 -75453445
30656 -75453445 -64622837 -39636137 -20672757 -15410427 -16512487 -12629375 -1166404
30649 -1166404 9901305 15080853 20696411 32643530 41818703 36783537 25668024 25693717
30641 25693717 33369540 28441543 8127534 -9388075 -20131295 -41738883 -72938796
30634 -72938796 -78083630 -36866392 14929761 24661182 -11238008 -48673467 -53735257
$$ packed form
30687G489489m204365k959445K061326o191178q863667J1672533L1701772K3025167
30679E3731632n20465j0742106j1603220k1050062l1069344k3571574o516164
30672e1341303Q98917J789683P965870J0982799K89009p205898Q208447K9088236
30664F75760K3254948l785707j7210843q621556m866323j9250118k9780521j5869085
30656g5453445J0830608K4986700J8963380N262330j102060L883112J1462971
30649a166404J1067709N179548N615558J1947119R175173n035166j1115513K5693
30641B5693717P675823m927997k0314009j7515609j0743220k1607588l1199913
30634g2938796n144834M1217238N1796153R731421l5899190l7435459n061790
$$ plain form
30627 -53735257 -31642583 -3127079 20431193 35700565 42326799 44354893 44333041 37103444
30619 37103444 21947367 15318969 33066958 61850053 68188632 39646324 1193302
30612 1193302 -14011397 1833322 28749197 38238896 14789664 -28265784 -53874931
30605 -53874931 -37155512 2679075 22798815 10913988 -1997503 9746451 29092007
30598 29092007 25283268 1995068 -9002222 6015393 29515804 45113182 55940464
30591 55940464 62269152 47308360 6221503 -28884461 -22832787 8863168 12541397
30584 12541397 -29294030 -67164121 -49712939 4077788 30352896 6747254 -24611244
30577 -24611244 -23406962 -3285692 -704532 -20666995 -38749384 -39162426 -24961292 -1837915
$$ packed form
30627e3735257K2092674K8515504K3558272J5269372O626234K028094k1852p229597
30619C7103444j5156077o628398J7747989K8783095O338579k8542308l8453022
30612A193302j5204699J5844719K6915875R489699k3449232m3055448k5609147
30605e3874931J6719419L9834587K0119740j1884827j2911491J1743954J9345556
30598B9092007l808739k3288200j0997290J5017615K3500411J5597378J0827282
30591E5940464O328688j4960792m1086857l5105964O051674L1695955L678229
30584A2541397m1835427l7870091J7451182N3790727K6275108k3605642l1358498
30577b4611244J204282K0121270K581160j9962463j8082389m13042J4201134K3123377
$$ plain form
30569 -1837915 22563930 29899320 7893762 -24650828 -33000553 -9440028 19700291
30562 19700291 33620080 41125699 55145570 63777197 45973876 7270831 -19165797
30555 -19165797 -9735419 21591840 38094634 20644136 -11697727 -24841774 -10474030
30548 -10474030 5927922 748261 -17245582 -23955761 -17146013 -17434451 -34560403 -52676527
30540 -52676527 -53948292 -40262818 -23575606 -8144138 7070875 17206751 14183232
30533 14183232 -1488492 -17689548 -19267141 89265 30323429 50618964 49040640
30526 49040640 35405846 27623083 28881345 29341947 26836031 29741939 38196796 39236028
30518 39236028 25587999 4912688 -13730038 -26532779 -23628840 8152958 59767468
$$ packed form
30569a837915K4401845P335390k2005558l2544590q349725K3560525K9140319
30562A9700291J3919789P505619J4019871Q631627j7803321l8703045k6436628
30555a9165797R430378L1327259J6502794j7450498l2341863j3144047J4367744
30548a0474030J6401952n179661j7993843o710179O809748k88438j7125952j8116124
30540e2676527j271765J3685474J6687212J5431468J5215013J0135876l023519
30533A4183232j5671724j6201056j577593J9356406L0234164K0295535j578324
30526D9040640j3634794p782763J258262M60602k505916K905908Q454857J039232
30518C9236028j3648029k0675311j8642726j2802741K903939L1781798N1614510
$$ plain form
30511 59767468 95784799 91372670 59254620 25768575 -2699101 -29991841 -44289688
30504 -44289688 -31249021 -6221947 -3306577 -29541480 -54781766 -53005536 -31883530
30497 -31883530 -13010036 -2821476 4203758 8688553 7752868 4898969 6003083 9860684
30489 9860684 11062476 7782913 412549 -11618447 -24572336 -27844042 -15568613 2230168
30481 2230168 8436981 -1432808 -13875188 -12047239 7183801 29849042 36601008 20269794
30473 20269794 -5835726 -19196676 -8969787 16801823 43413495 61466098 65868163
30466 65868163 54845551 38095136 35944701 56631233 78736397 71294664 32244086
30459 32244086 -6610164 -16098323 1640430 25252788 39609505 38837414 18613345
$$ packed form
30511E9767468L6017331m412129l2118050l3486045k8467676k7292740j4297847
30504d4289688J3040667K5027074K915370k6234903k5240286J776230K1122006
30497c1883530J8873494J0188560P025234M484795r35685k853899J104114L857601
30489I860684J201792l279563p370364j2030996j2953889l271706J2275429J7798781
30481B230168O206813r869789j2442380J827949J9231040K2665241O751966j6331214
30473B0269794k6105520j3360950J0226889K5771610K6611672J8052603M402065
30466F5868163j1022612j6750415k150435K0686532K2105164p441733l9050578
30459C2244086l8854250r488159J7738753K3612358J4356717p72091k0224069
$$ plain form
30452 18613345 -15559298 -38459071 -24527722 19534680 56992515 60919034 39349209
30445 39349209 16501136 3482965 -3739636 -10013561 -16892754 -25062655 -30477148 -25091841
30437 -25091841 -10752854 -3832530 -14812001 -31521858 -35701595 -28931195 -28037810 -41140267
30429 -41140267 -62245338 -81870988 -87654300 -65409113 -21314097 7292260 -7961145
30422 -7961145 -41468768 -42189923 -5570399 22377247 18296404 13206237 32630511 51008938
30414 51008938 38712892 15067891 11236478 11648415 -15233647 -48596570 -38029596
30407 -38029596 10164047 30392759 -7106416 -53436184 -56014403 -28659788 -13934497
30400 -13934497 -13551527 1378861 32475308 49601426 38582154 18537428 9022422
$$ packed form
30452A8613345l4172643k2899773J3931349M4062402L7457835L926519k1569825
30445C9349209k2848073j3018171p222601o273925o879193q169901n414493N385307
30437b5091841J4338987O920324j0979471j6709857m179737O770400Q93385j3102457
30429d1140267k1105071j9625650n783312K2245187M4095016K8606357j5253405
30422g961145l3507623p21155L6619524K7947646m080843n090167J9424274J8378427
30414E1008938j2296046k3645001l831413M11937k6882062l3362923J0566974
30407c8029596M8193643K0228712l7499175m6329768k578219K7354615J4725291
30400a3934497L82970J4930388L1096447J7126118j1019272k0044726r515006
$$ plain form
30393 9022422 6569052 1128622 -3439802 3590669 20998800 33084476 26745039 9244795
30385 9244795 4058902 22280550 42323145 32642369 -3846564 -26441505 -7394048
30378 -7394048 29940188 38832373 4970776 -41243500 -62684921 -51025500 -25254749
30371 -25254749 -6131672 4154345 18408706 40428366 51613874 35131346 9882386
30364 9882386 16207691 59478180 93015029 75864706 27302786 -700341 9890214
30357 9890214 33000474 45474858 50613496 53159495 43003483 16979436 -5333762
30350 -5333762 -4108187 14438744 27068092 21337089 5084297 -6209492 -4018252 8202253
30342 8202253 20232743 26610128 31946465 40752696 45445284 33060144 3282437 -28297235
$$ packed form
30393I022422k453370n440430m568424P030471J7408131J2085676o339437j7500244
30385I244795n185893J8221648K0042595r680776l6488933k2594941J9047457
30378g394048L7334236Q892185l3861597m6214276k1441421J1659421K5770751
30371b5254749J9123077J0286017J4254361K2019660J1185508j6482528k5248960
30364I882386O325305M3270489L3536849j7150323m8561920k8003127J0590555
30357I890214K3110260J2474384N138638K545999j0156012k6024047k2313198
30350e333762J225575J8546931J2629348n731003j6252792j1293789K191240J2220505
30342H202253J2030490O377385N336337Q806231M692588j2385140k9777707l1579672
$$ plain form
30334 -28297235 -45412162 -44228554 -34077089 -31512102 -48229096 -75566352 -87308519
30327 -87308519 -70435407 -46854679 -48146098 -73025849 -89790466 -80222079 -58781436
30320 -58781436 -44163224 -34905666 -23358922 -13194449 -8153028 591206 19028480
30313 19028480 33953611 29508749 13087966 8259421 24239624 44860799 47001354
30306 47001354 22189732 -16389705 -41361732 -32180352 1647256 24324688 12091809
30299 12091809 -16514889 -20925594 12917561 56250985 70159439 44066809 -152189
30292 -152189 -32753708 -39902145 -28375703 -12205466 3659212 24110449 48304548
30285 48304548 61426818 50766518 26659685 15954959 31109838 53569523 54292924
$$ packed form
30334b8297235j7114927J183608J0151465K564987j6716994k7337256j1742167
30327h7308519J6873112K3580728j291419k4879751j6764617R568387K1440643
30320e8781436J4618212R257558J1546744J0164473N041421Q744234J8437274
30313A9028480J4925131m444862j6420783m828545J5980203K0621175K140555
30306D7001354k4811622l8579437k4972027R181380L3827608K2677432j2232879
30299A2091809k8606698m410705L3843155M3333424J3908454k6092630m4218998
30292a52189l2601519p148437J1526442J6170237J5864678K0451237K4194099
30285D8304548J3122270j0660300k4106833j0704726J5154879K2459685P23401
$$ plain form
30278 54292924 27503756 -3173899 -13631556 -7746445 -9501409 -28650878 -46225277
30271 -46225277 -41082238 -20956533 -13969487 -33721030 -66570418 -90537856 -90715073 -58369123
30263 -58369123 2010822 58660501 69841769 31036645 -12847316 -19733859 902131
30256 902131 11227465 1127531 -6505197 1845026 14027854 20403886 30011881 49231698
30248 49231698 66410578 69601138 62575409 51576369 31538624 -526711 -29981576
30241 -29981576 -37557612 -22017988 1686998 21429586 33922727 36207262 24033486
30234 24033486 686902 -19701087 -20599936 5204580 48215774 84144136 89694348
30227 89694348 63274508 27523706 6888966 5992014 13382097 19285329 20764746 14383586
$$ packed form
30278E4292924k6789168l0677655j0457657N885111j754964j9149469j7574399
30271d6225277N143039K0125705O987046j9751543l2849388k3967438j77217L2345950
30263e8369123O0379945N6649679J1181268l8805124m3883961o886543K0635990
30256I02131J0325334j0099934p632728Q350223J2182828O376032R607995J9219817
30248D9231698J7178880L190560p025729j0999040k0037745l2065335k9454865
30241b9981576p576036J5539624K3704986J9742588J2493141K284535j2173776
30234B4033486k3346584k0387989q98849K5804516M3011194L5928362N550212
30227H9694348k6419840l5750802k0634740q96952P390083N903232J479417o381160
$$ plain form
30219 14383586 -2739513 -22107321 -25716078 -7132231 15292797 16597835 -3864519
30212 -3864519 -19704556 -10048604 13853030 23898839 11831382 -2731832 -1815053 7350756
30204 7350756 5030764 -15601261 -44234883 -65232922 -64452157 -34628619 12836104 49379113
30196 49379113 57087589 48522789 44351668 41055697 22739514 -2283030 -6863091 10463107
30188 10463107 17603710 -2425329 -23005306 -12937705 18977002 41359371 44226174
30181 44226174 39390820 29820807 8298560 -17539161 -27253064 -18025529 -9685189 -12946202
30173 -12946202 -13030334 4404868 26544110 27141450 530329 -30381449 -40612826 -30345456
30165 -30345456 -20862473 -24574424 -27512794 -10624265 16989479 23870173 -1472563 -33713873
$$ packed form
30219A4383586j7123099j9367808l608757J8583847K2425028J305038k0462354
30212c864519j5840037R655952K3901634J0045809j2067457j4563214R16779R165809
30204G350756k319992k0632025k8633622k0998039P80765K9823538M7464723L6543009
30196D9379113P708476q564800m171121l295971j8316183k5022544m580061J7326198
30188A0463107P140603k0029039k0579977J0067601L1914707K2382369K866803
30181D4226174m835354r570013k1522247k5837721r713903R227535Q340340l261013
30173a2946202q4132J7435202K2139242N97340k6611121l0911778j0231377J0267370
30165c0345456R482983l711951k938370J6888529K7613744O880694k5342736l2241310
$$ plain form
30157 -33713873 -46226007 -43027542 -38416480 -25188037 9827580 51510403 69258934
30150 69258934 59945248 48260897 44580347 32921188 5927759 -17020725 -16954729 2068683
30142 2068683 25440307 41171658 35264532 452284 -41478186 -53672584 -32385143
30135 -32385143 -13230999 -16485011 -19257855 -2443870 10307613 -6871051 -32022498
30128 -32022498 -26570187 3082350 18244752 10596605 8164192 22357659 32037136 24854670
30120 24854670 16199161 17871411 20657669 18097633 18268617 22208030 18455833 8414947
30112 8414947 9251708 22148296 27107593 19961251 21821735 36563814 34489293 2453851
30104 2453851 -23176922 -7233946 25843110 22706472 -24978135 -75083909 -95187481
$$ packed form
30157c3713873j2512134L198465M611062J3228443L5015617M1682823J7748531
30150F9258934r313686j1684351l680550j1659159k6993429k2948484O5996J9023412
30142B068683K3371624J5731351n907126l4812248m1930470j2194398K1287441
30135c2385143J9154144l254012k772844J6813985J2751483j7178664k5151447
30128c2022498N452311K9652537J5162402p648147k432413J4193467R679477p182466
30120B4854670q655509J672250K786258k560036J70984L939413l752197j0040886
30112H414947Q36761J2896588M959297p146342J860484J4742079k074521l2035442
30104B453851k5630773J5942976L3077056l136638m7684607n0105774k0103572
$$ plain form
30097 -95187481 -91292230 -78132189 -56488093 -27830003 -4090345 8508896 17827699
30090 17827699 30980210 45256433 56805487 63994944 60973619 43702216 24008512
30083 24008512 21041725 35086933 44705826 33694788 7731319 -17720479 -31576869
30076 -31576869 -27069973 -3865531 23939932 35312981 23920153 2429053 -16566149
30069 -16566149 -31244894 -40699689 -40337953 -32743664 -29071016 -32696926 -33037862 -21320011
30061 -21320011 -1629433 17875923 33111072 40144356 36031031 26535521 19214551 7907782
30053 7907782 -17035316 -40905350 -32916746 6760000 34416337 16764699 -23550860
30046 -23550860 -39767336 -21826226 511630 3239046 -11173699 -31701258 -48813598
$$ packed form
30097i5187481L895251J3160041K1644096K8658090K3739658J2599241R318803
30090A7827699J3152511J4276223J1549054P189457l021325j7271403j9693704
30083B4008512k966787J4045208R618893j1011038k5963469k5451798j3856390
30076c1576869M506896K3204442K7805463J1373049j1392828k1491100j8995202
30069a6566149j4678745r454795L61736P594289L672648l625910l40936J1717851
30061b1320011J9690578J9505356J5235149P033284m113325r495510p320970j1306769
30053G907782k4943098k3870034P988604L9676746K7656337j7651638m0315559
30046b3550860j6216476J7941110K2337856K727416j4412745k0527559j7112340
$$ plain form
30039 -48813598 -48082490 -21274282 12651504 22173237 4824917 -8406618 1957973
30032 1957973 17481993 13528059 -3002909 -7596028 2271666 3700647 -16737022 -41952057
30024 -41952057 -43923796 -16440194 16505604 22932054 -7296871 -53237572 -83483502
30017 -83483502 -85966798 -75357629 -72059896 -79887602 -87295150 -84917444 -75018763 -64786666
30009 -64786666 -57211253 -51875680 -50325121 -53776084 -55166338 -41980410 -14120164 6902743
30001 6902743 -492405 -26441054 -34133655 -4489447 34328373 35755030 -10221659 -63896070
29993 -63896070 -79689909 -53659016 -21745317 -15293099 -26324245 -21879576 10048401
29986 10048401 40847429 36354677 1872746 -25641146 -26900808 -18545399 -17779161 -15489710
$$ packed form
30039d8813598P31108K6808208L3925786R521733j7348320j3231535J0364591
30032A957973J5524020l953934j6530968m593119R867694J428981k0437669k5215035
30024d1952057j971739K7483602L2945798O426450l0228925m5940701l0245930
30017h3483502k483296J0609169L297733p827706p407548K377706R898681J0232097
30009f4786666P575413N335573J550559l450963j390254J3185928K7860246K1022907
30001F902743p395148k5948649p692601K9644208L8817820J426657m5976689n3674411
29993f3896070j5793839K6030893L1913699O452218j1031146M444669L1927977
29986A0048401L0799028m492752l4481931k7513892j259662Q355409P66238K289451
$$ plain form
29978 -15489710 -501810 11992344 457736 -27863356 -45981230 -43582576 -33192431
29971 -33192431 -26719394 -26031377 -30295568 -33567736 -23895560 -4749373 -3871559 -34383334
29963 -34383334 -62170091 -48124053 -11438777 -5205525 -32121325 -38100871 -681710
29956 -681710 31473127 13809560 -28038882 -44389277 -34082533 -27424952 -27162298 -14726172
29948 -14726172 4246788 8952349 7111349 23658392 50939108 55046833 32619126
29941 32619126 18020539 27057697 34447322 20592887 3728841 5302401 12823667 1592010
29933 1592010 -25884794 -45531682 -46180123 -39634930 -40764281 -49955463 -54588311 -43685327
29925 -43685327 -22381930 -8524216 -9499709 -11099456 -942805 8747357 1234067 -13035869
$$ packed form
29978a5489710J4987900J2494154j1534608k8321092j8117874K398654J0390145
29971c3192431O473037O88017m264191l272168R672176J9146187Q77814l0511775
29963c4383334k7786757J4046038L6685276O233252k6915800n979546L7419161
29956f81710L2154837j7663567m1848442j6350395J0306744O657581K62654J2436126
29948a4726172J8972960M705561j841000J6547043K7280716M107725k2427707
29941C2619126j4598587R037158P389625j3854435j6864046J573560P521266j1231657
29933A592010k7476804j9646888o48441O545193j129351r191182m632848J0902984
29925d3685327K1303397J3857714r75493j599747J0156651R690162p513290j4269936
$$ plain form
29917 -13035869 -11951076 -1312928 -5308646 -19638689 -13564304 14815175 27521662
29910 27521662 7480336 -10883211 1664965 18972330 1710242 -39311909 -63311219
29903 -63311219 -62705028 -61956496 -65180352 -51740638 -23928577 -14409309 -34481370 -50612605
29895 -50612605 -30164156 14671188 45852190 44628219 23194065 4728257 4004456
29888 4004456 18412966 30035216 23606410 4143756 -12821828 -25054119 -40095240
29881 -40095240 -49622085 -32037927 12237623 51588534 61828108 54074080 50255360
29874 50255360 50593625 43562706 31163532 22451343 13677450 -3426862 -22239417 -30880174
29866 -30880174 -33321224 -39559454 -43121306 -33932175 -27538119 -49922574 -90972116 -105644001
$$ packed form
29917a3035869J084793J0638148l995718j4330043O074385K8379479J2706487
29910B7521662k0041326j8363547J2548176J7307365j7262088m1022151k3999310
29903f3311219O06191P48532l223856J3439714K7812061R519268k0072061j6131235
29895e0612605K0448449M4835344L1181002j223971k1434154j8465808p23801
29888D004456J4408510J1622250o428806j9462654j6965584j2232291j5041121
29881d0095240r526845J7584158M4275550L9350911J0239574p754028l818720
29874E0255360L38265p030919j2399174q712189q773893j7104312j8812555q640757
29866c0880174k441050o238230l561852R189131O394056k2384455m1049542j4671885
$$ plain form
29858 -105644001 -72604523 -23301138 2170763 1208183 -8210984 -23135143 -45766099
29851 -45766099 -58917520 -46247790 -25339695 -25023437 -36768591 -27944045 -2386706
29844 -2386706 -1882500 -34816117 -49689778 -8415646 51927051 70144902 46937782
29837 46937782 33265383 47105862 53327633 29163058 1932319 4464998 29501340
29830 29501340 50671790 60995528 65934801 59052459 31562657 -4840425 -27462110
29823 -27462110 -29812297 -24132766 -23351726 -32301003 -46971385 -50690808 -24415623 24029610
29815 24029610 55621943 44694427 14261613 3194209 10719803 4456023 -22405296
29808 -22405296 -37980295 -21191434 8489756 24006657 25794365 26039326 20988234 2557007
$$ packed form
29858a05644001L3039478M9303385K5471901r62580r419167j4924159k2630956
29851d5766099j3151421J2669730K0908095L16258j1745154Q824546K5557339
29844b386706N04206l2933617j4873661M1274132O0342697J8217851k3207120
29837D6937782j3672399J3840479O221771k4164575k7230739K532679K5036342
29830B9501340K1170450J0323738M939273o882342k7489802l6403082k2621685
29823b7462110k350187N679531P81040q949277j4670382l719423K6275185M8445233
29815B4029610L1592333j0927516l0432814j1067404P525594o263780k6861319
29808b2405296j5574999J6788861K9681190J5516901J787708K44961n051092j8431227
$$ plain form
29800 2557007 -16533290 -13786013 11129869 34250589 36839223 23697109 11485064
29793 11485064 8646030 8788987 -204648 -19937471 -35038779 -31028307 -19676608 -31934504
29785 -31934504 -76602596 -120084129 -123172138 -89333536 -58088871 -53854727 -60745567
29778 -60745567 -51375690 -23546438 1727050 9363600 6144358 8561062 21837500 35374331
29770 35374331 39115293 38888632 47043687 58875956 52372957 19043903 -18018522 -31121636
29762 -31121636 -24288752 -25074340 -44669669 -66357064 -74978673 -77268580 -84344145 -89970715
29754 -89970715 -78795536 -48025452 -11597131 12503958 15566055 6497999 8373389
29747 8373389 34643757 66274158 68664264 36966921 4774716 -3073845 -2903911 -17180978
$$ packed form
29800B557007j9090297K747277K4915882K3120720K588634j3142114j2212045
29793A1485064k839034J42957q993635j9732823j5101308M010472J1351699j2257896
29785c1934504m4668092m3481533l088009L3838602L1244665M234144o890840
29778f0745567R369877K7829252K5273488P636550l219242K416704J3276438J3536831
29770C5374331L740962k26661Q155055J1832269o502999l3329054l7062425j3103114
29762c1121636O832884p85588j9595329k1687395q621609k289907p075565n626570
29754h9970715J1175179L0770084L6428321K4101089L062097r068056J875390
29747H373389K6270368L1630401K390106l1697343l2192205p848561J69934j4277067
$$ plain form
29739 -17180978 -30148373 -11916815 25738026 37346040 7718876 -30347717 -50225601
29732 -50225601 -64509720 -85843472 -91222435 -56408289 -1490744 31726781 32683990
29725 32683990 20926390 5695632 -17585884 -38509996 -38816206 -28899254 -38177577 -62077422
29717 -62077422 -58459289 -12749210 31391850 32081921 8042149 4621031 25053487 34018822
29709 34018822 16224913 -8127773 -22530652 -31355873 -34573177 -20604319 4538845
29702 4538845 11541171 -11547344 -36211668 -30471497 -1645994 17934481 14848364 2406909
29694 2406909 -7977941 -20199482 -36809231 -47471293 -41723116 -23213226 -4117681
29687 -4117681 9295548 19653246 29446537 34710348 30185493 18801979 11130736 12371699
$$ packed form
29739a7180978j2967395J8231558L7654841J1608014k9627164l8066593j9877884
29732e0225601j4284119k1333752n378963L4814146N4917545L3217525R57209
29725C2683990j1757600j5230758k3281516k0924112l06210R916952r278323k3899845
29717f2077422L618133M5710079M4141060O90071k4039772l421118K0432456Q965335
29709C4018822j7793909k4352686j4402879q825221l217304J3968858K5143164
29702D538845P002326k3088515k4664324N740171K8825503J9580475l086117j2441455
29694B406909j0384850j2221541j6609749j0662062N748177J8509890J9095545
29687d117681J3413229J0357698R793291N263811m524855j1383514p671243J240963
$$ plain form
29679 12371699 13645873 2467025 -19210804 -34171372 -27760373 -785345 34326447
29672 34326447 61427034 64815715 39022864 1413150 -16579251 -2901606 17048630
29665 17048630 9384596 -23701982 -43363713 -22413835 17984575 30065687 -7153575
29658 -7153575 -66356690 -103160540 -98645393 -66363396 -26798393 11774639 46749037
29651 46749037 68699667 65401785 36104165 -3052914 -27319723 -18925555 16680776
29644 16680776 47844719 41981744 1920116 -33478020 -34583704 -14578742 -4129416
29637 -4129416 -7290379 -6294227 -302709 -6846282 -22865402 -18381417 16656026 47364663
29629 47364663 37840274 551104 -23043785 -19443013 -14484332 -29972282 -51582208
$$ packed form
29679A2371699J274174j1178848k1677829j4960568O410999K6975028L5111792
29672C4326447K7100587L388681k5792851l7609714j7992401J3677645J9950236
29665A7048630p664034l3086578j9661731K0949878M0398410J2081112l7219262
29658g153575n9203115l6803850M515147L2281997L9565003L8573032L4974398
29651D6749037K1950630l297882k9297620l9157079k4266809Q394168L5606331
29644A6680776L1163943n862975m0061628l5398136j105684K0004962J0449326
29637d129416l160963R96152N991518o543573j6019120M483985L5037443L0708637
29629D7364663r524389l7289170k3594889L600772M958681j5487950k1609926
$$ plain form
29622 -51582208 -47355564 -7160026 43668506 69219092 60616076 45060369 51321031
29615 51321031 72362104 77722690 59904119 45064317 52967545 71903085 84151189
29608 84151189 89877950 89913188 73015645 43338660 32723052 54770650 72107286 48167579
29600 48167579 10222099 12887017 51642981 68056676 41416189 17316633 29661846
29593 29661846 48266411 33625477 734090 -9062159 9370876 26983444 25407833
29586 25407833 8011502 -17706460 -39583717 -37259701 -7714364 18334899 13273885
29579 13273885 -6348447 -4100890 22822729 45877848 51262641 48161838 35738982
29572 35738982 1760672 -40488728 -52131262 -20950399 15983449 19927894 -2905731
$$ packed form
29622e1582208M226644M0195538N0828532K5550586q603016j5555707O260662
29615E1321031K1041073N360586j7818571j4839802P903228J8935540J2248104
29608H4151189N726761L5238j6897543k9676985j0615608K2047598J7336636k3939707
29600D8167579l7945480K664918L8755964J6413695k6640487k4099556J2345213
29593B9661846J8604565j4640934l2891387r796249J8433035J7612568j575611
29586B5407833j7396331k5717962k1877257K324016K9545337K6049263n061014
29579A3273885j9622332K247557K6923619K3055119N384793l100803j2422856
29572C5738982l3978310m2249400j1642534L1180863L6933848L944445k2833625
$$ plain form
29565 -2905731 -20288013 -17999864 -3718701 15818684 36898966 47853953 39948048
29558 39948048 25838532 26325344 38657859 37008996 8171260 -30112898 -54153849
29551 -54153849 -64053723 -76501891 -95402493 -103885739 -86811734 -51248552 -19229526
29544 -19229526 -5361747 -7661844 -17481925 -29601243 -39801139 -40241256 -25881554 -4885440
29536 -4885440 4248673 -10498856 -42207342 -70757200 -80983485 -75868857 -71937974 -79632251
29528 -79632251 -88480453 -77199630 -41884467 -7919257 -5419303 -34947939 -66708980
29521 -66708980 -74218371 -59274574 -40716156 -29258302 -22023900 -14443349 -5386039 7096828
29513 7096828 22449787 28802954 11199539 -24531561 -48289764 -38304897 -9462359
$$ packed form
29565b905731j7382282K288149J4281163J9537385K1080282J0954987p905905
29558C9948048j4109516M86812J2332515j648863k8837736l8284158k4040951
29551e4153849r899874j2448168j8900602q483246J7074005L5563182L2019026
29544a9229526J3867779k300097r820081j2119318j0199896m40117J4359702K0996114
29536d885440R134113j4747529l1708486k8549858j0226285N114628L930883p694277
29528g9632251q848202J1280823L5315163L3965210K499954k9528636l1761041
29521f6708980p509391J4943797J8558418J1457854P234402P580551R057310J2482867
29513G096828J5352959O353167j7603415l5731100k3758203R984867K8842538
$$ plain form
29506 -9462359 5374266 -2495150 -11530918 -5309487 6216475 6798905 -3972244 -19480634
29498 -19480634 -39419368 -59534751 -64361256 -49743695 -39228720 -54384980 -78203180
29491 -78203180 -74835359 -41114587 -9652135 -307394 1208529 9623264 14425597 1970027
29483 1970027 -19584238 -32971994 -32820840 -22836803 -9009971 -3752938 -15503707 -25154912
29475 -25154912 409853 56168655 89112657 63865486 12726421 -8301526 8179999
29468 8179999 25393898 22140681 10951302 4461099 -1033987 -9113209 -18107296 -30428418
29460 -30428418 -43145235 -36746750 -1006138 36460687 39982170 17720244 7822977
29453 7822977 17325485 16961526 -779315 -4419551 22356328 51706274 57435831 52912020
$$ packed form
29506i462359J4836625p869416r035768O221431J1525962N82430j0771149j5508390
29498a9480634j9938734k0115383m826505J4617561J0514975j5156260k3818200
29491g8203180L367821L3720772L1462452R344741J515923Q414735M802333j2455570
29483A970027k1554265j3387756J51154R984037J3826832N257033j1750769r651205
29475b5154912K5564765N5758802L2944002k5247171n1139065k1027947J6481525
29468H179999J7213899l253217j1189379o490203n495086q079222q994087j2321122
29460c0428418j2716817O398485L5740612L7466825L521483k2261926r897267
29453G822977R502508l63959j7740841l640236K6775879K9349946N729557m523811
$$ plain form
29445 52912020 58441221 63150526 48918720 27405605 22150882 30203656 29407763 13022042
29437 13022042 -5158258 -10798696 2606238 33183485 63451399 68475581 46573610
29430 46573610 25228099 20966347 14590962 -12445336 -38987982 -31175684 5961308
29423 5961308 35024277 36849373 26206962 21204350 23455419 28079026 31180550 26927607
29415 26927607 14437624 4985336 6814563 9377053 367431 -9701647 -862969 25118156
29407 25118156 49085319 64331457 78439224 89134431 83471180 61464093 37788803
29400 37788803 18447306 -3466848 -27602792 -42567971 -44701492 -42349349 -39959831
29393 -39959831 -34738716 -28403168 -25118171 -20094336 -7483322 6227855 16487939 37859685
$$ packed form
29445E2912020N529201M709305j4231806k1513115n254723Q052774p95893j6385721
29437A3022042j8180300n640438J3404934L0577247L0267914N024182k1901971
29430D6573610k1345511m261752o375385k7036298k6542646P812298L7136992
29423E961308K9062969J825096j0642411n002612K251069M623607L101524m252943
29415B6927607j2489983r452288J829227K562490r009622j0069078Q838678K5981125
29407B5118156K3967163J5246138J4107767J0695207n663251k2007087k3675290
29400C7788803j9341497k1914154k4135944j4965179k133521K352143K389518
29393c9959831N221115O335548L284997N023835J2611014J3711177J0260084K1371746
$$ plain form
29385 37859685 78566258 107210443 83385446 21757635 -15442112 847296 32519890
29378 32519890 35467597 15337161 -403542 -9781176 -24139043 -35463687 -29971747
29371 -29971747 -17086254 -14127511 -15219124 -3595841 16236681 25581728 21652621 15698925
29363 15698925 10548788 4990592 9658004 29186570 37139611 3795153 -51227117 -69580732
29355 -69580732 -26557089 37045849 68219149 59934965 38410132 16559963 -11906428
29348 -11906428 -42476017 -53000302 -32353338 1225956 19241672 11952275 -8593659
29341 -8593659 -27809301 -40801743 -47087178 -45613886 -41483141 -47574271 -67216945 -81535382
29333 -81535382 -70643136 -45297789 -36469177 -49236042 -51405430 -21887612 12648989
$$ packed form
29385C7859685M0706573K8644185k3824997o1627811l7199747J6289408L1672594
29378C2519890K947707k0130436j5740703r377634j4357867j1324644N491940
29371b9971747J2885493K958743j091613J1623283J9832522R345047l929107n953696
29363A5698925n150137n558196M667412J9528566P953041l3344458n5022270j8353615
29355f9580732M3023643O3602938L1173300q284184k1524833k1850169k8466391
29348a1906428l0569589j0524285K0646964L3579294J8015716p289397k0545934
29341h593659j9215642j2992442o285435J473292M130745o091130j9642674j4318437
29333h1535382J0892246K5345347Q828612j2766865k169388K9517818L4536601
$$ plain form
29326 12648989 13437767 -14030564 -29563441 -17717009 -4849868 -12033649 -21340966 -4947263
29318 -4947263 33142434 64818226 76489449 79948589 86328670 85953890 62145351 19227238
29310 19227238 -13538461 -12850842 7023361 7125715 -24934545 -51576232 -31198654 21966548
29302 21966548 50227007 25289984 -19579241 -40353521 -37010475 -36042120 -40837659 -32105822
29294 -32105822 -9651522 -170740 -17983775 -43877681 -53093028 -43816789 -25891101
29287 -25891101 -53274 33899721 60792361 62336668 41915301 20856656 11103457
29280 11103457 5192667 -6934501 -24259773 -39569622 -47280893 -44829128 -35629205 -30750893
29272 -30750893 -37439788 -46613178 -43689172 -30865732 -23740089 -25852734 -25398807 -20223045
$$ packed form
29326A2648989P88778k7468331j5532877J1846432J2867141p183781r307317J6393703
29318d947263L8089697L1675792J1671223L459140O380081l74780k3808539m2918113
29310A9227238l2765699O87619J9874203J02354l2060260k6641687K0377578N3165202
29302B1966548K8260459k4937023m4869225k0774280L343046R68355m795539Q731837
29294c2105822K2454300R480782j7813035k5893906r215347R276239J7925688
29287b5891101K5837827L3952995K6892640J544307k0421367k1058645r753199
29280A1103457n910790j2127168j7325272j5309849p711271K451765R199923M878312
29272c0750893o688895r173390K924006J2823440P125643k112645M53927N175762
$$ plain form
29264 -20223045 -23380987 -34938648 -32625674 -7021869 16436917 13517070 866798
29257 866798 11892796 45720581 70489217 70465577 58927914 46480484 28036846 5081156
29249 5081156 -7754659 -6325832 -4707372 -13603159 -30923333 -54020090 -76626495 -75071283
29241 -75071283 -30603861 29968755 52654450 26780253 -171533 4899561 12976602
29234 12976602 -15169401 -65482789 -95467572 -95405314 -85337306 -70845315 -43354514
29227 -43354514 -13217355 -2864206 -10988040 -16670368 -15317545 -19868697 -30704380 -35144493
29219 -35144493 -33485284 -35160919 -32255169 -8656284 25491563 40697683 31148968 20409815
29211 20409815 22419871 27619287 30261059 37055326 43851309 36649076 22551201 25737271
$$ packed form
29264b0223045l157942j1557661K312974K5603805K3458786k919847j2650272
29257H66798J1025998L3827785K4768636k3640j1537663j2447430j8443638k2955690
29249E081156j2835815J428827J618460q895787j7320174k3096757k2606405J555212
29241g5071283M4467422O0572616K2685695k5874197k6951786N071094Q077041
29234A2976602k8146003n0313388k9984783O2258J0068008J4491991K7490801
29227d3354514L0137159J0353149q123834n682328J352823m551152j0835683m440113
29219c5144493J659209j675635K905750K3598885L4147847J5206120r548715j0739153
29211B0409815K010056N199416K641772O794267O795983p202233j4097875L186070
$$ plain form
29203 25737271 43318658 41095683 8178121 -19191635 -9287385 20216249 33043175
29196 33043175 24062519 12774002 8840324 10282276 18694536 31200012 31660049 13173052
29188 13173052 -4218281 -981425 10252776 4680019 -15145703 -26445191 -24435207
29181 -24435207 -24857802 -30722495 -24690589 -19502 24034193 28839697 23260463 30086325
29173 30086325 51018045 58567011 29984459 -15614639 -30164767 2707436 35558700
29166 35558700 11563895 -55236542 -89885016 -54556155 1423488 12010816 -19145859
29159 -19145859 -38152276 -22850331 -1180626 3932418 3590528 10245061 12453540 -1741496
29151 -1741496 -20165102 -21636290 -1358840 30141874 61292389 82932862 87556327
$$ packed form
29203B5737271J7581387k222975l2917562k7369756R904250K9503634J2826926
29196C3043175q980656j1288517l933678J441952Q412260J2505476M60037j8486997
29188A3173052j7391333L236856J1234201n572757j9825722j1299488K009984
29181b4435207m22595n864693O031906K4671087K4053695M805504n579234O825862
29173C0086325K0931720P548966k8582552m5599098j4550128L2872203L2851264
29166C5558700k3994805o6800437l4648474L5328861N5979643J0587328l1156675
29159a9145859j9006417J5301945K1669705N113044l41890O654533K208479j4195036
29151a741496j8423606j471188K0277450L1500714L1150515K1640473M623465
$$ plain form
29144 87556327 74390402 49688897 18239024 -17565889 -47809520 -56210819 -39533509
29137 -39533509 -17966640 -16053347 -35806810 -56565227 -60513440 -49827759 -35386877
29130 -35386877 -17336551 11396739 43886259 57601002 42941438 20623187 16524550
29123 16524550 29508470 42053435 52650791 71711583 89886440 82335960 49411329
29116 49411329 21980000 16026125 12552262 -3226938 -14975274 -8659444 -1901544 -11549228
29108 -11549228 -18574009 920551 30587473 36670923 21136579 13831367 20646237 17971454
29100 17971454 -3523450 -24849377 -30235441 -22919916 -8987817 5645512 2396731
29093 2396731 -34595938 -86056764 -109032734 -87220833 -46655943 -18779539 -12169059
$$ packed form
29144H7556327j3165925k4701505l1449873l5804913l0243631q401299J6677310
29137c9533509K1566869J913293j9753463k0758417l948213J0685681J4440882
29130c5386877J8050326K8733290L2489520J3714743j4659564k2318251m098637
29123A6524550J2983920J2544965J0597356J9060792J8174857p550480l2924631
29116D9411329k7431329n953875l473863j5779200j1748336O315830O757900r647684
29108a1549228p024781J9494560K9666922O083450j5534344p305212O814870k674783
29100A7971454k1494904k1325927n386064P315525J3932099J4633329l248781
29093B396731l6992669n1460826k2975970K1811901M0564890K7876404O610480
$$ plain form
29086 -12169059 -22149456 -41435652 -56791903 -59188598 -59584500 -71055234 -77974136 -53528703
29078 -53528703 -7149200 21404327 19544953 15006897 21967941 15218819 -21929200 -59917566
29070 -59917566 -59723959 -21697192 25362770 60326727 73348817 57854487 24895557
29063 24895557 7010377 22777809 50795344 58354610 41494107 19285844 5368635
29056 5368635 3949718 17340726 37633777 45485562 34613572 21972509 18740845 12359579
29048 12359579 -4372348 -11490394 5005367 21542944 10363732 -14639583 -21745230
29041 -21745230 -16763856 -32943236 -69929452 -85576646 -57292510 -16113126 -2735630
29034 -2735630 -14646368 -17885749 1889369 21632583 15609584 -5993476 -6994887 24607172
$$ packed form
29086a2169059r980397j9286196j5356251k396695l95902j1470734o918902K4445433
29078e3528703M6379503K8553527j859374m538056O961044o749122l7148019l7988366
29070e9917566J93607L8026767M7059962L4963957J3022090j5494330l2958930
29063B4895557j7885180J5767432K8017535P559266j6860503k2208263j3917209
29056E368635j418917J3391008K0293051P851785j0871990j2641063l231664o381266
29048A2359579j6731927p118046J6495761J6537577j1179212k5003315p105647
29041b1745230M981374j6179380l6986216j5647194K8284136M1179384J3377496
29034b735630j1910738l239381J9775118J9743214o022999k1603060j001411L1602059
$$ plain form
29026 24607172 54767853 52190758 45575222 93045614 189922640 252702275 220192130
29019 220192130 131715086 68491713 50453786 38257544 13163780 -3323377 -2901339
29012 -2901339 -6636816 -19757213 -18846815 1231063 9563304 -12535563 -40421127 -43921816
29004 -43921816 -26617810 -6995305 11405139 26717973 19958023 -20298706 -67480780
28997 -67480780 -79597258 -49298741 -11435823 -1410764 -21042690 -46597497 -58564100
28990 -58564100 -58108702 -58205828 -64244273 -68189060 -61286444 -43456327 -16530408 18542558
28982 18542558 48586554 49214436 17155109 -13509825 -12049402 4485547 -1895214 -28045685
28974 -28045685 -32796653 -2363703 27931205 27678338 10018558 201899 -723162 -71151
$$ packed form
29026B4607172L0160681k577095o615536M7470392R6877026O2779635l2510145
29019B20192130q8477044o3223373j8037927j2196242k5093764j6487157M22038
29012b901339l735477j3120397R10398K0077878Q332241k2098867k7885564l500689
29004d3921816J7304006J9622505J8400444J5312834o759950m0256729m7182074
28997f7480780j2116478L0298517L7862918J0025059j9631926k5554807j1966603
28990e8564100M55398r7126o038445l944787O902616J7830117K6925919L5072966
28982A8542558L0043996O27882l2059327l0664934J460423J6534949o380761k6150471
28974b8045685m750968L0432950L0294908k52867j7659780r816659r25061O52011
$$ plain form
28966 -71151 8829774 28394889 39513127 26783797 2305946 -15898163 -28312428 -36286313
28958 -36286313 -24814957 9457964 35310502 24982698 -1922041 -7565444 5291430
28951 5291430 3350526 -16502427 -21076800 1731737 23215207 24763528 28623131 54530091
28943 54530091 78042998 64161528 22757945 -3334395 3126700 18986673 22915787
28936 22915787 20039052 15349167 -6719038 -52122591 -85676962 -63400808 4037443
28929 4037443 51112666 33474267 -19120984 -45149367 -28283892 -5108811 -5860778
28922 -5860778 -20418465 -27066604 -24636525 -21220326 -13156797 4783677 20583630 14904850
28914 14904850 -14678959 -50567196 -71229460 -63722726 -30058867 9481393 29029090
$$ packed form
28966g1151Q900925J9565115J1118238j2729330k4477851j8204109j2414265p973885
28958c6286313J1471356L4272921K5852538j0327804k6904739n643403J2856874
28951E291430j940904j9852953m574373K2808537K1483470J548321L859603K5906960
28943E4530091K3512907j3881470m1403583k6092340O461095J5859973L929114
28936B2915787k876735m689885k2068205m5403553l3554371K2276154O7438251
28929D037443M7075223j7638399n2595251k6028383J6865475K3175081p51967
28922e860778j4557687o648139K430079L416199Q063529J7940474J5799953n678780
28914A4904850k9583809l5888237k0662264P506734L3663859L9540260J9547697
$$ plain form
28907 29029090 23547915 14035022 17765875 25599912 20592806 4927087 -9175096 -22710946
28899 -22710946 -40942088 -49610377 -28971354 7255829 16277546 -18610184 -60590749
28892 -60590749 -65175324 -37091448 -19116043 -32734487 -54981736 -55789179 -34594978
28885 -34594978 -9186339 11962408 27480482 27312244 5308701 -17033170 -9286374
28878 -9286374 20470412 28575806 1238501 -15466818 19909344 76325627 88241850
28871 88241850 47097233 7842253 6126521 17953067 12792637 395428 1727925
28864 1727925 11229676 16100228 22742626 34785446 31459508 -388325 -34913997 -40758293
28856 -40758293 -27274686 -23685592 -28798233 -18800197 6300075 23321682 28111884 38758090
$$ packed form
28907B9029090n481175r512893L730853P834037n007106j5665719j4102183j3535850
28899b2710946j8231142q668289K0639023L6227183R021717l4887730m1980565
28892f0590749m584575K8083876J7975405j3618444k2247249q07443K1194201
28885c4594978K5408639K1148747J5518074j68238k2003543k2341871P746796
28878i286374K9756786Q105394k7337305j6705319L5376162N6416283J1916223
28871H8241850m1144617l9254980j715732J1826546n160430j2397209J332497
28864A727925R501751M870552O642398J2042820l325938l1847833l4525672n844296
28856d0758293J3483607L589094n112641R998036K5100272J7021607M790202J0646206
$$ plain form
28848 38758090 55918695 56611207 34537711 14878140 18304847 35520495 47519316
28841 47519316 49426844 44733619 34491740 21340210 10325404 867104 -10068501
28834 -10068501 -18074763 -19634914 -25419719 -44596793 -60178582 -45362354 -3472857
28827 -3472857 35127390 55995484 70013042 77275272 58699432 17523571 -6330317
28820 -6330317 11778352 41132262 36388737 1005110 -20311706 -4996956 19605034
28813 19605034 14817954 -22047773 -56507844 -54556134 -15411321 32230155 63039613
28806 63039613 77935899 91564471 107267247 115373941 108104604 82774975 39752135
28799 39752135 -5571827 -20963300 6729431 42593970 41496255 9531923 -7467903
$$ packed form
28848C8758090J7160605O92512k2073496j9659571L426707J7215648J1998821
28841D7519316J907528m693225j0241879j3151530j1014806r458300j0935605
28834a0068501q006262j560151n784805j9177074j5581789J4816228M1889497
28827c472857L8600247K0868094J4017558P262230j8575840m1175861k3853888
28820f330317J8108669K9353910m743525l5383627k1316816J5314750K4601990
28813A9605034m787080l6865727l4460071J951710L9144813M7641476L0809458
28806F3039613J4896286J3628572J5702776Q106694p269337k5329629m3022840
28799C9752135m5323962j5391473K7692731L5864539j097715l1964332j6999826
$$ plain form
28792 -7467903 6454556 22284299 24425355 34640354 61397198 74856504 59981793
28785 59981793 49349648 68173109 88738002 81827365 73901162 99677495 129603846
28778 129603846 109023755 53013661 33816984 73430680 113200040 103620665 66296071
28771 66296071 42843513 32191609 12065506 -13775350 -25730236 -22319098 -12831750
28764 -12831750 6359985 39390550 67199877 63380107 29029149 -7536763 -21995338
28757 -21995338 -11343865 12875731 34482142 41120385 34657775 28558604 27609369 19856985
28749 19856985 -2213721 -24832166 -30946743 -24645938 -21802770 -25030090 -26081993 -26957114
28741 -26957114 -37273147 -51291907 -49625084 -29740579 -14687449 -19343450 -24260148
$$ packed form
28792g467903J3922459J5829743K141056J0214999K6756844J3459306j4874711
28785E9981793j0632145J8823461K0564893o910637p926203K5776333K9926351
28778A29603846k0580091n6010094j9196677L9613696L9769360r579375l7324594
28771F6296071k3452558j0651904k0126103k5840856j1954886L411138R487348
28764a2831750J9191735L3030565K7809327l819770l4350958l6565912j4458575
28757b1995338J0651473K4219596K1606411O638243o462610o099171r49235p752384
28749A9856985k2070706k2618445o114577O300805K843168l227320j051903q75121
28741b6957114j0316033j4018760J666823J9884505J5053130m656001m916698
$$ plain form
28734 -24260148 -1720924 40603186 64039022 48873127 20254781 14166418 32420583
28727 32420583 47291342 41738954 24707332 7783194 -11443723 -35046179 -52047331
28720 -52047331 -53293134 -46490128 -42545215 -37313132 -22354774 -5215603 -955270 -8355593
28712 -8355593 -12982429 -11678056 -14961662 -24378582 -26978321 -17133009 -6112605 -2459384
28704 -2459384 1228484 11690901 18243987 5497826 -24109573 -50850100 -57006843 -39629833
28696 -39629833 -9590263 15469113 21504152 8086827 -12012283 -23916870 -19511890
28689 -19511890 631646 26112837 40098458 34897222 23887714 26783108 43763536
28682 43763536 57472146 59409458 56204390 48111122 24581760 -9509040 -27025259
$$ packed form
28734b4260148K2539224M2324110K3435836j5165895k8618346o088363J8254165
28727C2420583J4870759n552388j7031622j6924138j9226917k3602456j7001152
28720e2047331j245803O803006L944913N232083J4958358J7139171M260333p400323
28712h355593m626836J304373l283606r416920k599739R845312J1020404L653221
28704b459384L687868J0462417O553086j2746161k9607399k6740527o156743J7377010
28696c9629833L0039570K5059376O035039j3417325k0099110j1904587M404980
28689a9511890K0143536K5481191J3985621n201236j1009508K895394J6980428
28682D3763536J3708610J937312l205068q093268k3529362l4090800j7516219
$$ plain form
28675 -27025259 -15484353 -1244085 -13765709 -39856736 -41100882 -10968372 14043224
28668 14043224 3866971 -28348076 -48135419 -40982031 -20164355 -4485711 106752
28661 106752 1002429 8463823 23609552 35610212 34404673 25145662 22943250 32882933
28653 32882933 43601442 43181709 33436226 24204112 20429127 20804384 24305708 30700977
28645 30700977 35639521 31718598 17364172 2082606 -1251010 8957779 18557308 11633325
28637 11633325 -11698700 -35759863 -47007938 -45143331 -36468533 -25646455 -18282397
28630 -18282397 -21975305 -36410358 -49181935 -50200286 -44339090 -40877823 -37370129 -25943518
28622 -25943518 -10096944 -1064840 -622110 -2559597 -9443377 -30233040 -58770981 -72603182
$$ packed form
28675b7025259J1540906J4240268j2521624k6091027j244146L0132510K5011596
28668A4043224j0176253l2215047j9787343P153388K0817676J5678644M592463
28661A06752Q95677P461394J5145729J2000660j205539r259011k202412R939683
28653C2882933J0718509m19733r745483r232114l774985L75257L501324O395269
28645C0700977M938544l920923j4354426j5281566l333616J0208789R599529o923983
28637A1633325k3332025k4061163j1248075J864607Q674798J0822078P364058
28630a8282397l692908j4435053j2771577j018351N861196L461267L507694J1426611
28622b5943518J5846574R032104M42730j937487o883780k0789663k8537941j3832201
$$ plain form
28614 -72603182 -60799429 -38676336 -26215784 -24162734 -20939989 -12210736 -2681212 3353918
28606 3353918 3596534 -2471013 -6757489 5086621 33301528 54489289 46108204 15236554
28598 15236554 -10304278 -15701105 -10994349 -12027337 -23105124 -38126153 -46826374 -39728395
28590 -39728395 -17968326 1867181 3678365 -7517195 -11976233 -1782182 11104932
28583 11104932 13274674 3185948 -14480385 -33242574 -41776861 -32336960 -16002743
28576 -16002743 -13102331 -23507644 -25004370 -8911143 3901725 -3665476 -16329728
28569 -16329728 -11690292 2599990 2715854 -10678581 -14266477 -2103443 3732019 -12870792
28561 -12870792 -39905053 -56178802 -54195361 -37457628 -12202837 9799607 15070961
$$ packed form
28614g2603182J1803753K2123093J2460552K053050L222745Q729253R529524O035130
28606C353918K42616o067547m286476J1844110K8214907K1187761q381085l0871650
28598A5236554k5540832n396827M706756j032988j1077787j5021029q700221P097979
28590c9728395K1760069J9835507J811184j1195560m459038J0194051J2887114
28583A1104932K169742j0088726j7666333j8762189q534287R439901J6334217
28576a6002743K900412j0405313j496726J6093227J2812868p567201j2664252
28569a6329728M639436J4290282J15864j3394435l587896J2163034N835462j6602811
28561a2870792k7034261j6273749J983441J6737733K5254791K2002444N271354
$$ plain form
28554 15070961 4124235 -8022936 -12560325 -14673148 -15795023 -6269984 13344057 20935124
28546 20935124 -222420 -34410776 -51087102 -43119640 -30926355 -31880674 -41283012 -44354519
28538 -44354519 -34705098 -17761230 -3082231 4437728 7923762 10582553 4038066 -25190245
28530 -25190245 -71093666 -102052624 -93431515 -59726176 -38489132 -44486192 -55595597
28523 -55595597 -46108515 -19184347 1238853 1799205 -6119716 -1945092 19626663 42261062
28515 42261062 46299163 29812916 5933614 -17121102 -40589686 -58748499 -56446910
28508 -56446910 -33816190 -16236433 -21158727 -27864882 -4428325 41851827 68876650
28501 68876650 56530620 31351656 23936074 26064738 9686037 -26568054 -53242831
$$ packed form
28554A5070961j0946726j2147171m537389k112823j121875R525039J9614041P591067
28546B0935124k1157544l4188356j6676326P967462J2193285r54319r402338l071507
28538d4354519R649421J6943868J4678999P519959L486034K658791o544487k9228311
28530b5190245m5903421l0958958Q621109L3705339K1237044n997060j1109405
28523e5595597R487082K6924168K0423200N60352p918921M174624K1571755K2634399
28515D2261062M038101j6486247k3879302k3054716k3468584j8158813K301589
28508e6446910K2630720J7579757m922294o706155K3436557M6280152K7024823
28501F8876650j2346030k5178964p415582K128664j6378701l6254091k6674777
$$ plain form
28494 -53242831 -49468868 -27512786 -13241585 -14216437 -15942996 -5438743 11116874 18271444
28486 18271444 13147879 8077105 11186811 15646114 14324896 14398051 25926073 43240673
28478 43240673 51588146 48581059 44841226 44674897 40836560 30678985 24590674 33169202
28470 33169202 53524678 71124103 70625136 46828948 10894813 -18050382 -32906144
28463 -32906144 -42112511 -47278018 -34523016 -4235993 10550976 -14869185 -51384470
28456 -51384470 -49818289 -14500943 1579987 -20444289 -36948557 -14657905 16977351
28449 16977351 19478942 9082063 20475089 37464510 16126752 -35816174 -60368054
28442 -60368054 -34366546 -2448769 -8947088 -39031307 -52223038 -42150192 -32060982
$$ packed form
28494e3242831L773963K1956082J4271201r74852j726559J0504253J6555617P154570
28486A8271444n123565n070774L109706M459303j321218P3155J1528022J7314600
28478D3240673Q347473l007087l739833j66329l838337j0157575o088311Q578528
28470C3169202K0355476J7599425m98967k3796188l5934135k8945195j4855762
28463c2906144r206367n165507J2755002L0287023J4786969k5420161l6515285
28456e1384470J566181L5317346J6080930k2024276j6504268K2290652L1635256
28449A6977351K501591j0396879J1393026J6989421k1337758n1942926k4551880
28442f0368054K6001508L1917777o498319l0084219j3191731J0072846J0089210
$$ plain form
28435 -32060982 -30673184 -24842421 -9382729 3647643 7445718 10623596 17562823 15317455
28427 15317455 -6447758 -31840633 -33614536 -13372149 -7891432 -41129888 -83140877
28420 -83140877 -81136062 -29773536 17043410 14421930 -18781945 -32453709 -11765087
28413 -11765087 15726919 27308458 28286786 29081265 27716205 22451158 20505722 24992593
28405 24992593 28974109 30063570 36352636 50244714 60448009 58923183 52930018 50101436
28397 50101436 43804447 26810401 10297611 12309651 29963058 40012051 30971886
28390 30971886 20007095 27378914 44222226 42915933 18636535 1015404 14277260
28383 14277260 41991948 50054505 34447798 21888273 26327537 32905277 30051570 28535523
$$ packed form
28435c2060982J387798N830763J5459692J3030372L798075L177878O939227k245368
28427A5317455k1765213k5392875j773903K0242387N480717l3238456m2010989
28420h3140877K004815N1362526M6816946k621480l3203875j3671764K0688622
28413a1765087K7492006J1581539R78328P94479j365060n265047j945436M486871
28405B4992593L981516J089461O289066J3892078J0203295j524826n993165k828582
28397E0101436o296989j6994046j6512790K012040J7653407J0048993r040165
28390C0971886j0964791P371819J6843312j306293k4279398j7621131J3261856
28383A4277260K7714688Q062557j5606707j2559525M439264O577740k853707j516047
$$ plain form
28375 28535523 35425374 35887423 20282801 6101561 9699688 17064811 9797628 974947
28367 974947 11609620 25419001 6721606 -40064495 -67817061 -49228218 -8717339
28360 -8717339 17188629 22224663 21502407 24758925 31302714 33830129 19767465 -13906621
28352 -13906621 -44789067 -45809992 -23652805 -10590796 -16085531 -18942150 -13695731 -24732419
28344 -24732419 -56000770 -66659457 -28497928 23267751 34540564 6651865 -13693252
28337 -13693252 -5895296 4555425 -4808774 -22999187 -31826746 -31818635 -29175028 -18987784
28329 -18987784 3838612 29536618 40851549 29821917 3120572 -23386751 -34774087
28322 -34774087 -28959997 -18320070 -13012089 -6163181 14426368 42081936 51103211 24416495
$$ packed form
28375B8535523O889851M62049j5604622j4181240L598127P365123p267183q822681
28367I74947J0634673J3809381j8697395m6786101k7752566J8588843M0510879
28360h717339K5905968N036034p22256L256518O543789K527415j4062664l3674086
28352a3906621l0882446j020925K2157187J3062009n494735k856619N246419j1036688
28344b4732419l1268351j0658687L8161529N1765679J1272813k7888699k0345117
28337a3693252P797956J0450721r364199j8190413q827559Q111K643607J0187244
28329a8987784K2826396K5698006J1314931j1029632k6701345k6507323j1387336
28322c4774087N814090J0639927N307981O848908K0589549K7655568R021275k6686716
$$ plain form
28314 24416495 -24889515 -61995498 -59017602 -19507284 22004149 31106644 9262995
28307 9262995 -8928307 624774 22679686 28265622 16099556 9554813 19038561 29283990
28299 29283990 25529947 13611056 8369120 16443291 36686078 64812612 89416535
28292 89416535 93522929 70375521 32825111 -455322 -23718690 -41956353 -54932580
28285 -54932580 -54994081 -41749315 -27268857 -19797471 -11515598 6276337 23306488 23669632
28277 23669632 16752925 29941887 62362144 73583295 39359806 -5928258 -14343489
28270 -14343489 6500155 10542529 -10488238 -18463622 -1029143 2015546 -32594156
28263 -32594156 -64807762 -50063682 -8368505 9223877 -1654114 -1522382 25187488
$$ packed form
28314B4416495m9306010l7105983K977896L9510318M1511433R102495k1843649
28307I262995j8191302R553081K2054912N585936j2166066o544743R483748J0245429
28299B9283990l754043j1918891n241936Q074171K0242787K8126534K4603923
28292H9416535M106394k3147408l7550410l3280433k3263368j8237663j2976227
28285e4932580o1501J3244766J4480458P471386Q281873J7791935J7030151L63144
28277B3669632o916707J3188962L2420257J1221151l4223489m5288064q415231
28270a4343489K0843644M042374k1030767p975384J7434479L044689l4609702
28263c2594156l2213606J4744080M1695177J7592382j0877991J31732K6709870
$$ plain form
28256 25187488 51467825 55827387 49096572 46492160 43950518 31955783 11783847 -8131845
28248 -8131845 -16699034 -2079155 33839265 66114082 70318760 51734325 33265488
28241 33265488 21898830 9744941 1384603 12355823 40632308 64153023 68006750
28234 68006750 53757994 25487327 -9219258 -27988617 -11740528 24451576 44205629
28227 44205629 34755926 14603388 -1414910 -14803682 -20810688 -6579668 21779525
28220 21779525 41252397 47996290 59935693 75987123 68437326 30201025 -4871918
28213 -4871918 -8834725 3380512 5482642 -32528 1239041 2928278 -8393134 -22515112
28205 -22515112 -16162141 13670068 46417329 60430358 45906949 7751023 -31587035
$$ packed form
28256B5187488K6280337M359562o730815k604412k541642j1994735k0171936j9915692
28248h131845q567189J4619879L5918420L2274817M204678j8584435j8468837
28241C3265488j1366658j2153889q360338J0971220K8276485K3520715L853727
28234F8006750j4248756k8270667l4706585j8769359J6248089L6192104J9754053
28227D4205629r449703k0152538j6018298j3388772o007006J4231020K8359193
28220B1779525J9472872O743893J1939403J6051430p549797l8236301l5072943
28213d871918l962807J2215237K102130n515170J271569J689237j1321412j4121978
28205b2515112O352971K9832209L2747261J4013029j4523409l8155926l9338058
$$ plain form
28198 -31587035 -45830775 -34141393 -23102363 -29883037 -41201850 -39112772 -25780772
28191 -25780772 -8659169 15994018 47099742 67508449 67196529 57590691 46374343
28184 46374343 22777630 -12034220 -28053148 -8100153 17880782 12339951 -15704136
28177 -15704136 -28984724 -17597957 -2408252 2949963 -615495 -15992042 -40952971
28170 -40952971 -51283129 -27292510 11551846 31438805 32534753 36736970 39866299
28163 39866299 19553955 -16029255 -34022444 -31175524 -35893899 -52244976 -49645787
28156 -49645787 -18369087 11431907 21262355 29407917 44683106 40486867 4120911
28149 4120911 -27152772 -14833975 25047392 49436858 47795613 39864484 33901401 23600832
$$ packed form
28198c1587035j4243740J1689382J1039030o780674j1318813K089078J3332000
28191b5780772J7121603K4653187L1105724K0408707l11920r605838j1216348
28184D6374343k3596713l4811850j6018928J9952995K5980935n540831k8044087
28177a5704136j3280588J1386767J5189705N358215l565458j5376547k4960929
28170d0952971j0330158K3990619L8844356J9886959J095948M202217L129329
28163C9866299k0312344l5583210j7993189K846920m718375j6351077K599189
28156d9645787L1276700K9800994R830448Q145562J5275189m196239l6365956
28149D120911l1273683J2318797L9881367K4389466j641245p931129n963083j0300569
$$ plain form
28141 23600832 14357450 18144089 27979317 26554162 16277481 14867795 24191157 27960942
28133 27960942 19408652 9053469 4530887 2582345 2248109 7580799 14714774 12788523
28125 12788523 1671073 -5055636 1061642 13221896 21915626 26376659 27411892 17489336
28117 17489336 -12729473 -59167409 -102042758 -122609923 -120996373 -112179420 -102388309
28110 -102388309 -78422163 -30423733 21605424 41407865 17996787 -22382535 -49779534
28103 -49779534 -59399520 -59704297 -49746888 -24342148 7605606 26270105 22081984 6217959
28095 6217959 504941 17723040 46796777 59372076 41198595 14370047 12626750
28088 12626750 35586198 49132577 35273770 16376054 18666077 36571242 50799775
$$ packed form
28141B3600832r243382L786639R835228j425155j0276681j409686R323362L769785
28133B7960942q552290j0355183m522582j948542l34236N332690P133975j926251
28125A2788523j1117450o726709O117278J2160254Q693730M461033J035233r922556
28117A7489336l0218809m6437936m2875349k0567165J613550Q816953R791111
28110a02388309K3966146M7998430N2029157J9802441k3411078m0379322k7396999
28103d9779534r619986l04777R957409K5404740L1947754J8664499m188121j5864025
28095F217959n713018J7218099K9073737J2575299j8173481k6828548j743297
28088A2626750K2959448J3546379j3858807j8897716K290023J7905165J4228533
$$ plain form
28081 50799775 59462256 68651986 70174974 54625533 34526333 28852674 32667498 26563451
28073 26563451 10385900 2888907 9546781 13195997 -989047 -27799334 -50614824
28066 -50614824 -55551319 -39203497 -13278748 2845836 2886094 -1934225 -6091857 -18401413
28058 -18401413 -33478313 -20124673 33939171 86778916 87984193 46533364 14761993
28051 14761993 14287460 20239681 14237050 5355233 -5735672 -34656849 -71753281 -78284854
28043 -78284854 -44635178 -11808540 -11669177 -24169290 -20624782 -11617422 -18235271 -28699575
28035 -28699575 -22097627 -8725214 -6959275 -3106960 22142250 45419879 27302991
28028 27302991 -20850933 -44505779 -21707729 11404747 16626384 -3908082 -30885531
$$ packed form
28081E0799775Q662481R189730J522988j5549441k0099200n673659L814824o104047
28073B6563451j6177551p496993O657874L649216j4185044k6810287k2815490
28066e0614824m936495J6347822K5924749J6124584M0258m820319m157632j2309556
28058a8401413j5076900J3353640N4063844N2839745J205277m1450829l1771371
28051A4761993m74533N952221o002631q881817j1090905k8921177l7096432o531573
28043g8284854L3649676L2826638J39363j2500113L544508R007360o617849j0464304
28035b8699575O601948J3372413J765939L852315K5249210K3277629j8116888
28028B7302991m8153924k3654846K2798050L3112476N221637k0534466k6977449
$$ plain form
28021 -30885531 -56802173 -76457785 -78410812 -63539163 -49965699 -45384653 -34852595
28014 -34852595 -8813297 17164029 25381529 21517108 21921043 28441509 29393803 16437795
28006 16437795 -8306744 -33249309 -41848900 -28900576 -14622680 -25637047 -58001146
27999 -58001146 -78139823 -66062044 -37155265 -14399661 -2348410 1168824 -7303357
27992 -7303357 -21930463 -23134002 -5547603 10520222 12210147 14541996 27751303 31915791
27984 31915791 12734038 -3449443 12673232 41242530 41690740 19404279 15770445
27977 15770445 36245225 39389246 5166221 -33404330 -43150408 -33892066 -27966988 -23470340
27969 -23470340 -12625553 -4878256 -4373616 7809998 39706018 61520462 45203750
$$ packed form
28021c0885531k5916642j9655612j953027J4871649J3573464M581046J0532058
28014c4852595K6039298K5977326Q217500l864421M03935O520466R52294j2956008
28006A6437795k4744539k4942565q599591J2948324J4277896j1014367l2364099
27999e8001146k0138677J2077779K8906779K2755604J2051251L517234q472181
27992g303357j4627106j203539J7586399J6067825J689925K331849J3209307M164488
27984C1915791j9181753j6183481J6122675K8569298M48210k2286461l633834
27977A5770445K0474780L144021l4223025l8570551r746078R258342N925078M496648
27969b3470340J0844787P747297N04640J2183614L1896020K1814444j6316712
$$ plain form
27962 45203750 11053211 232946 16105830 29643258 32591010 44158431 65097537
27955 65097537 65810868 32840925 -3610386 -6679222 22095477 50872367 57298367 45069245
27947 45069245 28098412 11998432 -6950503 -29570130 -45855428 -45540002 -36081631
27940 -36081631 -37725942 -54955355 -67844341 -62762335 -54169277 -57582296 -58364288 -34616582
27932 -34616582 995317 14678381 1351862 -12431751 -13796383 -15852891 -22144876
27925 -22144876 -18613027 -11229553 -29868201 -74243784 -95248147 -60358058 -5653001
27918 -5653001 12669728 -6601756 -21602499 -14780858 -5019265 -1999581 7541695 26067962
27910 26067962 35012340 25312773 8638982 -7193514 -25821051 -40371275 -33879854
$$ packed form
27962D5203750l4150539j0820265J5872884J3537428K947752J1567421K0939106
27955F5097537P13331l2969943l6451311l068836K8774699K8776890O426000j2229122
27947D5069245j6970833j6099980j8948935k2619627j6285298L15426R458371
27940c6081631j644311j7229413j2888986N082006Q593058l413019p81992K3747706
27932c4616582L5611899J3683064j3326519j3783613j364632k056508o291985
27925b2144876L531849P383474j8638648m4375583k1004363L4890089N4705057
27918e653001J8322729j9271484j5000743O821641R761593L019684R541276J8526267
27910B6067962Q944378r699567j6673791j5832496j8627537j4550224O491421
$$ plain form
27903 -33879854 -10892132 -264091 -13899245 -28520090 -22480417 -5329775 6326635
27896 6326635 17414026 36047880 47667055 35414024 12796895 7194283 18157704
27889 18157704 20671673 7557356 -791584 5739816 7086346 -14410176 -41484597 -42112627
27881 -42112627 -12617946 18895430 30236142 28681736 32273838 42045835 44186510 32334852
27873 32334852 14195915 -2356076 -15792365 -21006614 -8427515 17521959 32787196
27866 32787196 21794766 1491861 -1364858 9864650 7778447 -14495948 -31595622
27859 -31595622 -25343020 -9739136 -3692907 -3191847 949794 -95718 -14450927 -26466373
27851 -26466373 -21859141 -21231814 -52244205 -94707212 -94532636 -38939022 20388983 34513341
$$ packed form
27903c3879854K2987722J0628041j3635154j4620845O039673J7150642J1656410
27896F326635J1087391J8633854J1619175j2253031k2617129n602612J0963421
27889A8157704K513969j3114317q348940O531400J346530k1496522k7074421o28030
27881d2112627K9494681L1513376J1340712j554406L592102R771997K140675j1851658
27873C2334852j8138937j6551991j3436289n214249J2579099K5949474J5265237
27866C2787196j0992430k0302905k856719J1229508k086203k2274395j7099674
27859c1595622O252602J5603884O046229N01060M141641j045512j4355209j2015446
27851b6466373M607232O27327l1012391m2463007J74576N5593614N9328005J4124358
$$ plain form
27843 34513341 13880237 -3491302 -8789021 -15384388 -17678417 2643264 35542388
27836 35542388 45319447 20078504 -10270181 -14914250 1939096 17243461 21868595
27829 21868595 23147657 28039945 36752733 43834903 36232878 1314849 -52156691 -91528072
27821 -91528072 -91922979 -63167645 -33673714 -16452244 -5678745 1296202 -1524823 -13314654
27813 -13314654 -23230589 -25086753 -21483026 -13436512 -1893330 703578 -18316836 -43910231
27805 -43910231 -40883725 -3127330 27291733 12422114 -27312615 -39997976 -14259906
27798 -14259906 9595085 3458547 -7829513 12277061 54131463 71937709 43391741
27791 43391741 -3706080 -25228198 -5033571 37603411 72261576 82544627 73431664
$$ packed form
27843C4513341k0633104j7371539n297719o595367k294029K0321681L2899124
27836C5542388R777059k5240943l0348685m644069J6853346J5304365M625134
27829B1868595J279062M892288Q712788P082170p602025l4918029n3471540l9371381
27821i1528072l94907K8755334K9493931J7221470J0773499O974947k821025j1789831
27813a3314654r915935j856164L603727Q046514J1543182K596908j9020414k5593395
27805d3910231L026506L7756395L0419063j4869619l9734729j2685361K5738070
27798a4259906K3854991o136538j1288060K0106574M1854402J7806246k8545968
27791D3391741m7097821k1522118K0194627M2636982L4658165J0283051r112963
$$ plain form
27784 73431664 59921910 49183051 35563801 14907957 -1976444 1078587 23409698
27777 23409698 44415601 46258806 33083216 22688313 23616123 26844246 19345027 644629
27769 644629 -16008224 -16588201 1531562 28684588 50157643 52683659 28875115 -15952672
27761 -15952672 -59516945 -74394561 -53117100 -18531043 -1115465 -7511148 -19671304
27754 -19671304 -23241546 -24068749 -32542423 -43740629 -43347081 -27435671 -6869770 5390215
27746 5390215 4289231 -7284859 -21940271 -33558878 -44012689 -58633980 -70203962
27739 -70203962 -58912651 -21401662 10787903 3616312 -32095828 -50978949 -33864825
27732 -33864825 -10026120 -6908215 -7271954 18030351 56105451 65431298 35366570 -1602722
$$ packed form
27784G3431664j3509754j0738859j3619250k0655844j6884401L055031K2331111
27777B3409698K1005903J843205j3175590j0394903R27810L228123p499219j8700398
27769F44629j6652853n79977J8119763K7153026K1473055K526016k3808544m4827787
27761a5952672m3564273j4877616K1277461L4586057J7415578o395683j2160156
27754a9671304l570242q27203q473674j1198206L93548J5911410K0565901J2259985
27746E390215j100984j1574090j4655412j1618607j0453811j4621291j1569982
27739g0203962J1291311L7510989L2189565p171591l5712140j8883121J7114124
27732c3864825K3838705L117905l63739K5302305L8075100R325847l0064728l6969292
$$ plain form
27724 -1602722 -18576065 -24175751 -35428987 -48358991 -51262482 -47859265 -50044293 -59230455
27716 -59230455 -67932404 -70299133 -61524356 -37946800 -7193860 13552839 18886235 22008867
27708 22008867 30931302 34200387 23737301 13848229 17754160 21393221 6176784 -14359332
27700 -14359332 -11678020 9110214 11942649 -14111849 -34088114 -16843352 20009911
27693 20009911 34292663 11553333 -25746758 -50159150 -52775871 -41298755 -29624851
27686 -29624851 -27324701 -31046270 -30077888 -24220947 -25657141 -36429695 -38558292 -19936717
27678 -19936717 2993841 7268128 -1115693 3047755 21989447 28683881 8872719 -14998288
27670 -14998288 -16643120 -3785811 -1492916 -8423932 3474847 43088695 77594268
$$ packed form
27724a602722j6973343n599686j1253236j2930004k903491L403217k185028r186162
27716e9230455q701949k366729Q774777K3577556L0752940K0746699N333396L122632
27708B2008867Q922435L269085j0463086r889072L905931L639061j5216437k0536116
27700a4359332K681312K0788234K832435k6054498j9976265J7244762L6853263
27693B0009911J4282752k2739330l7300091k4412392k616721J1477116J1673904
27686b9624851K300150l721569R68382N856941j436194j0772554k128597J8621575
27678a9936717K2930558M274287q383821M163448J8941692O694434j9811162k3871007
27670a4998288j644832J2857309K292895o931016J1898779L9613848L4505573
$$ plain form
27663 77594268 69378947 22176286 -25061497 -43812139 -40513958 -38050048 -48464500
27656 -48464500 -67290350 -81862203 -78734016 -52666980 -15807486 9143969 11654132
27649 11654132 3392386 975984 7198055 15254298 20587313 18728356 2712243 -22736780
27641 -22736780 -33428132 -10991018 27289454 42685150 20529311 -14055436 -27948155
27634 -27948155 -13314804 12682167 26758296 15013165 -16272894 -41191542 -37934027
27627 -37934027 -14618439 1113016 -1896291 -10093007 -14203770 -23254668 -40416418 -47143063
27619 -47143063 -28080286 3398868 21189618 16885221 -73942 -21067630 -40838396
27612 -40838396 -50317611 -44002156 -30486959 -23103112 -24133892 -27040266 -26540497 -17671528
$$ packed form
27663G7594268q215321m7202661m7237783j8750642L298181K463910j0414452
27656d8464500j8825850j4571853L128187K6067036L6859494K4951455K510163
27649A1654132q261746k416402O222071Q056243N333015j858957j6016113k5449023
27641b2736780j0691352K2437114L8280472J5395696k2155839l4584747j3892719
27634b7948155J4633351K5996971J4076129j1745131l1286059k4918648L257515
27627c7934027K3315588J5731455l009307q196716m110763r050898j7161750o726645
27619d7143063J9062777L1479154J7790750m304397j6959163k0993688j9770766
27612d0838396r479215O315455J3515197P383847j030780k906374M99769Q868969
$$ plain form
27604 -17671528 3835623 28483737 33099131 9906078 -15784679 -15511053 4071954
27597 4071954 13412064 3059966 -9105461 -10631365 -9732498 -14771078 -20877440 -24867010
27589 -24867010 -35876188 -60701980 -89367413 -103385054 -91988304 -57573425 -13367399
27582 -13367399 22163565 37299840 36755093 34163226 35617648 37127563 35956387 35682665
27574 35682665 40213332 48363123 51878314 36430289 -4700596 -50522355 -61164031
27567 -61164031 -23044272 27144621 43504998 24955721 4399119 -5283864 -21092100
27560 -21092100 -46717667 -55829495 -31448571 4855607 19372023 3810446 -25397419
27553 -25397419 -47813953 -47626764 -19070691 22773015 49164545 47045310 31158795
$$ packed form
27604a7671528K1507151K4648114M615394k3193053k5690757K73626J9583007
27597D071954R340110j0352098j2165427j525904Q98867n038580o106362l989570
27589b4867010j1009178k4825792k8665433j4017641J1396750L4414879M4206026
27582a3367399L5530964J5136275n44747k591867J454422J509915j171176k73722
27574C5682665M530667Q149791L515191j5448025m1130885m5821759j0641676
27567f1164031L8119759N0188893J6360377j8549277k0556602r682983j5808236
27560b1092100k5625567r111828K4380924L6304178J4516416j5561577k9207865
27553b5397419k2416534J87189K8556073M1843706K6391530k119235j5886515
$$ plain form
27546 31158795 20945283 19082449 18700273 15775067 7310369 -6700290 -14014710 -2074148
27538 -2074148 15343298 7769696 -26107504 -49939804 -42523899 -29722847 -40025425
27531 -40025425 -55974106 -43071946 -7550291 12336624 2938704 -13174602 -18763885
27524 -18763885 -20393246 -23107757 -18934539 -8932279 -9887693 -27784197 -45344650 -46630504
27516 -46630504 -36747722 -27471145 -19343716 -8977456 -1136502 -2050059 -9114885 -15848758
27508 -15848758 -20084393 -20641957 -12863951 5132063 25152197 32869894 19151672 -10574684
27500 -10574684 -34969399 -29776969 9139295 57468279 84722335 82364055 62561794
27493 62561794 35460413 1992461 -31949934 -49826570 -39278524 -5743068 31063218
$$ packed form
27546C1158795j0213512j862834l82176k925206q464698j4010659p314420J1940562
27538b074148J7417446p573602l3877200k3832300P415905J2801052j0302578
27531d0025425j5948681J2902160L5521655J9886915r397920j6113306n589283
27524a8763885j629361k714511M173218J0002260r55414j7896504j7560453j285854
27516d6630504R882782R276577Q127429J0366260P840954r13557p064826o733873
27508a5848758m235635n57564P778006J7996014K0020134P717697j3718222k9726356
27500a0574684k4394715N192430L8916264M8328984K7254056k358280j9802261
27493F2561794k7101381l3467952l3942395j7876636J0548046L3535456L6806286
$$ plain form
27486 31063218 49819535 40354193 13015465 -6473403 -927018 20213809 33378855
27479 33378855 26868947 6101986 -19196870 -39456409 -43223709 -27336840 -6360699
27472 -6360699 3308822 4714818 9150594 9851130 -10234478 -45932508 -69903658 -68177270
27464 -68177270 -52160630 -32077150 -5204635 22395170 31740220 22648919 22807461 47034747
27456 47034747 71888757 71494587 54446819 39553387 18818063 -20232436 -51895742
27449 -51895742 -34864780 24624344 72602846 78215090 68778317 78569222 94800184
27442 94800184 81434460 37339660 11432 -3914068 13548478 26630501 28266096
27435 28266096 27629010 28188704 22873246 8536517 -7051271 -16115590 -20120680 -22215002
$$ packed form
27486C1063218J8756317r465342k7338728j9488868N546385K1140827J3165046
27479C3378855o509908k0766961k5298856k0259539l767300J5886869K0976141
27472f360699R669521J405996M435776P00536k0085608l5698030k3971150J726388
27464f8177270J6016640K0083480K6872515K7599805R345050r091301J58542K4227286
27456D7034747K4854010l94170j7047768j4893432k0735324l9050499l1663306
27449e1895742J7030962N9489124M7978502N612244r436773R790905J6230962
27442I4800184j3365724m4094800l7328228l925500J7462546J3082023J635595
27435B8266096o37086N59694n315458j4336729j5587788r064319m005090k094322
$$ plain form
27427 -22215002 -17842525 -2740373 14037570 17980819 10291952 8150531 20380819 35489076
27419 35489076 39428836 32467482 20783828 4724871 -13554720 -23131963 -18593422 -10644032
27411 -10644032 -8153296 -1229313 19908149 40803546 41272448 30094417 32985590 48681290
27403 48681290 49049502 27555238 13456678 23497682 31802811 11796160 -18302213
27396 -18302213 -23082219 -5182089 2249911 -10281999 -18603339 -10089256 -3610022 -13286536
27388 -13286536 -22148803 -10352440 11860394 20463759 12622169 4196243 1386783 -3480601
27380 -3480601 -11079085 -10896622 -1429926 2083326 -11758526 -32271785 -37649378 -19969940
27372 -19969940 6660621 21741365 19360293 13335241 20424310 38104503 44327093 24385537
$$ packed form
27427b2215002M372477J5102152J6777943L943249p688867k141421J2230288J5108257
27419C5489076L939760o961354j1683654j6058957j8279591r577243M538541P949390
27411a0644032K490736O923983K1137462K0895397M68902j1178031K891173J5695700
27403D8681290L68212k1494264j4098560J0041004Q305129k0006651l0098373
27396a8302213m780006J7900130P432000j2531910q321340Q514083O479234r676514
27388a3286536q862267J1796363K2212834Q603365p841590q425926k809460m867384
27380c480601p598484J82463R466696L513252j3841852k0513259n377593J7679438
27372a9969940K6630561J5080744k381072o025052P089069J7680193O222590j9941556
$$ plain form
27364 24385537 -7219737 -20887428 -5624814 21589196 39450026 42721634 36163265
27357 36163265 22709900 7833482 4764096 20079934 37638890 32070978 881159
27350 881159 -29058645 -32970336 -16907773 -6811933 -15380549 -31057953 -38226006 -35659744
27342 -35659744 -30588673 -25693521 -21593694 -23943030 -33943679 -35782246 -11470596 29117511
27334 29117511 51682704 39670779 15274279 4838119 1332751 -17241603 -46351181
27327 -46351181 -60613624 -54464159 -45680953 -38496899 -17586935 13032427 20423982 -9394108
27319 -9394108 -44006173 -48979566 -34042173 -26935869 -24215462 -3788275 28008627 41081437
27311 41081437 29484974 18865850 24469402 34578800 40444892 50126475 62108992
$$ packed form
27364B4385537l1605274j3667691J5262614K7214010J7860830L271608o558369
27357C6163265j3453365j4876418l069386J5315838J7558956n567912l1189819
27350H81159k9939804l911691J6062563J0095840q568616j5677404p168053K566262
27342c5659744N071071M895152M099827k349336j0000649j838567K4311650M0588107
27334B9117511K2565193j2011925k4396500j0436160l505368j8574354k9109578
27327d6351181j4262443O149465Q783206P184054K0909964L0619362P391555k9818090
27319i394108l4612065m973393J4937393P106304K720407K0427187L1796902J3072810
27311D1081437j1596463j0619124N603552J0109398N866092R681583J1982517
$$ plain form
27304 62108992 54947434 19813583 -18794998 -31812936 -19120296 -1002568 8686440
27297 8686440 7936856 -1080544 -11990816 -16504503 -15450616 -16657696 -16721760 -1164049
27289 -1164049 29512809 52678051 54272161 48035085 48595508 43286867 12081692 -36218985
27281 -36218985 -70343263 -74162125 -59450042 -44358588 -35893880 -32905574 -32508641 -32319157
27273 -32319157 -34612172 -45972362 -65563347 -78763207 -71322198 -46017016 -18479818
27266 -18479818 -2012869 -2340728 -18626338 -40813095 -53274030 -49823141 -39370357
27259 -39370357 -31852988 -27963000 -26694198 -28472797 -24141687 952495 40464005 63602131
27251 63602131 53607949 30848265 18727952 6554690 -27584185 -72701125 -94694623
$$ packed form
27304F2108992p161558l5133851l8608581j3017938J2692640J8117728R689008
27297H686440p49584r017400j0910272m513687J053887j207080o4064J5557711
27289a164049L0676858K3165242J594110o237076N60423n308641l1205175m8300677
27281c6218985l4124278l818862J4712083J5091454Q464708K988306L96933J89484
27273c2319157k293015j1360190j9590985j3199860P441009K5305182K7537198
27266a8479818J6466949l27859j6285610k2186757j2460935L450889J0452784
27259c9370357P517369L889988J268802j778599M331110K5094182L9511510K3138126
27251F3602131r994182k2759684j2120313j2173262l4138875m5116940k1993498
$$ plain form
27244 -94694623 -82642356 -56979958 -36847831 -26444782 -28687268 -43037074 -51510112
27237 -51510112 -36192536 -11584465 -10716711 -36120244 -53209424 -38224105 -5829399
27230 -5829399 18375205 27702517 28646154 28282104 34465718 47024009 45390716 10382818
27222 10382818 -38803764 -59706422 -44240547 -26912846 -26498634 -20051411 6270583
27215 6270583 22891682 4995459 -20963089 -18911413 -3629687 -13914793 -43544446
27208 -43544446 -48938330 -20505041 1984222 -7478162 -23669156 -11634344 24530517
27201 24530517 53099165 55809832 41986861 33362002 44334848 68060097 78182390
27194 78182390 55094354 12008208 -17521334 -18791879 -9086455 -11502626 -30925296
$$ packed form
27244i4694623J2052267K5662398K0132127J0403049k242486j4349806q473038
27237e1510112J5317576K4608071Q67754k5403533j7089180J4985319L2394706
27230e829399K4204604R327312R43637l64050O183614J2558291j633293l5007898
27222A0382818m9186582k0902658J5465875J7327701M14212O447223K6321994
27215F270583J6621099j7896223k5958548K051676J5281726j0285106k9629653
27208d3544446n393884K8433289K2489263r462384j6190994J2034812L6164861
27201B4530517K8568648K710667j3822971q624859J0972846K3725249J0122293
27194G8182390k3088036m3086146k9529542j270545R705424k416171j9422670
$$ plain form
27187 -30925296 -56479114 -70718588 -55009511 -5862890 48604414 68586927 48436605
27180 48436605 25112848 30629477 54020481 64188746 52707813 34004959 16082640
27173 16082640 -3986711 -19424878 -13430734 14871656 42062303 46812381 32725161
27166 32725161 16650569 4902316 -7355896 -19413072 -21978143 -12589159 -3594056
27159 -3594056 -8793112 -27095995 -44653069 -49984494 -41979164 -25891303 -8572556 2439086
27151 2439086 2460254 -4585522 -8597291 -4302934 3776223 8900380 9307950 4870849 -7288861
27142 -7288861 -27664442 -48307989 -58505992 -55576672 -45036200 -31043853 -12580461
27135 -12580461 9242409 24758449 21789723 -438585 -26057570 -35964939 -27926918
$$ packed form
27187c0925296k5553818j4239474J5709077M9146621N4467304J9982513k0150322
27180D8436605k3323757N516629K3391004J0168265j1480933j8702854j7922319
27173A6082640k0069351j5438167N994144K8302390K7190647M750078j4087220
27166C2725161j6074592j1748253j2258212j2057176k565071R388984Q995103
27159c594056n199056j8302883j7557074n331425Q005330J6087861J7318747J1011642
27151B439086K1168p045776m011769M294357Q079157N124157M07570m437101j2159710
27142g288861k0375581k0643547j0198003K929320J0540472J3992347J8463392
27135a2580461K1822870J5516040k968726k2228308k5618985r907369Q038021
$$ plain form
27128 -27926918 -18305555 -19827299 -23569816 -11282194 18395956 46823936 57071149
27121 57071149 47553382 25141881 -1054886 -17386465 -13947877 -2288293 -9800721
27114 -9800721 -46279257 -88417241 -107918667 -102702433 -88555037 -73303907 -56182120
27107 -56182120 -43347788 -44389484 -55836402 -63681347 -61659388 -55396579 -50554518 -47306303
27099 -47306303 -43378172 -33267408 -10093147 21465511 41225143 34557499 10595806
27092 10595806 -11675090 -25024174 -28003478 -12109998 22755474 51167239 47613213
27085 47613213 23190504 9535981 10978957 3797797 -18488802 -34359759 -33181824
27078 -33181824 -28291497 -21931379 3418253 41093088 48154229 6935500 -35661585
$$ packed form
27128b7926918R621363j521744l742517J2287622K9678150K8427980J0247213
27121E7071149r517767k2411501k6196767j6331579L438588J1659584p512428
27114i800721l6478536m2137984j9501426N216234J4147396J5251130J7121787
27107e6182120J2834332j041696j1446918p844945K021959O262809M842061L248215
27099d7306303L928131J0110764K3174261L1558658J9759632o667644k3961693
27092A0595806k2270896j3349084k979304J5893480L4865472K8411765l554026
27085D7613213k4422709j3654523J442976p181160k2286599j5870957J177935
27078c3181824M890327O360118K5349632L7674835P061141m1218729m2597085
$$ plain form
27071 -35661585 -28822426 7672911 13458644 -23421194 -54714449 -45652874 -14598367
27064 -14598367 8459050 21712940 32685672 32804441 14661140 -7153031 -15687548
27057 -15687548 -17434859 -27199500 -38115778 -29029474 2410409 33885462 46618383
27050 46618383 43878254 38281374 34199427 29601629 25897405 26377698 28292304 25260384
27042 25260384 18575449 18950650 31994788 46103523 43139785 22416801 5908360 13594060
27034 13594060 38962910 57369691 56142245 46179511 42303275 42772453 35193676 16249259
27026 16249259 -2986381 -8979569 3723417 30901826 58419878 64692812 36747358
27019 36747358 -9050739 -32499372 -8493615 42642204 75272482 68026807 41382554
$$ packed form
27071c5661585O839159L6495337N785733l6879838l1293255R061575L1054507
27064a4598367K3057417J3253890J0972732J18769j8143301k1814171q534517
27057a5687548j747311r764641j0916278R086304L1439883L1475053J2732921
27050D6618383k740129n596880m081947m597798l704224M80293J914606l031920
27042B5260384o684935L75201J3044138J4108735k963738k0722984j6508441P685700
27034A3594060K5368850J8406781j227446r962734l876236M69178p578777j8944417
27026A6249259j9235640n993188J2702986K7178409K7518052O272934k7945454
27019C6747358m5798097k3448633K4005757N1135819L2630278p245675k6644253
$$ plain form
27012 41382554 25018706 22605690 16887744 -1668701 -22667107 -27116323 -4207896
27005 -4207896 36350858 63313037 47070265 -5149392 -48217725 -47256018 -16754903
26998 -16754903 4593411 6430210 10555527 29753173 51874474 65498640 72440044
26991 72440044 69314784 46138586 13780441 3102098 20025238 29696855 8278869
26984 8278869 -15743323 -3318304 31499997 38238962 4141296 -26238881 -11832907
26977 -11832907 34175703 66296779 58788243 23535366 -9523165 -18018793 -1723906
26970 -1723906 19476311 25438347 15869014 6956653 10662449 24727305 39775406 46537357
26962 46537357 38988291 21253410 8837821 11365386 16546237 3910976 -27333245
$$ packed form
27012D1382554j6363848k413016n717946j8556445k0998406m449216K2908427
27005d207896M0558754K6962179j6242772n2219657m3068333R61707L0501115
26998a6754903K1348314J836799M125317J9197646K2121301J3624166O941404
26991G2440044l125260k3176198l2358145j0678343J6923140R671617k1417986
26984H278869k4022192J2425019L4818301O738965l4097666l0380177J4405974
26977a1832907M6008610L2121076p508536l5252877l3058531q495628J6294887
26970a723906K1200217N962036r569333q912361L705796J4064856J5048101O761951
26962D6537357p549066j7734881j2415589K527565N180851j2635261l1244221
$$ plain form
26955 -27333245 -57011238 -68516329 -61031384 -39996239 -12222562 9399143 13903314
26948 13903314 8076317 8618096 15872450 12421875 -7522810 -24974237 -20597514 2308362
26940 2308362 27539974 45304421 53038914 49232864 36766903 24616830 19398607 21488433
26932 21488433 30449428 43295762 47834677 34042739 13480640 7401329 11822211 -1015761
26924 -1015761 -37357744 -65755333 -63134465 -49689874 -51855836 -53759809 -20652454 42263548
26916 42263548 92432968 109001081 113179965 123830453 126332498 101709930 62523251
26909 62523251 39226248 43082063 58929220 67654745 63037937 50420853 39320483
26902 39320483 37370933 45541875 57072037 61442747 51567699 32557589 23487910 39146802
$$ packed form
26955b7333245k9677993j1505091P484945K1035145K7773677K1621705M504171
26948A3903314n826997N41779P254354l450575j9944685j7451427M376723K2905876
26940B308362K5231612J7764447P734493l806050j2465961j2150073n218223K089826
26932B1488433Q960995J2846334M538915j3791938k0562099o079311M420882j2837972
26924a015761l6341983k8397589K620868J3444591k165962j903973L3107355O2916002
26916D2263548N0169420J6568113M178884J0650488K502045k4622568l9186679
26909F2523251k3297003L855815J5847157Q725525m616808j2617084j1100370
26902C9320483j949550Q170942J1530162M370710r875048j9010110r069679J5658892
$$ plain form
26894 39146802 64342851 61630336 19104907 -23697628 -20379507 20531074 45523507
26887 45523507 24783416 -19167271 -53882790 -73881667 -82597639 -70843412 -37754279
26880 -37754279 -9564256 -9719704 -25454417 -29664841 -22534943 -23793068 -34186950 -35832420
26872 -35832420 -26625753 -22674326 -25066122 -15646587 6634083 15486230 -1657663 -17719211
26864 -17719211 -1904763 35763484 58010016 48558330 26541321 17173402 24919950
26857 24919950 34724452 27638623 -3189828 -42032801 -59038844 -39651081 -3290531
26850 -3290531 17062518 11307052 -1656822 -1096701 14359586 32236409 40917198 36228767
26842 36228767 22433349 9812095 5499838 6208132 5085694 2601853 2264770 -710849
$$ packed form
26894C9146802K5196049k712515m2525429m2802535L318121M0910581K4992433
26887D5523507k0740091m3950687l4715519j9998877q715972J1754227L3089133
26880c7754279K8190023j55448j5734713m210424P129898j258125j0393882j645470
26872c5832420R206667L951427k391796R419535K2280670Q852147j7143893j6061548
26864a7719211J5814448L7668247K2246532r451686k2017009r367919P746548
26857B4919950R804502p085829l0828451l8842973j7006043J9387763L6360550
26850c290531K0353049n755466j2963874N60121J5456287J7876823Q680789m688431
26842C6228767j3795418j2621254m312257P08294j122438k483841l37083k975619
$$ plain form
26834 -710849 -14208676 -33609892 -44383699 -41301731 -32310260 -22329695 -8442545 5671800
26826 5671800 7931417 -2314455 -9801648 -8597154 -13765630 -33380494 -47048459 -33912212
26818 -33912212 -8480371 -2364216 -17979662 -29075547 -25219584 -24179263 -33714305 -32809959
26810 -32809959 -7793467 18683466 18172335 -2171765 -14788912 -16067045 -25862945 -46428146
26802 -46428146 -52601514 -30170361 1161229 15815026 13641230 7972527 -513320 -17375649
26794 -17375649 -32969157 -31734551 -20048132 -20989860 -38322418 -48918758 -39442394 -27290792
26786 -27290792 -29636381 -33955146 -24304351 -19333250 -48164818 -93546378 -100476817 -52871972
26778 -52871972 -3799738 -5066791 -37329941 -44921998 -19758163 -7597191 -35352169
$$ packed form
26834g10849j3497827j9401216j0773807L081968Q991471R980565J3887150J4114345
26826E671800K259617j0245872p487193J204494n168476j9614864j3667965J3136247
26818c3912212K5431841O116155j5615446j1095885L855963J040321r535042R04346
26810c2809959K5016492K6476933n11131k0344100j2617147j278133r795900k0565201
26802d6428146o173368K2431153L1331590J4653797k173796n668703q485847j6862329
26794a7375649j5593508J234606J1686419r41728j7332558j0596340R476364J2151602
26786b7290792k345589m318765R650795M971101k8831568m5381560o930439M7604845
26778e2871972M9072234j267053l2263150p592057K5163835J2160972k7754978
$$ plain form
26771 -35352169 -74696163 -87784196 -74039268 -53860001 -33755714 -11059056 5860796
26764 5860796 7753796 4867347 14190870 31174055 34701243 18945583 1275433 -4495305
26756 -4495305 -6761464 -21509617 -50013491 -78491203 -93270233 -89295010 -67400379
$$ packed form
26771c5352169l9343994j3088033J3744928K0179267K0104287K2696658J6919852
26764E860796J893000k886449R323523J6983185L527188j5755660j7670150n770738
26756d495305k266159j4748153k8503874k8477712j4779030L975223K1894631
$$ [...]
##END NTUPLES=NMR SPECTRUM
##END=
