##TITLE=31Pdec_LR-710-C1-K2
 CD3OD, 24 sc
 7.2.2020
##JCAMPDX= 6.0         $$ Bruker NMR JCAMP-DX V2.0
##DATA TYPE= NMR SPECTRUM
##DATA CLASS= NTUPLES
##ORIGIN= UXNMR, Bruker Analytische Messtechnik GmbH
##OWNER= root
$$ XWIN-NMR		Version 3.5
$$ Fri Feb  7 14:34:12 2020 Russian Standard Time (UT+4h)  she@DPX200
##.OBSERVE FREQUENCY= 81.013821
##.OBSERVE NUCLEUS= ^31P
##.ACQUISITION MODE= SIMULTANEOUS
##.ACQUISITION SCHEME= undefined
##.AVERAGES= 24
##.DIGITISER RES= 17
##SPECTROMETER/DATA SYSTEM= spect
##.PULSE SEQUENCE= zgpg30
##.SOLVENT NAME= DMSO
##.SHIFT REFERENCE= (INTERNAL, DMSO, 0, 182.463)
##AUDIT TRAIL= $$ (NUMBER, WHEN, WHO, WHERE, WHAT)
$$ ##TITLE= Audit trail, XWIN-NMR		Version 3.5
$$ ##JCAMPDX= 5.01
$$ ##ORIGIN= Bruker BioSpin GmbH
$$ ##OWNER= she
$$ F:/spectra/data/she/nmr/P31/1/pdata/1/auditp.txt
$$ ##AUDIT TRAIL=  $$ (NUMBER, WHEN, WHO, WHERE, WHAT)
(   1,<2020-02-07 14:32:44.51 +0400>,<she>,<DPX200>,
      <created by zg, POWCHK disabled, PULCHK disabled
       configuration hash MD5:
       00 E9 B6 7A A2 85 ED C7 34 08 36 98 17 FE 4E 26
       data hash MD5: 32K
       46 0E C4 F8 FB 5E BA 7E D0 37 E9 98 25 A3 5A FB>)
(   2,<2020-02-07 14:32:46.96 +0400>,<she>,<DPX200>,
      <Start of raw data processing
       efp BC_mod = 2 LB = 1 FT_mod = 6 PKNL = 1 PHC0 = -1369.475 PHC1 = 190.4013 SI = 64K 
       data hash MD5: 64K
       D9 42 1B 15 2C E1 95 81 ED D8 2C 32 6D 15 2C 55>)
(   3,<2020-02-07 14:33:34.57 +0400>,<she>,<DPX200>,
      <pk PHC0 = 6.35152 PHC1 = 0 
       data hash MD5: 64K
       FC 79 72 44 9F E0 03 E8 82 3A 2C 0F 06 7B 93 57>)
(   4,<2020-02-07 14:33:44.01 +0400>,<she>,<DPX200>,
      <abs ABSG = 5 
       data hash MD5: 64K
       B6 9B 7F A6 83 8D 3B 0B 66 BD AC A4 4E C3 2F 66>)
$$ ##END=
$$ 
$$ hash MD5
$$ 74 D3 6C 29 96 52 B4 20 D5 C5 D3 9C 53 F3 A5 F6
##$RELAX= 
##$RELAX= 
##$RELAX= 
##$RELAX= 
##$RELAX= 
##$RELAX= 
##$RELAX= 
##$RELAX= 
$$ Bruker specific parameters
$$ --------------------------
##$DU= <F:/spectra>
##$EXPNO= 1
##$NAME= <P31>
##$PROCNO= 1
##$TYPE= <nmr>
##$USER= <she>
##$AMP= (0..31)
100 100 100 100 100 100 100 100 100 100 100 100 100 100 100 100 100 100 
100 100 100 100 100 100 100 100 100 100 100 100 100 100 
##$AQSEQ= 0
##$AQ_mod= 1
##$AUNM= <au_zg>
##$AUTOPOS= <>
##$BF1= 81.014009
##$BF2= 200.13
##$BF3= 200.13
##$BF4= 200.13
##$BF5= 200.13
##$BF6= 200.13
##$BF7= 200.13
##$BF8= 200.13
##$BYTORDA= 1
##$CFDGTYP= 0
##$CFRGTYP= 5
##$CHEMSTR= <none>
##$CNST= (0..31)
1 1 145 1 1 1 1 1 1 1 1 1 1 1 1 1 1 1 1 1 1 1 1 1 1 1 1 1 1 1 1 1 
##$CPDPRG= <waltz16>
##$CPDPRG1= <>
##$CPDPRG2= <waltz16>
##$CPDPRG3= <>
##$CPDPRG4= <mlev>
##$CPDPRG5= <mlev>
##$CPDPRG6= <mlev>
##$CPDPRG7= <mlev>
##$CPDPRG8= <mlev>
##$CPDPRGB= <>
##$CPDPRGT= <>
##$D= (0..31)
0 1 0 0 0 0 0 0 0 0 0 0.03 2e-05 3e-06 0 0 0 0 0 0 0 0 0 0 0 0 0 0 0 0 
0 0 
##$DATE= 1581071563
##$DBL= (0..7)
120 120 120 11 120 120 24 19 
##$DBP= (0..7)
150 150 150 150 150 150 150 150 
##$DBP07= 0
##$DBPNAM0= <>
##$DBPNAM1= <>
##$DBPNAM2= <>
$$ [...]
##$SUBNAM3= <"">
##$SUBNAM4= <"">
##$SUBNAM5= <"">
##$SUBNAM6= <"">
##$SUBNAM7= <"">
##$SUBNAM8= <"">
##$SUBNAM9= <"">
##$SW= 369.568048894756
##$SWIBOX= (0..15)
0 1 3 0 0 0 0 0 0 0 0 0 0 0 0 0 
##$SW_h= 29940.119760479
##$TD= 32768
##$TD0= 1
##$TE= 0
##$TE2= 300
##$TE3= 300
##$TEG= 300
##$TL= (0..7)
0 120 53 12 22 120 120 120 
##$TP= (0..7)
150 150 150 150 150 150 150 150 
##$TP07= 0
##$TPNAME0= <>
##$TPNAME1= <>
##$TPNAME2= <>
##$TPNAME3= <>
##$TPNAME4= <>
##$TPNAME5= <>
##$TPNAME6= <>
##$TPNAME7= <>
##$TPOAL= (0..7)
0.5 0.5 0.5 0.5 0.5 0.5 0.5 0.5 
##$TPOFFS= (0..7)
0 0 0 0 0 0 0 0 
##$TUNHIN= 0
##$TUNHOUT= 0
##$TUNXOUT= 0
##$USERA1= <user>
##$USERA2= <user>
##$USERA3= <user>
##$USERA4= <user>
##$USERA5= <user>
##$V9= 5
##$VALIST= <valist>
##$VCLIST= <CCCCCCCCCCCCCCC>
##$VD= 0
##$VDLIST= <DDDDDDDDDDDDDDD>
##$VPLIST= <PPPPPPPPPPPPPPP>
##$VTLIST= <TTTTTTTTTTTTTTT>
##$WBST= 1024
##$WBSW= 4
##$XGAIN= (0..3)
0 0 0 0 
##$XL= 0
##$YL= 0
##$YMAX_a= 5796
##$YMIN_a= -5974
##$ZGOPTNS= <>
##$ZL1= 120
##$ZL2= 120
##$ZL3= 120
##$ZL4= 120
##$ABSF1= 182.463
##$ABSF2= -187.1042
##$ABSG= 5
##$ABSL= 3
##$ALPHA= 0
##$AQORDER= 0
##$ASSFAC= 0
##$ASSFACI= 0
##$ASSFACX= 0
##$ASSWID= 0
##$AUNMP= <proc_1d>
##$AZFE= 0.1
##$AZFW= 0.5
##$BCFW= 0
##$BC_mod= 2
##$BYTORDP= 0
##$COROFFS= 0
##$CY= -3
##$DATMOD= 1
##$DC= 0
##$DFILT= <>
##$DTYPP= 0
##$F1P= 0
##$F2P= 0
##$FCOR= 1
##$FTSIZE= 65536
##$FT_mod= 6
##$GAMMA= 0
##$GB= 0
##$INTBC= 1
##$INTSCL= 5.30512e-09
##$ISEN= 30
##$LB= 1
##$LEV0= 0
##$LPBIN= 0
##$MAXI= 10000
##$MC2= 0
##$MEAN= 0
##$ME_mod= 0
##$MI= 50
##$NCOEF= 0
##$NC_proc= -8
##$NLEV= 6
##$NOISF1= 182.463
##$NOISF2= 159.3651
##$NSP= 0
##$NTH_PI= 0
##$NZP= 0
##$OFFSET= 182.463
##$PC= 4
##$PHC0= -1363.123
##$PHC1= 190.4013
##$PH_mod= 1
##$PKNL= yes
##$PPARMOD= 0
##$PSCAL= 0
##$PSIGN= 0
##$REVERSE= no
##$SF= 81.0140089999434
##$SI= 65536
##$SIGF1= 159.3651
##$SIGF2= -187.1042
##$SINO= 113.3802
##$SIOLD= 16384
##$SREGLST= <1H.CDCl3>
##$SSB= 0
##$STSI= 65536
##$STSR= 0
##$SW_p= 29940.119760479
##$SYMM= 0
##$S_DEV= 0
##$TDeff= 32768
##$TDoff= 0
##$TI= <>
##$TILT= no
##$TM1= 0
##$TM2= 0
##$TOPLEV= 0
##$USERP1= <user>
##$USERP2= <user>
##$USERP3= <user>
##$USERP4= <user>
##$USERP5= <user>
##$WDW= 1
##$XDIM= 65536
##$YMAX_p= 475354798
##$YMIN_p= -69728509
$$ End of Bruker specific parameters
$$ ---------------------------------
##NTUPLES= NMR SPECTRUM
##VAR_NAME=  FREQUENCY,     SPECTRUM/REAL,   SPECTRUM/IMAG
##SYMBOL=    X,             R,               I
##VAR_TYPE=  INDEPENDENT,   DEPENDENT,       DEPENDENT
##VAR_FORM=  AFFN,          ASDF,            ASDF
##VAR_DIM=   65536,         65536,           65536
##UNITS=     HZ,            ARBITRARY UNITS, ARBITRARY UNITS
##FACTOR=    0.456856943014862, 1,           1
##FIRST=     14782.0589164792, 0,            0
##LAST=      -15158.0608439998, 0,           0
##MIN=       -15158.0608439998, -69728509,   0
##MAX=       14782.0589164792, 475354798,    0
$$ Real data points
##PAGE= N=1
##DATA TABLE= (X++(R..R)), XYDATA
$$ [...]
44763g820539l776488o888174m7523Q353437O461369j367383k010890L712219
$$ -7820539 -11597027 -18485201 -18532724 -10179287 -3717918 -5085301 -7096191 -3383972
44755c383972L281109m342741o821021j282037O08788m632191m259067P278717
$$ -3383972 -102863 -4445604 -11266625 -12548662 -11939874 -16572065 -20831132 -13552415
44747a3552415J5556213R189838r32079n69643M069017n38293r463531p282333
$$ -13552415 2003798 11193636 10261557 9691914 13760931 13222638 3759107 -3523226
44739c523226M527775R134044J660396m727111j948549J713749j509708o119367
$$ -3523226 1004549 10138593 11798989 7071878 5123329 6837078 5327370 -791997
44731g91997m851779q83829k94591j373071L58932L023874J983687j853412l885376
$$ -791997 -5643776 -6527605 -6822196 -8195267 -7836335 -4812461 -2828774 -4682186 -8567562
44722h567562k945390j178846Q81049M244300P616965P591657K962684l028792
$$ -8567562 -11512952 -12691798 -11810749 -7566449 50516 7642173 10604857 7576065
44714G576065n208400j414587M480417N707355M07477n385592n132181j86610
$$ 7576065 2367665 953078 5433495 11140850 11548327 6162735 1030554 843944
44706H43944K750489P72587k996186m975348m234727r70629L338133N066957K522839
$$ 843944 3594433 4367020 1370834 -3604514 -7839241 -8809870 -5471737 -404780 2118059
44697B118059k57628J004781L230044M72936n265682n867236m1651M169806J757188
$$ 2118059 1860431 2865212 6095256 6568192 1302510 -4564726 -4606377 -436571 1320617
44688A320617k702710l829680k742666j613574J350480O320250Q101309L889440
$$ 1320617 -1382093 -5211773 -7954439 -9568013 -8217533 -1897283 6204026 10093466
44680A0093466j041167j360284J29883j248244l011899m75741L504333K429454
$$ 10093466 9052299 7692015 7821898 6573654 3561755 3086014 6590347 9019801
44672I019801k627555m407429j216676J057407p31077k382507j14085L504591
$$ 9019801 6392246 1984817 768141 1825548 1094471 -1288036 -1402121 2102470
44664B102470M279961K214115l12992k454263m196037m461629k416290R16211
$$ 2102470 6382431 8596546 8283554 5829291 1633254 -2828375 -5244665 -4328454
44656d328454L751788M927483L858128J096937r05289n1945K026721J428133k671617
$$ -4328454 -576666 4350817 8208945 9305882 8400593 8348648 10375369 11803502 9131885
44647I131885o735201p553805n498962k348681J075901L745307L893040J711725
$$ 9131885 2396684 -5157121 -10656083 -13004764 -11928863 -8183556 -4290516 -2578791
44639b578791J68086R44632J786305L84539j274637J07422L138970K958691j213059
$$ -2578791 -2410705 -1466073 320232 704771 -569866 -462444 2676526 5635217 4422158
44630D422158l908158r19462M171460M485756n78427m439305k617062J038276
$$ 4422158 514000 -405462 3765998 8251754 7673327 3234022 616960 1655236
44622A655236J54530m742178o847249k714800L102919M723473K748167K242984
$$ 1655236 1809766 -2932412 -9779661 -12494461 -9391542 -4668069 -1919902 323082
44614C23082M769475O126878K198638n517974j1068309r605847j850424N931291
$$ 323082 5092557 11219435 13418073 7900099 -3168210 -12774057 -14624481 -8693190
44606h693190P059912J232691m442777l256234K965264O396487L558294q67385
$$ -8693190 -1633278 -400587 -4843364 -8099598 -5134334 1262153 4820447 3953062
44598C953062j617929K33887R56304Q10035K108549L056925j92101n503579n493141
$$ 3953062 2335133 2569020 3525324 4335359 6443908 9500833 9308732 3805153 -1687988
44589a687988J366000O472954K595872m962752n197759K875600Q748043N177732
$$ -1687988 -321988 6150966 8746838 3784086 -1413673 1461927 10209970 15387702
44581A5387702k635627n632916k909290k99032o84958j566591j056252p92499
$$ 15387702 12752075 7119159 4209869 3910837 3225879 1659288 603036 -189463
44573a89463k023794k856322j204649J917844L634565K383443r52251l904448
$$ -189463 -2213257 -5069579 -6274228 -4356384 -721819 1661624 709373 -3195075
44565c195075m066798j251365J711893J735362q04511k734620k630328k501322
$$ -3195075 -7261873 -8513238 -6801345 -5065983 -5870494 -8605114 -11235442 -13736764
44557a3736764m008069n198193l092372J552638M435698K974354l02430p41050
$$ -13736764 -17744833 -22943026 -26035398 -24482760 -20047062 -17072708 -17375138 -18116188
44549a8116188K771343O560480O815698M002415J420921O14220L91316k28791
$$ -18116188 -15344845 -8784365 -1968667 2033748 3454669 4068889 4460205 4231414
44541D231414r76120k196014m226523m327497J134834R291555J0826499J936036
$$ 4231414 3255294 1059280 -3167243 -7494740 -6359906 2931649 13758148 15694184
44533A5694184q270841q664314j170560K790670o66193l560476R1277N203412
$$ 15694184 7423343 -1240971 -2411531 379139 -287054 -3847530 -3756253 1447159
44525A447159M559564m38438l539849k994137j390752Q1673J568085J396964j640813
$$ 1447159 6006723 5568285 2028436 -965701 -2356453 -2274780 -706695 690269 -950544
44516i50544m572005l496592P28217M041420M840122M141920J926909k100942
$$ -950544 -5522549 -9019141 -8290924 -4249504 590618 4732538 6659447 4558505
44508D558505n336115m581477j048661J175655J192505J605891L112989L242356
$$ 4558505 -777610 -5359087 -6407748 -5232093 -4039588 -2433697 679292 3921648
44500C921648Q87705j895922l294640l522371k831266j106160L01792k05180j198460
$$ 3921648 4809353 2913431 -381209 -3903580 -6734846 -7841006 -7539214 -7744394 -8942854
44491h942854K01220L223687L899254J208787j370733j494185q73638j059318
$$ -8942854 -8741634 -5517947 -1618693 -409906 -1780639 -3274824 -4148462 -5207780
44483e207780o03467J269003K062794r720k578682k596240o85871P83868J602008
$$ -5207780 -5811247 -4542244 -2479450 -2489170 -5067852 -7664092 -8349963 -7566095 -5964087
44474e964087K808195L855949L477855J881500r2813k211209l377332j571636
$$ -5964087 -3155892 700057 4177912 6059412 5966599 3755390 378058 -1193578
44466a193578K188519K865685j862402o489662m156063L287317P173233L861578
$$ -1193578 994941 3860626 1998224 -4491438 -8647501 -5360184 1813049 5674627
44458E674627r68787j418563M89270o89618m677499n651654r70161M394996L938578
$$ 5674627 4705840 3287277 3776547 3086929 -1590570 -7242224 -8212385 -3817389 121189
44449A21189j801809n374821j562108N735911Q095521L266475k235836k317329
$$ 121189 -1680620 -7055441 -8617549 -2881638 5213883 8480358 6244522 3927193
44441C927193P59042R05178k231876l237057L84267M651804N165927K407203o21766
$$ 3927193 4686235 5591413 3359537 122480 506747 5158551 10324478 12731681 12109915
44432A2109915k411757k746865j727164r48924k605966n456634m992322J1823
$$ 12109915 9698158 6951293 5224129 4275205 1669239 -3787395 -8779717 -8767894
44424h767894M626647M465164J751495J014489K196701K584831K267001K145665
$$ -8767894 -4141247 323917 2075412 3089901 5286602 7871433 10138434 12284099
44416A2284099l36099o535288j0147129m111215O659192R178191N85642p517876
$$ 12284099 11948000 5412712 -4734417 -8845632 -2186440 6991751 7577393 59517
44408E9517o441675j818779j563449k454894J763777O732227L836313m187749
$$ 59517 -6382158 -8200937 -9764386 -12219280 -10455503 -3723276 113037 -4074712
44400d074712o291563j07284N712104N979480M379388L228078n39294o010566
$$ -4074712 -10366275 -10473559 -4761455 1218025 5597413 8825491 8286197 2275631
44392B275631o102031K79269M023006k9110m155400n78111N416731M549697j238769
$$ 2275631 -3826400 -3547131 475875 446765 -3708635 -4286746 1129985 5679682 4440913
44383D440913l326965j299212j872709n406211m976830Q74386M841963K449696
$$ 4440913 1113948 -185264 -2057973 -7464184 -12441014 -11566628 -6724665 -4274969
44375d274969j613670j848826K00156q021l080007n992802o066736k835732J429696
$$ -4274969 -5888639 -7737465 -7537309 -7545330 -10625337 -16618139 -22684875 -25520607 -24090911
44366b4090911K848440N48229r07862K208613N916470L820390k095911l550223
$$ -24090911 -21242471 -20694242 -21602104 -19393491 -13477021 -9656631 -11752542 -15302765
44358a5302765J018478L889438N77457l299583j493462L692360O483627N932712
$$ -15302765 -14284287 -10394849 -9817392 -13116975 -14610437 -10918077 -4434450 1498262
44350A498262M067984R35268l142206m680679j831845J428615Q79641j530009
$$ 1498262 5566246 6501514 3359308 -1321371 -3153216 -1724601 -844960 -2374969
44342b374969j735042n63229j190206k491424r64787K426718L101200r2193l381602
$$ -2374969 -4110011 -4673240 -5863446 -8354870 -9319657 -6892939 -3791739 -3883932 -7265534
44333g265534l238291N23570N662729Q291759M852877k865567p153359l341952
$$ -7265534 -10503825 -9980255 -4317526 3974233 8827110 5961543 -1191816 -4533768
44325d533768L177722M166386K38930j214626J811395L570491O98089k851157
$$ -4533768 -1356046 2810340 3049270 1834644 3646039 7216530 7914619 5063462
44317E063462l122891j927225k164533k671162j397233K25664k06637j846784
$$ 5063462 1940571 13346 -2151187 -4822349 -6219582 -5993918 -6200555 -8047339
44309h047339j991340N7302K668403L928002K821714K03266q03823K176938O764085
$$ -8047339 -10038679 -9981377 -7312974 -3384972 -563258 -359992 -1163815 1013123 7777208
44300G777208P667247L252463k729399o429823p224678n207811k51755M606257
$$ 7777208 15444455 18696918 15967519 9537696 2313018 -2894793 -3146548 1459709
44292A459709M101926j517309m391821P39834Q099695Q195072R13450m954751
$$ 1459709 5561635 4044326 -347495 392339 8492034 16687106 17600556 12645805
44284A2645805m202113q16911l76556k532927l445626j734203O87360J352467
$$ 12645805 8443692 7626781 7250225 4717298 1271672 -462531 224829 1577296
44276A577296r50696m982182o577094k240497N231402Q061350L066042l307712
$$ 1577296 626600 -4355582 -10932676 -13173173 -7941771 119579 3185621 -122091
44268a22091l406279R60187J851725k149156l814777P15024N220835L340509r60321
$$ -122091 -3528370 -2568183 -716458 -2865614 -6680391 -5965367 -744532 2595977 1635656
44259A635656n0773M352021M006062j366784k829871K384931M642462l034549
$$ 1635656 1584883 5936904 9942966 8576182 5746311 8131242 12773704 9739155
44251I739155j2348119j1035351j030737N009350K548801l63876K207473N355153
$$ 9739155 -2608964 -13644315 -14675052 -9665702 -7116901 -7480777 -5273304 81849
44243H1849K764504l257158o084933l619468J478759N975949O816793K076076
$$ 81849 2846353 -410805 -6495738 -10115206 -8636447 -2660498 4156295 6232371
44235F232371m966521o817829r82035N615940N739565J484242m06651P14381J26707
$$ 6232371 1265850 -5551979 -6534014 -918074 4821491 6305733 5899082 6613463 6740170
44226F740170k574563k060346L444908P743817M547935l985505r759290q099410
$$ 6740170 4165607 2105261 5550169 13293986 17841921 13856416 4097126 -4002284
44218d002284k282950R19152j085534m216750l258946J203994L925202K964513
$$ -4002284 -6285234 -5366082 -6451616 -10668366 -13927312 -12723318 -8798116 -5833603
44210e833603K283606M359106M963534n7087o402261o120435O98597N764311M333654
$$ -5833603 -3549997 809109 5772643 5715556 -686705 -6807140 -6108543 -344232 3989422
44201C989422N99898k23073J010833J263951J027053J971492K716012J409715
$$ 3989422 4589320 4366247 5377080 6641031 7668084 9639576 12355588 13765303
44193A3765303j84343K75295N81556l111638q939468j0013333l605787M411166
$$ 13765303 13580960 13856255 14437811 11326173 2386705 -7626628 -11232415 -6821249
44185f821249O524672K284540k431192l079584n40830J813237K181542P33738
$$ -6821249 -296577 1987963 -443229 -3522813 -4063643 -2250406 -68864 664874
44177F64874j649586l288100j897712K749812O917556O221567J182531l001051
$$ 664874 -984712 -4272812 -6170524 -3420712 3496844 9718411 10900942 7899891
44169G899891l110068j757583k813088n346621n089591q21900L814244M998627
$$ 7899891 4789823 3032240 219152 -5127469 -10217060 -11038960 -7224716 -2226089
44161b226089K864646M07742r3068J067618J905050J228677K95038J062931K660822
$$ -2226089 638557 1046299 953231 2020849 3925899 5154576 5449614 6512545 9173367
44152I173367J727677k582662o496052o627503m474559k971437j341428K334341
$$ 9173367 10901044 8318382 1822330 -4805173 -9279732 -12251169 -13592597 -11258256
44144a1258256N688531M842453J693844K179603O609204P991604K279765n207654
$$ -11258256 -5569725 -727272 966572 3146175 9755379 17746983 20026748 14819094
44136A4819094p079724l465956m37449j492121m145287l752821J322421P353961
$$ 14819094 7739370 4273414 3835965 2343844 -1801443 -5554264 -4231843 3122118
44128C122118P838044Q16502o879797o886031o09959K584230p09258l394302j47538
$$ 3122118 10960162 11776664 4896867 -1989164 -2599123 -14893 -724151 -4118453 -4265991
44119d265991M138950L770485K042675L495943L469911l773682j1404623p543548
$$ -4265991 -127041 3643444 5686119 9182062 12651973 8878291 -2526332 -10069880
44111a0069880N030029J0377274K635422n504067k819305M136038L523684k634503
$$ -10069880 -5039851 5337423 7972845 2468778 -350527 3785511 7309195 4674692
44103D674692l517206J776945L403234k161422o149510j866469M417877L097046
$$ 4674692 1157486 2934431 6337665 4176243 -1973267 -3839736 578141 3675187
44095C675187m284136p761587l766740N93775p40552l642798j012586N225158
$$ 3675187 -608949 -8370536 -12137276 -11543501 -12284053 -15926851 -16939437 -11714279
44087a1714279O311107R9948n032326k270760M010436N588428K480507J086981
$$ -11714279 -5403172 -5303224 -10335550 -12606310 -8595874 -3007446 -526939 560042
44079E60042L168905M162419J715916j345894l170473n171492o867826n233782
$$ 560042 3728947 7891366 9607282 8261388 5090915 -80577 -6948403 -12182185
44071a2182185j376818r77101m728631n145309K190509J0186792R402053J322708
$$ -12182185 -13559003 -14536104 -19264735 -24410044 -22219535 -12032743 -2630690 -1307982
44063a307982m415319l426455l14150k9011j792798k257658j37746L295187N535497
$$ -1307982 -5723301 -9149756 -9463906 -9492917 -11285715 -13543373 -13681119 -10385932 -4850435
44054d850435M632768J755366Q54633L482935N806720L733197r59494l136253
$$ -4850435 -217667 1537699 2392332 5875267 11681987 15415184 14455690 11319437
44046A1319437j328618J357458K038653M67805j899747k332548J466117O926974
$$ 11319437 9990819 11348277 13386930 13854735 11954988 9622440 11088557 18015531
44038A8015531P045939n67364q588179r290272n292881m028717m814610p62592
$$ 18015531 25061470 24494106 15905927 6615655 1322774 -2705943 -7520553 -8283145
44030h283145P504795J0478422M146586l544156m494937r98374K69727j513099
$$ -8283145 -778350 9700072 13846658 10302502 5807565 4809191 5078918 3565819
44022C565819k421765o79755K276911M465816L835391n46610n365908n291306
$$ 3565819 1144054 464299 2741210 7207026 11042417 10495807 5129899 -161407
44014a61407p02245J728442j030468l498532p08976L561480K968040j591822m272388
$$ -161407 -863652 864790 -165678 -3664210 -4373186 -811706 2156334 564512 -3707876
44005c707876k975447o5570K768469M848107M147294N0350l467924k476154R00313
$$ -3707876 -6683323 -6748893 -3980424 867683 5014977 5065327 1597403 -878751 21562
43996B1562J803483r5707j534505j696624k008826j726918P24263L298696K653039
$$ 21562 1825045 1729338 194833 -1501791 -3510617 -5237535 -4513272 -1214576 1438463
43987A438463l0980o96307J079482K284364K078094J925860J248917j370883l475515
$$ 1438463 1407483 711176 1790658 4075022 6153116 8078976 9327893 7957010 4481495
43978D481495j282483L285945M191991J96131l626342l805953k233519j201722
$$ 4481495 3199012 6484957 10676948 10873079 7246737 3440784 1207265 5543
43970E543j88395J232429K015465J974180J383748j112136n346961o167203O6422
$$ 5543 -182852 1049577 3065042 5039222 6422970 5310834 -36127 -6203330 -6136908
43961f136908P073474N395031k972293o747189k971000p62926m235348m392952
$$ -6136908 936566 6331597 3359304 -3387885 -6358885 -7121811 -11357159 -15750111
43953a5750111M790997J3628290J0295154j182022p655656n716986k657449k601398
$$ -15750111 -10959114 2669176 12964330 11782308 4126652 -1590334 -4247783 -6849181
43945f849181k787806j599142j84564K662242P983056J0457470M425833m862071
$$ -6849181 -9636987 -11236129 -11420693 -8758451 -775395 9682075 14107908 9245837
43937I245837o451202k47422K680751k014020n473231j159341M416970L375093
$$ 9245837 2794635 2547213 5227964 3213944 -2259287 -3418628 998342 4373435
43929D373435o93758m90076J657112j357810p557551p872487r84686M016249J580955
$$ 4373435 3679677 3189601 4846713 3488903 -4068648 -11941135 -12925821 -8909572 -7328617
43920g328617k351204l35702N158084N980993M55366m626570l558569J560062
$$ -7328617 -9679821 -10015523 -4857439 1123554 1578920 -3047650 -6606219 -5046157
43912e046157M970191M663530K955227J377960j409497n943233r180861p871777
$$ -5046157 -75966 4587564 7542791 8920751 7511254 1568021 -7612840 -15484617
43904a5484617l278419L11788J335406K095093L786187M066509J683427K58474
$$ -15484617 -18763036 -18451248 -17115842 -15020749 -11234562 -7168053 -5484626 -5226152
43896e226152L554215Q599225Q311905J380341n126375n146561j521223p28855
$$ -5226152 -1671937 6927288 15239193 16619534 11493159 6346598 4825375 4096520
43888D096520k854225k307980K532789O582880N981726K901106J19062l232697
$$ 4096520 1242295 -1065685 1467104 8049984 14031710 16932816 17051878 13819181
43880A3819181o705331n576773J013102M619386j258386q727141n185964O518896
$$ 13819181 7113850 1537077 2550179 7169565 5911179 -2815962 -8001926 -1483030
43872a483030J0491112J630186o778691m423049Q23697j715210p036623m457217
$$ -1483030 9008082 10638268 3859577 -563472 260225 -1454985 -8491608 -12948825
43864a2948825K638993K473464m397121o018257L92063M431939J069339j494053
$$ -12948825 -10309832 -7836368 -12233489 -18251746 -17859683 -13427744 -12358405 -13852458
43856a3852458K634265O604653L066218l571870n155148j956109J117191L690215
$$ -13852458 -11218193 -4613540 -1547322 -5119192 -10274340 -12230449 -11113258 -7423043
43848g423043P083528P704221J812833o386837q945541m485658J512909M542327
$$ -7423043 -339515 7364706 9177539 2790702 -6154839 -10640497 -9127588 -4585261
43840d585261M020706R31679k385105k363567J306156L808557J782830j724907
$$ -4585261 -564555 367124 -2017981 -4381548 -3075392 733165 2515995 791088
43832G91088l126729m424641p686597q220129j112024Q633090J1028192M762923
$$ 791088 -2335641 -6760282 -14446879 -22667008 -23779032 -15145942 -4117750 645173
43824F45173j908756l047443k54760L271454O071551N749791O29709n220892n683565
$$ 645173 -1263583 -4311026 -4565786 -1294332 4777219 10527010 11156719 5935827 252262
43815B52262j742236K41717o50633O10646L931545K517790m560115q097210k349947
$$ 252262 -1489974 -1248257 -1898890 -1288244 2643301 5161091 600976 -7496234 -9846181
43806i846181N547653O121957M73775m019828m758045l647117j129572K204705
$$ -9846181 -4298528 1823429 2297204 -1722624 -6480669 -10127786 -11257358 -9052653
43798i052653K566625j183212k851443K325953Q358539O574660l64066k350403
$$ -9052653 -6486028 -7669240 -10520683 -8194730 163809 6738469 6374403 4024000
43790D024000K113197M341919K14170m007979k965336K47761J635783K899622
$$ 4024000 6137197 10479116 10693286 6685307 3719971 3967732 5603515 8503137
43782H503137N491713N419893N8231n527858n383315j487387K88578o54727q66470
$$ 8503137 13994850 19414743 19472974 13945116 8561801 7074414 7362992 6708265 5841795
43773E841795k81838j580038l745846l101813l30804P7967k110666j820353K592258
$$ 5841795 5559957 3979919 234073 -2867740 -3198544 -3120577 -5231243 -7051596 -4459338
43764d459338N598549K769914k116830k615196J094485L386913K050624Q68484
$$ -4459338 1139211 3909125 1792295 -822901 271584 3658497 5709121 6577605
43756F577605K836449M995950K458030m338992r124363o866032J75954M734155
$$ 6577605 9414054 14410004 16868034 12529042 3404679 -3461353 -3285399 1448756
43748A448756K592702l118788o278672m640089m69306M056269Q396432J0539025
$$ 1448756 4041458 922670 -5356002 -9996091 -10465397 -6409128 1987304 12526329
43740A2526329O869503k214598r796761r375143k740211K669817L140891J348113
$$ 12526329 19395832 17181234 7384473 -1990670 -4730881 -2061064 1079827 2427940
43732B427940J32815j378659l834981m243531L0804O136503Q164133M211437j417211
$$ 2427940 2560755 1182096 -2652885 -6896416 -6865612 -729109 7435024 11646461 10229250
43723A0229250l152011J20856M326935M523446J11804m429316m895413k566888
$$ 10229250 7077239 7198095 11525030 16048476 16160280 11730964 6835551 4268663
43715D268663j699875k582506j394299K212229K819256k222983o945288m613641
$$ 4268663 2568788 -13718 -1408017 804212 3623468 1400485 -5544803 -10158444
43707a0158444K284280O041549M953577L473585K954580M97194l052271k845977
$$ -10158444 -7874164 -1832615 3120962 6594547 9549127 10046321 6994050 4148073
43699D148073M11549l68082o303133q270104q11851P785781P221561L91414k544339
$$ 4148073 4559622 4191540 -2111593 -10381697 -11193548 -3407767 3813794 4205208 1660869
43690A660869l54397q2439k844503k237156K589664L941181r76495m029434P19096
$$ 1660869 1306472 1224033 -1620470 -3857626 -1267962 2673219 1696724 -2332710 -1613614
43681a613614O440959L743770m522199p307504j361032N114911M735043j07599
$$ -1613614 4827345 8571115 4048916 -3258588 -4619620 495291 5230334 5122735
43673E122735k732572j828621j825688n112087p554949l777920M357252Q237919
$$ 5122735 2390163 561542 -1264146 -6376233 -13931182 -17709102 -13351850 -5113931
43665e113931L263649m400058n904071j725506M96492j412533j636006K694090
$$ -5113931 -1850282 -6250340 -12154411 -13879917 -13383425 -14795958 -16431964 -13737874
43657a3737874O448461N479498K792102J438948j018768n325304n508726J461407
$$ -13737874 -7289413 -1809915 982187 2421135 1402367 -3922937 -9431663 -7970256
43649g970256P809810N594632o54284j812291P17475n07389l531647K465P880621
$$ -7970256 -160446 5434186 4779902 2967611 3685086 3177697 -353950 -351485 7529136
43640G529136Q324251l98783o203633l144622n23707n197070q732755k385339
$$ 7529136 15853387 15454604 9250971 6106349 5582642 385572 -8347183 -10732522
43632a0732522O758259O988368P05394j213206K286779L196845k32795k206773
$$ -10732522 -3974263 3014105 3719499 2506293 4793072 7989917 7757122 5550349
43624E550349j765943l704738p025356m589622L910486R552337P471654K734225
$$ 5550349 3784406 79668 -6945688 -11535310 -7624824 1927513 9399167 12133392
43616A2133392K2601k665006o008785m915349J867010O073658J297269o337419
$$ 12133392 12155993 9490987 3482202 -1433147 433863 6507521 7804790 1467371
43608A467371o718559l12736L822543J659479k070248k767924j489790p85438
$$ 1467371 -5251188 -5563924 -1741381 -81902 -2152150 -4920074 -6409864 -7195302
43600g195302m41736Q20201K660877L667638K999815R85229j137310k514683l960100
$$ -7195302 -7637038 -6816837 -4155960 -488322 2511493 3496722 2359412 -155271 -4115371
43591d115371o292577p284909l539608L362475O688198L337384j113012k03772
$$ -4115371 -10407948 -17692857 -21232465 -17869990 -11181792 -7844408 -8957420 -9161192
43583i161192L977420M468826K89204k570274n96633K821925L620966K494836
$$ -9161192 -5183772 -714946 -425742 -2996016 -3592649 -770724 2850242 5345078
43575E345078J696695M58911l002789p104783p884398m090978Q42865K507721
$$ 5345078 7041773 7500684 4497895 -2606888 -10491286 -14582264 -13739399 -11231678
43567a1231678M24976j456824N28060N109839P408841M860824r7171l691771m546642
$$ -11231678 -10806702 -12263526 -11735466 -6625627 783214 5644038 5546867 1855096 -2691546
43558b691546k602976K251241P725149Q568018K696645m395706o115148l773875
$$ -2691546 -5294522 -3043281 4681868 13249886 15946531 11550825 5435677 1661802
43550A661802l453936n329946l641072K074102M257123n13841m546189n37625
$$ 1661802 -1792134 -7122080 -10763152 -8689050 -4431927 -4945768 -9491957 -10029582
43542a0029582O178377N273229k594078p096159m258539q27717j018785N72470
$$ -10029582 -3851205 1422024 -1172054 -8268213 -12526752 -13354469 -14373254 -13800784
43534a3800784P546540J2349197P052064k570643m310115J827114L651957l717804
$$ -13800784 -6254244 6094953 13147017 10576374 6266259 8093373 11745330 8027526
43526H027526r823614n051626M798462P803524K889801j623171k092945k090746
$$ 8027526 -1796088 -6847714 -2049252 5754272 8644073 7020902 4927957 2837211
43518B837211k566950J11668N065822N382150p89885n555132k498156L793880
$$ 2837211 270261 381929 5447751 10829901 10040016 4484884 1986728 5780608
43510E780608M913179K39467m493595o167546n542756k558711K908875P037965
$$ 5780608 10693787 10933254 6439659 272113 -5270643 -7829354 -4920479 2117486
43502B117486N229269p88256m415413l035224n70610p48124k603870l847288m273650
$$ 2117486 7346755 6558499 2143086 -892138 -1462748 -2210872 -4814742 -8662030 -12935680
43493a2935680l866989j055072M604831J0050282J1108323O470163j275847p433206
$$ -12935680 -16802669 -17857741 -13252910 -3202628 7905695 14375858 13100011 5666805
43485E666805q158052l532815K042759M117810K847578J824738K688520L144873
$$ 5666805 -2491247 -6024062 -3981303 136507 2984085 4808823 7497343 10642216
43477A0642216O51598l797223o373636m369698M61818K781690l77696m586517
$$ 10642216 11293814 7496591 1122955 -3246743 -2784925 -3235 -380931 -4967448
43469d967448k483148N484734R591051L562469o042236q684151l989796J57922
$$ -4967448 -7450596 -1965862 7625189 11187658 5145422 -3538729 -7528525 -7370603
43461g370603P22080J785843M434392L909234j171779n215008m529976k473871
$$ -7370603 -6648523 -4862680 -428288 3480946 2309167 -2905841 -7435817 -9909688
43453i909688k127689j001568K438702L843369M05734k670482O0479M649522L385897
$$ -9909688 -12037377 -13038945 -10600243 -6756874 -6351140 -9021622 -8961143 -4311621 -925724
43444i25724k935962o136902k895434J394880J601176l54992M02024M789422Q987671
$$ -925724 -3861686 -9998588 -12894022 -11499142 -9897966 -10252958 -9850934 -5061512 3926159
43435C926159Q656022L145910l407042n703433l006550K04492L96603q45250q58776
$$ 3926159 12582181 15728091 12321049 6617616 3611066 3815558 4212161 3366911 2508135
43426B508135r00973l507383p174232p744393l920536J826401O446220P585301
$$ 2508135 1607162 -1900221 -9074453 -16818846 -20739382 -18912981 -12466761 -4881460
43418d881460L967430j960773m256041o63519K858001L602n645241m839579L568259
$$ -4881460 -914030 -2874803 -7130844 -7794363 -4936362 -4932760 -10578001 -15417580 -11849321
43409a1849321J0214153P870574J15906n115343n185795k656362O3237J992768
$$ -11849321 -1635168 6235406 6351312 1235969 -3949826 -6606188 -6542951 -4550183
43401d550183K261289J059812L36081J124502J838702J149022M08988Q60871O01256
$$ -4550183 -2288894 -1229082 -893001 231501 2070203 3219225 3628213 4489084 5090340
43392E090340k451044n912491n036342M27685M916419L943522l82994k945560
$$ 5090340 2639296 -3273195 -8309537 -7881852 -2965433 978089 595095 -2350465
43384b350465k671065k556997l361355j842612L000320O318165L997013l28053
$$ -2350465 -5021530 -7578527 -10939882 -12782494 -9782174 -3464009 533004 204951
43376B04951k21210L512687M238254L90286k572779k316007l425798p557518q092776
$$ 204951 -16259 3496428 7734682 8124968 5552189 3236182 -189616 -7747134 -15839910
43367a5839910p37918P566881Q145287L545916K146186L836093J242362o274627
$$ -15839910 -16577828 -9010947 -865660 2680256 4826442 8662535 9904897 3630270
43359C630270j0065982m957881L556829P080974L314297m001984q951104o907690
$$ 3630270 -6435712 -11393593 -7836764 -755790 2558507 -1443477 -10394581 -17302271
43351a7302271P71168O101117L882078j92623K093617P469353N408019m373583
$$ -17302271 -16531103 -10429986 -6547908 -6740531 -4646914 2822439 8230458 3856875
43343C856875j0188620o064522L84606J695469J005202K971133M519427K114462
$$ 3856875 -6331745 -12396267 -12011661 -10316192 -9310990 -6339857 -1820430 294032
43335B94032l38737J164793K757783p1557l938004m059247k779606l528276l004178
$$ 294032 -44705 1120088 3877871 3806314 -131690 -4190937 -6970543 -10498819 -13502997
43326a3502997J519640L787850j745338p495089k473298R183623J2730620M766086
$$ -13502997 -11983357 -8195507 -9940845 -17435934 -19909232 -10725609 2005011 6771097
43318F771097k499337l09244N411434N451542l665m634875m657843n22113M370867
$$ 6771097 4271760 3962516 9373950 14825492 14821827 10186952 5529109 5006996 9377863
43309I377863M633669j735435q205421o572769P70372L454139j274168m995764
$$ 9377863 14011532 12276097 4070676 -2502093 -1731721 1722418 448250 -4547514
43301d547514k355128J244689L82346j628655n79663P13564q41902j728646P92077
$$ -4547514 -6902642 -5657953 -5275607 -6904262 -7483925 -6770361 -7612263 -9340909 -8548832
43292h548832J629905l194244p033003k111147O378763O963092j1663k837277
$$ -8548832 -6918927 -10113171 -17146174 -19257321 -12878558 -5915466 -5927129 -8764406
43284h764406K972613Q122144M503499l154245n681884k152161J717926K798883
$$ -8764406 -5791793 2330351 6833850 3679605 -2002279 -4154440 -2436514 362369
43276C62369K211802P49589j797558l810928k761198Q50597L364015K321085o92554
$$ 362369 2574171 3323760 1526202 -2284726 -5045924 -4195327 -831312 1489773 797219
43267G97219k023565r583L175379L767277P32149k832867l635922k528549k731908
$$ 797219 -1226346 -1235929 1939450 5706727 6438876 3606009 -29913 -2558462 -5290370
43258e290370m305762l657922O16395M732954M719373J886119M50012J401792
$$ -5290370 -9596132 -13254054 -12637659 -7904705 -3185332 -1299213 -849201 552591
43250E52591K064286J019931p7153l8404k36596j734053k859187j688842P38029
$$ 552591 2616877 3636808 3559655 3521251 3284655 1550602 -1308585 -2997427 -2259398
43241b259398J838402J028815k20491j040040j647668j684314m63761J129995
$$ -2259398 -420996 607819 387328 -652712 -2300380 -3984694 -4448455 -3318460
43233c318460J327257L40954K82273J740164K761447J950657K84579r64814j683062
$$ -3318460 -1991203 -1650249 -1367976 372188 3133635 5084292 5368871 4404057 2720995
43224B720995j454587M52299K409804J065249l393939o049872l982227p61919
$$ 2720995 1266408 1718707 4128511 5193760 1799821 -4250051 -8232278 -8994197
43216h994197r09407l279142m073183l152193k297691j34243N090066R725587
$$ -8994197 -9903604 -13182746 -17255929 -20408122 -22705813 -22840056 -17749990 -8024403
43208h024403Q537046L280878N02002J228613L73195l305107m939296k958843
$$ -8024403 512643 3793521 4295523 5524136 5897331 2592224 -2347072 -5305915
43200e305915k242506m616678m438304J607480P758768P951769M745095L201176
$$ -5305915 -7548421 -12165099 -16603403 -14995923 -7237155 714614 5459709 8660885
43192H660885K087556j494677m198379j636252K530324J595786k832801l497892
$$ 8660885 10748441 9253764 5055385 3419133 5949457 7545243 4712442 1214550
43184A214550J33523J345440k313299n979242o739246p224695p965716m529051
$$ 1214550 1348073 2693513 380214 -5599028 -12338274 -19562969 -27528685 -32057736
43176c2057736M065242J0974252J0090783M046563l32737o46801N18424M79431
$$ -32057736 -27992494 -17018242 -6927459 -2880896 -3213633 -3860434 -3342010 -2862579
43168b862579j103639k461620r22314L579346O087776J875450n641756p672121
$$ -2862579 -3966218 -6427838 -7350152 -3770806 2316970 4192420 -1449336 -9121457
43160i121457j901240M417985N242820L101256K479856K568473J370598R30301
$$ -9121457 -11022697 -6604712 -1361892 1739364 4219220 6787693 8158291 9088592
43152I088592K476132J609611m669826j0277490p230689J922613O709678K801658
$$ 9088592 11564724 13174335 8504509 -1772981 -9003670 -7081057 -371379 2430279
43144B430279l769190o266267m215220j67603L897310N501204K857340j086590
$$ 2430279 -1338911 -7605178 -11820398 -11988001 -8090691 -2589487 267853 -818737
43136h18737j106019K076422J679366m449727q855558m581200M235798P448490
$$ -818737 -1924756 151666 1831032 -2618695 -11474253 -16055453 -11819655 -4371165
43128d371165K238678m129349m426733M15912M417318M442524K798108L045558
$$ -4371165 -2132487 -6261836 -10688569 -10272657 -5855339 -1412815 1385293 4430851
43120D430851N034806M941036K78641o158580q921076o268092j799080P90150
$$ 4430851 9465657 14406693 14685334 8526754 -394322 -6662414 -8461494 -7671344
43112g671344J970968L636479M540486J878843l324230o120004l972041l18788
$$ -7671344 -5700376 -2063897 2476589 4355432 1031202 -5088802 -9060843 -9379631
43104i379631K15996j830969k007208J328471M762331M819017K175696n56081
$$ -9379631 -9163635 -10994604 -13001812 -11673341 -6911010 -2091993 83703 -472378
43096d72378k347809k614388N51392O881353J0511603N556567m777276j0220757
$$ -472378 -2820187 -5434575 -4883183 1998170 12509773 18066340 13289064 3068307
43088C068307o115366J259815M371732L704755L333249K755143o83472m959797
$$ 3068307 -3047059 -1787244 2584488 6289243 9622492 12377635 11694163 6734366
43080F734366n844393m010137l016784k011072K203653O844030N276880j765515
$$ 6734366 889973 -3120164 -6136948 -8148020 -5944367 899663 6176543 4411028
43072D411028n505813j996380K342465J626010q39566m5116J492870j037913n236962
$$ 4411028 -1094785 -3091165 -748700 877310 37744 -7372 1485498 447585 -4789377
43063d789377m881080j05112K939676J409600j368360j895386j91615K301574
$$ -4789377 -9670457 -9775569 -6835893 -5426293 -6794653 -8690039 -8881654 -6580080
43055f580080M104627L288692l60013l249128j777566K474570M987279M675990
$$ -6580080 -2475453 813239 453226 -2795902 -4573468 -2098898 2888381 7564371
43047G564371M007584L753978K112990j285449m598863o678127p107696m505618
$$ 7564371 11571955 15325933 17438923 16153474 11554611 4876484 -2231212 -6736830
43039f736830Q74296M326654J983497k100739o17528N432403P244092J621998
$$ -6736830 -5862534 -1535880 447617 -1653122 -2270650 3161753 10405845 12027843
43031A2027843l850313k380119K309621K796094r97708l410364k079053K92300
$$ 12027843 8177530 5797411 8107032 10903126 9905418 6495054 4416001 4708301
43023D708301J109810J08100k140846m094054l082723J269460M946188M022408
$$ 4708301 5818111 5926211 3785365 -308689 -3391412 -2121952 2824236 6846644
43015F846644k49831l683607m550149l621837j025765K970734N462586L390855
$$ 6846644 6596813 2913206 -1636943 -5258780 -6284545 -3313811 2148775 5539630
43007E539630j799734n289784m440550o38576L583107O410711O421268L297682
$$ 5539630 3739896 -1549888 -5990438 -6629014 -3045907 3364804 9786072 13083754
42999A3083754j216724m902333o777131n982884j503266M490723O108614P38296
$$ 13083754 11867030 6964697 187566 -5795318 -7298584 -2807861 3300753 4039049
42991D039049n760103n800477l31462L217912K200348J383804L784575N711453
$$ 4039049 -1721054 -7521531 -7852993 -4635081 -2434733 -1050929 2733646 8445099
42983H445099L574060j23277j404442j058324j928967l094475j405573K716137
$$ 8445099 12019159 11895882 10491440 9433116 7504149 4409674 3004101 5720238
42975E720238N218121L842029M67747k014576k740084k521868k303314k345290
$$ 5720238 10938359 14780388 15248135 13233559 10493475 7971607 5668293 3323003
42967C323003j907260Q6935L023154L883542M59434m667304n728731r11912L893887
$$ 3323003 1415743 1502678 4525832 8409374 8868808 4201504 -1527227 -2439139 1454748
42958A454748J550972o249904r266860j449664R884930J2273228M007768m111205
$$ 1454748 3005720 -3244184 -12511044 -13960708 -4075778 8197450 12205218 8094013
42950H094013l599186J578775K888676m82330k597419l96537L456221N442079
$$ 8094013 4494827 6073602 8962278 8479948 5882529 5485992 8942213 14384292
42942A4384292L908117j419689p995185j0463907o966668l055371l735306m608950
$$ 14384292 18292409 16872720 8877535 -1586372 -8553040 -11608411 -15343717 -19952667
42934a9952667J352487J0397110J1275675K378131m889929l007351J317535p51491
$$ -19952667 -18600180 -8203070 3072605 5450736 560807 -2446544 -1129009 -1880500
42926a880500o301980o566953p68250M151061M336650K188376L50549j238504
$$ -1880500 -8182480 -14749433 -15517683 -11366622 -7029972 -4841596 -4491047 -5729551
42918e729551k689503l029415j654576J448753N555285P814222N174877l61714
$$ -5729551 -8419054 -11448469 -13103045 -11654292 -6099007 1715215 6890092 6528378
42910F528378k595810J48302K087490p45241l910669k203956J627738K114464
$$ 6528378 3932568 4080870 6168360 5423119 1512450 -691506 936232 3050696
42902C050696J93732P397P45404n94564j918198J89418K526668J31365l501715
$$ 3050696 3244428 3251825 3997229 3402665 1484467 1673885 4200553 4331918 830203
42893H30203j064395N279260O207343P64762j999212J318699K961950j873665
$$ 830203 -234192 5045068 11252411 12017173 10017961 11336660 14298610 12424945
42885A2424945o523332m446034K85809J233458J00968J040811J401111k989785
$$ 12424945 5901613 1455579 1741388 2974846 3075814 4116625 5517736 2527951
42877B527951q413128q115468l149091N1591L06444J560593L909273L379786M08471
$$ 2527951 -5885177 -14000645 -17149736 -17098145 -16791701 -15231108 -11321835 -7942049 -7533578
42868g533578K06332L403436L928172j046219n417952k467483N433427R692771
$$ -7533578 -7327246 -3923810 4362 -1041857 -6459809 -8927292 -3493865 6198906
42860F198906N852118k327146p955156p554627k972659J273590K284755J193184
$$ 6198906 12051024 9723878 1768722 -5785905 -8758564 -7484974 -5200219 -4007035
42852d007035J334300L807701N492407K503268m202010q077316l923771M513826
$$ -4007035 -2672735 1134966 6627373 9130641 4928631 -3148685 -7072456 -2558630
42844b558630P196313K26485p663179n601208M587100J0442393N657096k536614
$$ -2558630 4637683 4864168 -2799011 -8400219 -3813119 6629274 12286370 9749756
42836I749756m962612k094050M49627J383872K192532J066844l772918p641952
$$ 9749756 4787144 2693094 3142721 4526593 6719125 7785969 4013051 -3628901
42828c628901m341737L681132P791138N445399K336457J706396k42196n665502
$$ -3628901 -7970638 -4289506 3501632 8947031 11283488 12989884 12747688 7082186
42820G082186r497783p208124k274516m59286r60287P61884M239777M658960J466818
$$ 7082186 -2415597 -9623721 -11898237 -12357523 -13317810 -12555926 -8316149 -3657189 -2190371
42811b190371k0174K961010N776925L232365k068939k736195K728870O950343
$$ -2190371 -2210545 750465 6527390 9759755 7690816 4954621 7683491 14633834
42803A4633834L533005l522792m679812J889487P374521M481358k530407m374448
$$ 14633834 18166839 14644047 9964235 11853722 19228243 23709601 21179194 16804746
42795A6804746M4932K977193m26658n882976p120472m336301k346592l137184
$$ 16804746 16849678 19826871 19400213 13517237 6396765 2060464 -286128 -3423312
42787c423312l596044O110P036473J1963698R042389j105619j0194583j0154320
$$ -3423312 -7019356 -7013246 23227 11986925 21029314 19923695 9729112 -425208
42779d25208k356989L959549K860792k136414m109742j073892L902014P376390
$$ -425208 -2782197 1177352 4038144 1901730 -2208012 -3281904 620110 7996500
42771G996500P216825K524658m211076o839706j827753N858049P374334Q21742
$$ 7996500 15213325 17737983 13526907 6687201 4859448 10717497 18091831 18913573
42763A8913573o421994p199454k668628J155735J595933N44450m09906j519776
$$ 18913573 12491579 5292125 2623497 3779232 5375165 5919615 5509709 3989933
42755C989933j705945J320850N904819N843210j272100q536514p917135j753205
$$ 3989933 2283988 3604838 9509657 15352867 14080767 5544253 -2372882 -4126087
42747d126087Q14812j745440j279487N433794R677112M684708k125267n53254
$$ -4126087 -3311275 -5056715 -6336202 -902408 8774704 13459412 11334145 10780891
42739A0780891N182924L149324n686533p899296N22408P228323L094559m472995
$$ 10780891 15963815 19113139 13426606 5527310 6049718 13278041 16372600 11899605
42731A1899605n386603k425366k909709m304613k10940N776132M984914j293763
$$ 11899605 6513002 4087636 1177927 -3126686 -3337626 2438506 7423420 6129657
42723F129657m034672j687328j055214l698709l649197L56450K235934M92677
$$ 6129657 2094985 407657 -647557 -4346266 -7995463 -7639013 -5403079 -4910402
42715d910402J217576N480130N171710k938535r590639o797456M0674K258535
$$ -4910402 -3692826 1787304 6959014 4020479 -5570160 -12367616 -12326942 -10068407
42707a0068407J920683N540891J0194924P598832j140040o256570m214810j643570
$$ -10068407 -8147724 -2606833 7588091 15186923 14046883 7790313 3575503 1931933
42699A931933l292262n174651k640918J845903K951729N5586k736207j806970
$$ 1931933 -1360329 -6534980 -9175898 -7329995 -4378266 -4322680 -7058887 -8865857
42691h865857K349966N217367K352009m641876q132198l683881L296964M874538
$$ -8865857 -6515891 -1298524 1053485 -3588391 -11720589 -15404470 -12107506 -7232968
42683g232968J953595J880365O210740Q489463M561661k163581o968921q571613
$$ -7232968 -5279373 -3399008 2811732 11301195 15862856 13699275 6730354 -1841259
42675a841259o314332J84658O449430N452775k397110q134281o211120j059971
$$ -1841259 -8155591 -7970933 -1521503 3931272 1534162 -6600119 -12811239 -13871210
42667a3871210J375425J408187J065789n73972k661664q56800M160966M591235
$$ -13871210 -12495785 -11087598 -10021809 -10595781 -13257445 -14114245 -9953279 -5362044
42659e362044j553152m401510K235311Q545913L594746n704586n251546K371843
$$ -5362044 -6915196 -11316706 -9081395 -535482 3059264 -2645322 -7896868 -5525025
42651e525025K018447p927884j1983496k806477P275042O381624j29857j607950
$$ -5525025 -3506578 -11434462 -23417958 -26224435 -18949393 -12567769 -12697626 -14305576
42643a4305576J472536K925406K958734M571294N206033J805161j535894J05528
$$ -14305576 -12833040 -9907634 -6948900 -2377606 2828427 4633588 3097694 3203222
42635C203222L526324L064672L22501q6218K19699k754095o215701m461554Q46530
$$ 3203222 6729546 9794218 10116719 10030501 10250200 7496105 1280404 -3181150 -2334620
42626b334620L074117J240668r3754J11716j319617m316857n001320k309914R87490
$$ -2334620 739497 1980165 1886411 1998127 678510 -3638347 -8639667 -10949581 -9962091
42617i962091K895079K563830j272712o539153o595655K86421N408730K397264
$$ -9962091 -7067012 -4503182 -5775894 -12315047 -18910702 -18624281 -13215551 -10818287
42609a0818287o49909O168890J5251872J0879180m340575j0765967j617840P109283
$$ -10818287 -11468196 -5299306 9952566 20831746 16491171 5725204 4107364 11216647
42601A1216647K965547m623974k934255K651046N2758p884366q909699j969696
$$ 11216647 14182194 9558220 6623965 9275011 9327769 1443403 -7466296 -9435992
42593i435992K556911J25845l331316k905050j67951K582366M865581N127101
$$ -9435992 -6879081 -6753236 -10084552 -12989602 -13157553 -10575187 -5709606 -582505
42585e82505K392318k36280J76665J032260p77158k164426M41131K751852r82383
$$ -582505 1809813 1573533 1750198 2782458 2005300 -159126 282005 3033857 2051474
42576B051474o594249n215319K271852O687121N198461L157521J604708m387554
$$ 2051474 -4542775 -9758094 -7486242 -799121 4399340 7556861 9161569 4774015
42568D774015j2790420j2998068k302484P361375O087754k39514r62909K900851
$$ 4774015 -8016405 -21014473 -23316957 -15955582 -9867828 -10107342 -11070251 -8169400
42560h169400L097628p75540j554538K399034M589606J541509j857640q66595
$$ -8169400 -5071772 -5847312 -7401850 -5002816 -413210 1128299 -729341 -1595936
42552a595936J554639j05119m849259o108172j096818M963172N823677K519732
$$ -1595936 -41297 -146416 -4995675 -11103847 -12200665 -7237493 -1413816 1105916
42544A105916Q72686J886732L56143n300029q252372l303394L687551L890841
$$ 1105916 1978602 3865334 4221477 -1078552 -9330924 -12634318 -8946767 -5055926
42536e055926o92727p65194M595037O387496R64545l840870j753346K362916J739430
$$ -5055926 -5748653 -6513847 -1918810 4468686 5433231 1592361 -160985 2201931 3941361
42527C941361j547485k013229n29311j176670l181126l330259k622938l403394
$$ 3941361 2393876 380647 -148664 -1325334 -4506460 -7836719 -10459657 -13863051
42519a3863051l155857J497760P051947O884084J557127j714459K89282K979212
$$ -13863051 -17018908 -15521148 -8469201 -1585117 -27990 -1742449 -1453167 1526045
42511A526045J406261l522092p068740n388121J508776Q534863Q904874K226337
$$ 1526045 2932306 -589786 -7658526 -13046647 -11537871 -3003008 5901866 8128203
42503H128203l275453j071688M071605K753774n169802j0537346p861071j157999
$$ 8128203 4852750 3781062 7852667 10606441 5436639 -5100707 -12961778 -14119777
42495a4119777L467608M378661K716873K99768J73974L666657O443494L333689
$$ -14119777 -10652169 -6273508 -3556635 -3256867 -3082893 583764 7027258 10360947
42487A0360947l032910n279722k849373k116825m206511k851369K612355L242640
$$ 10360947 7328037 2048315 -801058 -2917883 -7124394 -9975763 -7363408 -4120768
42479d120768m281062q841513o76262J2113685J4146104M595615l511841l061264
$$ -4120768 -8401830 -17243343 -17919605 -5805920 8340184 12935799 9423958 6362694
42471F362694M02502J516246K452200M446557K700712m647114j0350437p357288
$$ 6362694 6765196 8281442 10733642 15180199 17880911 13233797 2883360 -4473928
42463d473928R06036N564853L936631N65653p69619o24856n58322p22811p26999
$$ -4473928 -3567892 1996961 5933592 6499245 5729626 5104770 4546448 3823637 3096638
42454C096638j31620J327991K140084m61291n841683q307910l890854L251877
$$ 3096638 2965018 4293009 6433093 5971802 130119 -8177791 -12068645 -8816768
42446h816768N891673L736944K690555M539215M316172k88341m073076l127442
$$ -8816768 -2925095 811849 3502404 8041619 12357791 12069450 7996374 4868932
42438D868932k036356n736861r282454m673905M677226O934948J49605l479448
$$ 4868932 2832576 -2904285 -12186739 -16860644 -12183418 -5248470 -5098865 -8578313
42430h578313L695358J2036351R079586j088873m513890O44443K225828n157505
$$ -8578313 -4882955 7153396 16232982 15144109 10630219 11274662 13500490 8342985
42422H342985j0717769m449548P038167J0342373M095654j790933k068711j171525
$$ 8342985 -2374784 -6824332 213835 10556208 14651862 12860929 10792218 9620693
42414I620693k600147k744717J627584O549854O139724Q77209l682346m427547
$$ 9620693 7020546 4275829 5903413 12453267 18592991 19470200 15787854 11360307
42406A1360307l135403k116059q41252J964281M739707L855196j365609n919384
$$ 11360307 8224904 6108845 5267593 7231874 11971581 15826777 14461168 8541784
42398H541784l903383L685668Q727678N374962k597943o496204l136050K500787
$$ 8541784 4638401 8324069 17051747 22426709 19828766 13332562 10196512 12697299
42390A2697299M087156L40680m907100o304544j346011O183310Q449454K565209
$$ 12697299 16784455 17125135 12218035 5913491 4567480 10750790 19200244 21765453
42382B1765453m480616m444829O01830J913697j725095k280351L251784O561008
$$ 21765453 17284837 12840008 13441838 15355535 13630440 11350089 14601873 21162881
42374B1162881J408981n290420m025907K008319K190494m539146q663235n198709
$$ 21162881 22571862 17281442 13255535 15263854 17454348 12915202 4251967 -946742
42366i46742N39816L555901N729611Q403513P216415j11602p270096o897459o12719
$$ -946742 -406926 3148975 8878586 17282099 24498514 24386912 17116816 10219357 9606638
42357I606638L999520L534090R40444l27129K04513J260732J192011q80928l199497
$$ 9606638 13606158 17140248 18080692 17753563 17958076 19218808 20410819 19529891 16330394
42348A6330394k551179R89045L474249L123598K865502M143808L248673j768186
$$ 16330394 13779215 14768260 18242509 21366107 24231609 28375417 31624090 29855904
42340B9855904n614029l290007J275150J396728j311958p04333J888698j89471
$$ 29855904 24241875 20951868 22227018 23623746 22311788 21607455 23496153 23306682
42332B3306682n455071m419572M598324J0847144P016460p9176j080138K134067
$$ 23306682 17851611 13432039 18030363 28877507 35893967 35814791 34734653 36868720
42324C6868720K093591j505504l333212k046094j11208K266559N098923M203441
$$ 36868720 38962311 37456807 34123595 32077501 31966293 34232852 39331775 43535216
42316D3535216k409535p028149j397533Q395393P918733l809756j0767295k544352
$$ 43535216 41125681 34097532 32699999 41095392 49014125 45204369 34437074 31892722
42308C1892722J0658474J3239154N590230K28206J979170L660232O90418j114494
$$ 31892722 42551196 55790350 61380580 61608786 63587956 67248188 67938606 66824112
42300F6824112L767964J0003863Q258290p50535n885898K22540J1782819J7361539
$$ 66824112 70592076 80595939 88854229 88103694 82217796 82440336 94223155 111584694
42292A11584694J3561711P179779N159756P407347J0482345J3430812J6685454
$$ 111584694 125146405 132326184 137485940 144893287 155375632 168806444 185491898
42285A85491898J8662658J7626151J5086745J3883854J4720404J7658856K3998095
$$ 185491898 204154556 221780707 236867452 250751306 265471710 283130566 307128661
42278C07128661L2239300L5584104K9802866K1044109J8126210J8744062J2685486
$$ 307128661 339367961 374952065 404754931 425799040 443925250 462669312 475354798
42271D75354798j250307j2376179j4818350j5879973k2059430k7379228k4570153
$$ 475354798 474104491 461728312 446909962 431029989 408970559 381591331 357021178
42264C57021178j9342819k2156550l0910966l3693728k6688051j8270753j5304216
$$ 357021178 337678359 315521809 284610843 250917115 224229064 205958311 190654095
42257A90654095j5390134j4288636j2307417j0752667r074318p944674r091249
$$ 190654095 175263961 160975325 148667908 137915241 128840923 120896249 111805000
42250A11805000j0375205p425693j902998j070621o426272j0069181o605024j786152
$$ 111805000 101429795 94004102 92101104 91030483 84604211 74535030 67930006 66143854
42242F6143854l341716q689464r151155l336946J261719m69828m993496o570062
$$ 66143854 62802138 54112674 44961519 41624573 42886292 42416464 37422968 30852906
42234C0852906n062743m308950n235323m268472P97143N938072N088710q57464
$$ 30852906 25790163 21481213 16245890 11977418 12774561 18712633 23801343 22943879
42226B2943879l477333K012983R066100Q476375J664690k075669k36378K13099
$$ 22943879 19466546 21479529 30545629 39022004 40686694 38611025 38374647 38587746
42218C8587746l856030n706672p72781M214380J477509n285909p233541m241322
$$ 38587746 34731716 29025044 28252263 32466643 33944152 28658243 21424702 17183380
42210A7183380l044994m702300l927508l4065J242961j898810l757709m41441
$$ 17183380 14138386 9436086 5508578 5474513 6717474 4818664 1060955 619514
42202F19514M470151O490864N987592M145078n23829p254366j0067265n290356
$$ 619514 5089665 11580529 17568121 21713199 21189370 13935004 3867739 -1422617
42194a422617J692378L024599n83422j387126L425696P272536L678115l948521
$$ -1422617 269761 3294360 2710938 1323812 4749508 12022044 15700159 11751638
42186A1751638n926742J213823R477926Q672293p29224p654962m338956L734065
$$ 11751638 5824896 7038719 16516645 25188938 24459714 16804752 12465796 16199861
42178A6199861N437410j106730o874386m867471J439284M663476L141462J76833
$$ 16199861 21637271 20530541 13656155 8788684 10227968 14891444 18032906 18209739
42170A8209739k244122l989396l412674J011592O021873N617315q83478o762572
$$ 18209739 15965617 11976221 8563547 9575139 15597012 21214327 20330849 13568277
42162A3568277o132724j341618Q70560j209563k690044j11881L029538J449402
$$ 13568277 7435553 6093935 6964495 5754932 3064888 2953007 5982545 7431947
42154G431947l883417o912319m901551j230193Q82570K709900N670259O962194
$$ 7431947 3548530 -3363789 -8265340 -9495533 -8612963 -5903063 -232804 6729390
42146F729390L554289k361334o061410o148443l789866R48359O935498R158380
$$ 6729390 10283679 7922345 1860935 -4287508 -8077374 -7129015 -193517 8964863
42138H964863M762638k95035J455767O509811M810233l303342o152348J80101
$$ 8964863 13727501 13432466 14888233 21398044 26208277 22904935 16752587 16932688
42130A6932688M211114k481088j0635615p784376J749275M643776L72468K2647
$$ 16932688 21143802 18662714 8027099 242723 1991998 6635774 7008242 7030889
42122G030889N558331O349232j259143o003704K09290Q642801P230329j440413
$$ 7030889 12589220 18938452 17679309 11675605 11884895 20527696 27758025 26317612
42114B6317612o065023m332637l420938n764838n740823j207510J716480j013478
$$ 26317612 20252589 15919952 12499014 6734176 993353 -214157 1502323 488845
42106D88845m050080j133959M435044M612655n81482k582725K440029O790858
$$ 488845 -3561235 -4695194 -260150 4352505 3771023 1188298 3628327 10419185
42098A0419185K226217o997135r118587j628415M927146K178663m431220m789581
$$ 10419185 12645402 5648267 -3470320 -5098735 -171589 2007074 -2424146 -7213727
42090g213727O25835K648320j745795n157840j266661O616903J1044407R012756
$$ -7213727 -6587892 -3939572 -5685367 -10843207 -12109868 -5492965 5551442 14564198
42082A4564198K482270m826078q412347n348375J155871L496400q52724n469600
$$ 14564198 17046468 12220390 3808043 -1540332 -384461 3111939 2259215 -3210385
42074c210385l931983J387565L657004J155909k380773m286448m625576l121246
$$ -3210385 -7142368 -5754803 -2097799 -941890 -3322663 -7609111 -12234687 -15355933
42066a5355933L91089L342678K984274J003591J202403L128013K732188n94976
$$ -15355933 -14964844 -11622166 -8637892 -7634301 -6431898 -3303885 -571697 -1166673
42058a166673k526817m39013K660415K644087l86448l006246k511944J118662
$$ -1166673 -3693490 -4132503 -1472088 1171999 785551 -2220695 -4732639 -3613977
42050c613977N384879O625738L140098k397544n263052l711247k70442J582032
$$ -3613977 1770902 8396640 11536738 9139194 3876142 164895 -105547 1476485
42042A476485L47064k950467m940526k008354M762105Q310672L475283m921187
$$ 1476485 1823549 -1126918 -6067444 -8075798 -3313693 4996979 8472262 3551075
42034C551075p027172q21127N788363O499704L782421K157826R12022k065428
$$ 3551075 -3476097 -4297224 1491139 7990843 11773264 13931090 14843112 12777684
42026A2777684m512440l423480p60475l6374r9281K044646M532342K886914k223212
$$ 12777684 8265244 4841764 4081289 4044915 3945634 5990280 10522622 13409536 11186324
42017A1186324n452671m727596l155139k852149k357207q93006J10439Q59685
$$ 11186324 5733653 1006057 -2149082 -5001231 -7358438 -8251444 -8141005 -7281320
42009g281320L325129O126863M894632j4550j957004K304865O760001M741325
$$ -7281320 -3956191 2170672 7065304 7050754 5093750 7398615 14158616 18899941
42001A8899941j280766m221594k968739j809493j854859m96945J590593P42172
$$ 18899941 17619175 13397581 10428842 8619349 6764490 6267545 7858138 8600310
41993H600310j889439q29182L287160K106325o976817j3407303p065571N994550
$$ 8600310 6710871 5881689 9168849 11275174 4298357 -9108946 -16174517 -10179967
41985a0179967J0713400L687892l312405j456313L359137J635726m482180m986768
$$ -10179967 533433 4221325 908920 -547393 2811744 4447470 -34710 -5021478
41977e021478K429386Q850784O660993q61600n111557l016215J327084L530320
$$ -5021478 -2592092 6258692 12919685 12058085 6946528 3930313 5257397 8787717
41969H787717L201618J442798j954431o485490q470235m455947K845315N883483
$$ 8787717 11989335 13432133 11477702 4992212 -3478023 -7933970 -5088655 794828
41961G94828J609714l705198k619800K800114L728111k414257p891818n741842
$$ 794828 2404542 -1300656 -3920456 -1120342 2607769 193512 -7698306 -13440148
41953a3440148P71154M001344K759687J614453K170176J651422n53201j396131
$$ -13440148 -12668994 -8667650 -5907963 -4293510 -2123334 -471912 -1025113 -2421244
41945b421244k8766P04133K41294J986820O277052P409542K221236l192216j531768
$$ -2421244 -2450010 -1745877 -1504583 482237 6759289 14168831 16390067 13197851 11666083
41936A1666083M082118M019309l097052p614092l197519L258099J539101o618374
$$ 11666083 15748201 19767510 16670458 9056366 5858847 9116946 10656047 4037673
41928D037673r415561j277671R606963J2184124N810425j253959l295864k008165
$$ 4037673 -5377888 -6655559 2951404 15135528 20945953 19691994 16396130 14387965
41920A4387965r67672o48933l78725j014412k844407l579018j544704J004245
$$ 14387965 13420293 12771360 12392635 11378223 8533816 4954798 3410094 4414339
41912D414339R54487p65818r21700M11676J69117j823289j819794J771866N439612
$$ 4414339 5368826 4603008 3681308 4092984 4262101 2438812 619018 2390884 7830496
41903G830496N732348L704376J717569n67477l610197m668522j612924K053316
$$ 7830496 13562844 17267220 18984789 18417312 14807115 10138593 8525669 10578985
41895A0578985J073816l565475n714290l236497p86688k040510m248018l312580
$$ 10578985 11652801 8087326 2373036 -863461 -1650149 -3690659 -7938677 -11251257
41887a1251257q2688K108757K936123L809511L470528q3101m249677l834377Q87461
$$ -11251257 -11333945 -9225188 -6289065 -2479554 990974 907873 -3341804 -7176181 -6288720
41878f288720L248757m96608n437082n020755j05619L719297N171393P308467
$$ -6288720 -3039963 -3536571 -8973653 -13994408 -14100027 -10380730 -5209337 2099130
41870B099130R184115N105598m887534j0731702m768122N890560P487789j306798
$$ 2099130 11283245 16388843 11501309 769607 -3998515 1892045 9379834 8073036
41862H073036p401961k200004O354415O182523j491664n687514k937327q69427
$$ 8073036 671075 -1528929 4825486 11008009 9516345 3828831 891504 22077
41854B2077m167753o726686k046961N918467Q580941M782923L80034j515498k860252
$$ 22077 -4145676 -10872362 -12919323 -7000856 1580085 6363008 6743042 5227544 2367292
41845B367292m085813k254551K739428N955871M104908J61705j496382r00109
$$ 2367292 -1718521 -3973072 -1233644 4722227 8827135 8988840 7492458 6592349
41837F592349m65979n25438l94482j159285l512434m882076k664279J307235L343502
$$ 6592349 6126370 5600932 5206450 4047165 534731 -4347345 -7011624 -5704389 -2360887
41828b360887L173589K445517J83905m529306o988288j510723Q013616J0479134
$$ -2360887 812702 3258219 3442124 -1087182 -8075470 -9586193 -1572577 8906557
41820H906557L008534m149638k681394J858987K51694n101311m862060J228902
$$ 8906557 11915091 7765453 5084059 6943046 7194740 2093429 -2768631 -1539729
41812a539729L966464l28639m828061l951473p73659P05030K371108O147989Q207877
$$ -1539729 2426735 2098096 -2729965 -6681438 -7455097 -6750067 -4378959 1769030 9976907
41803I976907N063980L66236o74562R8542k763819q623078j0965675o623294N67912
$$ 9976907 15040887 15407123 14732561 14831103 12067284 3444206 -7521469 -14144763 -13576851
41794a3576851N255817N382514J792017k711668l979444l68841L810689K838438
$$ -13576851 -8321034 -2938520 -1146503 -3858171 -7837615 -8206456 -4395767 -1557329
41786a557329k046485l414958J914689Q026454Q340332M684511L410494N043998
$$ -1557329 -3603814 -7018772 -5104083 2922371 11262703 15947214 19357708 24401706
41778B4401706L669885l110946r207258q107621k221955N42556j940242l702272
$$ 24401706 28071591 24960645 15753387 7645766 5423811 5966367 4026125 323853
41770C23853o52636K745229O37269m498885n124261J46491M925806M782164K329544
$$ 323853 -328783 2416446 3053715 -1445170 -6569431 -6422940 -1497134 3285030 5614574
41761E614574R16616o77595l752074m935402q02381N854665R092229P280763L468131
$$ 5614574 6531190 5853595 2101521 -2833881 -3636262 2218403 11310632 18591395 22059526
41752B2059526k4998l193411n487196n380385k962204l56284M04159j471820n100235
$$ 22059526 22034528 18841117 13353921 7973536 5011332 4655048 5059207 3587387 -1512848
41743a512848p088883l598555M165820R002946N691344j915163n294683j435280
$$ -1512848 -8601731 -12200286 -8034466 968480 6659824 4744661 -550022 -1985302
41735a985302M554490N804280P6685q501318j1917559n233103O430943J1567922
$$ -1985302 2569188 8373468 8450153 -51165 -11968724 -17201827 -10770884 797038
41727G97038O085335j357179k106295N36811p96579l743330p92737N813799O012239
$$ 797038 6882373 5525194 3418899 3955710 3159131 -584199 -1376936 4436863 10449102
41718A0449102j404902o035616k116690L495177L569235P58276K34236O10659
$$ 10449102 9044200 3008584 891894 4387071 7956306 8714582 8948818 9559477
41710I559477j459441m289527m909774m474023m540849k940385J483733M552783
$$ 9559477 8100036 3810509 -1099265 -5573288 -10114137 -13054522 -11570789 -7018006
41702g018006K191943l471537p307131o772968j824965N641345R910837N554471
$$ -7018006 -4826063 -8297600 -15604731 -22377699 -24202664 -18561319 -8650482 -3096011
41694c096011l514303o409004l04858N267412L631228N93137K242557L727590
$$ -3096011 -6610314 -13019318 -13324176 -8056764 -4425536 -3832399 -1589842 2137748
41686B137748j88416l212009J650664P554711M230698l247638j815671P038655
$$ 2137748 1949332 -1262677 387987 7942698 12173396 8925758 7110087 14148742
41678A4148742Q713646q87074r335677p710333j986547k13707j285349j754446
$$ 14148742 22862388 21975314 12639637 4929304 2942757 2729050 1443701 -310745
41670c10745k615163l811524j861831K031755J063420n109974p126698k62230
$$ -310745 -2925908 -6737432 -8599263 -6567508 -5504088 -10614062 -17740760 -18002990
41662a8002990P486457P824373L602974J201498K63961j541548j670259J413112
$$ -18002990 -10516533 -2692160 910814 2112312 2376273 834725 -835534 577578
41654E77578K796611n08821k860398K76745L236875j78099n134882m090372p7203
$$ 577578 3374189 2865368 4970 281715 3518590 3340491 -1794391 -5884763 -5961966
41645e961966k93251k252101Q22233N189428J416975q088056j0988371m570798
$$ -5961966 -6255217 -8507318 -7685085 -2495657 -1078682 -9166738 -20155109 -24725907
41637b4725907J064597J201270L056834R595081J1289870K218171p580452o190043
$$ -24725907 -23661310 -22460040 -19403206 -9808125 1481745 3699916 -3880536 -10070579
41629a0070579K447394N838036J895973o76885K296020N577978M454335M91336
$$ -10070579 -7623185 -1785149 110824 -566061 1729959 7307937 11762272 12253608
41621A2253608l587860p305710r014508n520351K116109P224173N168207p49990
$$ 12253608 8665748 1360038 -7654470 -13174821 -11058712 -3834539 1333668 583678
41613E83678l760773j702816J948664L472747K466908L92443j845074l728772
$$ 583678 -3177095 -4879911 -2931247 541500 3008408 3400851 1555777 -2172995
41605b172995l928792j240557K956797M871750K463414j442052k193086Q10431
$$ -2172995 -6101787 -7342344 -4385547 486203 2949617 1507565 -685521 124910
41597A24910L571985L010819L00722k220758m399500o347923n971613j963705
$$ 124910 3696895 6707714 7008436 4787678 388178 -5959745 -11931358 -13895063
41589a3895063K255742J750016k796689n086660j474920M228815O213988L999155
$$ -13895063 -11639321 -9889305 -12685994 -17772654 -19247574 -15018759 -8804771 -4805616
41581d805616J450985N83161p1602j717026l476982m406456m158668j521225M015491
$$ -4805616 -3354631 -2771470 -2843072 -4560098 -8037080 -12443536 -16602204 -18123429 -14107938
41572a4107938Q606106O609368j075241o110177l828309k21537k090896m995069
$$ -14107938 -5501832 1107536 32295 -6077882 -9906191 -10127728 -12218624 -17213693
41564a7213693O2305J0350101J3014533M331992m069420k938647J538211K92073
$$ -17213693 -17151388 -6801287 6213246 10545238 6475818 3537171 5075382 5367455
41556E367455k769128J024429P717764N520817n299791j1261667n717229K543465
$$ 5367455 2598327 3622756 11340520 16861337 11561546 299879 -5417350 -2873885
41548b873885M212029J490537q4155j437208m391434m952823n66261K650892j148693
$$ -2873885 1338144 2828681 2744526 1307318 -3084116 -8036939 -8603200 -5952308 -7101001
41539g101001o568711m293637M252132R115929O632551K673356J782688K081847
$$ -7101001 -13669712 -17963349 -13711217 -4595288 2037263 4710619 6493307 8575154
41531H575154J611712J449386J047335k013068n902283n411485q48250J361007
$$ 8575154 10186866 11636252 12683587 10670519 4768236 -643249 -1491499 -130492
41523a30492o53480r68019L053991M971016M21292l850769l54429N895384M445986
$$ -130492 -783972 -1751991 1302000 6273016 6694308 2843539 2489110 8384494 12830480
41514A2830480l876174q043880l733190J445193J202893q80949m5279J059832
$$ 12830480 8954306 910426 -2822764 -1377571 -174678 -1055627 -1100906 -41074
41506d1074j387238m001882j510528L476627L788468q39138l169450K09247L900023
$$ -41074 -1428312 -5430194 -6940722 -3464095 324373 -514765 -3684215 -3474968 425055
41497D25055K522892j171545j243175K122363L457762P59113j810455o47888K240745
$$ 425055 2947947 1776402 533227 2655590 6113352 6872465 5062010 4414122 6654867
41488F654867L032421J510007m37032l146164p659317j1043303q521831j186620
$$ 6654867 9687288 11197295 10760263 7614099 -45218 -11088521 -19610352 -20796972
41480b0796972L570437J892314r98129Q82817M705412L657604j287369k052913
$$ -20796972 -17226535 -15334221 -16332350 -15449533 -10744121 -7086517 -8373886 -10426799
41472a0426799L957928R369039P337507M98701l977446l408314q7911K963301
$$ -10426799 -6468871 2900168 10237675 10736376 6758930 3350616 3262705 6226006
41464F226006L022136j451572o920517n942945K973872J0727606Q531864j68035
$$ 6226006 9248142 7796570 876053 -5066892 -2093020 8634586 17166450 16998415
41456A6998415n275386m176085k188175j237715J947685O072588M214614m077321
$$ 16998415 11723029 7546944 5358769 4121054 6068739 12141327 16355941 12278620
41448A2278620q866998l515847N021462O058486k78155n401478n161596k943571
$$ 12278620 3411622 -104225 4917237 10975723 10697568 5296090 134494 -2809077
41440b809077j826035o95979J592173L412155K855314J04361l027667m326543
$$ -2809077 -4635112 -5331091 -3738918 -326763 2528551 2632912 -394755 -4721298
41432d721298k930196j103922k062992m708545m095226P63586M287503L063760
$$ -4721298 -7651494 -8755416 -10818408 -15526953 -19622179 -18858593 -14571090 -11507330
41424a1507330J811365N094600Q331893M898783j726867k518972K220008L030854
$$ -11507330 -9695965 -4601365 3730528 8629311 6902444 4383472 6603480 9634334
41416I634334l086296p780926m997323K84535J729953J318841K949237L790263
$$ 9634334 6548038 -1232888 -6230211 -5945676 -4215723 -2896882 52355 3842618
41408C842618p5516m678997l278505K738655O022751M257796J274873j410859
$$ 3842618 3767102 -911895 -4190400 -1451745 4571006 8828802 10103675 8692816
41400H692816n768648r643729o640885L372647J0714067P494253j974143p092000
$$ 8692816 2924168 -6719561 -13360446 -9987799 726268 8220521 6246378 -845622
41392h45622l918828K453485N988903N165475J455294k778708m554843k459913
$$ -845622 -4764450 -2310965 3677938 8843413 10298707 7519999 2965156 505243
41384E05243M77871n97683n724172r119741o296434O91181O815417R744624R427238
$$ 505243 983114 385431 -5338741 -14458482 -20754916 -20063735 -13248318 -3503694 5923544
41375E923544N399777j246475n462690l029863K896835N030868J662136k069265
$$ 5923544 11323321 10076846 4614156 1584293 4481128 9511996 11174132 9104867
41367I104867k835293k848886l451740j920066J896704K538266k230941n668964
$$ 9104867 6269574 3420688 -31052 -1951118 -54414 2483852 252911 -5416053
41359e416053j886598L870076L053663k202958k828768J705448K736628k426831
$$ -5416053 -7302651 -3432575 -378912 -2581870 -5410638 -3705190 -968562 -3395393
41351c395393o017455l424826m80112j788219j745690M668246J0074302M420589
$$ -3395393 -9412848 -12837674 -13317786 -15106005 -16851695 -12183449 -2109147 2311442
41343B311442p537426j0018426K052552J4961582J3747921R55833q044413n154005
$$ 2311442 -5225984 -15244410 -13191858 1769724 15517645 16473478 8429065 3275060
41335C275060J768961J211230o622245j1527427q034542j654478J099869K018330
$$ 3275060 5044021 6255251 -366994 -11894421 -19928963 -21583441 -20483572 -18465242
41327a8465242N455011Q876983O910636J656032K08626L119309M229138J726789
$$ -18465242 -13010231 -4133248 2777388 4433420 4642046 7761355 11990493 13717282
41319A3717282j05819o94116m141463q556410o108556K365161N108850k048963
$$ 13717282 13611463 12917347 8775884 219474 -5889082 -3523921 1584929 -464034
41311d64034p417642k237265M660144K516849k545168P61602P580154M924981
$$ -464034 -7881676 -10118941 -5458797 -2941948 -5487116 -4725514 2854640 7779621
41303G779621m638798o303973J735969N305725j635803p787334m299465K160302
$$ 7779621 3140823 -3163150 -1427181 3878544 2242741 -5544593 -9844058 -7683756
41295g683756K990687N24321m70678k019248n244708m253212L245848Q641207
$$ -7683756 -4693069 -4168748 -4639426 -6658674 -11903382 -16156594 -12910746 -4269539
41287d269539N045418j181413j043486K756897K378621j128524j615475l64032
$$ -4269539 775879 -405534 -1449020 1307877 3686498 2557974 942499 578467
41279E78467k968063p110019n445756P19707K240453k858871n804834p18679P240550
$$ 578467 -2389596 -9499615 -14945371 -14225664 -11985211 -14844082 -20648916 -21367595 -14127045
41270a4127045J0556396Q673890N068867J319400j814250k232143L55570K304511
$$ -14127045 -3570649 5103241 10172108 11491508 9677258 7445115 7800685 10105196
41262A0105196N87186k827512m071702k998391k767341m660178o006359l910996
$$ 10105196 10692382 7864870 3793168 794777 -1972564 -6632742 -12639101 -16550097
41254a6550097M16982K585152M99650k570943k044984J918634N089357N340104
$$ -16550097 -16133115 -13547963 -13048313 -15619256 -17664240 -15745606 -10656249 -5316145
41246e316145M475493L620556J321708k183125l507780j638265m58458k310647
$$ -5316145 -840652 2779904 4101612 1918487 -1589293 -3227558 -3686016 -5996663
41238e996663l351308K77048N392338N981427J704036k755754m526535m021098
$$ -5996663 -9347971 -9070923 -3678585 2302842 4006878 1251124 -3275411 -7296509
41230g296509j830032J155260K655636K346078L429401O412663N561886k105390
$$ -7296509 -9126541 -7971281 -5315645 -2969567 459834 6872497 12434383 10328993
41222A0328993q770219n544894K872322L928555l290814o156806J597924R645151
$$ 10328993 1558774 -3986120 -1113798 2814757 -476057 -6632863 -5034939 4610212
41214D610212O540545l729470q467094l635415L312743M799208O11177m551626
$$ 4610212 11150757 7421287 -1045807 -4681222 -1368479 3430729 4041906 -509720
41206e09720n974154k127079L530334M947913L32611m872567m325199J511093
$$ -509720 -6483874 -8610953 -5080619 -132706 199905 -4672662 -8997861 -7486768
41198g486768O481475O200498K064683j337380j075487J514946K670325J297681
$$ -7486768 -1005293 5195205 7259888 5922508 4847021 6361967 9032292 10329973
41190A0329973R88804M442317P529976L812274n212967j0389378p158732j567621
$$ 10329973 11318777 15761094 23291070 27103344 21890377 11500999 4342267 2774646
41182B774646p30665k820014j549435L388622O258643L796742j403155n394793
$$ 2774646 2043981 -776033 -2325468 1063154 7321797 11118539 9715384 4320591
41174D320591o555782m850274j017410K776911L837058J518657j863467l075106
$$ 4320591 -2235191 -7085465 -8102875 -5325964 -1488906 29751 -1833716 -4908822
41166d908822j099168J378929N73863l120865m380275k23951M373073L113127
$$ -4908822 -6007990 -4629061 -4055198 -7176063 -11556338 -11780289 -7407216 -4294089
41158d294089j184879K0033P028796R854074L007754n872875p242875k443247
$$ -4294089 -5478968 -5458935 1569861 11423935 14431689 8558814 1315939 -1127308
41150a127308J057363J292262J279569J311516l47631j796521m576K662201J205232
$$ -1127308 -69945 1222317 2501886 3813402 3465771 1669250 1664674 4326875 5532107
41141E532107l801300o869229n567558k362683L82896K048081J839940L55129
$$ 5532107 1730807 -5138422 -10705980 -13068663 -12685767 -10637686 -8797746 -8442617
41133h442617J093716N102103O870264J958370m368500m109700M41677K79860
$$ -8442617 -7348901 -2246798 4623466 6581836 2213336 -1896364 -1454687 -1174827
41125a174827m869213n670777J011744O572252M665888N83741R48213K753472
$$ -1174827 -6044040 -11714817 -10703073 -4130821 535067 1118808 2067021 4820493
41117D820493M5605m828444m696075J173778O209561N481266O92944k746472p56165
$$ 4820493 4866098 37654 -4658421 -3484643 2724918 8206184 8899128 6152656 5396491
41108E396491N644211R974024O626318j287542m878307j834431J49108m439103
$$ 5396491 11040702 21014726 27641044 26353502 21475195 19640764 19789872 15350769
41100A5350769r789909p480228O97955N419917K445924l769176p429460o834549
$$ 15350769 5560860 -1919368 -1221413 4198504 6644428 2875252 -4554208 -11388757
41092a1388757l348614N72205K777402L624319N214832O622847L787503k763497
$$ -11388757 -14737371 -14165166 -11387764 -7763445 -2548613 4074234 7861737 5098240
41084E098240n313813N05990P368716N686072k125162n278282p08187L549302
$$ 5098240 -215573 290417 7659133 13345205 11220043 5941761 5233574 8782876
41076H782876J351154l869462o468631o005571m091852k86098M786621P086573
$$ 8782876 10134030 6264568 -204063 -6209634 -10301486 -10587584 -5800963 1285610
41068A285610M152318q00788l047541j854599O60577L008287L895154J373756
$$ 1285610 5437928 4637140 1589599 -265000 395577 3403864 7299018 8672774
41060H672774m186169q354445p041711j314883M546848Q055741Q911784O291575
$$ 8672774 4486605 -3867840 -10909551 -12224434 -7677586 378155 9289939 15581514
41052A5581514k87495p592060j0082925o341307j485700q10434k723630j416167
$$ 15581514 15294019 7701959 -2380966 -8722273 -10207973 -11018407 -13742037 -15158204
41044a5158204L810143O540933K925800j267010J192743O735692N059298m482491
$$ -15158204 -11348061 -4807128 -1881328 -3148338 -1955595 4780097 9839395 5356904
41036E356904j0101494m884065K600388K262052j283258K600824J1048798J0508778
$$ 5356904 -4744590 -9628655 -7028267 -4766215 -6049473 -3448649 7600149 18108927
41028A8108927j522249j1063667p508307K387413O155053K177383k526032m248533
$$ 18108927 16586678 5523011 -1985296 402117 6557170 8734553 6208521 1959988
41020A959988m419202l597911r84240J935232K713818J734848J041438J173485
$$ 1959988 -2459214 -6057125 -7041365 -5106133 -2392315 -657467 383971 1557456
41012A557456J877954L185612L239745j073371q118004j0613713n038009K408100
$$ 1557456 3435410 6621022 9860767 8787396 669392 -9944321 -14982330 -12574230
41004a2574230M225160J717308P89263J805016R70433j189793r76588M19898j467427
$$ -12574230 -8349070 -6631762 -5842499 -4037483 -3067050 -4256843 -5233431 -4813533 -6280960
40995f280960m954058l202551L902537P498363K769960l266549j914237N081360
$$ -6280960 -11235018 -14437569 -10535032 -3036669 -266709 -3533258 -5447495 -366135
40987c66135R238438P150872K740031p921j017453j505915j918018k774617m290335
$$ -366135 8872303 16023175 18763206 18755285 17737832 16231917 14313899 11539282 7248947
40978G248947m745785j995474K749485N048328K377297k492075m782845l410472
$$ 7248947 2503162 507688 3257173 8305501 10682798 8190723 3407878 -2594
40970b594j549984j718896k611776k017118p02856p11900j145935N26644L180202
$$ -2594 -1552578 -3271474 -5883250 -7900368 -8603224 -9315124 -10461059 -9934415 -6754213
40961f754213K733254o49904j265981L226763O726285L346516l130045m775578
$$ -6754213 -4020959 -4670863 -5936844 -2710081 4016204 7362720 4232675 -542903
40953e42903j413729M04637j354295k212678m77666L5201j550025m37894M454852
$$ -542903 -1956632 -1551995 -2906290 -5118968 -5596634 -5561433 -7111458 -7549352 -3094500
40944c094500O346383J356072l524312n88663N659994M589512m151010r561747
$$ -3094500 3251883 4607955 1083643 494980 6154974 10744486 6593476 -2968271
40936b968271m923585L814855P663231N629093K140840j118815n188138q473385
$$ -2968271 -7891856 -4077001 3586230 9215323 11356163 10237348 5049210 -3424175
40928c424175p396234k334132J821987K305837J887720L554027N237079L595858
$$ -3424175 -10820409 -13154541 -11332554 -9026717 -7138997 -3584970 1652109 5247967
40920E247967P00622J496515M775959L108497n399179j1233658n200013P633083
$$ 5247967 5948589 7445104 12221063 15329560 9930381 -1303277 -6503290 1129793
40912A129793J2965201N273836o241377j0464011o512773r71793J137456o84557
$$ 1129793 14094994 19368830 13127453 2663442 -3849331 -4821124 -3683668 -4368225
40904d368225m002854m725364l62983N518976O085027P65564k927359k83530L488187
$$ -4368225 -8371079 -13096443 -13459426 -7940450 -1855423 -1089859 -4017218 -4300748 -812561
40895h12561J815139k891256l935230j227444J96433K967K547055P444982Q152584
$$ -812561 1002578 -1888678 -5823908 -7051352 -6854919 -6851952 -4304897 3140085 11292669
40886A1292669J638022o678562r781065o383168j52486M237227L589857j035512
$$ 11292669 12930691 6252129 -3528936 -9912104 -10064590 -5827363 -2237506 -3273018
40878c273018l667431P4110O090854O787765K475443O57729L224747L010838l610386
$$ -3273018 -6940449 -6866339 -775485 6012280 8487723 9145452 12370199 15381037 11770651
40869A1770651r329576o877650j28698K959177K434069K908353K858400k425207
$$ 11770651 2441075 -4436575 -4565273 -1606096 827973 3736326 6594726 4169519
40861D169519r450189q910506j72750O517856M900757Q12776J333162L989226
$$ 4169519 -5280670 -14191176 -14363926 -7846070 -2945313 -2132537 -799375 3189851
40853C189851K883538p91273j763974j36445k51919k326985k517736n10627k6054
$$ 3189851 6073389 5282116 3518142 3381697 3129778 802793 -1714943 -2225570 -2251624
40844b251624j396454m55695L510156N117688J293289l109043k300951J944252
$$ -2251624 -3648078 -4103773 -593617 4524071 5817360 2708317 407366 2351618
40836B351618L551020J098900j392131j107369P12432K020929K211155J221493
$$ 2351618 5902638 7001538 5609407 4502038 5214470 7235399 9446554 10668047
40828A0668047o00298k107849l219450n705036r145173q500703n54000Q918961
$$ 10668047 10067749 7959900 4740450 -964586 -10109759 -18610462 -19164462 -10245501
40820a0245501J0579035L887968k388102k678276o20501p39543j672428j488747
$$ -10245501 333534 4221502 1833400 -844876 -1465377 -2204920 -3877348 -5366095
40812e366095k572408n613697m998293K683637J0301468Q478219o89857o404602
$$ -5366095 -7938503 -13552200 -18550493 -15866856 -5565388 2912831 2222974 -4181628
40804d181628m102788N57895K263368K236776K468266J416303j486496k996847
$$ -4181628 -8284416 -7726521 -5463153 -3226377 -758111 658192 -828304 -3825151
40796c825151j185819J060573P37516p54650m80373J760627M248792N570354M391082
$$ -3825151 -5010970 -3950397 -3212881 -3967531 -4447904 -2687277 1561515 7131869 11522951
40787A1522951J60559m377300m755155o93911K771165J870009j414714l215357
$$ 11522951 11683510 7306210 2551055 1857144 4628309 6498318 5083604 1868247
40779A868247k724885j158963R55653L014449L554790K361222R51016l29070k577864
$$ 1868247 -856638 -2015601 -1059948 1954501 5509291 7870513 8821529 8492459 5914595
40770E914595m655455l454265L08409J310652k486719n832276l750955J296614
$$ 5914595 1259140 -2195125 -1886716 -576064 -3062783 -8895059 -12646014 -11349400
40762a1349400M194239M872365N830895N535723Q74934n552536p145406k335481
$$ -11349400 -7155161 -2282796 3548099 9083822 9958756 4406220 -2739186 -5074667
40754e074667L234598M017880O2518m839053o853994m102180J607363N225779
$$ -5074667 -1840069 2177811 2240329 -2598724 -9452718 -13554898 -11947535 -6721756
40746f721756L670333j90344j818650j624479l023344n316008m119779R57929
$$ -6721756 -3051423 -3241767 -5060417 -6684896 -9708240 -15024248 -19144027 -18186098
40738a8186098M667110L585142M28450j097843j415731k335460k823355r92466
$$ -18186098 -13518988 -9933846 -9505396 -10603239 -12018970 -14354430 -17177785 -18170251
40730a8170251J861379K674115J232035M98524K177457M148089L460554P97764
$$ -18170251 -16308872 -13634757 -12402722 -11904198 -9726741 -5578652 -2118098 -1320334
40722a320334P2276L066430O405324N972503K871902J434867J967342N72653k960514
$$ -1320334 -1248058 1818372 8223696 14196199 17068101 18502968 20470310 21042963 18082449
40713A8082449l409359N66121J909898m183386j0658794p749825J770997N870151
$$ 18082449 14673090 15239211 17149109 12965723 2306929 -5442896 -3671899 2198252
40705B198252O94812m879932l344370J886217M167886K952696P83680k618946
$$ 2198252 2893064 -1986868 -5331238 -3445021 722865 3675561 4459241 1840295
40697A840295p554113r958622n764381K284405O787598M096964k178997n555053
$$ 1840295 -5713818 -15672440 -21436821 -19152416 -12364818 -8267854 -10446851 -16001904
40689a6001904l031233K340555M941682L361778K078587M125233N199448L96873
$$ -16001904 -19033137 -16692582 -11750900 -8389122 -6310535 -2185302 3014146 3411019
40681C411019n796618m462211L139401N682194r26295o390409j788355O452624
$$ 3411019 -2385599 -6847810 -3708409 1973785 1047490 -5342919 -7131274 -678650
40673f78650O575749j050881o006589l579444R25045K206808R87436j73721m77946
$$ -678650 5897099 4846218 -1160371 -4739815 -3814770 -1607962 -620526 -794247 -1272193
40664a272193L42138J929622K046202m19905k332231o92206J659321K34540k844173
$$ -1272193 -930055 999567 3045769 2625864 293633 -398573 1260748 1495288 -1348885
40655a348885j436587M170003O412495J296112n997115q385699m895491N28540
$$ -1348885 -2785472 1384531 7797026 9093138 3096023 -5289676 -10185167 -9656627
40647i656627L965889L541244L13180j439930J560073O152514N632169p69735
$$ -9656627 -5690738 -2149494 -1836314 -3276244 -1716171 4436343 10068512 9298777
40639I298777n820193l690539K710907O361189M643378M90453k408847k963575
$$ 9298777 3478584 -211955 2498952 8860141 13503519 13993972 11585125 8621550
40631H621550k751767m109805o807790o890016j584989N308722P383995M938574
$$ 8621550 5869783 1759978 -5047812 -11937828 -13522817 -8214095 -830100 4108474
40623D108474M521175P874563Q219187J245201o802004q022509m694581m622018
$$ 4108474 8629649 16504212 24723399 25968600 19166596 11144087 6449506 1827488
40615A827488p868272o876690N87218P123191O488404J674258j360658k254585
$$ 1827488 -6040784 -12917474 -12330256 -5207065 1281339 2955597 1594939 -659646
40607f59646l695953m540862j483786M173132P175178N804888L798293L712644
$$ -659646 -4355599 -8896461 -10380247 -6207115 968063 6772951 10571244 14283888
40599A4283888K918719j337734o406762p279858l314325J351249L055016J404515
$$ 14283888 17202607 15864873 9458111 2178253 -1136072 215177 3270193 4674708
40591D674708k141498n202379m648692L88176N547948N110680l83909m147195
$$ 4674708 2533210 -2669169 -7317861 -6929685 -1381737 3728943 3345034 -802161
40583h02161k052845K219728K867222o72960m409491m989134k064754J874743
$$ -802161 -2855006 -635278 2231944 1558984 -2850507 -7839641 -9904395 -8029652
40575h029652K584799j665530n844271l064448M635633P057098P66241m610927
$$ -8029652 -5444853 -7110383 -12954654 -16019102 -11383469 -4326371 -3560130 -8171057
40567h171057j110469M593276K237560m707165m878745J847374M673445K70804
$$ -8171057 -9281526 -4688250 -2450690 -7157855 -12036600 -10189226 -5515781 -5244977
40559e244977k960499l97491K546130K812082M895993Q629099N239481o800088
$$ -5244977 -8205476 -8602967 -6056837 -3244755 1651238 10280337 15519818 8719730
40551H719730j4522807q834236R66823K368661p86699K319360Q652835O272494
$$ 8719730 -5803077 -14637313 -13670490 -11301829 -12088528 -9769168 -1116333 5156161
40543E156161l848333p694767q0810Q360990Q564333M147147J235583q73091l514002
$$ 5156161 1307828 -6386939 -6467749 1893241 10457574 14604721 15840304 14967213 11453211
40534A1453211l410098P7650R44602l745020p441016m065439J977600K814238
$$ 11453211 8043113 8120763 9065365 5320345 -2120671 -6186110 -4208510 -1394272
40526a394272j116575l579047k722918j393961l23249J627513K387454r42606
$$ -1394272 -2510847 -6089894 -8812812 -10206773 -10530022 -8902509 -6515055 -7457661
40518g457661n571835n702350j428407J726898K274253M299590P919846O302691
$$ -7457661 -13029496 -18731846 -20160253 -18433355 -16159102 -11859512 -3939666 2363025
40510B363025l122617j1242583q208441K314379Q068552N567915L273985O273477
$$ 2363025 -759592 -12002175 -20210616 -17896237 -9827685 -4259770 -985785 5287692
40502E287692P748014J336896o225232m317021M086929N359349m395489j2840260
$$ 5287692 13035706 14372602 8147370 3830349 7917278 13276627 8881138 -3959122
40494c959122q958721K080171P660259M280704j922080o055920p598713n538312
$$ -3959122 -12917843 -10837672 -3177413 1103291 -818789 -6874709 -14473422 -20011734
40486b0011734J184628Q780779J1064408P304973K415618l63559j706953j863887
$$ -20011734 -18827106 -10046327 1018081 8323054 10738672 10375113 8668160 6804273
40478F804273j82008J026025j581722n875895n922295j352271J355246r19929
$$ 6804273 6622265 7648290 6066568 190673 -5731622 -7083893 -5728647 -6648576
40470f648576k827668Q70653P008347Q767428N044771P00392m25383P69357R17842
$$ -6648576 -9476244 -8605591 -1597244 7170184 12214955 12915347 12489964 13259321 14177163
40461A4177163j853748n635781o228355k283887K172839K997513J741704J961051
$$ 14177163 12323415 6687634 459279 -1824608 348231 3345744 5087448 7048499
40453G048499K118854j233828m811028j912563N172226N977478k061590q327064
$$ 7048499 9167353 7933525 3122497 1209934 6382160 12359638 10298048 1970984
40445A970984m915180J640873J726844k622911l425227o88485k73171j819765
$$ 1970984 -2944196 -1303323 423521 -2199390 -5624617 -6313102 -6586273 -8406038
40437h406038M65913O191715P652442J417585o279080p582545j707773N410621
$$ -8406038 -7940125 -1748410 5904032 7321617 1042537 -6540008 -8247781 -2837160
40429b837160P105494K076577l457218k189342L829316M342460l978161j0624687
$$ -2837160 4268334 6344911 2887693 698351 4527667 8870127 4891966 -5732721
40421e732721o121428L247084N120272k47307k689319K30133J538604l61096Q74517
$$ -5732721 -11854149 -8607065 -3486793 -3734100 -6423419 -6193286 -4654682 -5015778 -4141261
40412d141261N663480N490814k074140p379269l537084L065898L802619M58413
$$ -4141261 1522219 7013033 4938893 -2440376 -5977460 -2911562 891057 1349470
40404A349470m90300J135807J664274J348851K310645K841122K09157l985512
$$ 1349470 859170 1994977 3659251 5008102 7318747 10159869 10369026 6383514
40396F383514o256005n833102l093797K337433Q183919R203175M501868J12905
$$ 6383514 127509 -5705593 -8799390 -6461957 1721962 10925137 15427005 15539910
40388A5539910M5328M20318k699689n850708m503624j034325K10782L17147J418628
$$ 15539910 15585238 16005556 13305867 7455159 2951535 1917210 2127992 2445139 3863767
40379C863767O84383l528682n329779k15671N047728J994167m699275m085575
$$ 3863767 4548150 1019468 -4310311 -4525982 521746 2515913 -2183362 -6268937
40371f268937K525745L721386k119810l952386K426450O673118J628466m399487
$$ -6268937 -3743192 -21806 -2141616 -6094002 -3667552 3005566 4634032 234545
40363B34545j957203L543039J198908p089594r623959k973695M018880M150337
$$ 234545 -1722658 1820381 3019289 -4070305 -13694264 -16667959 -12649079 -8498742
40355h498742N10299p41900Q55428J909592J284007O73725J071828J545931J200954
$$ -8498742 -7988443 -8730343 -7874915 -5965323 -4681316 -4007591 -2935763 -1389832 -188878
40346a88878O04657O24187N46998j260370m260960n029745j640149K563014K724925
$$ -188878 415779 1039966 1586964 326594 -3934366 -8964111 -10604260 -8041246 -5316321
40337e316321n03912j547343K032071O149819O377338L537245P30345j623499
$$ -5316321 -5820233 -7367576 -5335505 814314 7191652 10728897 11459242 9835743
40329I835743m481826o691120o585219n333484m988878m303973l44647N872917
$$ 9835743 5353917 -1337203 -7922422 -13255906 -18244784 -22548757 -22893404 -17020487
40321a7020487R075928O194788M71801k560157j570635M8693m55479j589173n11245
$$ -17020487 -7944559 -1749771 -1277970 -3838127 -5408762 -5360069 -5815548 -7404721 -7915966
40312g915966J942621J833720j818893m470871j950723L060204M026332n24379
$$ -7915966 -5973345 -4139625 -5958518 -10429389 -12380112 -9319908 -5293576 -5817955
40304e817955m926528l977751Q55976M544755M999098L998594L280710K427985
$$ -5817955 -10744483 -14722234 -13866258 -9321503 -4322405 -323811 2956899 5384884
40296E384884N95336j432195j803656n6911J702832J132850r20883j197876J138236
$$ 5384884 5980220 4548025 2744369 2687458 4390290 5523140 4602257 3404381 4542617
40287D542617K963455J971958q0189j287767k956131n170842l332922M545189
$$ 4542617 7506072 9478030 9397841 8110074 5153943 -16899 -3349821 1195368
40279A195368J0581573N678549n984443j0810913m793941J601001L24908l059910
$$ 1195368 11776941 17455490 11471047 660134 -4133807 -2532806 -2207898 -5267808
40271e267808n98223N155021P135388N182455L106815M98791l804371n405486
$$ -5267808 -5866031 -711010 6424378 11606833 14713648 15212439 11408068 6002582
40263F002582r59219L218612p41730q752126j0074473m153847p54937l581814
$$ 6002582 5043363 8261975 7520245 -1231881 -11306354 -15460201 -16215138 -19796952
40255a9796952n504579j924346K404624L524628M831343Q379530Q937675L169961
$$ -19796952 -25301531 -27225877 -24821253 -21296625 -16465282 -8085752 851923 4021884
40247D021884k951657k957552K34240N56614m94853K459273P905520Q651343K462553
$$ 4021884 1070227 -1887325 -1653085 -1096471 -1591324 867949 8773469 17424812 19887365
40238A9887365n354534r397257q633535m291786J321680M425938L148630Q86645
$$ 19887365 14532831 5135574 -3497961 -7789747 -6468067 -2042129 1106501 1993146
40230A993146J821558M147402K978379r41146j837280J335979K492117j991739
$$ 1993146 3814704 7962106 10940485 9999339 8162059 9498038 11990155 9998416
40222I998416p420422q249895o325440o616372q132898n082259L642367J1298632
$$ 9998416 2577994 -5671901 -11997341 -18613713 -26746611 -31828870 -28186503 -16887871
40214a6887871J0964278L384517m308601o114701k330008J929426K488447J98797
$$ -16887871 -5923593 -2539076 -6847677 -12962378 -15292386 -13362960 -10874513 -10675716
40206a0675716r81802N23405K209844J894154J226292K465599L878844K153617
$$ -10675716 -11657518 -11134113 -8924269 -7030115 -5803823 -3338224 540620 2694237
40198B694237j386306j487165L175775P050976M906053j340245n815809o058788
$$ 2694237 1307931 -179234 2996541 10047517 14953570 13613325 7797516 1738728
40190A738728m007010j822652k63283L46860Q79715L485849P449082P324595Q7375
$$ 1738728 -2268282 -4090934 -4354217 -4007357 -3127642 358207 7807289 15131884 15219259
40181A5219259p978670p952245q39455L858202K106873o72843j010189k722737
$$ 15219259 7240589 -711656 -1551111 2307091 4413964 3741121 2730932 8195
40173H195o500139m525693O462770J5342738J0456138k544245q254673l297832
$$ 8195 -6491944 -11017637 -4554867 10787871 21244009 18699764 10445091 7147259
40165G147259J594287l27967m291290n409021n363100m652081M74902Q555682
$$ 7147259 8741546 8413579 4122289 -1286732 -6649832 -11301913 -10827011 -2271329
40157b271329J0502109K732479n777064n986475q36685J773043Q99519J6528j157857
$$ -2271329 8230780 10963259 5186195 -800280 -1636965 136078 1035597 1052125 -105732
40148a05732m120565n799535l393818q30924k483514m528614j115621M536670
$$ -105732 -4226297 -10025832 -13419650 -14250574 -16734088 -21262702 -22378323 -17841653
40140a7841653M794088P95137O24792N278539P136054L264648k79981j875p26636
$$ -17841653 -13047565 -12252428 -11627636 -6349097 786957 4051605 3771624 3769749 3043113
40131C043113n305481p557060k054019N693920O281661l55613n743592m887672
$$ 3043113 -2262368 -9819428 -11873447 -6179527 102134 -253479 -5997071 -10884743
40123a0884743j271298q4658j373527j309699K135478O246884O384187J868955
$$ -10884743 -12156041 -12240699 -13614226 -14923925 -12788447 -6541563 -157376 1711579
40115A711579k246083j411877J801543J386287k351530k588807K792885O183535
$$ 1711579 -534504 -1946381 -144838 1241449 -1110081 -3698888 -906003 5277532
40107E277532R78625p634695r093304k192612L569809J530596l613734l441721
$$ 5277532 6256157 -1378538 -10471842 -12664454 -9094645 -7564049 -11177783 -14619504
40099a4619504K481949O802408M753345L9305r90991J848524L073331L96065j314531
$$ -14619504 -12137555 -5335147 -581802 -542497 -1533488 315036 3388367 3784432 2469901
40090B469901K364307P359122N858846k027586p427853m758278J038547K286939
$$ 2469901 4834208 12193330 18052176 16024590 8596737 3838459 4877006 7163945
40082G163945j183485l884655l247521j318401J23176J122469J028413r56656
$$ 7163945 5980460 2095805 -1151716 -2470117 -2346941 -1224472 -196059 -1152715
40074a152715k745385j173582K534026L086940j609578o746162o232803O4555
$$ -1152715 -3898100 -5071682 -2537656 549284 -1060294 -7806456 -14039259 -13974704
40066a3974704O648075Q585553N678618J272108j484656k079966k055037k424846
$$ -13974704 -7326629 1258924 6937542 8209650 6724994 4645028 2589991 165145
40058A65145k253656k61120K866993M903198M515220K162488j143136m540271
$$ 165145 -2088511 -2349631 517362 5420560 9935780 12098268 10955132 6414861
40050F414861o629933n513934n42269O075861R849297P113628j035644q059120
$$ 6414861 -215072 -5729006 -6271275 -195414 9653883 16767511 15731867 7672747
40042G672747p654101j273176K723136k80648m347511j108619P444184J0594141
$$ 7672747 18646 -1254530 1468606 1187958 -3159553 -4268172 3176012 13770153
40034A3770153L705372n316732p270566l393838r63133j878736k285319r99189
$$ 13770153 17475525 12158793 4888227 1494389 531256 -1347480 -3632799 -4631988
40026d631988r59145k625892k904409j611528k260835m404781k306823M900845
$$ -4631988 -5591133 -8217025 -11121434 -12732962 -14993797 -19398578 -21705401 -16804556
40018a6804556Q708472L109184m716951l883495L748559O476308J043432k886658
$$ -16804556 -8096084 -4986900 -9703851 -13587346 -9838787 -3362479 -2319047 -5205705
40010e205705R93795N433883J979430m661771l646624N000916J0071075N213571
$$ -5205705 -4211910 1221973 3201403 -1460368 -5106992 -106076 9964999 15178570
40002A5178570l102619n635699k042538R75774n82453l884594l751598J044835
$$ 15178570 12075951 6440252 4397714 5373488 4791035 906441 -2845157 -1800322
39994a800322O184416O101757j04080p604582j0865852q453039k607115L418614
$$ -1800322 4384094 10485851 10381771 2777189 -8088663 -16541702 -19148817 -15730203
39986a5730203O368953M433110Q1138j341645J525959L807579K012783l38212
$$ -15730203 -9361250 -4928140 -4847002 -6188647 -4662688 -855109 1157674 819462
39978H19462O82300J867349j208942m746260k185114L311522K472798m256059
$$ 819462 1501762 3369111 2160169 -2586091 -4771205 -1459683 1013115 -3242944
39970c242944o180901K8995M205641n96007o536286m105936K799007M790294K395542
$$ -3242944 -9423845 -9394850 -5189209 -5785216 -12321502 -16427438 -13628431 -8838137 -6442595
39961f442595K400759M262915K229172k077830j491343L110717L068907k941720
$$ -6442595 -4041836 221079 2450251 372421 -1118922 1991795 5060702 2118982
39953B118982n502606M36021P215127O386190N99840k540351j900718j387747
$$ 2118982 -3383624 -2947603 4267524 10653714 11253554 8713203 6812485 5424738
39945E424738j869730j386360n86695j661846l186542j443787L264642N877479
$$ 5424738 3555008 2168648 1581953 -79893 -3266435 -4710222 -1445580 4431899
39937D431899K805050l695931p882043n961213M73434N532676M485895j089459
$$ 4431899 7236949 3541018 -4341025 -10302238 -9828804 -4296128 189767 -899692
39929h99692m880727l069947J891519N235415M933009J766998k450685m762352
$$ -899692 -5780419 -8850366 -6958847 -1723432 3209577 4976575 2525890 -2236462
39921b236462k335927L252243N657062J210057n199069n583644Q17689O591080
$$ -2236462 -4572389 -1320146 4336916 5546973 347904 -5235740 -4418051 2173029
39913B173029N428746j128096o756352p186321k958490K332360N144874M512755
$$ 2173029 7601775 6473679 -282673 -7468994 -10427484 -8095124 -2950250 1562505
39905A562505K343306P92147k15418j705009k788700j488245J484210K485880
$$ 1562505 3905811 4697958 4482540 2777531 -11169 -1499414 -15204 2470676
39897B470676j57523l119959k226556J318575J655046l923483j0025070q535831
$$ 2470676 2313153 -806806 -3033362 -1714787 -59741 -3983224 -14008294 -22544125
39889b2544125J254325J0642061J1250984M679785n30996k97915J114684p26013
$$ -22544125 -21289800 -10647739 603245 5283030 4752034 4454119 5568803 4842790
39881D842790l564258l305487j639544l129259o480734n278251J783413P483423
$$ 4842790 1278532 -2026955 -3666499 -6795758 -13276492 -18554743 -16771330 -9287907
39873i287907N685337m25073l497584j679236J400666L487064N096835N364455
$$ -9287907 -3602570 -4027643 -7525227 -9204463 -7803797 -4316733 780102 6144557
39865F144557K293394k358782l613805k54867K981871K015060j646316m465925
$$ 6144557 8437951 6079169 2465364 2210497 5192368 7207428 5561112 1095187
39857A095187n335901m114268q3175M761115N206274J29192l638793l41800N312550
$$ 1095187 -4240714 -8354982 -8438157 -3677042 1529232 1658424 -1980369 -2322169 2990381
39848B990381M759184j071090l590902q85558l00596m743145o478276J4421P291460
$$ 2990381 7749565 6678475 3087573 2202015 1901419 -2841726 -9320002 -9305581 -2014121
39839b014121M915799m910910r942136m010601O375707J1046346O557981k339982
$$ -2014121 2901678 -2009232 -11951368 -15961969 -9586262 1460084 8018065 5678083
39831E678083p885412o164473r22562R53646j257855j534135K191039L448251
$$ 5678083 -2207329 -8371802 -9294364 -8340718 -9598573 -11132708 -8941669 -5493418
39823e493418j505102m942734J127109J0369369R830019l49410o988012l789999
$$ -5493418 -6998520 -11941254 -10814145 -444776 9385243 9035833 2047821 -1742178
39815a742178R80679l65402l643432k250866J514494J823122p05776j583907m27112
$$ -1742178 -761499 -1126901 -4770333 -7021199 -5506705 -3683583 -4389359 -5973266 -6400378
39806f400378o4590r34463j274925j18604L088357P995100J0099734L898522p237650
$$ -6400378 -6464968 -7399431 -8674356 -8792960 -5704603 2290497 12390231 16288753 9051103
39797I051103j1419277l845143N140445M759578m82247N52758O856976P282689
$$ 9051103 -2368174 -6213317 -1072872 3686706 3204459 3757217 10614193 17896882
39789A7896882p65432p052769m333451K223456M636616K328960j212817m507966
$$ 17896882 17131450 10078681 5745230 7968686 12605302 14934262 13721445 9213479
$$ [...]
##END NTUPLES=NMR SPECTRUM
##END=
