##TITLE=31Pdec_LR-710-C1-K
 CDCl3_DMSO-d6, 24 sc
 6.2.2020
##JCAMPDX= 6.0         $$ Bruker NMR JCAMP-DX V2.0
##DATA TYPE= NMR SPECTRUM
##DATA CLASS= NTUPLES
##ORIGIN= UXNMR, Bruker Analytische Messtechnik GmbH
##OWNER= root
$$ XWIN-NMR		Version 3.5
$$ Thu Feb  6 14:41:29 2020 Russian Standard Time (UT+4h)  she@DPX200
##.OBSERVE FREQUENCY= 81.013821
##.OBSERVE NUCLEUS= ^31P
##.ACQUISITION MODE= SIMULTANEOUS
##.ACQUISITION SCHEME= undefined
##.AVERAGES= 24
##.DIGITISER RES= 17
##SPECTROMETER/DATA SYSTEM= spect
##.PULSE SEQUENCE= zgpg30
##.SOLVENT NAME= DMSO
##.SHIFT REFERENCE= (INTERNAL, DMSO, 0, 182.463)
##AUDIT TRAIL= $$ (NUMBER, WHEN, WHO, WHERE, WHAT)
$$ ##TITLE= Audit trail, XWIN-NMR		Version 3.5
$$ ##JCAMPDX= 5.01
$$ ##ORIGIN= Bruker BioSpin GmbH
$$ ##OWNER= she
$$ F:/spectra/data/she/nmr/P31/1/pdata/1/auditp.txt
$$ ##AUDIT TRAIL=  $$ (NUMBER, WHEN, WHO, WHERE, WHAT)
(   1,<2020-02-06 14:40:35.40 +0400>,<she>,<DPX200>,
      <created by zg, POWCHK disabled, PULCHK disabled
       configuration hash MD5:
       00 E9 B6 7A A2 85 ED C7 34 08 36 98 17 FE 4E 26
       data hash MD5: 32K
       82 1C CB 71 46 3E 8C 05 93 F0 06 B2 29 41 27 A3>)
(   2,<2020-02-06 14:40:37.85 +0400>,<she>,<DPX200>,
      <Start of raw data processing
       efp BC_mod = 2 LB = 1 FT_mod = 6 PKNL = 1 PHC0 = -1371.411 PHC1 = 177.2013 SI = 64K 
       data hash MD5: 64K
       2A 18 36 9A 20 CC 99 16 0F FE D6 E5 CA 21 57 0A>)
(   3,<2020-02-06 14:41:00.53 +0400>,<she>,<DPX200>,
      <pk PHC0 = 17.57861 PHC1 = 0 
       data hash MD5: 64K
       4C D4 91 1C B3 8E D9 87 50 C6 AC D4 98 48 59 BB>)
(   4,<2020-02-06 14:41:03.50 +0400>,<she>,<DPX200>,
      <abs ABSG = 5 
       data hash MD5: 64K
       A4 46 48 4B 08 2D B1 A6 96 89 E5 68 37 EF 31 8C>)
$$ ##END=
$$ 
$$ hash MD5
$$ 19 D9 F6 96 C2 38 57 24 2A 50 90 25 6B C3 8B ED
##$RELAX= 
##$RELAX= 
##$RELAX= 
##$RELAX= 
##$RELAX= 
##$RELAX= 
##$RELAX= 
##$RELAX= 
$$ Bruker specific parameters
$$ --------------------------
##$DU= <F:/spectra>
##$EXPNO= 1
##$NAME= <P31>
##$PROCNO= 1
##$TYPE= <nmr>
##$USER= <she>
##$AMP= (0..31)
100 100 100 100 100 100 100 100 100 100 100 100 100 100 100 100 100 100 
100 100 100 100 100 100 100 100 100 100 100 100 100 100 
##$AQSEQ= 0
##$AQ_mod= 1
##$AUNM= <au_zg>
##$AUTOPOS= <>
##$BF1= 81.014009
##$BF2= 200.13
##$BF3= 200.13
##$BF4= 200.13
##$BF5= 200.13
##$BF6= 200.13
##$BF7= 200.13
##$BF8= 200.13
##$BYTORDA= 1
##$CFDGTYP= 0
##$CFRGTYP= 5
##$CHEMSTR= <none>
##$CNST= (0..31)
1 1 145 1 1 1 1 1 1 1 1 1 1 1 1 1 1 1 1 1 1 1 1 1 1 1 1 1 1 1 1 1 
##$CPDPRG= <waltz16>
##$CPDPRG1= <>
##$CPDPRG2= <waltz16>
##$CPDPRG3= <>
##$CPDPRG4= <mlev>
##$CPDPRG5= <mlev>
##$CPDPRG6= <mlev>
##$CPDPRG7= <mlev>
##$CPDPRG8= <mlev>
##$CPDPRGB= <>
##$CPDPRGT= <>
##$D= (0..31)
0 1 0 0 0 0 0 0 0 0 0 0.03 2e-05 3e-06 0 0 0 0 0 0 0 0 0 0 0 0 0 0 0 0 
0 0 
##$DATE= 1580985634
##$DBL= (0..7)
120 120 120 11 120 120 24 19 
##$DBP= (0..7)
150 150 150 150 150 150 150 150 
##$DBP07= 0
##$DBPNAM0= <>
##$DBPNAM1= <>
##$DBPNAM2= <>
$$ [...]
##$SUBNAM3= <"">
##$SUBNAM4= <"">
##$SUBNAM5= <"">
##$SUBNAM6= <"">
##$SUBNAM7= <"">
##$SUBNAM8= <"">
##$SUBNAM9= <"">
##$SW= 369.568048894756
##$SWIBOX= (0..15)
0 1 3 0 0 0 0 0 0 0 0 0 0 0 0 0 
##$SW_h= 29940.119760479
##$TD= 32768
##$TD0= 1
##$TE= 0
##$TE2= 300
##$TE3= 300
##$TEG= 300
##$TL= (0..7)
0 120 53 12 22 120 120 120 
##$TP= (0..7)
150 150 150 150 150 150 150 150 
##$TP07= 0
##$TPNAME0= <>
##$TPNAME1= <>
##$TPNAME2= <>
##$TPNAME3= <>
##$TPNAME4= <>
##$TPNAME5= <>
##$TPNAME6= <>
##$TPNAME7= <>
##$TPOAL= (0..7)
0.5 0.5 0.5 0.5 0.5 0.5 0.5 0.5 
##$TPOFFS= (0..7)
0 0 0 0 0 0 0 0 
##$TUNHIN= 0
##$TUNHOUT= 0
##$TUNXOUT= 0
##$USERA1= <user>
##$USERA2= <user>
##$USERA3= <user>
##$USERA4= <user>
##$USERA5= <user>
##$V9= 5
##$VALIST= <valist>
##$VCLIST= <CCCCCCCCCCCCCCC>
##$VD= 0
##$VDLIST= <DDDDDDDDDDDDDDD>
##$VPLIST= <PPPPPPPPPPPPPPP>
##$VTLIST= <TTTTTTTTTTTTTTT>
##$WBST= 1024
##$WBSW= 4
##$XGAIN= (0..3)
0 0 0 0 
##$XL= 0
##$YL= 0
##$YMAX_a= 7041
##$YMIN_a= -5880
##$ZGOPTNS= <>
##$ZL1= 120
##$ZL2= 120
##$ZL3= 120
##$ZL4= 120
##$ABSF1= 182.463
##$ABSF2= -187.1042
##$ABSG= 5
##$ABSL= 3
##$ALPHA= 0
##$AQORDER= 0
##$ASSFAC= 0
##$ASSFACI= 0
##$ASSFACX= 0
##$ASSWID= 0
##$AUNMP= <proc_1d>
##$AZFE= 0.1
##$AZFW= 0.5
##$BCFW= 0
##$BC_mod= 2
##$BYTORDP= 0
##$COROFFS= 0
##$CY= -3
##$DATMOD= 1
##$DC= 0
##$DFILT= <>
##$DTYPP= 0
##$F1P= 0
##$F2P= 0
##$FCOR= 1
##$FTSIZE= 65536
##$FT_mod= 6
##$GAMMA= 0
##$GB= 0
##$INTBC= 1
##$INTSCL= 5.30512e-09
##$ISEN= 30
##$LB= 1
##$LEV0= 0
##$LPBIN= 0
##$MAXI= 10000
##$MC2= 0
##$MEAN= 0
##$ME_mod= 0
##$MI= 50
##$NCOEF= 0
##$NC_proc= -8
##$NLEV= 6
##$NOISF1= 182.463
##$NOISF2= 159.3651
##$NSP= 0
##$NTH_PI= 0
##$NZP= 0
##$OFFSET= 182.463
##$PC= 4
##$PHC0= -1353.832
##$PHC1= 177.2013
##$PH_mod= 1
##$PKNL= yes
##$PPARMOD= 0
##$PSCAL= 0
##$PSIGN= 0
##$REVERSE= no
##$SF= 81.0140089999434
##$SI= 65536
##$SIGF1= 159.3651
##$SIGF2= -187.1042
##$SINO= 113.3802
##$SIOLD= 16384
##$SREGLST= <1H.CDCl3>
##$SSB= 0
##$STSI= 65536
##$STSR= 0
##$SW_p= 29940.119760479
##$SYMM= 0
##$S_DEV= 0
##$TDeff= 32768
##$TDoff= 0
##$TI= <>
##$TILT= no
##$TM1= 0
##$TM2= 0
##$TOPLEV= 0
##$USERP1= <user>
##$USERP2= <user>
##$USERP3= <user>
##$USERP4= <user>
##$USERP5= <user>
##$WDW= 1
##$XDIM= 65536
##$YMAX_p= 359695686
##$YMIN_p= -108263286
$$ End of Bruker specific parameters
$$ ---------------------------------
##NTUPLES= NMR SPECTRUM
##VAR_NAME=  FREQUENCY,     SPECTRUM/REAL,   SPECTRUM/IMAG
##SYMBOL=    X,             R,               I
##VAR_TYPE=  INDEPENDENT,   DEPENDENT,       DEPENDENT
##VAR_FORM=  AFFN,          ASDF,            ASDF
##VAR_DIM=   65536,         65536,           65536
##UNITS=     HZ,            ARBITRARY UNITS, ARBITRARY UNITS
##FACTOR=    0.456856943014862, 1,           1
##FIRST=     14782.0589164792, 0,            0
##LAST=      -15158.0608439998, 0,           0
##MIN=       -15158.0608439998, -108263286,  0
##MAX=       14782.0589164792, 359695686,    0
$$ Real data points
##PAGE= N=1
##DATA TABLE= (X++(R..R)), XYDATA
$$ [...]
44716c058279M70789p6579M713389O143474J51978n139541l059327J104301M33091
$$ -3058279 -2587490 -2664069 2049320 8192794 8344772 3205231 145904 1250205 1683296
44707A683296j772089Q81788N799775N818876J071719k587750l682662m765834
$$ 1683296 -88793 792995 6592770 12411646 13483365 10895615 7212953 2447119
44699B447119m366617J260473Q703109Q933591L23482p461610o004716J083352
$$ 2447119 -1919498 -659025 8044084 16977675 17301157 9839547 3834831 4918183
44691D918183L991877m56270o132087o239172j041996L524468L209656o1612j568957
$$ 4918183 8910060 8453790 2321703 -3917469 -4959465 -1434997 1774659 1713047 144090
44682A44090m51828l52514l000606m685826j635123L886091O398555M425004J215387
$$ 144090 -307738 -660252 -3660858 -8346684 -9981807 -6095716 302839 4727843 5943230
44673E943230o32100j464964j872883j329548O3806J214573J667184J470402j9753
$$ 5943230 5311130 3846166 1973283 643735 707541 1922114 3589298 5059700 5039947
44664E039947k624767l446708R5135N493348P103829L513564n45202r63328K97253
$$ 5039947 2415180 -1031528 -936393 4556955 11660784 15174348 14629146 13665818 13963071
44655A3963071j166672n275666p106376l270373L352406O390650L271591j462797
$$ 13963071 12796399 7520733 414357 -2856016 496390 6887040 10158631 8695834
44647H695834j466358L331482O460283L373748k793062n872936m290959j124480
$$ 8695834 7229476 10560958 17021241 20394989 17601927 11728991 7438032 6313552
44639F313552J136224K155838J494721j276046m573816o029682n237357k832693
$$ 6313552 7449776 9605614 11100335 9824289 5250473 -779209 -6016566 -8849259
44631h849259J469904O567034P923480K844911l547657l480367K517142N896442
$$ -8849259 -7379355 -812321 7111159 9956070 6408413 2928046 5445188 11341630
44623A1341630K033467m365435p392631p014757n209382j417147L695343N295956
$$ 11341630 13375097 9009662 1617031 -5397726 -10607108 -12024255 -8328912 -3032956
44615c032956Q54483m164478k919084K913419N636896K636816p37269M04358M093814
$$ -3032956 -2178473 -6342951 -9262035 -6348616 -711720 1925096 1187827 1592185 5685999
44606E685999N070818J580927l137156m722146k129900J314446J511239j562843
$$ 5685999 10756817 12337744 9200588 4478442 2348542 3662988 5174227 3611384
44598C611384l915388k957916o64101N7026l06899M55169K134961K440272N44739
$$ 3611384 -304004 -3261920 -3926021 -3868995 -4175894 -3720725 -1585764 854508 1399247
44589A399247j995594l281704k449282J18640K750590L804339L716415L921407
$$ 1399247 -596347 -3878051 -6327333 -6208693 -3458103 346236 4062651 7984058
44581G984058L518843L24144l943032m092672O38149M004590J668779k134969
$$ 7984058 11502901 11827045 7884013 3791341 4429490 8434080 10102859 7967890
44573G967890j685896J062874P01224j909835j533070J908843L206261M58138
$$ 7967890 6281994 7344868 8046092 6136257 4603187 6512030 9718291 10176429
44565A0176429l058777m992164n299155k608632L374672O788391J637456p075602
$$ 10176429 7117652 2125488 -3173667 -5782299 -2407627 4380764 6018220 -1057382
44557a057382p906152j2355M800573K22512n309855l097000K506828L318943J041769
$$ -1057382 -8963534 -8975889 -4175316 -3952804 -9262659 -12359659 -9852831 -6533888 -5492119
44548e492119J899131M205900K089713k627820l039698O47002J737218j000501
$$ -5492119 -3592988 612912 2702625 74805 -2964893 -2317891 -580673 -1581174
44540a581174j700290J764863M132863J668008k632759m792414m687743l337344
$$ -1581174 -3281464 -1516601 2616262 4284270 1651511 -3140903 -7828646 -11165990
44532a1165990p87908J702035K106877J218214J307116J241103j729079n466538
$$ -11165990 -11953898 -10251863 -8144986 -6926772 -5619656 -4378553 -6107632 -11574170
44524a1574170m643626L23331K731396k80531l383463j194578M816493R734810
$$ -11574170 -16217796 -15894465 -13163069 -13443600 -16827063 -18021641 -13205148 -3470338
44516c470338J0267675M949914m574485j0813086o194754N457147J0543062K847913
$$ -3470338 6797337 11747251 7172766 -3640320 -9835074 -4377927 6165135 9013048
44508I013048q011902j0212144m671798r963R78821J709155L008617K360104j2031
$$ 9013048 1001146 -9210998 -13882796 -13892759 -12913938 -11204783 -8196166 -5836062 -5848093
44499e848093j188003n08596O83790K299638L873579K642729j723218l968321
$$ -5848093 -7036096 -7544692 -6860902 -4561264 -687685 1955044 231826 -3736495
44491c736495m98336L987579L538782O03521J003132L122417J345912k515398
$$ -3736495 -4234831 -247252 3291530 3895051 4898183 8020600 9366512 6851114
44483F851114j720992K609484K269499l769857o895255l078422R27084n18640
$$ 6851114 5130122 7739606 10009105 6239248 -656007 -3734429 -2807345 -3325985
44475c325985l508801k996967r01485o5663J981347O637677Q417180K861549m868906
$$ -3325985 -6834786 -9831753 -10733238 -10798901 -8817554 -2179877 6237303 9098852 4229946
44466D229946o421003j425152L938540N847829M375975j51213n957488p972400
$$ 4229946 -2191057 -3616209 322331 6170160 10546135 10394922 4437434 -3534966
44458c534966l551989K151723K360921j784194l420227Q0463M693169N842953
$$ -3534966 -7086955 -4935232 -2574311 -4358505 -7778732 -7698269 -3005100 2837853
44450B837853K299634m146548q631165n707230L206715Q325854L393778m613433
$$ 2837853 5137487 990939 -7640226 -13347456 -10140741 -1814887 1578891 -3034542
44442c034542n045551O86141K410116j743525k899923K739065O929133K702843
$$ -3034542 -8080093 -7393952 -4983836 -6727361 -9627284 -6888219 40914 2743757
44434B743757m760148o849469l786120r65711J427270O834305J3105379J3190379
$$ 2743757 -2016391 -8865860 -12651980 -13617691 -12190421 -5356116 7749263 20939642
44426B0939642N499907k798183m942758k730618k605178o090737p865978l662974
$$ 20939642 26439549 23641366 18698608 15967990 13362812 7272075 -593903 -4256877
44418d256877L006220M764050n0814n372678n688535k388500L20794J751894L153049
$$ -4256877 -1250657 3513393 3462579 -1910099 -7598634 -9987134 -9666340 -7914446 -4761397
44409d761397L326337R29230j354123l99770J699050J338894M16518K581672M602146
$$ -4761397 -1435060 -505830 -1859953 -2259723 -560673 778221 1194739 3776411 8378557
44400H378557M33468o678880o472008K203623P932690L253699n137849p926167
$$ 8378557 8812025 2133145 -4338863 -2135240 5797450 9051149 3913300 -4012867
44392d012867n693194l411924j073146K306472K857834j289320l916917m55669
$$ -4012867 -9706061 -13117985 -14191131 -11884659 -9026825 -10316145 -14233062 -14688731
44384a4688731K722368j096143n452820k40824R942653J1209982K207202m240330
$$ -14688731 -11966363 -13062506 -18515326 -18756150 -8813497 2396485 4603687 363357
44376C63357j883055J375652k70304j255918K436340M283795m90262m667078q84109
$$ 363357 -1519698 -144046 -414350 -1670268 766072 5049867 4559605 -107473 -991582
44367i91582N056791L378159l761710o499385k937910J65912k05030l91099J474979
$$ -991582 4065209 7443368 3681658 -2817727 -5755637 -5589725 -5794755 -6185854 -4710875
44358d710875L079891L846512N271213N436880R67241n188480n683462K84153
$$ -4710875 -1630984 2215528 7486741 12923621 13890862 8702382 3018920 3303073
44350C303073N198174M139532N60870j149307k088138m368785o045844m713163
$$ 3303073 8501247 12640779 13201649 12052342 9964204 5595419 -450425 -5163588
44342e163588j883434K3198J505048L502218M527103L503504K318007K499872
$$ -5163588 -7047022 -7023824 -5518776 -2016558 2510545 6014049 8332056 10831928
44334A0831928K484610J118134M59944J742613K005872j263961n255614n974726
$$ 10831928 13316538 14434672 14894616 16637229 18643101 17379140 12123526 6148800
44326F148800m469595m080006l912559o93891M256135N801195K603556j338530
$$ 6148800 1679205 -2400801 -6313360 -7007251 -2751116 3050079 5653635 4315105
44318D315105l018741l164233k157056J201978N204053M914213o69204n515004
$$ 4315105 1296364 -1867869 -4024925 -2822947 2381106 7295319 6626115 1111111
44310A111111m252488M35519K156488M6073r74205J748812M860945M267458P94776
$$ 1111111 -3141377 -2705858 -549370 -503297 -1477502 271310 5132255 9399713 10194489
44301A0194489j516310j161026q30273l169273o690019p425407m018078Q42955
$$ 10194489 8678179 7517153 6686880 3517607 -3172412 -10597819 -14615897 -13772942
44293a3772942M276155O085428O730491N332331K192706O79665K920731N483403
$$ -13772942 -9496787 -3411359 3319132 8651463 10844169 11523834 14444565 19927968
44285A9927968L620971j549754m947815n468410o075696o361155k481067L795300
$$ 19927968 23548939 21999185 17051370 11582960 5507264 -853891 -3334958 460342
44277D60342M033041m394671j1659071p742944L475359R516523N672950j063730
$$ 460342 4493383 98712 -11560359 -19303303 -15827944 -6311421 -638471 -1702201
44269a702201k995462K24188M606872O978689N879139J617347l215666n933883
$$ -1702201 -4697663 -4473475 133397 7112086 12991225 14608572 11392906 5459023
44261E459023o609003o518399m935912o40843M504204P037409O175383L480064
$$ 5459023 -1149980 -7668379 -12604291 -13245134 -8740930 -1703521 4471862 7951926
44253G951926k79004m283888n489141j945174K761459L133766p61723l838597
$$ 7951926 7672922 3389034 -2100107 -4045281 -1283822 1849944 1088221 -2750376
44245b750376l177787j89323L251330N851070N319636J273220j478864J348897
$$ -2750376 -5928163 -6117486 -2866156 2984914 8304550 9577770 8098906 9447803
44237I447803N753806M419922j615480m653978l463761m793908r917414j0204661
$$ 9447803 15201609 19621531 18006051 13352073 9888312 5094404 -4823010 -15027671
44229a5027671q85377R863824J1862337N841698p52800m516961o173117n386106
$$ -15027671 -15913048 -6049224 5813113 11654811 10902011 6385050 211933 -5174173
44221e174173k213405K94029M30680P13931K047023O18133m271542n929979o11326
$$ -5174173 -7387578 -7093549 -6662869 -5948938 -3901915 -3283782 -7555324 -13485303 -14096629
44212a4096629M475035J973248k751326J68449Q346886J0236979L218194l072715
$$ -14096629 -9621594 -7648346 -10399672 -10231223 -1884337 8352642 11570836 8498121
44204H498121k273489M72984j322615n799989p313161m663805j014593O28871
$$ 8498121 6224632 6697616 5375001 -424988 -7738149 -12401954 -13416547 -12787676
44196a2787676l69085j863023m38355L822778N469027O44662o001271o708302
$$ -12787676 -13156761 -15019784 -15458139 -11635361 -6166334 -5521672 -11522943 -18231245
44188a8231245j291829L561248M374366L668620L447380K863728K387446L536067
$$ -18231245 -19523074 -15961826 -11587460 -7918840 -4471460 -1607732 779714 4315781
44180D315781M135797M50714n536788p555394m303445p86204N9046L63145J370850
$$ 4315781 8451578 8902292 3365504 -4189890 -8493335 -9279539 -9220493 -8857348 -7486498
44171g486498J366420M21928O31652J107444n78106k226587J9607L179109J178807
$$ -7486498 -6120078 -5698150 -5066498 -3959054 -4537160 -6763747 -6744140 -3565031 -2386224
44162b386224l144091r52397O447404P120929j956579p947257j589219Q251377
$$ -2386224 -5530315 -6482712 -35308 7085621 5129042 -2818215 -4407434 3843943
44154C843943Q497482N54747m907603m050142n40185L582655P511277O879292
$$ 3843943 12341425 12896172 7988569 3938427 3398242 6980897 14492174 21371466
44146B1371466r00223r763989j1710915p305424k617865K6418J156563q57945
$$ 21371466 20471243 10707254 -1003661 -8309085 -10926950 -10900532 -9743969 -10601914
44138a0601914n748207p107665r70648N918340N547734J603326K640547O705744
$$ -10601914 -16350121 -23457786 -24428434 -18510094 -12962360 -11359034 -8718487 -2012743
44130b012743M959933j954818m395024m37580R70954m034678p115165j261659
$$ -2012743 2947190 992372 -3402652 -3840232 -2869278 -6903956 -14019121 -15280780
44122a5280780P982560J0462552M230268m066470p158668k978297L557756L985471
$$ -15280780 -7298220 3164332 7394600 3328130 -3830538 -6808835 -3251079 734392
44114G34392l933778j0844472o555781N033904J0154953M292554k576510j826913
$$ 734392 -3199386 -14043858 -20599639 -15565735 -5410782 -1118228 -3694738 -5521651
44106e521651K691333L665407J596826R73947J814053J490066N28535R46861J919986
$$ -5521651 -2830318 835089 2431915 3405862 5219915 6709981 7238516 8185377 10105363
44097A0105363J464937j50780j800754l543699n021230m975669m034823m210226
$$ 10105363 11570300 11419520 9618766 6075067 1053837 -3921832 -7956655 -12166881
44089a2166881m324983p51775N503254P933104L606323k044515k952979k56884
$$ -12166881 -16491864 -17243639 -11740385 -3807281 -200958 -2245473 -5198452 -5455336
44081e455336J356565R23468O49483J290296J979830K440944K493297J326174
$$ -5455336 -4098771 -3175303 -2525820 -1235524 744306 3185250 5678547 7004721
44073G004721r25014l002807m566022n511697l717791J904059O566198M198815
$$ 7004721 6079707 3076900 -1489122 -7000819 -10718610 -8814551 -2248353 1950462
44065A950462k628739m807298j96255L303262R23916j937403n89474M14367l307896
$$ 1950462 -678277 -5485575 -5681830 -2378568 -1454652 -3392055 -3981529 -3567162 -6875058
44056f875058o330104k159818M799628N783913J578353M1176K858201M557517
$$ -6875058 -13205162 -15364980 -10565352 -4781439 -3203086 -3161910 -303709 4253808
44048D253808L014353J550526J078898j129355m428951m406907n30095K609754
$$ 4253808 7268161 8818687 9897585 8768230 4339279 -67628 -597723 2012031
44040B012031K741554K471531L445989L731292K097397k00750k574515n152194
$$ 2012031 4753585 7225116 10671105 14402397 16499794 16299044 13724529 8572335
44032H572335n730766k264017J579860j95766o019194p086699p731P277288O108548
$$ 8572335 2841569 577552 2157412 1961646 -4057548 -11144247 -11151978 -3874690 2233858
44023B233858j323941n635803k326107M270100P631647N918288K164332o9143
$$ 2233858 909917 -4725886 -7051993 -2781893 4849754 10768042 12932374 12863231
44015A2863231j44789L93056R55781K140799K477017j344045q321113j1116792
$$ 12863231 12718442 13111498 14067279 16208078 18685095 17341050 9019937 -2096855
44007b096855n141131L127007L356915m228820q762491l697105N120537Q669474
$$ -2096855 -7237986 -4110979 -754064 -4982884 -13745375 -17442480 -12321943 -3652469
43999c652469N858737J754221m81786j394048j721296j025832J089110M217053
$$ -3652469 2206268 3960489 3478703 2084655 363359 -662473 426637 4643690
43991D643690O508206M764158j867341q104193o924027O26375M808918m67352
$$ 4643690 11151896 15916054 14048713 5944520 -979507 -353132 4455786 3988434
43983C988434q951014j0175821l239788K969248K206959j961276k574957J400091
$$ 3988434 -4962580 -15138401 -18378189 -15408941 -13201982 -15163258 -17738215 -16338124
43975a6338124N075116N010212L140401K691439K840747L77893l912619m568717
$$ -16338124 -11263008 -6252796 -3112395 -420956 2419791 2797684 -1114935 -5683652
43967e683652P76036O400756N320751r37744m379698j749471J760639R67922k440673
$$ -5683652 -4907616 1493140 6813891 5876147 1496449 -253022 1507617 2475539 34866
43958C4866l993660k992637j540314j39197J988002L996562M161862K562676N50369
$$ 34866 -3958794 -6951431 -8491745 -8630942 -6642940 -2646378 1515484 4078160 4628529
43949D628529j500044l762551n293128m891076k826572L4945L677830P459177
$$ 4628529 3128485 -634066 -5927194 -10818270 -13644842 -13609897 -9932067 -2472890
43941b472890Q499162M606631j364428l321453O29373N014242L523081k673596
$$ -2472890 6026272 10632903 9268475 5947022 6576395 11590637 15113718 12440122
43933A2440122o178503l102932J796705J886922k111216l680333l22128L108730
$$ 12440122 6261619 3158687 4955392 6842314 4731098 1050765 728637 3837367
43925C837367J910978k301219n240265n495430l464533Q96258N219433M093495
$$ 3837367 5748345 3447126 -1793139 -7288569 -10753102 -9856844 -4637411 -543916
43917e43916l075999p521832j776260P884404Q585518l60386n905316n73455O758055
$$ -543916 -3619915 -11141747 -12918007 -5033603 3551915 3191529 -2713787 -3287242 3470813
43908C470813M752036l969291q069116l945969J559375K722401J253555O79009
$$ 3470813 8222849 4253558 -3815558 -7761527 -6202152 -3479751 -2226196 -1547187
43900a547187Q36859J75111o54096k14275R07922J104888O10154J228312L030720
$$ -1547187 -710328 -535217 -1189313 -1403588 -495666 609222 1219376 2447688 5478408
43891E478408L259665J47339l380577k790191J162070K463071j510931n548226
$$ 5478408 8738073 8885412 5504835 2714644 3876714 6339785 4828854 -719372
43883g19372m136357N36872K811975K144867J512174N21223k364455l114168L189848
$$ -719372 -4855729 -4318857 -1506882 637985 2150159 2671382 306927 -2807241 382607
43874C82607J1488167J0463566j213551j1675730j1642786m616356J770327N257064
$$ 382607 11870774 22334340 21120789 9445059 -2197727 -6814083 -5043756 213308
43866B13308N536827Q71655n880080o480122P68822O389090L864310l19532R58249
$$ 213308 5750135 6621790 741710 -5738412 -4969590 1419500 5283810 4964278 5922527
43857E922527K263391m054398j2058782j0300144r63508L148308j263466m599730
$$ 5922527 8185918 4131520 -7927262 -18227406 -19190914 -16042606 -17306072 -21905802
43849b1905802j162340L645398M844741M834988N592714M260844M85051p82392
$$ -21905802 -23068142 -19422744 -14578003 -9743015 -4150301 110543 595594 -186798
43841a86798K058072L632136O29955k717266k195324l8366K22007o20676q00851
$$ -186798 1871274 5503410 6133365 3416099 1220775 1182409 1404416 783740 -17111
43832a7111j036087j101738J615826O614205Q625131N151282O98283j98325N26218
$$ -17111 -1053198 -2154936 -539110 6075095 14700226 19851508 20549791 20351466 20877684
43823B0877684j277342n382463q469721q539319n397146l31707K959515J573149
$$ 20877684 19600342 14217879 5748158 -2791161 -8188307 -8520014 -5560499 -3987350
43815c987350j156838Q79270O176653O041334j614536p143653l065985M619237
$$ -3987350 -5144188 -4264918 1911735 7953069 6338533 -805120 -3871105 748132
43807G48132O011166J559521j572428k130424m229461p210618n729701N15082
$$ 748132 6759298 8318819 6746391 4615967 386506 -6824112 -12553813 -12038731
43799a2038731N384606N264154K749541P59464q91950k054102r84247J841392
$$ -12038731 -6654125 -1389971 1359570 2119034 1227084 -827018 -1811265 30127
43791C0127L113315J469896n57552m63016J281810K727054K222815j242860o529863
$$ 30127 3143442 4613338 4055786 3592770 4874580 7601634 9824449 8581589 2051726
43782B051726r322178n902472J645113O819540N870052J485063r22526J027447
$$ 2051726 -7270452 -13172924 -11527811 -4708271 1161781 2646844 1724318 2751765
43774B751765M543371M310931j701209q490205q585359j547850M810387M959748
$$ 2751765 7295136 11606067 9904858 1414653 -7170706 -8718556 -3908169 1051579
43766A051579K657835L343748M637971J103381n161253o889704l101854Q2662
$$ 1051579 3709414 7053162 11691133 12794514 7633261 743557 -2358297 -2275635
43758b275635n5004J62883K148576J739193k528108n252785k447124K019928K762046
$$ -2275635 -2330639 -2167756 -19180 1720013 -808095 -6060880 -8508004 -6488076 -3726030
43749c726030P52222K65144J877357K941784K068096m04544l449818m193480J87731
$$ -3726030 -2973808 -2708664 -831307 2110477 4178573 3774029 324211 -3869269 -3681538
43740c681538O286990N385609m542235j2732666q355857M195485J0611558N461697
$$ -3681538 2605452 7991061 3448826 -9283840 -17639697 -13444212 -2832654 2629043
43732B629043k697054n072570k887402j300054o52166J383474M027994N089201
$$ 2629043 -68011 -5140581 -8027983 -9328037 -9980203 -8596729 -4568735 520466
43724E20466N338959O301984N766006N30109p054453j0094479n669845J212661
$$ 520466 5859425 12161409 17927415 18457524 11403071 1308592 -4361253 -3148592
43716c148592L818965J323095j796306k311872j437974j409519j417949R74751
$$ -3148592 670373 1993468 197162 -2114710 -3552684 -4962203 -6380152 -5405401
43708e405401N119219O710350L264251j881097l652069k185286k018353m207892
$$ -5405401 -286182 6424168 9688419 7807322 4155253 1969967 -48386 -4256278
43700d256278l898025J790320P672659O898354Q27812l066160k035266n05625
$$ -4256278 -8154303 -6363983 1308676 8207030 9034842 5968682 3933416 3427791
43692C427791j294959j350661J128687K112144q87859k730910J290448N817685
$$ 3427791 2132832 782171 1910858 4023002 3135143 404233 1694681 7512366
43684G512366K517676n470454o172676L268809J1144592P549783k244980o736642
$$ 7512366 10030042 4559588 -1613088 1655721 12800313 20350096 18105116 11368474
43676A1368474l874739n07756p40045k784933m890260o590275n203261J190007
$$ 11368474 7493735 6985979 6245934 3461001 -1429259 -8019534 -13222795 -12032788
43668a2032788P286591N089546l455923o433044J468299R633430N459210p279245
$$ -12032788 -4746197 343349 -3112574 -9545618 -8077319 1556111 7015321 -263924
43660b63924j2567425l540320Q697238J0140326J209214o036432m244815J974509
$$ -263924 -12831349 -16371669 -7674431 2465895 3675109 -2361323 -6606138 -4631629
43652d631629M654022K362333q39595k072884j491631J69206J909142J540941
$$ -4631629 22393 2384726 1545131 -527753 -2019384 -1850178 58964 1599905
43644A599905j672201m244191k466737J382483J816205q28886l66864M548577
$$ 1599905 -72296 -4316487 -6783224 -5400741 -3584536 -4413422 -4780286 -231709
43636b31709O676459J208271n869938o488588k342721n27743j233348J221439
$$ -231709 6444750 7653021 1783083 -4705505 -7048226 -7575969 -8809317 -7587878
43628g587878O740784Q360302L647031j441156k343887j736683k406854j716085
$$ -7587878 -847094 7513208 11160239 9719083 7375196 5638513 3231659 1515574
43620A515574K116416M375587L56951o568455q955570m746804J750224N936925
$$ 1515574 3631990 8007577 8364528 1796073 -7159497 -11906301 -10156077 -4219152
43612d219152N951415K084431k688218l570845Q82365O260383P979442O682274
$$ -4219152 1732263 3816694 1128476 -2442369 -1560004 4700379 12679821 19362095
43604A9362095M554630K14602p220551j2292371q837474l14498L209378r29776
$$ 19362095 23916725 24131327 16910776 4618405 -4219069 -4533567 -1324189 -2253965
43596b253965m522312j349677L753526L292392j248639k674163K25498J513238
$$ -2253965 -6776277 -8125954 -4372428 -1080036 -2328675 -5002838 -4777340 -3264102
43588c264102j565746l838436n15827M517214L473341l967112r055591m985570
$$ -3264102 -4829848 -8668284 -9184111 -4666897 -1193556 -5160668 -14216259 -19201829
43580a9201829M190643Q661632M919280j126867k926277j081061m26390k333491
$$ -19201829 -15011186 -6349554 -1430274 -2557141 -5483418 -6564479 -6990869 -9324360
43572i324360l305141m88685M254436O519056M352957K94020j662803q92050o44321
$$ -9324360 -12629501 -13118186 -8863750 -2344694 2008263 2302283 639480 -252570 -896891
43563h96891k653659l389856P89128O150723N029069k456230o933913l324997
$$ -896891 -3550550 -6940406 -6151278 -555 5028514 2572284 -4361629 -7686626
43555g686626J227074r32690m894697j289965O807053P341002o93421m060812
$$ -7686626 -6459552 -7392242 -12286939 -13576904 -6769851 571151 -122270 -4183082
43547d183082L584786J0021621K877223j0007126j1129647Q44593R543414M847100
$$ -4183082 -598296 9423325 12300548 2293422 -8836225 -7991632 1551782 6398882
43539F398882m673768o993533l025894o52966p32310J381187M762056L469776
$$ 6398882 1725114 -5268419 -8294313 -8947279 -9679589 -8298402 -3536346 -66570
43531f6570k454020n457087j778310L017314K988363K51144J40092K651819L850752
$$ -66570 -2520590 -7977677 -9755987 -6738673 -3750310 -3499166 -3359074 -707255 3143497
43522C143497K555887L85449k380414n424918m929222J904021R612544R133515
$$ 3143497 5699384 6084833 3704419 -1720499 -6649721 -4745700 4866844 14000359
43514A4000359P71159m909589j906431K792537M12185o341583q099140k820449
$$ 14000359 14771518 9861929 7955498 10748035 11160220 4818637 -3280503 -6100952
43506f100952K585882K900610m3960k316877k297936J80974M101049O234579M147337
$$ -6100952 -3515070 -614460 -658420 -2975297 -5273233 -5092259 -991210 5243369 9390706
43497I390706K58862j174988n05575j410445l993854m889860l959326m356720
$$ 9390706 9649568 8474580 7969005 6558560 2564706 -2325154 -6284480 -10641200
43489a0641200n354630k294574M428871P653740M001161n99660m1203L534727
$$ -10641200 -15995830 -18290404 -13861533 -6207793 -2206632 -2806292 -2847495 687232
43481F87232N086287M430698L268038K56338m557543n722421k91553M675766Q96229
$$ 687232 5773519 10204217 13472255 13728593 9171050 3448629 3157076 7832842 8729071
43472H729071q089615j1495829o731470j028289J102988K081400K716013m2065
$$ 8729071 639456 -10856373 -17587843 -18616132 -17513144 -15431744 -12715731 -12757796
43464a2757796m475128l314869M177161Q436305L573788k885647j329810N362742
$$ -12757796 -17232924 -20547793 -16370632 -7934327 -4360539 -7246186 -8575996 -3213254
43456c213254O872988R07436m843143m446521p2824L153484K895775o2914l075184
$$ -3213254 3659734 4567170 -275973 -4722494 -4795318 -1641834 1253941 1191027 -1884157
43447a884157l327094j123960R535r24730P9566M840010P751891M012905j074046
$$ -1884157 -5211251 -6335211 -6325676 -7250406 -7170840 -2330830 5421061 9433966 8359920
43438H359920L12218M456319O98854r945514j3304537l240247P627673O234917
$$ 8359920 8672138 13128457 13827311 3881797 -9422740 -12662987 -5035314 1199603
43430A199603j782110k123839N774943R381545L530160l013800l011541q72968
$$ 1199603 -582507 -2706346 3068597 12450142 15980302 12966502 9954961 9081993
43422I081993k550203m981518k726177J612452J706966j678923k278357R51374
$$ 9081993 6531790 1550272 -1175905 436547 2143513 464590 -1813767 -862393
43414h62393K418384l99407k785714o61509K728065J569714m293683r351022r020275
$$ -862393 1555991 1156584 -1629130 -2290639 437426 2007140 -2286543 -11637565 -20657840
43405b0657840l744394K371893N156380L615342Q85849O90040K139073O45195
$$ -20657840 -24402234 -22030341 -16873961 -13258619 -12372770 -11682730 -9543657 -8898462
43397h898462m453720o770592j127449P750900J0112518L853773l328270m907264
$$ -8898462 -13352182 -20122774 -21250223 -13499323 -3386805 466968 -2861302 -7768566
43389g768566k671583q38144Q76863L879601N155601J264767m502465n243442
$$ -7768566 -10440149 -11278293 -10401430 -6521829 -1366228 -101461 -4603926 -9847368
43381i847368k01316M184072L363880l18692k706158k935791j692020J006868
$$ -9847368 -10048684 -5864612 -2500732 -2819424 -5525582 -8461373 -10153393 -9146525
43373i146525L742967L540994P46997J79540L799951N996725J114183p011290
$$ -9146525 -5403558 -1862564 -1115567 -936027 2863924 8860649 9974832 2963542
43365B963542q993259k581166M352332M243172j672287o822177p052716k861409
$$ 2963542 -6029717 -8610883 -4258551 -15379 -1687666 -8509843 -15562559 -18423968
43357a8423968K583593N200116K590132k527240l738074J592740Q141615Q637566
$$ -18423968 -15840375 -10640259 -8050127 -10577367 -14315441 -12722701 -4581086 4056480
43349D056480K556727m015815o010590l684184O6993L075000L880817J533927
$$ 4056480 6613207 2597392 -3413198 -7097382 -7030389 -3955389 -74572 1459355
43341A459355k633905m797462k330684K678592N014510J707445m652512q261556
$$ 1459355 -1174550 -5972012 -8302696 -5624104 -609594 1097851 -3554661 -11816217
43333a1816217n988007q36883J376278p44509j996656K336530Q664622Q357407
$$ -11816217 -17804224 -18641107 -17264829 -18009338 -20005994 -17669464 -9004842 -647435
43325f47435l86596q243494n655479M774721J1394881Q073949O26514k223685
$$ -647435 -1034031 -9277525 -14933004 -10158283 1236598 9310547 9937061 7713376
43317G713376O18369L966782M343207K254069j375868o101282r531905q477679
$$ 7713376 8331745 12298527 16641734 18895803 17519935 11418653 1886748 -6590931
43309f590931l516468J082366L107573M628078O940479P073369K346812m337144
$$ -6590931 -10107399 -9025033 -5917460 -1289382 5651097 12724466 15071278 10734134
43301A0734134p469606n778465k700309r31945K5592J058155J465370N24305j220675
$$ 10734134 3264528 -2513937 -5214246 -6146191 -6120599 -5062444 -3597074 -3072769 -4293444
43292d293444k791686l294658j769905J601655M558647N208777M811054N418511
$$ -4293444 -7085130 -10379788 -12149693 -10548038 -5989391 -780614 4030440 9448951
43284I448951N510985J821513m396994p445952m919718j000126K63848N43140
$$ 9448951 14959936 16781449 12384455 4938503 18785 -981341 -717493 -174353
43276a74353K488612L492992l21269o173790p067851k136530J571481m87421l608137
$$ -174353 2314259 5807251 5485982 -687808 -7755659 -9892189 -8320708 -8808129 -12416266
43267a2416266j308951M471779O129183J818185j914908k46132K547781j70936
$$ -12416266 -13725217 -9253438 -3124255 -1306070 -3220978 -3467110 -919329 -1090265
43259a090265o663331q590040l007431L399955M103702J436765J440624M137168
$$ -1090265 -7753596 -16343636 -19351067 -15951112 -11847410 -10410645 -8970021 -4832853
43251d832853M762199K497033J290911K111828J063004l121847n858640l983129
$$ -4832853 -70654 2426379 3717290 5829118 6892122 3770275 -2088365 -6071494
43243f071494q80603n06801j125680J41015P93137k715937o927134n033807J928497
$$ -6071494 -6952097 -7458898 -8584578 -8443563 -7650426 -10366363 -17293497 -22327304 -20398807
43234b0398807M963494L3049n380482k574149O136883J0833967P486795K121018
$$ -20398807 -15435313 -15402264 -20782746 -23356895 -17220012 -6386045 1100750 3221768
43226C221768Q07710R83818l256628j0389845j2227624n961659R05189J325852
$$ 3221768 4029478 5013296 1756668 -8633177 -20860801 -26822460 -25917271 -24591419
43218b4591419j086038J065361N999647N676974J71203j617241K516613L096647
$$ -24591419 -25677457 -24612096 -18612449 -12935475 -12764272 -14381513 -11864900 -8768253
43210h768253n031955j2075005p379655L880839Q598444M706704J069496K011116
$$ -8768253 -13800208 -25875213 -33254868 -29374029 -20775585 -16068881 -14999385 -12988269
43202a2988269L549387L451843L769650L579979j16783m062402k083269K804096
$$ -12988269 -9438882 -5987039 -2217389 1362590 1245807 -2816595 -4899864 -2095768
43194b095768J436558m942462m458835N297168J0946831M100790m738681k999094
$$ -2095768 -659210 -5601672 -10060507 -4763339 6183492 10284282 5545601 2546507
43186B546507M632959N923780J046640j141778m44604l725806q868863n786534
$$ 2546507 7179466 13103246 14149886 13008108 12563504 8837698 -31165 -5817699
43178e817699N516666J1760968N257614n271912q114763l742002r0301M50438
$$ -5817699 -301033 11459935 16717549 11445637 3330874 -411128 -501429 -50991
43170e0991J609061M180168L772819j983995q604528r339629l263867L288188
$$ -50991 1558070 5738238 9511057 7527062 -1077466 -10417095 -13680962 -10392774
43162a0392774M191796P62614j213466n18471j413086m751277m974320L77330
$$ -10392774 -6200978 -5438364 -6651830 -7170301 -8583387 -13334664 -18308984 -17931654
43154a7931654M939576L296740K89488K601264O431356L735595k853416l301227
$$ -17931654 -12992078 -9695338 -9405850 -6804586 -373230 3362365 508949 -2792278
43146b792278K585106L845556l632596r877587o308921J956444N528558L830625
$$ -2792278 -207172 3638384 5788 -9871799 -16180720 -14224276 -8695718 -4865093
43138d865093J660968k54125l449681n491079l127334J517274M108590M598290
$$ -4865093 -3204125 -3458250 -6907931 -12399010 -15526344 -14009070 -9900480 -5302190
43130e302190N169924M856327J812354j782144k613368j681701j716068j721464
$$ -5302190 -132266 4724061 6536415 4754271 2140903 459202 -1256866 -2978330
43122b978330M00272K289608L99969k897962k037350K634196M956844K394666
$$ -2978330 -2578058 -288450 111519 -2786443 -4823793 -2189597 2767247 5161913
43114E161913q89629j555169j745365l819192n336668k794854K599780O154900
$$ 5161913 4272284 2717115 971750 -2847442 -8184110 -10978964 -8379184 -2224284
43106b224284N307142J860194n54366N0491K468308L637468K106553m5493J17273
$$ -2224284 3082858 4943052 4388686 4439177 6907485 10544953 12651506 12606013 12723286
43097A2723286K234899K990254O85193k422625l092857j040267J104543J080779
$$ 12723286 14958185 17948439 18633632 16211007 13118150 12077883 13182426 14263205
43089A4263205p78164k688728l903910m830875m705872j511913L884982N898763
$$ 14263205 13485041 10796313 6892403 2061528 -2644344 -4156257 -271275 5627488
43081E627488O13223o968691p398040O20444P689278O218644r4397l347286k807584
$$ 5627488 6240711 -727980 -8126020 -7505576 183702 6402346 6307949 2960663 153079
43072A53079l144361m828341l632806J189750M986759M889711L633301M561312
$$ 153079 -2991282 -7819623 -11452429 -10262679 -5275920 -386209 3247092 7808404
43064G808404O663657O284422J489000n793553j0268097p112915J866496P686993
$$ 7808404 14472061 20756483 22245483 16451930 6183833 -929082 937414 8624407
43056H624407L903142m598753p514691k635511K792901L950513M039808N952036
$$ 8624407 12527549 7928796 414105 -2221406 571495 4522008 8561816 14513852
43048A4513852O073539J190545m397341m791545j609812q68508l212792l759153
$$ 14513852 20587391 21777936 17380595 12589050 10979238 10110730 6897938 3138785
43040C138785q05441J635486P63923j072587j280384j147561k080483j473268
$$ 3138785 2333344 3968830 4732753 3660166 2379782 1232221 -848262 -2321530
43032b321530L360184R054698Q917545K156407l994206l512016N20819R24026
$$ -2321530 1038654 10093352 19010897 21167304 17173098 13661082 14181901 15105927
43024A5105927k932851m746091j629235J009958j974727o727644n581843J338384
$$ 15105927 12173076 7426985 5797750 6807708 4832981 -1894663 -7476506 -6138122
43016f138122O004150M241115J474768L779683P853529N267012m596487j1555653
$$ -6138122 -133972 4107143 5581911 9361594 17215123 22482135 17885648 6329995
43008F329995p090524L775656P982298J493833n085484j560803O469467N204204
$$ 6329995 -760529 3015127 10997425 12491258 7405774 5844971 12314438 17518642
43000A7518642o272205j3004872n393206O723862Q570719J067355l203763M90275
$$ 17518642 11246437 -1758435 -7151641 -427779 8142940 9210295 6006532 6496807
42992F496807N297764O362728N904600M330631j549940q777915q519214o93620
$$ 6496807 11794571 18157299 24061899 28392530 26842590 18064675 9545461 8851841
42984H851841L061967k474342o309878J082140J0481818P154577n576161j0913755
$$ 8851841 11913808 9439466 3129588 4211728 14693546 21848123 16271962 5358207
42976E358207m016721K469393k12575m456891r88320N499460M310189m563854
$$ 5358207 1341486 3810879 3598304 -858587 -1846907 3652553 7962742 3398888
42968C398888j0926470q599994j518214L640833M844228L959479K875357K029723
$$ 3398888 -7527582 -16127576 -17645790 -14004957 -9160729 -5201250 -2325893 -296170
42960b96170Q89678r93708k702871k211133R54028M086436M024234J219126o18985
$$ -296170 593508 -400200 -3103071 -5314204 -4360176 -273740 3750494 4969620 4350635
42951D350635Q07661L571066M161928J852889r04787k052614k224373k908696
$$ 4350635 5158296 8729362 12891290 14744179 13839392 11786778 9562405 6653709
42943F653709l889090l986396l266462k525083j257251J402145L939645L593485
$$ 6653709 2764619 -1221777 -4488239 -7013322 -8270573 -6868428 -2928783 664702
42935F64702O87900j232121o03991L7466j292349k711247k222076j414812k022361
$$ 664702 1352602 120481 -483510 -446044 -1738393 -4449640 -6671716 -8086528 -10108889
42926a0108889j665194K593041Q186945R256363M551569r23003k435518l48587
$$ -10108889 -11774083 -9181042 -994097 8262266 12813835 11890832 9455314 9106727
42918I106727K002762K319761N22403j872164k896122j928050k47096R13275J468421
$$ 9106727 11109489 13429250 13951653 12079489 9183367 7255317 7008221 7921496 9389917
42909I389917P10396k755988p079403o635746M90623P378687N993763j686857
$$ 9389917 10100313 7344325 264922 -6370824 -5880201 1498486 7492249 5805392
42901E805392o167700l303728J643942L267055K833647L651552N012617M103567
$$ 5805392 -362308 -3666036 -2022094 1244961 4078608 7730160 12742777 16846344
42893A6846344O44494l032300m450332k429670J594499L450833L70834m807110
$$ 16846344 17490838 14458538 10008206 7578536 9173035 12623868 12994702 8187592
42885H187592o782927m464547o87882L164384O851475P250598K069380l087300
$$ 8187592 1404665 -3059882 -3747764 -583380 6268095 13518693 15588073 12500773
42877A2500773l51552O952667O868124k444785q114715k504926L971732n52373
$$ 12500773 12149221 19101888 25970012 23525227 15410512 12905586 16877318 16324945
42869A6324945j0019303j0191509r42311N153215L085580K26160J257286J562083
$$ 16324945 6305642 -3885867 -4828178 325037 3410617 3636777 4894063 6456146
42861F456146j936387m692134l290431j240653j831529k653554j180394O31103
$$ 6456146 4519759 -172375 -3462806 -4703459 -6534988 -9188542 -10368936 -9737833
42853i737833Q49801Q72402J285793K23499j525637M0064M671940O219882J874057
$$ -9737833 -8888032 -8015630 -6729837 -6506338 -8031975 -7991911 -3319971 2899911 4773968
42844D773968l152644l888212k316164j757266r62545J279371J810547r49681
$$ 4773968 1621324 -2266888 -4583052 -6340318 -7302863 -6023492 -4212945 -5162626
42836e162626k331026J257092N490878M941339J760528R26082J747281J312483
$$ -5162626 -7493652 -6236560 -745682 4195657 5956185 6882267 8629548 9942031
42828I942031J370953L618176L208025l341103q485708l683223M308203J196795
$$ 9942031 11312984 14931160 18139185 14798082 6312374 2629151 6937354 8134149
42820H134149j1376243j5563068l726041R947378J0959374L930062Q47560J719198
$$ 8134149 -3242094 -18805162 -22531203 -12583825 -1624451 2305611 3153171 4872369
42812D872369l87301l513816n02523N872008N708817j199711m522814m48956K756545
$$ 4872369 4485068 971252 468729 6340737 12049554 10849843 6327029 5878073 8634618
42803H634618m69532l977631j392875K741397R40360m682337o242669k669530
$$ 8634618 8165086 4187455 2794580 5535977 6476337 1794000 -4448669 -7118199
42795g118199k30579j694590k308769K163342Q522512R695878L032310o407745
$$ -7118199 -7348778 -9043368 -11352137 -9188795 -666283 9029595 12061905 5654160
42787E654160j0344711n475971K374335M141741j373646n378613p63762P577376
$$ 5654160 -4690551 -10166522 -7792187 -3650446 -5024092 -10402705 -11166467 -3589091
42779c589091R197514K722370k777721j345395K225478J412214j842420j656485
$$ -3589091 5608423 8330793 5553072 4207677 6433155 7845369 6002949 4346464
42771D346464J336577J213951k994183n363078k235515K795774N211483N445727
$$ 4346464 5683041 6896992 3902809 -1460269 -3695784 -900010 4311473 9757200
42763I757200N180581K658455l446880q878978q203015k667825J784671L208003
$$ 9757200 14937781 17596236 14149356 5270378 -2932637 -5600462 -3815791 -607788
42755f07788M311997M891978J094486n733257p095817Q04619R277502P908181
$$ -607788 3704209 8596187 9690673 3957416 -3138401 -2333782 6943720 14851901
42747A4851901q73645n606705k099303K391128J586249j452736j449108L26948
$$ 14851901 13978256 8371551 6272248 8663376 10249625 8796889 7347781 7674729
42739G674729n26750l503338m047083q10804K530552K613404K32771j777900k365284
$$ 7674729 7147979 3644641 -402442 -1213246 1317306 3930710 4163481 2385581 20297
42730B0297k724980l554010l134254M02672M867247M821839j141055o536188m500518
$$ 20297 -2704683 -6258693 -9392947 -8990275 -4123028 698811 -442244 -6978432 -11478950
42721a1478950K546744O084407L594038R91625K174966L373513Q11978k767065
$$ -11478950 -8932206 -2847799 746239 1737864 3912830 7286343 8098321 5331256
42713E331256l593974l013282l186822k163613J107386K154822j899527n301983
$$ 5331256 1737282 -1276000 -4462822 -6626435 -5519049 -3364227 -5263754 -10565737
42705a0565737j391436O458916R748732P369378M401162J428476m567539j0199666
$$ -10565737 -11957173 -5498257 4250475 11619853 16021015 17449491 12881952 2682286
42697B682286q037193K69747M313605M89676l437604k198367m36215j917069k292195
$$ 2682286 -5354907 -5085160 -771555 -281879 -3719483 -5917850 -6354065 -8271134 -10563329
42688a0563329J245807L278567M22097j313783K217492M001800k063198q294918
$$ -10563329 -9317522 -6038955 -5616858 -6930641 -4713149 -711349 -2774547 -11069465
42680a1069465m635153L709359L905230l290572m804692L083772Q944301M573415
$$ -11069465 -15704618 -11995259 -8090029 -11380601 -16185293 -13101521 -4157220 416195
42672D16195l497591n407658p08071N245609R120904Q828498K440995o694519
$$ 416195 -3081396 -8489054 -9197125 -3951516 5169388 13997886 16438881 9744362
42664I744362r946174l881934M103950N292882K84588m175964m603465k323022
$$ 9744362 -201812 -4083746 20204 5313086 5597674 1421710 -3181755 -5504777
42656e504777P32113L036258K844369N03397p57815N79366J485143q39852m017062
$$ -5504777 -4772664 -1736406 1107963 1611360 853545 1432911 2918054 2078202 -1938860
42647a938860l698259L20590M295126N319090L485680P02394q19947l18610L06410
$$ -1938860 -5637119 -5316529 -1021403 4297687 7783367 8485761 7665814 7347204 7653614
42638G653614j058074k971403k364413l45931j395472n610620p160134k962203
$$ 7653614 6595540 3624137 1259724 913793 -481679 -6092299 -13252433 -16214636
42630a6214636K370686L677019K338096K003806J859800n60734l267704k150883
$$ -16214636 -13843950 -10166931 -7828835 -5825029 -3965229 -4525963 -7793667 -9944550
42622i944550K388036N779860N100651J271777k859980m073608r04987L445435
$$ -9944550 -7556514 -1776654 3323997 4595774 1735794 -2337814 -3242801 202634
42614B02634L661003q4843j751893P27642J657196j980508l771685J314129O508702
$$ 202634 3863637 3778794 2026901 2754543 4411739 2431231 -1340454 -26325 6482377
42605F482377L407676l208321k643384L330810L126368m325901o609157J609892
$$ 6482377 9890053 6681732 4038348 7369158 10495526 6169625 -439532 1170360
42597A170360Q860396M456316n432447q044349k118597L602893M231416J775921
$$ 1170360 10030756 14487072 9054625 1010276 -1108321 2494572 6725988 8501909
42589H501909k078088p129586r838424n419417M287023J0862400Q940954K167614
$$ 8501909 6423821 -705765 -10544189 -15963606 -11676583 -814183 8126771 10294385
42581A0294385j809078K9280L530175K518242l938764r868249r167636l153619
$$ 10294385 8485307 8514587 12044762 14563004 10624240 755991 -8411645 -11565264
42573a1565264J513783J931085J597799L266659M374820K179351j131740k004154
$$ -11565264 -10051481 -8120396 -6522597 -3255938 1118882 3298233 2166493 162339
42565A62339o82471O12329J535317K353741J890754K8933p52149M49279N55400
$$ 162339 -520132 92197 1627514 3981255 5872009 5900942 5148793 5598072 6153472
42556F153472k301949m854020l925929j778967j586752j473494J290993L727621
$$ 6153472 3851523 -1002497 -4928426 -6707393 -8294145 -9767639 -8476646 -4749025
42548d749025J572607k324753j563109L102122M346757k56256m702142l837594
$$ -4749025 -3176418 -5501171 -7064280 -3962158 384599 128343 -4573799 -8411393
42540h411393K67734L154916L623137K481099M96637m52779J534720M608024M566013
$$ -8411393 -8143659 -4988743 -1365606 1115493 1612130 1159351 2694071 7302095 11868108
42531A1868108J041464k101753l112474l825868m087422j116364L708330M291484
$$ 11868108 12909572 10807819 7695345 3869477 -217945 -1334309 2374021 6665505
42523F665505p01341m368372j772601K628615K831780N39409K28837K85197l225815
$$ 6665505 5964164 1595792 -176809 2451806 5283586 5822995 6051832 6337029 3111214
42514C111214p610504o605981n15276M345330N247528M882602M431046K320728
$$ 3111214 -4499290 -11105271 -11620547 -7275217 -2027689 2854913 7285959 9606687
42506I606687j84836J98834J751098o59750n652417n430977J358910N408103J84736
$$ 9606687 9421851 9620685 11371783 10712033 5059616 -371361 987549 6395652 6580388
42497F580388q042207r812824n488690j375101J327889M770711N922002L06468
$$ 6580388 -1461819 -11274643 -16763333 -18138434 -16810545 -12039834 -6117832 -5811364
42489e811364p294826o730175J919615P048439K964934j469938K562047R534341
$$ -5811364 -13106190 -19836365 -17916750 -10868311 -7903377 -9373315 -6811268 2723073
42481B723073Q566690N47083m133627k104752l78814k745810l318689K366063
$$ 2723073 11289763 11836846 7703219 5598467 5219653 2473843 -844846 1521217
42473A521217Q323275O623288o94747n411301n411680n419846o704869m426999
$$ 1521217 9844492 16467780 15773033 10361732 4950052 -469794 -7174663 -11601662
42465a1601662K757590P773674M630098j942112k439112M014430Q506647M721469
$$ -11601662 -8844072 -1070398 3559700 1617588 -821524 3192906 11699553 16421022
42457A6421022l302348p871913p291455n116038l123631o5144L569741M512971
$$ 16421022 13118674 5246761 -2044694 -7160732 -10284363 -10349507 -6779766 -2266795
42449b266795J610255j788364k140666O7403K238889L617818M938096N567429
$$ -2266795 -656540 -2444904 -4585570 -4518167 -2279278 1338540 6276636 11844065
42441A1844065L826536O2041k784735k351787M31928K218439M54467m046340p394385
$$ 11844065 15670601 15732642 12947907 10596120 11028048 13246487 13700954 9654614 2260229
42432B260229o141543j097646L098706K867108o98588l715334l825848j714625
$$ 2260229 -3881314 -4978960 -1880254 986854 288266 -3427068 -7252916 -8967541
42424h967541M05310O34939j117030k469397r53219J943157J628887k728306n223474
$$ -8967541 -8562231 -7927292 -9044322 -11513719 -12466938 -10523781 -8894894 -11623200 -16846674
42415a6846674o95039P170150R915316N302115q16313l224945k494718p41661
$$ -16846674 -17541713 -10371563 -456247 4845868 4029555 804610 -1690108 -2431769
42407b431769K013517M942060M757877L19933m460336n313840k642739L66233
$$ -2431769 -418252 4523808 9281685 9601618 5141282 -172558 -2815297 -2449064
42399b449064J817328J166204j656678m659838m192546N36311N814160Q020354
$$ -2449064 -631736 534468 -1122210 -5782048 -9974594 -9438283 -3624123 4396231
42391D396231O761326K385630m575616r474125n798312M199338Q102996n03763
$$ 4396231 11157557 13543187 8967571 -506554 -6304866 -2105528 5997468 5493705
42383E493705j0695271q244574L748022R666360M558575n29993K110247N289915
$$ 5493705 -5201566 -13446140 -9698118 -31758 4526817 3996824 6107071 11396986
42375A1396986N37580p316225p928631j249906L531929J654823k546336l680423
$$ 11396986 11934566 4618341 -3310290 -4560196 -1028267 626556 -1919780 -5600203
42367e600203j738591l907n44358k371289k169417K301969Q196746R306723L891856
$$ -5600203 -7338794 -7342701 -7887059 -10258348 -12427765 -10125796 -1929050 7377673 11269529
42358A1269529k049184k322159J372044K653015m67251m179985n313487m526211
$$ 11269529 9220345 6898186 8270230 10923245 10455994 6276009 962522 -3563689
42350c563689l129253j003300J304456J820802J63117r55533R37360M426126N546744
$$ -3563689 -6692942 -7696242 -6391786 -4570984 -4407867 -5363400 -4426040 86 5546830
42341E546830K597398j516250k388426P30113L960155L564372M85059j343070
$$ 5546830 8144228 6627978 4239552 4969665 8929820 12494192 12979251 11636181
42333A1636181k59393J577378J387981j507161n503996p151561l214373M542799
$$ 11636181 11376788 12954166 14342147 12834986 7330990 179429 -3034944 1507855
42325A507855Q423994L464769m220592m118449L703342P999339K648784m835121
$$ 1507855 9931849 13396618 9176026 5057577 8760919 16760258 19409042 14573921
42317A4573921n555749k044872j795753m115678k193425M843254J0252386R095454
$$ 14573921 9018172 6973300 5177547 1061869 -1131556 3711698 13964084 23059538
42309B3059538K910243m094072q120549o719637k024851q11439n511783q188329
$$ 23059538 25969781 21875709 13755160 7035523 5010672 4199233 -1312550 -9500879
42301i500879r08059J0586619J3011203M536332k632771k36332N476709M972528
$$ -9500879 -10408938 177681 13188884 17725216 15092445 14856113 20332822 25305350
42293B5305350j373367o536140o755394k948556K649984O483432M652790j758041
$$ 25305350 23931983 17395843 10640449 7691893 10341877 16825309 21478099 19720058
42285A9720058n989320l650440K214320O456225P312915M219276l327212j0797703
$$ 19720058 13730738 10080298 12294618 18750843 26063758 30283034 26955822 16158119
42277A6158119r657103P02520Q583547M925920l229581l249874L830729N638897
$$ 16158119 6501016 7203536 15787083 20713003 17483422 14233548 18064277 23703174
42269B3703174j854248q766452o929430m68527L162679L881324N051135N480582
$$ 23703174 21848926 13082474 6153044 5684517 8847196 12728520 17779655 23260237
42261B3260237K110246k930777m063557L47904O607729J0675226J1338236R513941
$$ 23260237 25370483 22439706 18376149 18724053 25331782 36007008 47345244 56859185
42253E6859185P249858O571199P063110N744687J522857j778683K67493O422582
$$ 56859185 64109043 70680242 77743352 83488039 85010896 83232213 83499706 89922288
42245H9922288J1185402J2237238J2912457J6294330K0235156K0815057J8764611
$$ 89922288 101107690 113344928 126257385 142551715 162786871 183601928 202366539
42238B02366539J8982098K3518123K7966420K6602471J9614950J2892259J0672670
$$ 202366539 221348637 244866760 272833180 299435651 319050601 331942860 342615530
42231C42615530J0508609O571547l350967j5518388k4150932k6285590k3273117
$$ 342615530 353124139 359695686 356344719 340826331 316675399 290389809 267116692
42224B67116692j9293148j8566106k2073406k5925894k4477328j6695153q371155
$$ 267116692 247823544 229257438 207184032 181258138 156780810 140085657 131714502
42217A31714502n876468q444915r727940p240697o005066j0096323j4541488j1265751
$$ 131714502 125838034 117393119 107665179 100424482 94419416 84323093 69781605 58515854
42209E8515854j674748L499640j457590r150849r075092j082075N994685O042070
$$ 58515854 56841106 60340746 58883156 49732307 40657215 39575140 45569825 51611895
42201E1611895P99293m812080p394305o032676k982851k588102n615841o362889
$$ 51611895 52411188 47599108 40204803 34172127 31189276 28601174 22985333 16622444
42193A6622444j32888Q334762R936664L489632l727434o936298p697518o768404
$$ 16622444 16489556 24824318 34760982 38250614 34523180 27586882 19889364 13120960
42185A3120960k077082M152030N159965P1542l740302k606013j961591m737121
$$ 13120960 11043878 15195908 20355873 20427415 16687113 14081100 12119509 7382388
42177G382388m254400L377934R034678L455385o712685q012659o04999L466159
$$ 7382388 3127988 6505922 15540600 18995985 12283300 4270641 3665642 7131801
42169G131801K820k916034n05993J841985J01731j588201j23212N23709k209734
$$ 7131801 7134621 4218587 3712594 5554579 5656310 4068109 3944897 4468606 2258872
42160B258872l476926M96279N011134M292868N88267n13877O10235n24920m190696
$$ 2258872 -1218054 -721775 4289359 8582227 9170494 8656617 9266852 8741932 4551236
42151D551236n953611l430308P66589K470696N1759l980591m480320J027596P820608
$$ 4551236 -1402375 -4832683 -4066094 -1595398 -1543639 -5524230 -10004550 -8976954 -1156346
42142a156346P999075K33256p966272r129331l506444L410683P243133P036528
$$ -1156346 6842729 7075985 -890287 -10019618 -13526062 -10115379 -2872246 4164282
42134D164282M788935M024005N673286N409713n87399p982299q757635l227320
$$ 4164282 8953217 12977222 18650508 24060221 23472822 15490523 6732888 3505568
42126C505568K85086j275001j957292J030489J631375l441422p155359l418325
$$ 3505568 3790654 2515653 558361 1588850 3220225 -221197 -7376556 -10794881
42118a0794881K543208L125370K08619m19049N11976J8659Q31460N090537O425426
$$ -10794881 -8251673 -5126303 -4917684 -5336733 -4824757 -4806098 -3974638 1115899 7541325
42109G541325n12853q206460o171199J956587M380233M59335l07084L619786M176151
$$ 7541325 7028472 -1177988 -7349187 -5392600 -1012367 -553032 -860116 2759670 6935821
42100F935821Q7638p10924L068599L110914k242382l915113R33669K920923k176656
$$ 6935821 7023459 6312535 9381134 12492048 10249666 6334553 7268222 10189145 8012489
42091H012489m965151K86129M265835j026450p711219n984536q71948j412265
$$ 8012489 3047338 3333467 7599302 6572852 -1138367 -7122903 -7994851 -9407116
42083i407116l533127R71845O994673M550131j588672J148104R871528Q902268
$$ -9407116 -12940243 -11968398 -4973725 -423594 -2012266 -864162 9007366 17909634
42075A7909634l977318j2441076o795923K447888L039678j249341m74335M813945
$$ 17909634 13932316 1491240 -5304683 -2856795 182883 -1066458 -1540793 3273152
42067C273152O898442L700482q77712m566687p026208o222074j180454M174264
$$ 3273152 10171594 13872076 12994364 8427677 1401469 -4820605 -6001059 -1826795
42059a826795N158992K169759j365195m045543o025860o483816m940583k427192
$$ -1826795 3332197 5501956 4136761 91218 -5934642 -12418458 -17359041 -19786233
42051a9786233J037879O481676J1251445R377079N05561o502290m134119L469523
$$ -19786233 -18748354 -12266678 -1015233 8361846 8867407 2365117 -1769002 1700521
42043A700521O383872K064279l260456m296955j726428J703691M570645N825341
$$ 1700521 8084393 10148672 6888216 2591261 864833 2568524 7139169 12964510
42035A2964510M663240K016556o04065l393366o645269p946377m648978J098490
$$ 12964510 17627750 19644306 19040241 15646875 9001606 1055229 -3593749 -2495259
42027b495259L406949m15939o244519p238114p00227Q779873J2665762O705321
$$ -2495259 911690 495751 -5748768 -12986882 -13687109 -4907236 7758526 14463847
42019A4463847l457814p581534k849055L152656L393435K40745p18418l64795
$$ 14463847 11006033 3424499 575444 3728100 7121535 7362280 6643862 6279067
42011F279067k713031n528330k872355L899542O331468J417743l787559l004503
$$ 6279067 3566036 -1962294 -4834649 -935107 5396361 6814104 3026545 22042
42003B2042N07726K40994l571447n289277k397126J751771K738792j60874l536800
$$ 22042 529768 770762 -2800685 -8089962 -10487088 -8735317 -5996525 -6157399 -9694199
41994i694199l047306J829810O085443M399248j831236n708784l548946J201828
$$ -9694199 -12741505 -10911695 -4826252 -427004 -2258240 -7967024 -11515970 -10314142
41986a0314142L793709L948547L738042L281335J541864q64414k292403k100412
$$ -10314142 -6520433 -2571886 1166156 4447491 5989355 5124941 2832538 732126
41978G32126n40769J720613L042566J949321l55916j072398P5344P32758J90402
$$ 732126 191357 1911970 4954536 6903857 6547941 5475543 5550887 6283645 6474047
41969F474047K751M7254j293249k420031M5528L699289J560951n950042q385596
$$ 6474047 6476798 6524052 5230803 2810772 2856300 6555589 8116540 2166498 -6219098
41960f219098l38515Q685287P617860K73363k035854P61230q37733p223139p132852
$$ -6219098 -6557613 2127674 9745534 10018897 7983043 8744273 7906540 683401 -6449451
41951f449451L101633J1029822O047595m225060n174358L601822Q958100L607067
$$ -6449451 -3347818 7682004 13729599 9504539 4330181 7932003 16890103 20497170
41943B0497170n316603q309961n790634m237726n414078n153609j211021L057970
$$ 20497170 15180567 6870606 1079972 -3157754 -8571832 -13725441 -14936462 -11878492
41935a1878492M065656L091459L184463L682305J976553o80839n30123J345834
$$ -11878492 -7812836 -4721377 -1536914 2145391 4121944 3441105 2910982 4256816
41927D256816n72569o199610p204881N18092Q109870N223388m178282o908117
$$ 4256816 3684247 -2515363 -9720244 -9202152 -1092282 4131106 -47176 -6955293
41919f955293N15932P916579O776742M8129n335117o937416m685655J505851P733015
$$ -6955293 -6439361 1477218 8253960 8302089 2966972 -3970444 -8656099 -7150248 582767
41910E82767P100784l70120n432036k348103K605868J437797l143825l427917
$$ 582767 7683551 7313431 1881395 -466708 2139160 3576957 433132 -2994785
41902b994785J15006N28461l127478m132715P87597O385539O756144K710547q43169
$$ -2994785 -2879779 -2351318 -5478796 -9611511 -8823914 -2438375 4317769 7028316 6185147
41893F185147j025614J321156L470211L057687l7744l723204o202917p267394
$$ 6185147 5159533 6480689 9950900 13008587 12970843 9247639 3044722 -4222672
41885d222672o486588k970101J308571J505443l546347p921981n695922J153504
$$ -4222672 -10709260 -13679361 -12370790 -10865347 -14411694 -22333675 -28029597 -26876093
41877b6876093O082019O717817N609370M449891K890508J878925K851119L901128
$$ -26876093 -20794074 -14076257 -8466887 -4016996 -1126488 752437 3603556 7504684
41869G504684J478100l968313p944652p475393l398328K221264P408654R587198
$$ 7504684 8982784 5014471 -2930181 -10405574 -13803902 -11582638 -4173984 5413214
41861E413214P062171J178098m990339q819710p787504p12188P903272R577349
$$ 5413214 12475385 13653483 8663144 -156566 -7944070 -8656258 -752986 8824363
41853H824363K417211m794988m463432o17723m08807j266552L274599R548244
$$ 8824363 11241574 6446586 1983154 1365431 956624 -309928 2964671 12512915
41845A2512915Q082498L7676l896514j360728j514763p704102j0431943l219500
$$ 12512915 20595413 20633089 16736575 15375847 13861084 6156982 -4274961 -7494461
41837g494461O221679P887798L155240p66338k119496l092798l619639l295900
$$ -7494461 -1272782 6615016 9770256 9003918 6884422 3791624 171985 -3123915
41829c123915l884253m723209j742689M494275O974325L065829q94619p31726
$$ -3123915 -7008168 -11731377 -13474066 -8979791 -2005466 1060363 165744 -565982
41821e65982q27867l525429k797808L541623O431389O29554l783625K266852R287753
$$ -565982 -1393849 -4919278 -7717086 -4175463 2255926 2885480 -898145 1368707 10656460
41812A0656460L669181q527006j0318169j230816L312951j697911m685526O08358
$$ 10656460 14325641 5798635 -4519534 -5750350 -2437399 -4135310 -8820836 -8212478
41804h212478N452967L055379j026657j406276j552354l586223k567592K300790
$$ -8212478 -2759511 295868 -730789 -2137065 -3689419 -7275642 -9843234 -7542444
41796g542444L284197j849418l567361L499359R924921O103822k824915o537364
$$ -7542444 -4258247 -6107665 -9675026 -6175667 3749254 9853076 7028161 490797
41788D90797m774590k919588q97446K803714L633807j458348n646623k369187
$$ 490797 -4283793 -7203381 -8100827 -5297113 -1663306 -3121654 -8768277 -11137464
41780a1137464K669561J148648k766470j47896N387133L171202m783683n563600
$$ -11137464 -8467903 -7319255 -10085725 -10233621 -4846488 -1675286 -6458969 -12022569
41772a2022569L105228Q653306L840510k997178k787775J371426K353482O9034
$$ -12022569 -8917341 -264035 3576475 579297 -2208478 -837052 1516430 1585464
41764A585464k090943l730567m356582j084982M851125O247190N33950m303297
$$ 1585464 -505479 -4236046 -8592628 -9677610 -4826485 1420705 1954655 -2348642
41756b348642r04439O255254P994047L878434P39403J085241J035282j524950
$$ -2348642 -3253081 3002173 10996220 14874654 15614057 16699298 17734580 16209630
41748A6209630l981397m435449m351670m748525l999385p57402L538086N969170
$$ 16209630 12228233 7792784 3441114 -1307411 -5306796 -6064198 -2526112 3443058
41740C443058M784765J110527j354101m335K634683J437846l504055n676472j494056
$$ 3443058 8227823 9338350 7984249 7979914 10614597 12052443 8548388 2871916 1377860
41731A377860L483532K141577l954552p462704n869431k893953o24363K774102
$$ 1377860 4861392 7002969 3048417 -4414287 -10283718 -13177671 -13802034 -11027932
41723a1027932O900366P356663K739105j726837r74612K972097M323635J454004
$$ -11027932 -4127566 3229097 5968202 4241365 3266753 6238850 10562485 12016489
41715A2016489j928945k445183p87429L92305K18198M3266P21854P37642j829972
$$ 12016489 10087544 7642361 6854932 7247237 7465435 7508701 8230555 8968197 7138225
41706G138225n892675p894662o368081l650268j749749O45760M488469O677729
$$ 7138225 1245550 -6649112 -13017193 -16667461 -18417210 -17771450 -13282981 -6605252
41698f605252M211944l3430p59582J604998J887501q84348k007258J18680O56068
$$ -6605252 -2393308 -2426738 -3186320 -1581322 306179 -578169 -2585427 -2466747 -1810679
41689a810679k856720m791160K0101O870873P120881Q87991l242141n77177M137981
$$ -1810679 -4667399 -9458559 -9438458 -2567585 4553296 5441287 2199146 1621969 5759950
41680E759950M575977P36683l207951m881877m731605l609010j942025k45562
$$ 5759950 10335927 11072610 7864659 2982782 -1748823 -5357833 -7299858 -7545420
41672g545420J058452J746062J439659L38540J90144K586591N972877O466703
$$ -7545420 -6486968 -4740906 -3301247 -2962707 -2772563 -185972 5786905 12253608
41664A2253608K501992l088435o488935o796484n565436l981701j886220R63290
$$ 12253608 14755600 11667165 5178230 -1618254 -7183690 -11165391 -13051611 -12088321
41656a2088321L594052M051709J561558j258627k13767M637357P128086K535626
$$ -12088321 -8494269 -4442560 -2881002 -4139629 -4353396 283961 7412047 9947673
41648I947673m576920n367701M04279K986756l315095j1046382r775609o20336
$$ 9947673 5370753 3052 407331 3394087 78992 -10967390 -20742999 -21363335
41640b1363335O270050O106264L613790L148855K578347n71740l433318k495792
$$ -21363335 -15093285 -8987021 -5373231 -2224376 353971 -217769 -3651087 -6146879
41632f146879L98705J185261k82297j379994j591695j909336j221475J924350
$$ -6146879 -5748174 -4562913 -4845210 -6225204 -7816899 -9726235 -10947710 -9023360
41624i023360M915643L460639j533258m389720k802942m94454l0521J445265N618988
$$ -9023360 -4107717 -647078 -2180336 -6570056 -9372998 -9867452 -9897973 -8452708 -2833720
41615b833720P260901J184927p847661r248888n69207Q907412R973411L612686
$$ -2833720 4427181 5612108 -2235553 -11484441 -12053648 -3146236 6827175 10439861
41607A0439861k882833n127860l738199q86322J461975J940635J189535J100841
$$ 10439861 7557028 2429168 -1309031 -2195353 -733378 1207257 2396792 3497633
41599C497633J204557r43427m100785l055243K567903N006038k72590n508589
$$ 3497633 4702190 3758763 -342022 -3397265 -829362 4176676 3904086 -1604503
41591a604503j539185O633089O543569j269268l248441M399970P595591l268243
$$ -1604503 -3143688 3489401 10032970 8763702 5515261 9915231 17510822 14242579
41583A4242579j5822159j3020356R41807P172878M32643n245002k19413O974169
$$ 14242579 -1579580 -14599936 -13658129 -6485251 -6052608 -11297610 -11517023 -4542854
41575d542854N536227m76869o38906M477169N682670J136474j218368K608670
$$ -4542854 993373 516504 -122402 4354767 10037437 11173911 9955543 12564213
41567A2564213O136586K920967l719020o626711n500940n234576o096485l047309
$$ 12564213 18700799 21621766 17902746 11276035 5775095 540519 -5555966 -8603275
41559h603275M398230Q736429M741901k137968l251620R41344K843569J75896
$$ -8603275 -4205045 4531384 9273285 7135317 3883697 4825041 7668610 7844506
41551G844506j497157Q13956K786336J217304m67662M41414J37770m207240p408990
$$ 7844506 6347349 7161305 9947641 11164945 10697283 11138697 11276467 7069227 -339763
41542c39763m201079Q22524j38085m979957m682851K309022Q194604Q047439M749230
$$ -339763 -4540842 -3718318 -3856403 -8836360 -13519211 -11210189 -3015585 5031854 9781084
41533I781084J096442l705336p821029o191053O28792N106238L619046R64189
$$ 9781084 10877526 7172190 -648839 -6839892 -6211100 -1104862 2514184 3478373
41525C478373O73277n65537m255045m914377j15835K707263k218070p936172n016917
$$ 3478373 4151650 3586113 -668932 -5583309 -5699144 -2991881 -5209951 -13146123 -18163040
41516a8163040K831181M533915n07785k308258K735932O527101L113989k295135
$$ -18163040 -15331859 -10797944 -11305729 -13613987 -10878055 -4350954 -1236965 -3532100
41508c532100k564277P39198J272383k369946n790213n107657p30860L855491
$$ -3532100 -6096377 -5357179 -4084796 -6454742 -12244955 -17352612 -18083472 -14227981
41500a4227981N408279M051712L011145L700712K825431k267210p426044o261402
$$ -14227981 -8819702 -4767990 -1756845 1943867 4769298 2502088 -4923956 -11185358
41492a1185358J06013M237214L520070L010587N430297N966760J151343l826817
$$ -11185358 -11079345 -6842131 -3322061 -311474 5118823 11085583 12236926 8410109
41484H410109k775705J339968R33471m202581o692869k899181K179891K770680
$$ 8410109 5634404 6974372 7907843 3705262 -2987607 -5886788 -3706897 -936217
41476i36217j60574j969094j383038j092389k732528m386593l561645q56927P88491
$$ -936217 -1096791 -3065885 -4448923 -5541312 -8273840 -12660433 -16222078 -17079005 -16290514
41467a6290514K65743P0043K639405O066529O044977K244916l61623J730079N211196
$$ -16290514 -16024771 -15954728 -13315323 -7248794 -1203817 1041099 679476 2409555 7620751
41458G620751M472184k38118l150808j295965J697892J590560l59359k52689J922054
$$ 7620751 12092935 11854817 8704009 7408044 9105936 10696496 10337137 10084448 12006502
41449A2006502K564109N16757j174471l10185J169385P27562p38775q53832L11374
$$ 12006502 14570611 15087368 13912897 13602712 14772097 15499659 14760884 13907052 14218426
41440A4218426R81729Q12185M16814r49464l989719o547291n818890k980194j713213
$$ 14218426 15200155 16012340 16429154 15479690 11489971 4942680 -876210 -3856404 -5569617
41431e569617k161092q18955K776221M174260R81016k789239k483724P52229K901664
$$ -5569617 -7730709 -8549664 -5773443 -1599183 -618167 -3407406 -5891130 -5138901 -2237237
41422b237237L283685L641656L366099M11151l824698m959880j605714K251768
$$ -2237237 1046448 4688104 8054203 8465354 4640656 -319224 -1924938 326830
41414C26830K127011j320856k853755J028667O962852P745192J617994m373286
$$ 326830 2453841 1132985 -1720770 -692103 6270749 14015941 15633935 11260649
41406A1260649l937051j400515n261982j3346864j3838190l046627P803994Q515473
$$ 11260649 7323598 5923083 661101 -12685763 -26523953 -29570580 -21766586 -13251113
41398a3251113L390684J609431K558345L25095l572213k905442J550288L446163
$$ -13251113 -9860429 -8250998 -5692653 -5367558 -8939771 -11845213 -10294925 -6848762
41390f848762J628662k3569j078300l238282l223002K366941P301658K814622
$$ -6848762 -5220100 -5243669 -6321969 -9560251 -12783253 -10416312 -3114654 -300032
41382c00032o600997p525477J584422P583569L367662k369022j321579J414006
$$ -300032 -6901029 -14426506 -12842084 -5258515 -1890853 -4259875 -5581454 -4167448
41374d167448j737504p391756p510855j677308M655118Q260926Q417196M882148
$$ -4167448 -5904952 -13296708 -20807563 -22484871 -17829753 -9568827 -1151631 3730517
41366C730517O14179N03253L483534K950984j764611l396666k3523O40313m094733
$$ 3730517 4344696 4847949 8331483 11282467 9517856 6121190 6097667 6737980 2643247
41357B643247n180841J856903O288841p55963r763325p222050K563124N518169
$$ 2643247 -2537594 -680691 5608150 4852187 -4911138 -12133188 -9570064 -4051895
41349d051895Q53135n59234L176091K938012l621785p874330n118771k92503K767801
$$ -4051895 -3198760 -3757994 -581903 2356109 -1265676 -9140006 -14258777 -14551280 -11783479
41340a1783479N506033O688592K384793m171789m403803J660543M652489J411542
$$ -11783479 -6277446 411146 2795939 -1375850 -5779653 -4119110 533379 1944921
41332A944921o17217K197705L120712j911774o025834k866359L155075M967650
$$ 1944921 1327704 3525409 6646121 4734347 -1291487 -4157846 -1002771 3964879
41324C964879L075366J010719j954359o525780q194130l473150L430771O232107
$$ 3964879 7040245 8050964 6096605 -429175 -8623305 -12096455 -8665684 -2433577
41316b433577M639334J880900j155418m258763m814271j553125K142355K858693
$$ -2433577 2205757 4086657 2931239 -1327524 -6141795 -7694920 -5552565 -2693872
41308b693872J527715n5653k565190n442264m789646O81415N774554N092973k17331
$$ -2693872 -1166157 -1221810 -3787000 -9229264 -14018910 -13337495 -7562941 -2469968 -2687299
41299b687299n114355o321462l173096K430519N075754Q57898m786904k002832
$$ -2687299 -7801654 -14123116 -17296212 -14865693 -9789939 -8932041 -13718945 -15721777
41291a5721777P974861J1849968L865501m284015j520570M827174J405387q589798
$$ -15721777 -7746916 4103052 7968553 3684538 2163968 6991142 8396529 -193269
41283a93269j0073335q0351Q066700N599959l52775n06065K747154J987308k403170
$$ -193269 -10266604 -10346955 -2280255 3319704 2966929 2460864 5208018 7195326 4792156
41274D792156l815331l35517K485731l47969o276085p679052r38896Q114193R957226
$$ 4792156 976825 641308 3127039 2779070 -3497015 -11176067 -12114963 -4000770 5956456
41265E956456K950552m438253n075673k275508k945534n881399m159552K611956
$$ 5956456 8907008 4468755 -606918 -2882426 -5827960 -11709359 -15868911 -13256955
41257a3256955O662047L795921m82342K77712M101689M298927o70356n453855
$$ -13256955 -6594908 -2798987 -3281329 -3003617 1098072 5396999 4726643 -727212
41249g27212n071510p03581K363884J002121k639668m136958j776740K525556
$$ -727212 -5798722 -6502303 -4138419 -3136298 -5775966 -9912924 -11689664 -9164108
41241i164108O283380Q088395O629309J466292m394592o140047k938609Q92115
$$ -9164108 -2880728 5207667 11836976 13303268 8908676 2768629 -169980 722135
41233G22135J752835L19665j869470m687766o218231k644521N193817J0188862
$$ 722135 2474970 2794635 925165 -3762601 -9980832 -12625353 -7431536 2757326
41225B757326Q058698L207081J031946j93875l908294o960822m271630J782369
$$ 2757326 10816024 14023105 15055051 14861176 10952882 3992060 -279570 1502799
41217A502799M312873J856122j615920m078436n700528m378085J119620N746814
$$ 1502799 5815672 7671794 6055874 1977438 -3723090 -8101175 -6981555 -1234741
41209a234741M157603J19340J116832N308243M040713l024274o339012j763885
$$ -1234741 2922862 3042202 4159034 9467277 13507990 10483716 4144704 2380819
41201B380819L139281J624717k712139l397621l57287K732373L936975K289892
$$ 2380819 5520100 7144817 4432678 1035057 677770 3410143 7347118 9637010
41193I637010k321005n688094k447315M612303N883884j315454q392641q515742
$$ 9637010 7316005 1627911 -819404 3792899 9676783 8361329 -31312 -8547054
41185h547054n137783k707288J360169Q167261J0044584J625758q787538r767319
$$ -8547054 -13684837 -16392125 -15031956 -6864695 3179889 4805647 -3981891 -13749210
41177a3749210l615110j316508m077115k408901O584597J3147470R416980O11983
$$ -13749210 -17364320 -18680828 -22757943 -25166844 -18582247 -5434777 3982203 4594186
41169D594186l306366p67325J792740l19695n138123p329685l853071K867338
$$ 4594186 1287820 520495 2313235 1993540 -3144583 -10474268 -14327339 -11460001
41161a1460001O657653L752637k806782o711367n823715l514954k791038k361306
$$ -11460001 -4802348 -1049711 -3856493 -10567860 -16391575 -19906529 -22697567 -25058873
41153b5058873K80885M345466O311690M275763M42164j010072J563004N294581
$$ -25058873 -24777988 -20432522 -14120832 -9845069 -9402905 -10412977 -8849973 -3555392
41145c555392O019572L091617l69693j827376j833586j735942j125645J137675
$$ -3555392 2464180 5555797 5186104 3358728 1525142 -210800 -1336445 -198770
41137a98770M643581P029860N369091j099924q112842q405226k47700P863802
$$ -198770 4444811 11474671 16843762 15743838 7630996 -774230 -1021930 6841872
41129F841872O351784k568280p713445m649582n42312j330663k971940l40025
$$ 6841872 13193656 10625376 2911931 -1737651 -2279963 -3610626 -6582566 -6922591
41121f922591L198391K185472j051316q16244K000091K263502k84192j940389
$$ -6922591 -3724200 -1538728 -2590044 -3406288 -1406197 857305 573113 -1367276
41113a367276k593472m612674n971474k476930L742270N700090K004796j081343
$$ -1367276 -3960748 -8573422 -14544896 -17021826 -13279556 -7579466 -5574670 -6656013
41105f656013Q56212M943835O525881M779667J258340k602154m972282m352419
$$ -6656013 -5799801 -855966 5669915 10449582 11707922 9105768 4133486 -218933
41097b18933j969807n27073l75918K04223J567164K746487L810488M675835L217246
$$ -218933 -2188740 -2715813 -3091731 -2887508 -1320344 1426143 5236631 9912466 13129712
41088A3129712j402167n470096n388447l390670l441494m124121j996823O57130
$$ 13129712 11727545 6257449 869002 -2521668 -5963162 -10087283 -12084106 -11426976
41080a1426976o45026l223364n54335N706303P007466J986134j326595J59105
$$ -11426976 -12072002 -15295366 -15849701 -10143398 -3135932 -1149798 -2476393 -2317288
41072b317288q27324p938651j2281253n445128O298798R991306L539444l261332
$$ -2317288 -3144612 -11083263 -23364516 -28809644 -22510846 -12519540 -8980096 -12241428
41064a2241428k808159K564174O112465M423995l71378k950207j72814M289989
$$ -12241428 -15049587 -12485413 -6372948 -1948953 -2320331 -5270538 -5443352 -1153363
41056a153363L399590l489342q464792n545252J106622L562584Q63781j546849
$$ -1153363 2246227 -1243115 -9707907 -15253159 -14146537 -10583953 -9720172 -11267021
41048a1267021n05078J718887J904123r8300j566863J76894L792637L434423l864335
$$ -11267021 -11772099 -10053212 -8149089 -8247389 -9814252 -9637358 -5844721 -2410298 -6274633
41039f274633j0998395p752940L911264R979016L471750n433577m680793K500021
$$ -6274633 -17273028 -25025968 -21114704 -11135688 -7663938 -13097515 -17778308 -15278287
41031a5278287M528775o79890n046165l897407l10796K363427L645525K807857
$$ -15278287 -10749512 -11429402 -16475567 -20372974 -20683770 -18320343 -14674818 -11866961
41023a1866961K28212J46612M633077P440572K509194m189890j929975P088483
$$ -11866961 -11638749 -11492137 -6859060 581512 3090706 -1099184 -3029159 4059324
41015D059324R490262J255609n950032k868583M337495N318834L02967l867146
$$ 4059324 13549586 14805195 8855163 5986580 10324075 15642909 15945876 12078730
41007A2078730n179418n886272n433399j691687L413372N649674M233361J605753
$$ 12078730 6899312 1013040 -4420359 -6112046 -2698674 2951000 7184361 8790114
40999H790114m92896j386089n47931N96841r79248m805575n784842j506651L191699
$$ 8790114 8297218 6911129 6363198 6960039 5980791 1175216 -4609626 -6116277 -2924578
40990b924578K941095n90932k280962j239841O7319J435733M031113N685848K732266
$$ -2924578 16517 -574415 -2855377 -4095218 -4027899 -2592166 1438947 7124795 9857061
40981I857061l807464q369182p374426k532793J964088L053876O49818j859918
$$ 9857061 6049597 -2319585 -9694011 -12226804 -10262716 -7208840 -6559022 -8418940
40973h418940n46522L629621M996838J280446k191715l86602L153557J680666
$$ -8418940 -8965462 -5335841 -339003 941443 -1250272 -1636874 1516683 3197349
40965C197349l819047n868420j709549L464324M850764L424946J730857j15480
$$ 3197349 -621698 -6490118 -8199667 -4735343 115421 3540367 5271224 5155744
40957E155744k065004k237103J46810K917348L655598J904194j598505m987916
$$ 5155744 3090740 853637 1000447 3917795 7573393 9477587 7879082 2891166
40949B891166n006376o33090L422067J812899k935457l226973J336444K045494
$$ 2891166 -2115210 -2748300 673767 2486666 -448791 -3675764 -2339320 -293826
40941b93826n109791j1224589o440771N300443J1334932P259357Q21815m61344
$$ -293826 -5403617 -16628206 -23068977 -17768534 -6433602 825755 1647570 1186226
40933A186226K121355L696215L027889J435096q65403l688059m961096l153881
$$ 1186226 3307581 7003796 10031685 11466781 10601378 6913319 1952223 -1201658
40925a201658l5168J489463J128580Q23994J736287L412503M849580M548282P81084
$$ -1201658 -1236826 252637 1381217 2205211 3941498 7354001 12203581 16751863 17532947
40916A7532947n646245r685600o472094J820213O679158K856651m987781q064557
$$ 17532947 11886702 2201102 -4270992 -2450779 4228379 7085030 2097249 -5967308
40908e967308m405656k40897m31012k025942O2751M414833M847639O0349l422837
$$ -5967308 -10372964 -10613861 -11044873 -13070815 -13008064 -8593231 -3745592 -3685243 -7108080
40899g108080N3701P033238Q877991K812261m468019n092630N62206M930034K882611
$$ -7108080 -7054379 -21141 8856850 11669111 7201092 2108462 2670668 7600702 10483313
40890A0483313k311366l735215K92411M508433L679185j235529n048886m658425
$$ 10483313 8171947 4436732 4729143 9237576 12916761 11681232 6632346 1973921
40882A973921j582820Q70147J089217j46492j292456k085556l823590o693879
$$ 1973921 391101 1261248 2350465 2203973 911517 -1174039 -4997629 -11691508
40874a1691508p370052k161141O496668J0375076N234171k821683m931593r11086
$$ -11691508 -19061560 -21222701 -14726033 -4350957 883214 -1938469 -6870062 -7781148
40866g781148K347323K305599L478204P741961R240117K953878o728253j1005567
$$ -7781148 -5433825 -3128226 349978 8091939 17332056 20285934 13557681 2552114
40858B552114p423317j172526K700260M221506N843275P849661P405731J970579
$$ 2552114 -4871203 -6043729 -3343469 878037 6721312 14570973 21976704 23947283
40850B3947283o073968r700666m991881K536009L992775q95497m033709j847970
$$ 23947283 17873315 8172649 3180768 5716777 9709552 8814055 4780346 2932376
40842B932376J13315j520882j102852N275420J0490294O882711m77659j692739
$$ 2932376 3045691 1524809 421957 5697377 16187671 23070382 22592723 20899984
40834B0899984J662277K69479n815224p207047k140265K45668m174560q297657
$$ 20899984 22562261 22831740 17016516 9809469 7669204 7914872 3740312 -4557345
40826d557345p316342n748383n728962j311305P988337J0793561J512519p079757
$$ -4557345 -11873687 -17622070 -23351032 -24662337 -16674000 -5880439 -4367920 -11447677
40818a1447677k013384Q562434P768859k903427o489567J926872Q720450M798498
$$ -11447677 -13461061 -4898627 2870232 -33195 -6522762 -4595890 4124560 8923058
40810H923058j589446q43461L323346L243405K06099r14640j449305m376823o507901
$$ 8923058 7333612 6490151 9813497 13056902 13263001 12348361 10899056 6522233 14332
40801A4332l903263r7q6320j998666n57810K458556J551827j887597j406494L110972
$$ 14332 -3888931 -3889028 -3975348 -5974014 -6531824 -4073268 -2521441 -4409038 -5815532 -2704560
40791b704560N016936K324825O11119K447123K503547k724056p610755n598607
$$ -2704560 2312376 4637201 5248320 7695443 10198990 7474934 -135821 -5734428
40783e734428N47999L208419J361396P38493L762216O008325L657053j005886
$$ -5734428 -5186429 -1978010 -616614 121879 3884095 9892420 13549473 12543587
40775A2543587l714017l615967j914759J112910M127732L006386l658853r009370
$$ 12543587 8829570 5213603 3298844 4411754 8539486 11545872 7887019 -1122351
40767a122351m389980P781654J4259102P419464m437765q643354m986018l089251
$$ -1122351 -5512331 2269323 16528425 23947889 19510124 10866770 5880752 2791501
40759B791501n924667o178046j34599N031164K762349k210694j729662L070694
$$ 2791501 -3133166 -9311212 -9445811 -4414647 -1652298 -3862992 -5592654 -2521960
40751b521960M893907K305829J49514N2537p19902j479737J690000O572431M774940
$$ -2521960 2371947 4677776 4827290 4879827 4159925 2680188 4370188 10942619 15717559
40742A5717559n169255j2704396q956666P66947M915436J372282k439167k138934
$$ 15717559 10548304 -2156092 -11112758 -10345811 -5430375 -4058093 -6497260 -8636194
40734h636194p04162p33793m02577J119208Q38197k334471m011971k93169N949620
$$ -8636194 -9340356 -10074149 -10476726 -9357518 -8519321 -10853792 -14865763 -15158932 -9209312
40725i209312Q382550M940713n69644l272600j567160K059665L089912o44326
$$ -9209312 -826762 4113951 3544307 271707 -1295453 764212 3854124 3209798
40717C209798n692844o406369k482323M95410k29380k37005L772497O430889J363810
$$ 3209798 -2483046 -8889415 -11371738 -10876328 -11105708 -11342713 -7570216 -1139327 224483
40708B24483o848582p265127J251494P823122N717546J433504K626277N361878
$$ 224483 -6624099 -13889226 -12637732 -4814610 902936 2336440 4962717 10324595
40700A0324595J536769o648721r410224m399641M06807p20871m024442l681187
$$ 10324595 11861364 5212643 -4197581 -8597222 -8190415 -8911286 -12935728 -16616915
40692a6616915L11310M604587P349840P425088L619000j890144l401039J012603
$$ -16616915 -16305605 -11701018 -4351178 3073910 6692910 4802766 1401727 2414330
40684B414330N423126L412827l143214o967108n029607p18710K481225M576791
$$ 2414330 7837456 11250283 8107069 1139961 -3889646 -4608356 -2127131 2449660
40676B449660N993945N302533J884896j751864k373596L15969L538647M365661
$$ 2449660 8443605 13746138 15631034 13879170 11505574 11821543 15360190 19725851
40668A9725851K273671o69325j907840j032669j68502j311049l693249m581747
$$ 19725851 21999522 21330197 19422357 18389688 18221186 16910137 13216888 8635141
40660H635141k589827M95117J460243q72996m174260n077793l145735j171765
$$ 8635141 6045314 6540431 8000674 7127678 2953418 -2124375 -5270110 -6441875
40652f441875q75207j85236L105702O648784N938245R40488l371506l508576r66375
$$ -6441875 -7317082 -7502318 -4396616 2252168 8190413 9130901 5759395 2250819 1284444
40643A284444J338878K218058P31494l977937r156950q993878j936105N890598
$$ 1284444 2623322 4841380 5572874 1594937 -7562013 -16555891 -18491996 -12601398
40635a2601398P868180M519092Q14055q15043q76518O89345L686531N261087K772814
$$ -12601398 -4733218 -214126 599929 -215114 -1091632 -402287 3284244 8545331 11318145
40626A1318145k121706n641771o324482m317973N85843O169526O766140N45779
$$ 11318145 9196439 3554668 -2769814 -7087787 -6501944 -332418 6433722 6979501
40618F979501n477606m159413J095795J888754j657484k197495J264894J669474
$$ 6979501 1501895 -2657518 -1561723 327031 -1330453 -3527948 -2263054 -593580
40610e93580l086592n961611k806650J131026J194965P51414L142546M687686
$$ -593580 -3680172 -9641783 -12448433 -11317407 -10122442 -9371028 -6228482 -1540796
40602a540796K270435J61990J905685K692847j703394n247575j053795N157826
$$ -1540796 729639 891629 2797314 5490161 3786767 -1460808 -2514603 2643223
40594B643223K894723n289168o780248J026359O771683L293145k648384l223892
$$ 2643223 5537946 248778 -6531470 -5505111 1266572 4559717 1911333 -1312559
40586a312559r21943o08523R8895M108841O070485J84490p963283p619668J150947
$$ -1312559 -2234502 -2843025 -2744130 1364711 7435196 7619686 -343597 -7963265 -6812318
40577f812318P392143N124651K38107l88500J422820K82750l902697o946857o540024
$$ -6812318 579825 5704476 5942583 5554083 6976903 7259653 3356956 -3589901 -10129925
40568a0129925l350932J125141M278592K811281k723955o370244l898872Q48835
$$ -10129925 -13480857 -12355716 -8077124 -5265843 -7989798 -14360042 -18258914 -17410079
40560a7410079J442509j518793k156745O57220K149688Q73721J290606M647547
$$ -17410079 -15967570 -17486363 -19643108 -18985888 -16836200 -15962479 -14671873 -10024326
40552a0024326N004314q73034o348802m169345K195205L940290J87875k123610
$$ -10024326 -5020012 -5893046 -12241848 -16411193 -14215988 -10275698 -10087823 -12211433
40544a2211433K16480L161391L103917J104774q00177j523811M25833M280805
$$ -12211433 -11994953 -8833562 -5729645 -4624871 -5425048 -6948859 -6523026 -2242221
40536b242221M497360j865915p308652k954452N983946O051159k501793m439438
$$ -2242221 2255139 389224 -6919428 -9873880 -3889934 2161225 -340568 -4780006
40528d780006N193446J0523142m16854j4604229j2347019L347850J2499287P443240
$$ -4780006 413440 10936582 10519728 -4084501 -16431520 -13083670 -584383 6858857
40520F858857q48368l584361m207803n951038m693073J038753N014355L468512
$$ 6858857 6010489 2426128 -1781675 -7732713 -12425786 -11387033 -6372678 -2904166
40512b904166P23741M73284N85051L13283L033122P348408N394542m136777j0671664
$$ -2904166 -2180425 -1707141 -1122090 -808807 2224315 9572723 14967265 10830488 158824
40503A58824o570745J163636K104980k108323k764728J221442L580197K115418
$$ 158824 -6411921 -5248285 -3143305 -5251628 -8016356 -6794914 -3214717 -1099299
40495a099299M11024M3430m78209j86336L161868O971754O066518J008598k310749
$$ -1099299 -688275 -644845 -1123054 -1309390 1852478 8824232 14890750 15899348 13588599
40486A3588599j529485j61073p10040j338477m23945O90467P50065J83204j138040
$$ 13588599 12059114 11898041 11188001 9849524 9425579 10116046 10866111 11049315 9911275
40477I911275l802740o085746n166441j440132K092937M496272O730265P285054
$$ 9911275 6108535 22789 -5143652 -6583784 -4490847 5425 6735690 14020744
40469A4020744L298447l417372o937299n316180l082617l762026m888061l108710
$$ 14020744 17319191 13901819 6964520 1648340 -1434277 -5196303 -10084364 -13193074
40461a3193074K50973J989726J747226P76477o44955j458997R70274O027491P481331
$$ -13193074 -12942101 -10952375 -9205149 -8428672 -9073627 -10532624 -9562350 -3534859 3946472
40452C946472R46407q227318r924682j881240P357327Q776685K363568m761776
$$ 3946472 4892879 -3334439 -13259121 -15140361 -7783034 993651 3357219 -1404557
40444a404557o274661j282007N996580R246009M993569l404574q283961n862151
$$ -1404557 -7679218 -8961225 -2964645 6281364 11274933 7870359 -413602 -6275753
40436f275753j66198K988943L388725M303150N024315J227059o454500j0113495
$$ -6275753 -6441951 -3453008 -64283 4238867 9263182 10490241 4035741 -6077754
40428f077754m533844M641778P636235K997204j990053k028334Q80706K845762
$$ -6077754 -10611598 -5969820 1666415 4663619 2673566 645232 1525938 4371700
40420D371700K842148Q57897k894442m892242m79339P682325R575887J134905
$$ 4371700 7213848 8071745 5177303 285061 -194278 7488047 17063934 18198839
40412A8198839q191969p733378n24274K374961r53281j970779K964424O581275
$$ 18198839 10006870 2273492 1749218 4124179 3170898 1200119 4164543 10745818
40404A0745818L003408k972078m030394r93052N60888o16223j837394k546788
$$ 10745818 13749226 10777148 6746754 5753702 6314590 5698367 3860973 1314185
40396A314185l871355m090985m36772N101575O890274L216042j210906j522899
$$ 1314185 -2557170 -6648155 -7084927 -1983352 4906922 8122964 6912058 5389159
40388E389159J389745K786073K36439l806036n419182l993941k260380j494126
$$ 5389159 6778904 9564977 9801416 5995380 576198 -3417743 -5678123 -7172249
40380g172249O71462N291283P692078L031372m882443o990134k093642J003680
$$ -7172249 -6500787 -1209504 6482574 9513946 4631503 -2358631 -4452273 -3448593
40372c448593k394836m855277O47458P394537L963812p381155j2512904n242755
$$ -3448593 -5843429 -10698706 -10051248 -2656711 1307101 -6074054 -18586958 -23829713
40364b3829713N267262Q875238O486182L656536Q72137l413637o204302l655577
$$ -23829713 -18562451 -9687213 -3201031 455505 1327642 -2085995 -8290297 -11945874
40356a1945874J991627N264884M930497L450809J437508j696040l348911l18473
$$ -11945874 -9954247 -4689363 241134 3691943 5129451 3433411 84500 -233973
40348b33973M461124L863885l406586r836263q446365j182941M864074O673577
$$ -233973 4227151 8091036 4684450 -5151813 -13598178 -14781119 -9917045 -3243468
40340c243468P116710Q703765R184776M861626l254551r018934q002981l299142
$$ -3243468 3873242 12577007 21761783 26623409 23368858 14349924 6346943 3047801
40332C047801j802121m811258o090879j203717M996537M360742l162795r060566
$$ 3047801 1245680 -3565578 -9656457 -10860174 -5863637 -1502895 -4665690 -13726256
40324a3726256o897130R41160P589783Q872118N303776N08431j311764O56816
$$ -13726256 -20623386 -19682226 -12092443 -3220325 2083451 2591882 1280118 1936934
40316A936934J939836j780872p435561p655371j750967K561665Q47797j261553
$$ 1936934 3876770 2095898 -5339663 -12995034 -14746001 -12184336 -11336539 -12598092
40308a2598092K317727P679185O965784Q56712k774547p83610K260803K489204
$$ -12598092 -10280365 -2601180 4364604 5221316 2446769 1663159 3923962 6413166
40300F413166R36954r91087l299626l645184J158173P908866Q336712Q64606n615466
$$ 6413166 7350120 6359033 3059407 -585777 572396 8481262 16817974 17682580 12067114
40291A2067114m135688L61046o27145n830919o753512j045130M283555L068197
$$ 12067114 7931426 8292472 7665327 1834408 -4919104 -5964234 -1680679 1387518
40283A387518k719390p052512o568130j806654M499124Q631563Q021781L816594
$$ 1387518 -1331872 -8384384 -14952514 -16759168 -12260044 -3628481 4393300 8209894
40275H209894j35001j485315j213371j245116k009948k599399j916894M01835
$$ 8209894 8074893 6589578 5376207 4131091 2121143 -478256 -2395150 -1993315
40267a993315L108465L881994K064978J08431P24173L392702N333634M982770
$$ -1993315 1115150 4997144 7062122 7170553 7894726 11287428 16621062 21603832
40259B1603832K739641n34274l639139m886785m187676m004398n633514o122287
$$ 21603832 24343473 23809199 20170060 15283275 11095599 7091201 1457687 -4664600
40251d664600k289694L494438N691992L203184K20520n83696j069468k788725
$$ -4664600 -6954294 -3459856 2232136 5435320 5655840 5072144 4002676 1213951
40243A213951l656866j748898R25289J073804j455732l917862l992362j610222
$$ 1213951 -2442915 -4191813 -3266524 -2192720 -3648452 -7566314 -11558676 -13168898
40235a3168898J484573L433144M224184N228107N773049K625179m317932q833745
$$ -13168898 -11684325 -8251181 -4026997 1201110 6974159 9599338 5281406 -3552339
40227c552339n859016J81205J103709k400995k031488M048244P799636M574069
$$ -3552339 -9411355 -9230150 -8126441 -10527436 -12558924 -8510680 -711044 3863025
40219C863025K82212M52417J070016k745380o674775m374262J223411K939155
$$ 3863025 4145237 4597654 5667670 2922290 -3752485 -8126747 -6903336 -3964181
40211c964181J162533J256229K797288J415873j122737P51184N106344M369778
$$ -3964181 -2801648 -1545419 1251869 2667742 1545005 2296189 7402533 11772311
40203A1772311j238620l173971P10392K100431l163561o987835j872579O699409
$$ 11772311 10533691 7359720 8070112 10170543 7006982 19147 -1853432 4845977
40195D845977Q342036K224894l976406n414177l624825j627604j149970k672224
$$ 4845977 13188013 15412907 11436501 6022324 2397499 769895 -380075 -3052299
40187c052299m105269j955600L061533N438775L229572J853924N001179P463172
$$ -3052299 -7157568 -9113168 -6051635 -612860 2616712 4470636 9471815 16934987
40179A6934987L481749k917441l900919j98896J295631n29759j065086m38130
$$ 16934987 20416736 17499295 13598376 13399480 14695111 14165352 13100266 12662136
40171A2662136l456048q649040p979589j14239N802106L686082j114391k041224
$$ 12662136 9206088 557048 -7422541 -7536780 -1734674 1951408 837017 -1204207
40163a204207j304571k913587l465237J374257O801357M980088k149163n876701
$$ -1204207 -2508778 -5422365 -8887602 -7513345 -711988 4268100 2118937 -3757764
40155c757764m630830m684756p089376m844366L856688R649724N253219l047441
$$ -3757764 -8388594 -13073350 -20162726 -25007092 -21150404 -11500680 -6247461 -9294902
40147i294902m647231J76615K719103J23013j911461Q9605K696517L071744L134204
$$ -9294902 -13942133 -13765518 -11046415 -10923402 -12834863 -12745258 -10048741 -6976997 -3842793
40138c842793L371796R0154o491499q348061p65985P916199O356593k993334o910177
$$ -3842793 -470997 -380843 -6872342 -15220403 -15986388 -8070189 -1713596 -4706930 -11617107
40129a1617107p61259N542016L551932j736371j686725K345787L232567M44332
$$ -11617107 -12378366 -6836350 -3284418 -5020789 -6707514 -4361727 -1129160 -684828
40121f84828o81909J023019K081886K504829N589829R418557P239902j607867
$$ -684828 -1366737 -343718 1738168 4242997 9832826 19251383 26491285 24883418
40113B4883418q809318q148645k848990J402244M042656N820036L823640l295972
$$ 24883418 16074100 7925455 5076465 6478709 10521365 16341401 20165041 16869069
40105A6869069r569749q073233p16494M360706L614960P60728l33088K2836K5389
$$ 16869069 7299320 -773913 -1490407 2870299 6485259 7245987 6912899 6935735 6961124
40096F961124j106772l520714o201423o474245l141105R98776K897045L451108
$$ 6961124 5854352 2333638 -3867785 -10342030 -13483135 -12484359 -9587314 -6136206
40088f136206M083905K224697l836869q266550l969449N303707Q348646L146310
$$ -6136206 -2052301 172396 -3664473 -11931023 -15900472 -10596765 -2248119 898191
40080H98191J61063N338907R921424M341198o077291r120400m071364j022678
$$ 898191 1059254 6398161 16319585 20660783 14583492 5463092 1391728 369050
40072C69050l831961n116845N9178N505798L741089k508502m811061j106216K810610
$$ 369050 -3462911 -8579756 -8520578 -3014780 726309 -1782193 -6593254 -7699470 -4888860
40063d888860K475043J26514J52962K778305M269520K029625k252160m611252
$$ -4888860 -2413817 -2287303 -2134341 643964 4913484 6943109 4690949 79697
40055G9697l144498K06514K047196J100497q76652j375216j6369Q86901r44567
$$ 79697 -3064801 -2858287 -811091 289406 -587246 -1962462 -1978831 -1091930 -2036497
40046b036497m219040m525579J72072N731897O314306K142092r00722J82031J851847
$$ -2036497 -6255537 -10781116 -10609044 -4877147 1437159 3579251 2678529 2860560 4712407
40037D712407Q12703l47798J862721N040484M213158k67162l532555l832548m015788
$$ 4712407 5525110 5177312 7040033 12080517 16293675 16026513 12493958 8661410 4645622
40028D645622n421076n421546k198979K148923M720456M876880L179159K51563
$$ 4645622 -775454 -6197000 -8395979 -6247056 -1526600 3350280 6529439 6781002
40020F781002k313066k647613j095393L46860J301157K927209M439969L143344
$$ 6781002 4467936 1820323 724930 1071790 2372947 5300156 9740125 12883469
40012A2883469j144101m756673m508168j081285K560721M032255K704059K05243
$$ 12883469 11739368 6982695 2474527 1393242 3953963 7986218 10690277 10895520
40004A0895520o97316J89434l00808k766178j913109N101577J0314460L936771
$$ 10895520 10198204 10387638 10086830 7320652 5407543 10509120 20823580 24760351
39996B4760351r284656j3540695m003043N746536L556095m536853n639993M20164
$$ 24760351 15475695 1935000 -2068043 3678493 7234588 2697735 -2942258 -2522094
39988b522094L456742k09032m011811k472851K545332O364192N767081J55761
$$ -2522094 934648 725616 -3286195 -5759046 -3213714 3150478 8917559 9073320
39980I073320o023187n035201L658707Q823396J613589r692820r694348J775956
$$ 9073320 3050133 -1985068 1673639 10497035 12110624 2417804 -7276544 -5500588
39972e500588R494326N247214k351192l578456j083780j628721m117508l450730
$$ -5500588 3993738 9240952 6889760 3311304 2227524 598803 -3518705 -6969435
39964f969435L38090L613400M761545K980878l077460j0134548r703448O98941
$$ -6969435 -6631345 -3017945 1743600 4724478 1647018 -8487530 -18190978 -17492037
39956a7492037J0860263R863083R49986l461024Q86216O005055M482524j304963
$$ -17492037 -6631774 3231309 4181295 720271 1606487 7611542 12094066 10789103
39948A0789103m541581k923287L94917J607204j84902k897932l991822l283543
$$ 10789103 6247522 3324235 3719152 5326356 5141454 2243522 -1748300 -5031843
39940e031843k549258k288403j125357Q80632J469613K33352r2627J473763J881583
$$ -5031843 -7581101 -9869504 -10994861 -10114229 -8644616 -8411264 -8503891 -7030128 -5148545
39931e148545m54194k116771n72894O78978j950615m818984k178567L868104N768051
$$ -5148545 -5602739 -7719510 -8292404 -7613426 -9564041 -14383025 -16561592 -12693488 -6925437
39922f925437J957213j363373m39294J011069q79996l721784l234337Q8313K423617
$$ -6925437 -4968224 -6331597 -6770891 -5759822 -6639818 -10361602 -13595939 -13507626 -11084009
39913a1084009K379225J973210K689757L022628O00181l785201n314276j15386
$$ -11084009 -8704784 -6731574 -4041817 -1019189 -419008 -4204209 -9518485 -9633871
39905i633871Q568513J2049621O110325l287262p081632l631456J256049K649793
$$ -9633871 -1065358 10984263 17094588 13807326 6725694 3094238 4350287 7000080
39897G000080O27180k408395l960227j728264L928207Q157286O334379K97503
$$ 7000080 7627260 5218865 1258638 -469626 3458581 11615867 17950246 18247749
39889A8247749m002289m350817l441530k966781j656710O52999J944488J680979
$$ 18247749 14245460 9894643 6453113 3486332 1829622 2482621 4427109 6108088
39881F108088J278795O98699j079250k389847p37955J744218L57862m221159o071974
$$ 6108088 7386883 8085582 7006332 4616485 3878530 5622748 5980610 1759451 -4312523
39872d312523l046250N11985J376091J314876J599668M54265j547538n79894K716192
$$ -4312523 -7358773 -6846788 -5470697 -4155821 -2556153 -2101888 -3649426 -4229320 -1513128
39863a513128J868359m772960r135989m703813L647333P260106N530453L539092
$$ -1513128 355231 -4417729 -13553718 -18257531 -14610198 -7350092 -1819639 1719453
39855A719453K888940J983189J292337J373037n73675n363404p233923k150620
$$ 1719453 4608393 6591582 7883919 9256956 8683281 3319877 -3914046 -6064666
39847f064666L527046J563482m465976m139914L220387P811028M911905K56990
$$ -6064666 -2537620 -974138 -5440114 -9580028 -6359641 1451387 6363292 6620282
39839F620282j434941k511518m142282k451531K560471L699088j864318n882542
$$ 6620282 5185341 2673823 -1468459 -3919990 -1359519 2339569 475251 -5407291
39831e407291r09074P732003R536725L505029k481499l564793j718274K40074
$$ -5407291 -6316365 1415638 10952363 14457392 11975893 8411100 6692826 6932900
39823F932900J411665N06189l070549o045638m431046K83977K830653J818339
$$ 6932900 8344565 8850754 5780205 -265433 -4696479 -4412502 -1581849 236490
39815B36490Q19312J666887J869778j4360j281900J48215J681762O4955l011412
$$ 236490 1055802 2722689 4592467 4578107 3296207 3444422 5126184 5191139 2179727
39806B179727l041442M35340K747980P72508k133433m54957N256878P912331K959397
$$ 2179727 -861715 -426375 2321605 3094113 960680 505723 5762601 13674932 16634329
39797A6634329m976498p732304m241609j048748k100558l245461M58470O298498
$$ 16634329 11657831 3925527 -316082 -1364830 -3465388 -6710849 -6252379 46119
39789D6119P384759K402047l021829m268937k504385o68110J101391L533573M560752
$$ 46119 7430878 9832925 6811096 2542159 37774 -630336 471055 4004628 8565380
39780H565380J346506m408589o608272j971777M816757O116331J362279j445535
$$ 8565380 9911886 5503297 -1104975 -3076752 1740005 7856336 9218615 7773080
39772G773080L504518J0511684Q337711m916387j7778629j8216754o983030M600135
$$ 7773080 11277598 21789282 30126993 25210606 7431977 -10784777 -17767807 -13167672
39764a3167672P741415L754963l55968m31437J787089K626910J730245J943055
$$ -13167672 -5426257 -1671294 -2027262 -2458699 -671610 1955300 3685545 5628600
39756E628600L982450M114095r9130m339116k992650J165341j90793p389373j0179619
$$ 5628600 9611050 13725145 13626015 9286899 6294249 7459590 7268797 -120576 -10300195
39747a0300195k726422O528307O733278J24108l041010p21250j2315l437708n068094
$$ -10300195 -13026617 -6498310 234968 359076 -2681934 -3403184 -3415499 -6853207 -11921301
39738a1921301j770091J353864L12410j002349J924151O482928P549994N121701
$$ -11921301 -13691392 -12337528 -12025118 -13027467 -11103316 -4620388 2929606 8051307
$$ [...]
##END NTUPLES=NMR SPECTRUM
##END=
