##TITLE=31Pdec_LR-710-B1
 D2O, 24 sc
 6.2.2020
##JCAMPDX= 6.0         $$ Bruker NMR JCAMP-DX V2.0
##DATA TYPE= NMR SPECTRUM
##DATA CLASS= NTUPLES
##ORIGIN= UXNMR, Bruker Analytische Messtechnik GmbH
##OWNER= root
$$ XWIN-NMR		Version 3.5
$$ Thu Feb  6 14:32:39 2020 Russian Standard Time (UT+4h)  she@DPX200
##.OBSERVE FREQUENCY= 81.013821
##.OBSERVE NUCLEUS= ^31P
##.ACQUISITION MODE= SIMULTANEOUS
##.ACQUISITION SCHEME= undefined
##.AVERAGES= 24
##.DIGITISER RES= 17
##SPECTROMETER/DATA SYSTEM= spect
##.PULSE SEQUENCE= zgpg30
##.SOLVENT NAME= CDCl3
##.SHIFT REFERENCE= (INTERNAL, CDCl3, 0, 182.463)
##AUDIT TRAIL= $$ (NUMBER, WHEN, WHO, WHERE, WHAT)
$$ ##TITLE= Audit trail, XWIN-NMR		Version 3.5
$$ ##JCAMPDX= 5.01
$$ ##ORIGIN= Bruker BioSpin GmbH
$$ ##OWNER= she
$$ F:/spectra/data/she/nmr/P31/1/pdata/1/auditp.txt
$$ ##AUDIT TRAIL=  $$ (NUMBER, WHEN, WHO, WHERE, WHAT)
(   1,<2020-02-06 14:31:35.14 +0400>,<she>,<DPX200>,
      <created by zg, POWCHK disabled, PULCHK disabled
       configuration hash MD5:
       00 E9 B6 7A A2 85 ED C7 34 08 36 98 17 FE 4E 26
       data hash MD5: 32K
       C5 1E A5 63 92 40 59 0D 80 20 9E 3D 69 9C 50 4B>)
(   2,<2020-02-06 14:31:37.23 +0400>,<she>,<DPX200>,
      <Start of raw data processing
       efp BC_mod = 2 LB = 1 FT_mod = 6 PKNL = 1 PHC0 = -1337.858 PHC1 = 97.20132 SI = 64K 
       data hash MD5: 64K
       C6 26 B3 C8 B5 9F 86 A1 98 90 0D 57 98 ED BA 63>)
(   3,<2020-02-06 14:32:09.53 +0400>,<she>,<DPX200>,
      <pk PHC0 = -33.55299 PHC1 = 80 
       data hash MD5: 64K
       F6 8C 2F 49 AB 60 8E BF 4F 9A 0E 9E 39 AC D8 5B>)
(   4,<2020-02-06 14:32:12.81 +0400>,<she>,<DPX200>,
      <abs ABSG = 5 
       data hash MD5: 64K
       B4 05 84 3E AB 9B 97 CE 7D 82 32 F9 8A 25 AE 34>)
$$ ##END=
$$ 
$$ hash MD5
$$ E7 F1 E0 A7 A9 AC 61 DE 74 E2 FA B5 C4 73 82 24
##$RELAX= 
##$RELAX= 
##$RELAX= 
##$RELAX= 
##$RELAX= 
##$RELAX= 
##$RELAX= 
##$RELAX= 
$$ Bruker specific parameters
$$ --------------------------
##$DU= <F:/spectra>
##$EXPNO= 1
##$NAME= <P31>
##$PROCNO= 1
##$TYPE= <nmr>
##$USER= <she>
##$AMP= (0..31)
100 100 100 100 100 100 100 100 100 100 100 100 100 100 100 100 100 100 
100 100 100 100 100 100 100 100 100 100 100 100 100 100 
##$AQSEQ= 0
##$AQ_mod= 1
##$AUNM= <au_zg>
##$AUTOPOS= <>
##$BF1= 81.014009
##$BF2= 200.13
##$BF3= 200.13
##$BF4= 200.13
##$BF5= 200.13
##$BF6= 200.13
##$BF7= 200.13
##$BF8= 200.13
##$BYTORDA= 1
##$CFDGTYP= 0
##$CFRGTYP= 5
##$CHEMSTR= <none>
##$CNST= (0..31)
1 1 145 1 1 1 1 1 1 1 1 1 1 1 1 1 1 1 1 1 1 1 1 1 1 1 1 1 1 1 1 1 
##$CPDPRG= <waltz16>
##$CPDPRG1= <>
##$CPDPRG2= <waltz16>
##$CPDPRG3= <>
##$CPDPRG4= <mlev>
##$CPDPRG5= <mlev>
##$CPDPRG6= <mlev>
##$CPDPRG7= <mlev>
##$CPDPRG8= <mlev>
##$CPDPRGB= <>
##$CPDPRGT= <>
##$D= (0..31)
0 1 0 0 0 0 0 0 0 0 0 0.03 2e-05 3e-06 0 0 0 0 0 0 0 0 0 0 0 0 0 0 0 0 
0 0 
##$DATE= 1580985094
##$DBL= (0..7)
120 120 120 11 120 120 24 19 
##$DBP= (0..7)
150 150 150 150 150 150 150 150 
##$DBP07= 0
##$DBPNAM0= <>
##$DBPNAM1= <>
##$DBPNAM2= <>
$$ [...]
##$SUBNAM3= <"">
##$SUBNAM4= <"">
##$SUBNAM5= <"">
##$SUBNAM6= <"">
##$SUBNAM7= <"">
##$SUBNAM8= <"">
##$SUBNAM9= <"">
##$SW= 369.568048894756
##$SWIBOX= (0..15)
0 1 3 0 0 0 0 0 0 0 0 0 0 0 0 0 
##$SW_h= 29940.119760479
##$TD= 32768
##$TD0= 1
##$TE= 0
##$TE2= 300
##$TE3= 300
##$TEG= 300
##$TL= (0..7)
0 120 53 12 22 120 120 120 
##$TP= (0..7)
150 150 150 150 150 150 150 150 
##$TP07= 0
##$TPNAME0= <>
##$TPNAME1= <>
##$TPNAME2= <>
##$TPNAME3= <>
##$TPNAME4= <>
##$TPNAME5= <>
##$TPNAME6= <>
##$TPNAME7= <>
##$TPOAL= (0..7)
0.5 0.5 0.5 0.5 0.5 0.5 0.5 0.5 
##$TPOFFS= (0..7)
0 0 0 0 0 0 0 0 
##$TUNHIN= 0
##$TUNHOUT= 0
##$TUNXOUT= 0
##$USERA1= <user>
##$USERA2= <user>
##$USERA3= <user>
##$USERA4= <user>
##$USERA5= <user>
##$V9= 5
##$VALIST= <valist>
##$VCLIST= <CCCCCCCCCCCCCCC>
##$VD= 0
##$VDLIST= <DDDDDDDDDDDDDDD>
##$VPLIST= <PPPPPPPPPPPPPPP>
##$VTLIST= <TTTTTTTTTTTTTTT>
##$WBST= 1024
##$WBSW= 4
##$XGAIN= (0..3)
0 0 0 0 
##$XL= 0
##$YL= 0
##$YMAX_a= 14537
##$YMIN_a= -6421
##$ZGOPTNS= <>
##$ZL1= 120
##$ZL2= 120
##$ZL3= 120
##$ZL4= 120
##$ABSF1= 182.463
##$ABSF2= -187.1042
##$ABSG= 5
##$ABSL= 3
##$ALPHA= 0
##$AQORDER= 0
##$ASSFAC= 0
##$ASSFACI= 0
##$ASSFACX= 0
##$ASSWID= 0
##$AUNMP= <proc_1d>
##$AZFE= 0.1
##$AZFW= 0.5
##$BCFW= 0
##$BC_mod= 2
##$BYTORDP= 0
##$COROFFS= 0
##$CY= -3
##$DATMOD= 1
##$DC= 0
##$DFILT= <>
##$DTYPP= 0
##$F1P= 0
##$F2P= 0
##$FCOR= 1
##$FTSIZE= 65536
##$FT_mod= 6
##$GAMMA= 0
##$GB= 0
##$INTBC= 1
##$INTSCL= 5.30512e-09
##$ISEN= 30
##$LB= 1
##$LEV0= 0
##$LPBIN= 0
##$MAXI= 10000
##$MC2= 0
##$MEAN= 0
##$ME_mod= 0
##$MI= 50
##$NCOEF= 0
##$NC_proc= -10
##$NLEV= 6
##$NOISF1= 182.463
##$NOISF2= 159.3651
##$NSP= 0
##$NTH_PI= 0
##$NZP= 0
##$OFFSET= 182.463
##$PC= 4
##$PHC0= -1371.411
##$PHC1= 177.2013
##$PH_mod= 1
##$PKNL= yes
##$PPARMOD= 0
##$PSCAL= 0
##$PSIGN= 0
##$REVERSE= no
##$SF= 81.0140089999434
##$SI= 65536
##$SIGF1= 159.3651
##$SIGF2= -187.1042
##$SINO= 113.3802
##$SIOLD= 16384
##$SREGLST= <1H.CDCl3>
##$SSB= 0
##$STSI= 65536
##$STSR= 0
##$SW_p= 29940.119760479
##$SYMM= 0
##$S_DEV= 0
##$TDeff= 32768
##$TDoff= 0
##$TI= <>
##$TILT= no
##$TM1= 0
##$TM2= 0
##$TOPLEV= 0
##$USERP1= <user>
##$USERP2= <user>
##$USERP3= <user>
##$USERP4= <user>
##$USERP5= <user>
##$WDW= 1
##$XDIM= 65536
##$YMAX_p= 528856238
##$YMIN_p= -159883118
$$ End of Bruker specific parameters
$$ ---------------------------------
##NTUPLES= NMR SPECTRUM
##VAR_NAME=  FREQUENCY,     SPECTRUM/REAL,   SPECTRUM/IMAG
##SYMBOL=    X,             R,               I
##VAR_TYPE=  INDEPENDENT,   DEPENDENT,       DEPENDENT
##VAR_FORM=  AFFN,          ASDF,            ASDF
##VAR_DIM=   65536,         65536,           65536
##UNITS=     HZ,            ARBITRARY UNITS, ARBITRARY UNITS
##FACTOR=    0.456856943014862, 1,           1
##FIRST=     14782.0589164792, 0,            0
##LAST=      -15158.0608439998, 0,           0
##MIN=       -15158.0608439998, -159883118,  0
##MAX=       14782.0589164792, 528856238,    0
$$ Real data points
##PAGE= N=1
##DATA TABLE= (X++(R..R)), XYDATA
$$ [...]
43425C2952811J6942055q209043k5566444j8871331L235538K0513532K0935242
43418D1932360Q489675k682575l207311J508796J012383l200336j959713K327065
43410D4220344j766633j1072575q055415Q470310J5885517L419740p976453J22704
43402D3247539J1064044M2599k2760966k6369254q360929J700165j0573292k2954968
43394c4965062j2254980J0811745J7976054K438544j4337896j2184385L269217
43387c9246763J0035944j141125j4731468j0399258J1122428K9755940K9728567
43380A5124265J2046500j2259652k8096030k0006447J0649456L3097962J5983669
43373B6539723k6467789m4199839j8121034J2201041P222776j4880778r840918
$$ y = [32952811, 49894866, 41685823, 16119379, -2751952, 483586, 20997118, 41932360, 50422035, 47739460, 44532149, 46040945, 47053328, 43852992, 41893279, 44220344, 42453711, 31381136, 23325721, 31796031, 47681548, 51101288, 43124835, 43247539, 54311583, 54354182, 31593216, 5223962, -3136967, -1436802, -12010094, -34965062, -47220042, -36408297, -18432243, -15993699, -30331595, -42515980, -39246763, -29210819, -30351944, -45083412, -55482670, -44360242, -14604302, 15124265, 27170765, 14911113, -13184917, -33191364, -22541908, 10556054, 26539723, 71934, -44127905, -62248939, -50047898, -42825122, -57705900, -67546818]
43366f7546818K4234160M7550976L8581312J5754552j065460j5575585l1977049
43359I956088l5884661j5516500J4764085K8241559J6227914m739077j2250299
43352G99109m23802J4551613J2146831o550593j7347873m520801J5479006J5196367
43344B9329857o069422k2724984j8208252k158331Q647633R835060N676424j27842
43336D200143l519470m9692Q154808J2354204Q376396K122859Q91560M497678
43328C7028486Q077174R366472R090725N652624n588181k3339968l2704006j7100648
43320i517322J6044375L3572566J5003688j7017820k5221480r496330k943123
43313D24554j8194322l0548825k0941901k074033J0588965K0561579K7159419
$$ y = [-67546818, -43312658, 4238318, 42819630, 58574182, 57508722, 41933137, 9956088, -25928573, -41445073, -26680988, 1560571, 17788485, 13049408, 799109, 375307, 14926920, 27073751, 20523158, 3175285, -1345516, 14133490, 29329857, 23260435, 535451, -17672801, -19831132, -11183499, -1348439, 4327985, 4200143, 680673, 630981, 8785789, 21139993, 29516389, 31639248, 32530808, 37028486, 45105660, 54472132, 63562857, 69215481, 63627300, 40287332, 7583326, -9517322, 6527053, 40099619, 55103307, 38085487, 12864007, 3367677, 424554, -17769768, -48318593, -69260494, -71334527, -60745562, -40183983, -13024564]
43306a3024564J5330873j0592059j8693358l77279Q343870j2114614k4068354
43299e5195485M115323L4668494J8201707j7964086r540256L5713090M6589968
43292E6588755M268910k8999434j2403612J4928343P464947j6695463j8298721
43285F853725j437999N784312J48022m711275q496278j4437009j1905037M317278
43277b3884261J7987200J6074392Q076477L892789k078759r262654l654661J0492990
43269A7643513N781290k0708879l1504065o404387K1127601J6638218k476540
43262I6751l597079N699431J396468p296577R59902J2202375k2897k1543635j7004598
43253b9109859Q718474J7532949R42434j1135949l567450N785630L980895k14511
$$ y = [-13024564, 2306309, -8285750, -26979108, -27356387, -19012517, -31127131, -55195485, -51080162, -16411668, 1790039, -16174047, -25714303, 9998787, 56588755, 60857665, 31858231, 19454619, 34382962, 41847909, 25152446, 6853725, 5415726, 11200038, 11348060, 6636785, -1859493, -16296502, -28201539, -23884261, -5897061, 10177331, 18253808, 22146597, 20067838, 10805184, 7150523, 17643513, 23424803, 2715924, -28788141, -35192528, -14064927, 2573291, 96751, -3500328, 2199103, 3595571, -3701006, -2741104, 9461271, 9438374, -12105261, -29109859, -20391385, -2858436, -1916002, -13051951, -16619401, -10833771, -6852876, -7067387]
43245g067387j749802o285589q329381M405191K2170971K0915172P95903j4361997
43237A0493081j6149611j6984838j7010582k628924J8629095J9644903k206615
43230f213491j7653036j0602257L225468J0510128J7633540K4151535J5759904
43223C6811791l368295p551507O207633P928319j3661472k7373269j0993433J0493273
43215a506960P820204m509784J808586J7855406J5321440l234494j0771706j609020
43207B1173672M570523j106986p675644q675028q685781p415208n50526N903998
43199b460980L186927k159660J642536Q617539M170105p440670q682189N30567
43191b595825K505324p012327j1864355l978965M319488L880387L478931J0396186
$$ y = [-7067387, -8817189, -15102778, -23432159, -19026968, 3144003, 24059175, 24855078, 10493081, -5656530, -22641368, -39651950, -42280874, -23651779, -4006876, -6213491, -23866527, -34468784, -31243316, -20733188, -3099648, 21051887, 36811791, 33443496, 25891989, 32099622, 40027941, 26366469, -1006800, -12000233, -1506960, 6313244, 1803460, 3612046, 21467452, 36788892, 33554398, 22782692, 21173672, 25744195, 24637209, 16961565, 8286537, -399244, -7814452, -8364978, -2460980, 725947, -1433713, 208823, 8826362, 12996467, 5555797, -3126392, -2595825, -90501, -7102828, -18967183, -22946148, -18626660, -14746273, -11267342, -871156]
43183h71156J4196476L734407j1989990j4654689k504823O639107k420882k3979884
43175c1851434l6535283k4463589N411457K9827468L2293209J7197298K14992
43168g905882q003609m971810O864133J8109041J5869337m54095j4714179j5822505
43160a1029569j3348203j6940505j3222531J3066340M2783812L8090862k320125
43153C7080081l3461485k1374842J4806431L4583270K8385878J5993053P739668
43146H3752054n516803k6437961l8791214k8356344l782243J1547427M961936
43139b623148j2258073j8423226q363556o79224r898152j9024953o205L8436265
43131c2840272N1188015J8161379k1342983k0264825J0945223K3441363K245015
$$ y = [-871156, 13325320, 17059727, 5069737, -9584952, -12089775, -5450668, -7871550, -31851434, -68386717, -92850306, -87438849, -57611381, -25318172, -8120874, -7905882, -15909491, -20881301, -14017168, 4091873, 19961210, 19507115, 4792936, -11029569, -24377772, -41318277, -54540808, -41474468, 1309344, 39400206, 37080081, 3618596, -17756246, -2949815, 31633455, 60019333, 76012386, 83752054, 78235251, 51797290, 13006076, -15350268, -19132511, -7585084, -2623148, -14881221, -33304447, -41668003, -42347227, -52245379, -71270332, -71276537, -32840272, 18347743, 36509122, 15166139, -5098686, 5846537, 29287900, 31532915]
43124C1532915j8614493j2408996O511248J4504316J1114800M305153q841944
43117B8102999k7094716l2868291j6057316O362369J3173383O468139O5075k319817
43109b4168175M92929J6840915M1936781M7615503J9824900j1937288j4839412
43102G5766153m733086j7637844m2699817l4640947P356085K8324018L09777l4128659
43094b2084320k7977355L914031J9202104J3616706J1473926J5856049J1720019
43087B5721160M014103J0593971K3658014J7129712q315510k3161607j5593206
43080C4046637p693016j6834656k8960536k3243639k904904J2049956J0193016
43073b3347142k688387j1974513o802372R154493K0280057J9116580J7003067
$$ y = [31532915, 12918422, 509426, 7020674, 21524990, 32639790, 36944943, 28102999, 1008283, -31860008, -47917324, -41554955, -28381572, -21913433, -21848358, -24168175, -23675246, -6834331, 35102450, 82717953, 102542853, 90605565, 75766153, 71033067, 53395223, 10695406, -23945541, -16589456, 11734562, 12044339, -22084320, -50061675, -46147644, -26945540, -13328834, -1854908, 14001141, 25721160, 29735263, 40329234, 63987248, 81116960, 72801450, 49639843, 34046637, 26353621, 9518965, -19441571, -42685210, -45590114, -33540158, -23347142, -26035529, -38010042, -44812414, -35657921, -15377864, 3738716, 20741783]
43066B0741783K3563475K6192978Q904600j6436238k1813052l778292J1661283
43059D9036537O621729q671351j7203507j5699813q922194j762156r42340p902373
43051e445468r443412N663444K2416117J5780912r075801k0954419j0353796j540328
43043a2952751q496306j2682444q49508P591744n137994k0678831j2786217J0079032
43035e5913275J9907570J2392058N723852N802445J661539p927282r395170K139585
43027b5608678J4052082J4315287N026396l730612m178666L887099J1518096Q668965
43019B3949969j472690n170768n1617k05391j0867824j5201541o79981J7474786
43011G774943J7747406M131479l699214j489791m53858l884395m972268l514339
$$ y = [20741783, 44305258, 70498236, 79402836, 62966598, 41153546, 37375254, 49036537, 55658266, 46986915, 29783408, 14083595, 5161401, 3399245, 2456905, -5445468, -14888880, -9225436, 13190681, 28971593, 19895792, -1058627, -11412423, -12952751, -21449057, -34131501, -34981009, -27389265, -32527259, -53206090, -65992307, -55913275, -36005705, -23613647, -17889795, -12087350, -10425811, -18353093, -27748263, -25608678, -11556596, 2758691, 7785087, 4054475, -124191, 3762908, 15281004, 23949969, 22477279, 17306511, 17254894, 17049503, 6181679, -9019862, -9699843, 7774943, 25522349, 29653828, 25954614, 24464823, 24010965, 20126570, 15154302, 11639963]
43003A1639963n452727q475450m798498M204620J0090045J0039285N839101k273049
42995B0813290r144339l705020J1327835J3186122q770092k9406830j9622566
42988b5321600J1058354K9525605K5298697J3378627J084186j5619272k8446413
42981A0958184k3041367p610805l830349j0326147p295982M373999N085703j819212
42973c3505976Q130636L0088882K5701738j4186378m5109773l2040397L59679
42966f0561589J0704706K116342M890135K1731367K8477925J6143482j820863
42959B1681505j6112151k5916141k3655382l888010J6754591J5569110j553040
42952a7119518o367402R913137K4624253J8120695N378p467998J460205J1994811
$$ y = [11639963, 6187236, -2288214, -7086712, -2882092, 7207953, 17247238, 23086339, 20813290, 11668951, 7963931, 19291766, 32477888, 23707796, -5699034, -25321600, -14263246, 15262359, 40561056, 53939683, 55023869, 39404597, 10958184, -12083183, -19693988, -23524337, -33850484, -41146466, -36772467, -31686764, -33505976, -25375340, 4713542, 30415280, 16228902, -28880871, -60921268, -60561589, -49856883, -47740541, -42850406, -21119039, 7358886, 23502368, 21681505, 5569354, -20346787, -44002169, -47890179, -31135588, -15566478, -17119518, -23486920, -13573783, 11050470, 29171165, 29176543, 21708545, 23168750, 35163561]
42944C5163561P223001j3523323l1753217k7012967n92484K3401813K5866274
42937A8772658J3556547M531421K660846j122684r662532j6123877j6377760j2369438
42929a6134819n010516N772805J5288723J6893218R427012k888980j3639619j4489976
42921d782152j922423J1678894P390703j1663456j7981920M63914J6639124K381085
42913B203769k6003145k9550197n212064J1670878M113387l129693J0881414K6556685
42905h468966J6267109q502421j2678224Q360673K0537600J234141k6961889k6945167
42897c7157144L372160L0641217K9398395O673104j7621574l4385056l9941132
42890e9020030k6162111N220337L0818581L0237912J5058697J0244697J3986363
$$ y = [35163561, 42386562, 28863239, -2889978, -29902945, -30495429, -7093616, 18772658, 32329205, 36860626, 39521472, 38398788, 28736256, 12612379, -3765381, -16134819, -21145335, -15372530, -83807, 16809411, 26236423, 23347443, 9707824, -4782152, -6704575, 4974319, 12365022, 701566, -17280354, -16816440, -177316, 2203769, -23799376, -53349573, -58561637, -46890759, -42777372, -45907065, -35025651, -8468966, 7798143, -704278, -13382502, -5021829, 15515771, 16749912, -10211977, -37157144, -33784984, -3143767, 26254628, 32927732, 15306158, -19078898, -59020030, -85182141, -79961804, -49143223, -18905311, -3846614, 6398083, 20384446]
42883B0384446N171553j3068153j3972710L837508Q035449j2106788k2406147
42876b4124842M7684K5344740J8251518n852960j1560128j666129n36573k706688
42868b803378J1983572K8549717J5953170j3051747j6357112O355077J3756150
42861D4385449l556024r665965O398180R502783j2154304j8599318R502042K8597864
42853E4410707M219678k7162589j8560455J0195213J3143279m98482R065798L1230522
42845G6043671J9167488k3964328m1634150j2185547K0362837J7581966m255480
42838E1116457j5137464j5070437j3940485o581085P248135R525490o301697j9387337
42830h528423j5129410p358259p579762j975527J6884584K4802390K987496k3919429
$$ y = [20384446, 25555999, 12487846, -1484864, 2352644, 10388093, -1718695, -24124842, -24077158, 1267582, 19519100, 13666140, 2106012, 439883, -96690, -2803378, 9180194, 37729911, 53683081, 40631334, 24274222, 30629299, 44385449, 40829425, 31163460, 37561640, 47064423, 34910119, 16310801, 25812843, 54410707, 58630385, 31467796, 12907341, 23102554, 36245833, 35747351, 44813149, 76043671, 95211159, 71246831, 29612681, 17427134, 37789971, 55371937, 51116457, 35978993, 20908556, 6968071, 386986, 7635121, 17160611, 10858914, -8528423, -23657833, -31016092, -38595854, -40571381, -23686797, 1115593, 4103089, -19816340]
42822a9816340k1179251K746230J1888637j122480j1600436q260678m561168n109608
42814e7015094L085619J9994309K5742817J4016436L230260L179276o97968j4709214
42806c173559j7493884L966594K3354541J0087881k0286226k4243277O816910
42799b0971020L4833313L0000189P788183j125991N172612M701052j1890411k8644822
42791A9863105k6767247q045868P385941M038252r805456j0636713Q215207K1938165
42783F185386N781495k5325523l1513057l286562K4948047K6016792J5582950
42776A8389528J7326456K0536624L658704j9995873j9056616K460801R132915
42769C2452539q418116k0206153q790711M242538r16398j0264183o189157Q67507
$$ y = [-19816340, -40995591, -38249361, -26360724, -27483204, -39083640, -47344318, -51905486, -57015094, -53929475, -33935166, -8192349, 5824087, 9054347, 12233623, 11535655, -3173559, -20667443, -16700849, 6653692, 16741573, -3544653, -27787930, -20971020, 13862293, 43862482, 51650665, 50524674, 55697286, 60398338, 48507927, 19863105, -6904142, -14950010, -7564069, -3525817, -13331273, -23967986, -15752779, 6185386, 11966881, -13358642, -44871699, -48158261, -23210214, 2806578, 18389528, 35715984, 56252608, 59911312, 39915439, 20858823, 23319624, 32452539, 24034423, 3828270, -4962441, -719903, -1636301, -11900484, -18089641, -17222134]
42761a7222134l395167p202769M211470J6753090R791248o001373n535244P749814
42753h51065R001640n143140j3957397j0338773q886710j4571105j3579055q92980
42745e9218585R633702R346442N352458J694722o357141j3912828p301964R736146
42737e1027048J6154282Q137132O210002J6683845J6259007o378143k3017226
42730a6978149p331594J9303449J6901781j1920130k5578901n524915J8707221
42723a2421238J3980330j2249623k5796797r467487K0070125L3952497K1648683
42716B9716490k84240q456958M12247Q583792L629885n550778n292813K112068
42708B4869693N612191M040681L991203N677721M946179M379793Q050388R257778
$$ y = [-17222134, -20617301, -27820070, -23608600, -6855510, 2935738, -3065635, -8600879, -851065, 8150575, 3007435, -10949962, -21288735, -30175445, -44746550, -58325605, -59218585, -49584883, -40238441, -34885983, -33191261, -39548402, -53461230, -60763194, -51027048, -34872766, -26735634, -20525632, -3841787, 12417220, 6039077, -16978149, -24309743, -5006294, 11895487, -24643, -25603544, -31128459, -12421238, 1559092, -10690531, -36487328, -45954815, -25884690, 8067807, 29716490, 29432250, 20975292, 21387539, 29971331, 33601216, 28050438, 22757625, 24869693, 30481884, 34522565, 38513768, 44191489, 49137668, 53517461, 61567849, 70825627]
42700G0825627r82782j5399864j6903193m399903M050021j834535r021217o34421
42692B5699733J8883640K7522461J1415184j8688411l6537350k5711642L300528
42685E884143K3887319K2004717P538172n036303j4568221k2466632j8399004
42678a155809M089745K5829498J9520690j1162993l2324576k3954776k311318
42671b1469539R102036J0011656J2073411J4626670R007808l297607j2582622
42664A7471813j4493411r394405M025427K1152079K5350830O267483j9867458
42657C0512358k5954037r774057L656903j099526q713326J646620K4435610L6219685
42649E0930230K8338336J4461531O638395P7023j2419294k3933334k2993909j3022994
$$ y = [70825627, 69842845, 54442981, 37539788, 33139885, 37189906, 35355371, 26334154, 25699733, 44583373, 72105834, 83521018, 64832607, 28295257, 2583615, 5884143, 29771462, 51776179, 59314351, 54278048, 39709827, 17243195, -1155809, 2933936, 28763434, 48284124, 37121131, 4796555, -19158221, -21469539, -12367503, -2355847, 9717564, 24344234, 33352042, 30054435, 17471813, 2978402, -6416003, -2390576, 18761503, 44112333, 50379816, 30512358, 4558321, -5215736, -1558833, -2658359, -11371685, -9725065, 14710545, 50930230, 79268566, 93730097, 100368492, 100445515, 88026221, 64092887, 41098978, 28075984]
42641B8075984q788831j4079395j5900934n362132O960759N931201m723533o062196
42633a3949077R409211K5324965K0455621n161040k8323305k6326623k86359K5673718
42625F817111K8223290P024686j7408328k5512340j4721143L571107J5406258
42618C400641J2419416k099370j2225641l856643J5566724K2751264J0563928
42611D6520319R77813J3613117L3756980L0859885K575934k1206581j9021568
42604H8075899k929297K551811r052185k4661693k9846834k1327726p996933l027084
42596h214042r243440j3132191j891514J6155110K0678100P664174o138556q015917
42588b138276k853555Q93293K783996L263402J29024k791632J894801J0059924
$$ y = [28075984, 19287153, 5207758, -10693176, -16055308, -9094549, -3163348, -7886881, -13949077, -4539866, 20785099, 41240720, 36079680, 7756375, -18570248, -18856607, 6817111, 35040401, 42065087, 24656759, -855581, -15576724, -12005617, 3400641, 15820057, 13720687, 1495046, -2361597, 13205127, 35956391, 46520319, 47498132, 61111249, 94868229, 125728114, 128304048, 107097467, 88075899, 85146602, 87698413, 78646228, 53984535, 24137701, 2809975, -5186958, -8214042, -17457482, -30589673, -32481187, -16326077, 4352023, 12016197, 5877641, -2138276, -4991831, -4098538, -1314542, 1948860, 2077884, -713748, 1181053, 11240977]
42580A1240977R827812L745584O837122J7299294J4053492n950452j5782644k137261
42572C9133924O744383j5613855m5219183l7776861M867889L5946243K8723847
42565A6806387N153339m499930J441342J0040197J7660908K4265349K2276223
42558I3143815O741083j4121837k8797183l3836046k9429859j5170760K974911
42551a8495876J2635971R405861J803737l572346j0396498j9171485j8231324
42544d6021960q1047K1967283K7071449J3123648k394179p006213o805054j1515491
42536a1661564j5930635o743076J4273783K6319154J5564104m146189r329832
42529H345745l29731J244240j1114430j7356307m880561Q485798L188739r032798
$$ y = [11240977, 21068789, 24814373, 31651495, 48950789, 63004281, 57053829, 41271185, 39133924, 45878307, 30264452, -14954731, -52731592, -47863703, -11917460, 16806387, 21959726, 17459796, 18901138, 28941335, 46602243, 70867592, 93143815, 99884898, 85763061, 56965878, 23129832, -6300027, -21470787, -18495876, -5859905, 3545956, 5349693, 1777347, -8619151, -27790636, -46021960, -46103007, -24135724, 2935725, 16059373, 13665194, 6658981, -146073, -11661564, -27592199, -34335275, -20061492, 6257662, 21821766, 17675577, 8345745, 8016014, 9260254, -1854176, -19210483, -24091044, -15605246, -12416507, -21449305]
42521b1449305m358860J4239575K3796619J8261042J0603628L547097j1189311
42514C3450485k5381250j8835267L341324J0484626o059240j6880748k294191
42507b2174261J4209510M178295j8924806k0684547K269827K1649517K0874744
42500A398279J0482792K313900n294767j2542837j0508508K427769J1633807M415835
42492D326270j1325621j6575778o058885N330689L264102n750925m034717Q563312
42484b2261553J0811825o028459j6765857M181143L8238077M1460001P351475
42477E6986652k1996925j6635538K376085L210581p912622n962709P319080R935501
42469B7320105p21229o303467J16213P732032J0713600J2240198Q861984m605927
$$ y = [-21449305, -25808165, -11568590, 12228029, 30489071, 41092699, 44639796, 33450485, 8069235, -10766032, -7424708, 3059918, -2999322, -19880070, -22174261, -7964751, -3786456, -22711262, -43395809, -41125982, -19476465, 1398279, 11881071, 14194971, 8900204, -3642633, -14151141, -11723372, -89565, 4326270, -6999351, -23575129, -29634014, -24303325, -21039223, -26790148, -30824865, -22261553, -11449728, -17478187, -34244044, -30062901, 8175176, 49635177, 56986652, 34989727, 18354189, 20730274, 23940855, 16028233, 10065524, 17384604, 27320105, 26598876, 20295409, 20411622, 28143654, 38857254, 51097452, 59959436, 55353509]
42461E5353509j7044228j3202819k445219p911106k5670635k5095028J863210
42454c4152316K1746667O609564k3881653k9294035k428944K5803978K8388423
42447g208316R347139r775075j4329947l874966J3607475K7290245K7240279J0235333
42439E2532167j4861336l1071325k8607344j5481840n932865L13554J4665258
42432b8443731L3611900L4643266R585324j5732742j4319935K801549M230392
42425B6376023j3103040k0431805k360426K0486185K1001616j635785k6400049
42418C932719l3696882j9782029M70048N286367p571736j2192229R829573L4137985
42410a9586184K2055362j9476769m0690578j6772246K1513760L5807310K4829871
$$ y = [55353509, 38309281, 25106462, 22661243, 14750137, -10920498, -36015526, -34152316, -12405649, -5796085, -29677738, -58971773, -61400717, -35596739, -7208316, 2138823, -7636252, -21966199, -25841165, -12233690, 15056555, 42296834, 52532167, 37670831, 6599506, -22007838, -37489678, -43422543, -43108989, -28443731, 5168169, 39811435, 49396759, 33664017, 19344082, 22145631, 26376023, 13272983, -7158822, -9519248, 10966937, 31968553, 30332768, 3932719, -29764163, -49546192, -49076144, -43789777, -51361513, -63553742, -53724169, -19586184, 2469178, -17007591, -57698169, -74470415, -52956655, -17149345, 7680526]
42403G680526N485107j6318657l3058792k5059906Q485691L3026238K3144506
42396C384713J141107q7628J0215873L089357j4227077j0894323Q272072N836431
42388F730525k3030468l6251230r899430K4358534K9118723J3992778R915421
42381A4934853J6409442Q676963j4765634k4987566n511003K1821366K4385571
42374D0963992K77969k0026262j2803705Q588481J2751189m625198j4769371k873823
42366G483272M164560j7831865l9243729j1834153N1281848Q0285558M4089633
42359A18395124p609621k1927027j5088863k6841824m2940399k1241539K5957297
42352H703148M0188915O685091k4428640j9131973n250870j2965126k1321468
$$ y = [7680526, 13165633, -3153024, -36211816, -61271722, -52786031, -19759793, 3384713, 4525820, 4438192, 14654065, 17743422, 3516345, -7377978, 894094, 6730525, -16299943, -52551173, -62450603, -38092069, -8973346, 5019432, 14934853, 31344295, 40021258, 25255624, 268058, -5242945, 16578421, 40963992, 41241961, 21215699, 8411994, 17000475, 29751664, 25126466, 10357095, 7483272, 11647832, -6184033, -45427762, -57261915, -5980067, 74305491, 118395124, 110785503, 88858476, 73769613, 46927789, 3987390, -17254149, 8703148, 48892063, 55577154, 31148514, 12016541, 6765671, -6199455, -27520923]
42345b7520923k098020K3618376J9544046k412232k712965J7992311K2888027
42338D9298620N051750k632339J0356455J0256968k1840874n1509959m0049841
42331d1069220j188751K2062126J5770025M87245o212120l549546O322738J9394800
42323A2017297K2533233P470820j2817573k0530018j7959637j6567512j2070098
42316c7923488M984231K3149458K3294871J1921754J0443580J5058091K607373
42309E3535870k2442236k6563497k811153J1691593o866770l0055431k2310915
42302d5822539N049542J6809412Q234689K432979Q600106J5870743J8579343J7097110
42294D6851385K488889k8663181n1514279l7896068j78403K2578941J9568387
$$ y = [-27520923, -29618943, -6000567, 13543479, 11131247, 8418282, 26410593, 49298620, 54350370, 51718031, 62074486, 72331454, 50490580, -1019379, -41069220, -42257971, -20195845, -4425820, -3938575, -10150695, -13700241, -7377503, 12017297, 34550530, 42021350, 29203777, 8673759, -9285878, -25853390, -37923488, -32939257, -9789799, 13505072, 25426826, 35870406, 50928497, 53535870, 31093634, 4530137, 1718984, 13410577, 6543807, -23511624, -45822539, -40772997, -23963585, -15728896, -13295917, -4695811, 11174932, 29754275, 46851385, 49340274, 20677093, -30837186, -68733254, -68911657, -46332716, -26764329]
42287b6764329J3590692J2367721k075874k5991766k2711144J6662788M2976302
42280H054390J6402638k7632756k5912367J8323648M0727015J2413754k1564667
42273B0811655j5041469J3679955J8754016k900404j6420208q157554r64247j1409256
42265a647512k4781395k0980215j091699K1532097L6816549L5509195J1975396
42258E7332416j8054180k3368685J785108K2231496R160304j6613621j8639414
42251A3833424n353308j4873538m4379017m3695546P535832O1015784O4408142
42244C8491773K9562639L831037J605179K991683J174044P872360J8630492J3067500
42236A17226707q509231k2526502j9681326j4392947j3124013m976709Q985064
$$ y = [-26764329, -13173637, -805916, -2881790, -28873556, -51584700, -34921912, 8054390, 24457028, -3175728, -29088095, -10764447, 29962568, 42376322, 20811655, 5770186, 19450141, 38204157, 35303753, 18883545, 10725991, 9761744, -1647512, -26428907, -47409122, -48500821, -26968724, 9847825, 45357020, 57332416, 39278236, 15909551, 17694659, 39926155, 49086459, 32472838, 13833424, 8480116, -6393422, -50772439, -94467985, -86932153, -25916369, 38491773, 68054412, 71885449, 73490628, 76482311, 77656355, 85528715, 104159207, 117226707, 108717476, 86190974, 66509648, 52116701, 38992688, 34015979, 43001043]
42229D3001043Q797316j0094690k4506037j9306636p688334l46828J5226814M2047561
42221D7130209M9337334J3493470l6569527n1303157k7102986n036985p284549
42214a7336191j2274857R48692J8188809J6326854o01353j1509739r370283l801430
42206a9429498j650419j147424p55365j088873p04590P73921o97697n031367j806173
42197c1537485J5296063L1707187K5047975l415766k5585493k1415938l863750
42190a3767207J707621p530830j2989384n679126K146788p31291o967935m562743
42182d8374107L456426N743055K300786L550573J1177272J3334933K941178r481687
42174a5351571q935711L384694J1416474O009103k880479r31248Q849852R310162
$$ y = [43001043, 51798359, 41703669, 17197632, -2109004, -9797338, -10144166, 5082648, 47130209, 96467543, 109961013, 73391486, 22088329, -5014657, -10051642, -17336191, -29611048, -28662356, -10473547, 5853307, 5251954, -6257785, -15628068, -19429498, -21079917, -22227341, -22982706, -24071579, -24776169, -24002248, -24699945, -29731312, -31537485, -16241422, 15465765, 40513740, 37097974, 11512481, -9903457, -13767207, -12059586, -19590416, -32579800, -38258926, -36112138, -36843429, -43811364, -48374107, -44917681, -39174626, -36873840, -33323267, -22145995, -8811062, -5869884, -15351571, -24287282, -20902588, -9486114, -3477011, -6357490, -7288738, 1561114, 10871276]
42166A0871276m664069j4841473l916721J7137420K1025981J568391j7284655
42159I896150j3817266N127259J8023981J6222687P429551J054702L00560K284835
42151D6522459j009155j3877007k4217491j3344925J3348709K3042582j747622
42144B8717550l3154838l2135500j006980K2487650J6556205m380734j7404909
42137b0321556j3811657N401017L1340730M1907902J9604671j9592761l8054225
42130F474121k3646719k440697K631529L21722N873135J2157249N584121p138280
42122a83819r507751j299448M906930N509222O956693R851017P203007k822974
42114B0612877j3147736j5970404q518586O122751J8769672J9009030N307025
$$ y = [10871276, 6207207, -8634266, -12550987, 4586433, 25612414, 27180805, 9896150, -3921116, 1206143, 19230124, 35452811, 42882362, 43937064, 44237624, 46522459, 45513304, 31636297, 7418806, -5926119, 7422590, 30465172, 28717550, -4437288, -36572788, -37579768, -15092118, 1464087, -2916647, -20321556, -34133213, -28732196, 2608534, 44516436, 64121107, 44528346, 6474121, -17172598, -19613295, -16981766, -16660044, -10786909, 1370340, 6954461, -183819, -9691570, -10991018, -6084088, -574866, 6381827, 16232844, 23435851, 20612877, 7465141, -8505263, -17023849, -10901098, 7868574, 26877604, 32184629]
42107C2184629j2458886k2126372j7739403j806062J4074887J5593833K695253
42100A0417879o361633p65581L574724r113880k0522286l150361K7407492K6607800
42092B8094154q114630k6084989K66016L2343605K6327993k976960j5852053j1671328
42084B2331808j5411595k4492983j6484470M026997J1956651P857369J4553053
42077D336830L1089785L1950554J3020461j943351m791258j3496555l1256606
42070B8909860l3678558j0766581J2281252J3404210L946667K945620P080426
42063B4122896N365021J508094J924229J58650p810260r804795J540096R482244
42055B6486175l354893k3750585k3518777p90664J7093607J2736512M91615J555536
$$ y = [32184629, 19725743, -2400629, -20140032, -21946094, -7871207, 7722626, 10417879, 4056246, 3290665, 6865389, -2248491, -22770777, -25921138, 1486354, 28094154, 19979524, -6105465, -5839449, 26504156, 52832149, 49855189, 34003136, 22331808, 6920213, -17572770, -34057240, -30030243, -18073592, -10216223, 4336830, 35426615, 67377169, 80397630, 78454279, 73663021, 60166466, 28909860, -4768698, -15535279, -3254027, 10150183, 14096850, 17042470, 24122896, 29487917, 30996011, 32920240, 33078890, 25268630, 15463835, 17003931, 26486175, 23131282, -619303, -24138080, -24928744, -7835137, 4901375, 5392990, 6948526]
42047F948526J2048460R974650j0521328k7315334j9453517L072151J3834226
42040a1412166R381396J2062725K8805962L3055767N725791k7659008k8354372
42033B1606095q8523J7086298L202970k1454490l1986095k5246688p253137J7125453
42025b7008117L4134245K6460793r15831k1143975k0348210j2035604j0004637
42018c0861336r549239m928541k785777n834694l404093Q946783J8701112J7257875
42010a2457910J3566111J5241756J4321900M095885p754710j4831576k2163382
42003i981926k8428259j8873996Q252686K8308927K2147666M164983j008300N838942
41995A0420723O848091k107828j0220138j1860380r224634l253024K105304l685598
$$ y = [6948526, 18996986, 28971636, 18450308, -8865026, -28318543, -25246392, -11412166, -2030770, 10031955, 38837917, 71893684, 77619475, 49960467, 21606095, 21517572, 38603870, 41806840, 20352350, -11633745, -36880433, -44133570, -27008117, 7126128, 33586921, 32671090, 11527115, -8821095, -20856699, -30861336, -40410575, -45339116, -48124893, -53959587, -57363680, -48416897, -29715785, -12457910, 1108201, 16349957, 30671857, 34767742, 27013032, 12181456, -9981926, -38410185, -57284181, -49031495, -20722568, 1425098, 5590081, 4581781, 10420723, 17268814, 15160986, 4940848, -6919532, -16144166, -19397190, -17291886, -20977484]
41987b0977484k1271674l1624017j8936239O097869K0900957J9210462J1103334
41980c5496792O202744R886023K2829157L1753487J7959673j0829089j9791368
41973B2513835K136164J7133914o381737l8899180l0587496J0755832L0621558
41966G292890J0446091j1053450m977623P786190J207572j2607986j0650229J163484
41958a1393061L548906k095966k006804K558813J150198k630488L581860J7733769
41950A0447227K4422781J6439241O98244j3882398k1291106j5489836K985004
41943D329157J9446087J7999778K093475j0579840j3804382j8448435k8469525
41936b7433685k8130137n382103K4210745L4556230K4333043J5104859J4527638
$$ y = [-20977484, -42249158, -73873175, -92809414, -86711545, -65810588, -46600126, -35496792, -29294048, -19408025, 3421132, 35174619, 53134292, 42305203, 22513835, 24649999, 41783913, 35402176, -3497004, -34084500, -23328668, 7292890, 17738981, 6685531, 1707908, 9494098, 10701670, -1906316, -12556545, -11393061, -7844155, -9940121, -11946925, -9388112, -8237914, -10868402, -7286542, 10447227, 34870008, 51309249, 52007493, 38125095, 16833989, 1344153, 4329157, 23775244, 41775022, 43868497, 33288657, 19484275, 1035840, -27433685, -55563822, -60945925, -36735180, -2178950, 22154093, 37258952, 51786590]
41929E1786590N631002j8084013l1915457j5479537J0050572R548640j1985912
41922d48115j7187020L670547J7439700J876445k0045246j7570183M247120J9850851
41914h165901J9461497Q531185q463349k1312153j1180225K0354557L7500379
41907C6725990J3777416k5415487l4079442q592839J2281646M658919j4205521
41900a4849318j7304052n1682K1473231K6780820P677036j7403184j6091558J4698054
41892D929347L5475432J6917811j5268567k0378642o118787q514284k4337281
41885a7294971j6966165J4708212K9968657J5500566M974595J4185482J2041988
41878E7118364j8083002l9690612k1626720Q166492R333230n339496K162919K6526684
$$ y = [51786590, 57417592, 39333579, 7418122, -8061415, 1989157, 11537797, -448115, -17635135, -13964588, 3475112, 5351557, -14693689, -32263872, -28016752, -8165901, 11295596, 19826781, 11363432, -9948721, -21128946, -774389, 36725990, 50503406, 25087919, -8991523, -17584362, -5302716, -643797, -14849318, -32153370, -32205052, -10731821, 16048999, 23726035, 6322851, -9768707, 4929347, 40404779, 57322590, 42054023, 21675381, 15556594, 7042310, -17294971, -34261136, -19552924, 10415733, 25916299, 30890894, 45076376, 57118364, 39035362, -655250, -22281970, -14115478, -4782248, -10121744, -7958825, 18567859]
41870A8567859K8515242J422506j8753262r809805Q500588R778460m487517j5416144
41862A8317927j2566018q11477P640845M284951o569969j1646654n976238J054640
41854f271993K153742L239549J0155083J6916331J7231515J5153123J3714480
41847G2291830O386660q553851j9101419j7618983j3762558j6210931j6837524
41840a3406776q202006q61224m851362q292065M304071K3020373K3925753M051930
41832A9688694j4037721j0930041R062285K3763111J3664019j6125282l3145804
41825h060739j2596547K4105044L1472553N524483q699104R849894K1166151p740407
41817E5021328l9319009j9893288L1287999M6767086J1470123k2121626j9332737
$$ y = [18567859, 47083101, 48505607, 29752345, 19942540, 28443128, 38221588, 33734071, 18317927, 5751909, 4940432, 12581277, 16866228, 10296259, -1350395, -7326633, -6271993, -4118251, -878702, 9276381, 26192712, 43424227, 58577350, 72291830, 78678490, 70124639, 51023220, 33404237, 19641679, 3430748, -13406776, -21608782, -22470006, -27321368, -35613433, -31309362, -8288989, 15636764, 19688694, 5650973, -5279068, 3783217, 27546328, 41210347, 25085065, -8060739, -20657286, 3447758, 34920311, 40444794, 31745690, 41595584, 62761735, 55021328, 15702319, -4190969, 27097030, 73864116, 85334239, 63212613, 43879876]
41810D3879876m877785o889149j2963369n350103L086514l363790j1237615j899639
41802C84940J5139824J8037091N459678o761393r287658m621079p9113m553213
41794A3719077j8788717k4196576q08779L8025358N2813033K9010558m325819
41787H5448135j8484218j9496180k1956947j8628663k158974Q346647n027340
41780H042460k2547137j2782920J5784206K4695256L174711j9147875k0083625
41773b2864924j2111170j1695005j1282952L99031J2923173J1480613N139045
41766b8012189J3219420K9618683K6408892k707694k5191976j0390339K6731077
41759B9675874M2594994K1134294q994134j7944586j3342448j9112395l1815066
$$ y = [43879876, 39002091, 32112942, 19149573, 13799470, 16885984, 13522194, 2284579, 384940, 15524764, 33561855, 39021533, 32260140, 22972482, 18351403, 18272290, 13719077, -5069640, -29266216, -30074995, 7950363, 60763396, 89773954, 85448135, 66963917, 47467737, 25510790, 6882127, 4723153, 13069800, 8042460, -14504677, -27287597, -11503391, 13191865, 16366576, -2781299, -22864924, -34976094, -46671099, -57954051, -57555020, -44631847, -33151234, -28012189, -14792769, 14825914, 41234806, 38527112, 13335136, 2944797, 29675874, 72270868, 93405162, 84411028, 66466442, 53123994, 34011599, 2196533]
41752B196533k4937184N217870K5678035J1063592j7928103k0382710R076287
41745a0015680L2413178J8681503j6299690l2541450j6557753P939373J6777884
41738C97365J2126217N930496k554295j4834726j4909613R989366L7978729L3765335
41730F7888874J995694j5354380k987247N009917j4357324k9670440o458477L0607467
41722C6674084L2162646O11345j7062163l796591R824220K757937r151976j1447700
41714D0571802j3474755j9107332j3693879L768870J0582811m25269n285085Q614133
41706A1551296J7634456K498032j6859820j4081734J609078M921566m214954p124998
41698d067078Q56392Q981058J0344862L159460j2959069k5620034j4181355J5649014
$$ y = [2196533, -22740651, -17522781, 8155254, 19218846, 1290743, -19091967, -10015680, 22397498, 41079001, 24779311, -7762139, -24319892, -16380519, 397365, 12523582, 18454078, 15899783, 1065057, -13844556, -3855190, 34123539, 67888874, 69884568, 54530188, 51542941, 56552858, 42195534, 12525094, 6066617, 36674084, 68836730, 69448075, 52385912, 48589321, 58413541, 61171478, 52019502, 40571802, 27097047, 7989715, -5704164, -1935294, 8647517, 8222248, 2937163, 11551296, 29185752, 31683784, 14823964, 742230, 2351308, 7272874, 3057920, -4067078, -3210686, 5770372, 16115234, 19274694, 6315625, -19304409, -33485764, -17836750]
41690a7836750K4790833p491770m7254658m9605973j8247114J0235065K2140515
41683h3269852K9285713L0252569J1739191j5008504j9370949K646385K0986317
41676b2739130J6359224L340033J398616Q776122J3909889J1613622O36081j6520050
41668A6774407k6734085j7417827K010516Q318231k562465r860746P1941J4903929
41660a4496099J6683949N514320n320936p235005l419803m344719j6446279l0155766
41652e9220338k6031352j812221J7649784J2215720l471992j720905J6418979
41645d5972325K5071498J2999957n338022j4153373q387255J3050805M0599328
41638A7870613M6959988J6648051k1548901k4939068J833533J3173007o992626
$$ y = [-17836750, 6954083, -537687, -47792345, -97398318, -115645432, -105410367, -83269852, -53984139, -23731570, -11992379, -27000883, -46371832, -43725447, -22739130, -6379906, -3039873, -1641257, 7134865, 21044754, 32658376, 33294457, 16774407, -9959678, -27377505, -25366989, -17048758, -19611223, -29471969, -29400028, -14496099, 2187850, 7702170, 2381234, -4853771, -8273574, -12618293, -29064572, -59220338, -85251690, -87063911, -69414127, -57198407, -60670399, -62391304, -45972325, -20900827, -7900870, -13238892, -27392265, -35779520, -22728715, 17870613, 64830601, 81478652, 59929751, 34990683, 36824216, 49997223, 43004597]
41631D3004597k3053393q632665J1618700M885207j8109748k3692730n720020
41624a9700052J2836223J5935846Q691175K196877J82177k531011j3818183k9782775
41616b5989723k9800480k516869K8162093K8708014N330183m606045P937782J1791315
41608A9016270p628563k1852165q305115J3786776J9908207J5681422J0389017
41601D0995849o818861l3986405l7746682m104264K7557075K1374423J316951
41594H588086N370379J8135129M370658j9231025j0167005K0144899K0731784
41587D7942905j2101173l0141043j6661105o780902j4807391q602647K2948921
41580a8202435L9618441J6706229j2192125j2835525k077138n288515p067620
$$ y = [43004597, 19951204, 11318539, 22937239, 27822446, 9712698, -13980032, -19700052, -6863829, 9072017, 17763192, 19960069, 20142246, 17611235, 3793052, -25989723, -55790203, -58307072, -30144979, -1436965, 3893218, -712827, 7224955, 19016270, 11387707, -10464458, -18769573, -4982797, 14925410, 30606832, 40995849, 34176988, 190583, -37556099, -41660363, -14103288, 7271135, 8588086, 13958465, 32093594, 36464252, 17233227, 7066222, 27211121, 47942905, 35841732, 5700689, -10960416, -17741318, -32548709, -41151356, -18202435, 21416006, 38122235, 25930110, 13094585, 11017447, 5728932, -1338688]
41573a338688J2499724K9700761J2966421j9703628k5871933l582925J2226134
41566A6895866O601433k322126j210822K839192L165465J764045k279345j0183495
41558A5270213j2829034k215154J2196684J6035589J0449714L811978m462171
41551C8257819j4094469j3448488M30835Q160893j981592q874799Q227309K9546762
41543D6224270K2167266p017024k3483972j9424256j5819945j7696726j0319005
41536b5369392K524843P09812j0131373l757547J4829777J0970116j6057091k2735352
41528d9016207O000201K5914934N511829j9939423p401328K2670837K4335266
41521H076109M136245M245237K5464005K5907176o269265l2939408k7074801p623509
$$ y = [-1338688, 11161036, 40861797, 53828218, 34124590, 8252657, 4669732, 16895866, 23497299, 21175173, 19964351, 22803543, 25969008, 27733053, 25453708, 15270213, 2441179, 226025, 12422709, 28458298, 38908012, 42719990, 38257819, 24163350, 10714862, 11145697, 19306590, 17324998, 8450199, 16677508, 46224270, 68391536, 61374512, 37890540, 18466284, 2646339, -15050387, -25369392, -22844549, -22134737, -32266110, -36023657, -21193880, -10223764, -26280855, -49016207, -43016006, -17101072, -11589243, -31528666, -38929994, -16259157, 8076109, 12212354, 16457591, 41921596, 67828772, 61559507, 28620099, 1545298, -6078211]
41513f078211J051537M947742J5467989K0493457N252096j8418871k7011363j7793976
41505b2089600p653375o349791n810282N366855K4754248L4727260K0154968r599271
41497C3501012k4790732j1740802N722544k58190j7429614j1623056J5309783
41490a1309055K3202184k335237k2259237k737718L1421544L4570738Q614474
41483E9167693m847664J0003501K4888468J5921466m365268j3860433j2624225
41476G4283538j2760159j5594624j5056583j1635756q429491j438060J2650245
41469B2019110K3647523J5950204r742844l1775242k8600288j756889K4390240
41462A4131814K5988628K965396k1353716k4318913o169113J2893572J5049628
$$ y = [-6078211, -5026674, -78932, 15389057, 35882514, 41134610, 22715739, -4295624, -22089600, -29742975, -36092766, -41903048, -36536193, -11781945, 22945315, 43100283, 33501012, 8710280, -3030522, 2692022, 2433832, -14995782, -26618838, -11309055, 11893129, 9557892, -12701345, -15439063, 15982481, 50553219, 59167693, 54320029, 64323530, 89211998, 105133464, 100768196, 86907763, 74283538, 61523379, 45928755, 30872172, 19236416, 10806925, 9368865, 22019110, 45666633, 61616837, 51873993, 20098751, -8501537, -10258426, 14131814, 40120442, 43085838, 21732122, -2586791, -8755904, 4137668, 19187296]
41455A9187296J450097j1346684q555389P529527J8406146J0065206o539978n747839
41447B4448382J6485474K9711670P168813l2668068m4460251j4863910K0061995
41440E884105K3193644J099772j3005821m701008J1258037J6491787O820722j1048959
41432C5992279k4485225j8975857P034381L1660830K9443441L411637j8113256
41425D5968230j9915518j7276154k6351996l5247456k2181750Q413941K9355505
41418c7235198K7852780J8718717J6792719J5443578L193722j3057370j7226056
41411A4482892q726358j355614J09205N244658J6435236J8030671j690299k7074511
41403A5455880k8712458p31241K7608201K4264941p619932l3154031k7162418
$$ y = [19187296, 20637393, 9290709, 735320, 8264847, 26670993, 36736199, 30196221, 24448382, 40933856, 70645526, 77814339, 45146271, 686020, -14177890, 5884105, 29077749, 30177521, 17171700, 12470692, 23728729, 40220516, 47041238, 35992279, 11507054, -7468803, -434422, 31226408, 60669849, 64081486, 45968230, 26052712, 8776558, -17575438, -52822894, -75004644, -66590703, -37235198, -9382418, 9336299, 26129018, 41572596, 44766318, 31708948, 14482892, 5756534, 4400920, 4510125, 9754783, 26190019, 44220690, 42530391, 15455880, -13256578, -13987819, 13620382, 37885323, 30265391, -2888640, -30051058]
41396c0051058k767133Q609617q22997p760815N743719K5051379K4817676O342539
41388B9162927o221931k680508J894972m357829j1673600q391199q34832N24184
41380b577816L39762P616914J6882025J7492151J2781047J1389906P310432r661773
41372F1572648k8136573k4811229j486029J2650354K862087j0634878o137973
41365E878407O998917O865302o619368j6923608j9356012k1108767j8302454J821456
41357f0746127L2534323M4438019K2367858j0411238k0303919o254751L138938
41350D763103p448633j9760095j1676749R324552J8406662J0131010K406902M314681
41342A0461433K727159r961525j5925839J686598K6711554K8076598M291419j3934592
$$ y = [-30051058, -32818191, -24208574, -25031571, -32792386, -27048667, -1997288, 22820388, 29162927, 22940996, 20260488, 22155460, 17797631, 6124031, -2267168, -3102000, -2577816, -2238054, 5378860, 22260885, 39753036, 52534083, 63923989, 71234421, 61572648, 33436075, 8624846, 7138817, 19789171, 22651258, 12016380, 5878407, 12877324, 19742626, 13123258, -3800350, -23156362, -44265129, -62567583, -60746127, -28211804, 16226215, 38594073, 28182835, 7878916, 1624165, 4763103, -2685530, -22445625, -34122374, -24797822, -6391160, 3739850, 6146752, 10461433, 13188592, 3227067, -12698772, -11012174, 15699380, 43775978, 48067397, 34132805]
41334C4132805o323772J3347223K1287346J2774660l54890o656846k391046O197761
41326G2013241L684878j8498551m4102603m5726340j9768327R905827K6635470
41319a5856405L6921980M4370310L4410076K136107k7214680k8079435r228190
41312C7459763K436036r40187p695520j0093088o913750M814830J9051277J5307880
41304E3427241j1881144l2213817j6950518J5422402K3769563N005013p514450
41297B9064290j759935l69175j1067490p422263K3308636M9151398L4993529q756981
41289A07142009m1290562l8122391o345474K9803445M4001649K5022610p734343
41282A12476943k1088912r381809L18199q005958j6471196p675492O099948Q045636
$$ y = [34132805, 27809033, 41156256, 62443602, 75218262, 74863372, 68206526, 65815480, 72013241, 75698119, 57199568, 13096965, -32629375, -52397702, -42491875, -15856405, 21065575, 65435885, 99845961, 101982068, 74767388, 46687953, 37459763, 39895799, 38955612, 31260092, 21167004, 14253254, 19068084, 38119361, 53427241, 41546097, 9332280, -7618238, 7804164, 31573727, 36578740, 29064290, 27304355, 26935180, 15867690, 8445427, 31754063, 80905461, 115898990, 107142009, 65851447, 27729056, 21383582, 51187027, 95188676, 120211286, 112476943, 91388031, 82006222, 82324421, 74318463, 57847267, 50171775, 56271723, 64317359]
41274F4317359N521171J0083968J1990702L72020j2020660j0863174o713459j1412051
41266E1275876r616308J3206092L4826327K7035332N959428Q506389L0003348
41259A61196484L2382787R754067l683471N772579J2070387J022181n983170L538777
41251B16070621Q745504l208988j1329772k96376J1172966P076349K781825Q660714
41243B39672843L246526k1876255k8407208J0886911N2384784L6274994j9058460
41236B73124135l9905763p869058J7856461j824793k9519236j9841365Q899333
41229B00919714J2486993o231424q770926J3512684L0059003K2999640J0545892
41222B75521576J2235342J9362423J2819574p181732k3186778k4309908j6719386
$$ y = [64317359, 69838530, 79922498, 91913200, 92285220, 80264560, 69401386, 62687927, 51275876, 41659568, 54865660, 89691987, 116727319, 122686747, 131193136, 161196484, 193579271, 203333338, 199649867, 205422446, 217492833, 218515014, 212531844, 216070621, 224816125, 221607137, 210277365, 209980989, 221153955, 228230304, 231012129, 239672843, 242919369, 221043114, 192635906, 203522817, 255907601, 292182595, 273124135, 233218372, 225349314, 243205775, 241380982, 211861746, 192020381, 200919714, 213406707, 207175283, 198404357, 211917041, 241976044, 264975684, 275521576, 287756918, 307119341, 319938915, 312757183, 289570405, 265260497, 248541111]
41215B48541111j1832376j1629419r023815k00404R161982J2612464J2284831
41208B49914374J3064546J2262892N197436j972413J796242J3376350J6728790
41201C10368217O396084m848017p141643o785934r588044o579949R554591K5355068
41193C16730373K0700469l173751k3882441k3748164n449482J4591030K0050558
41186C15818592P108538r350699r307628N406239R907160o949326k1033521q111734
41178B83487621J4581949J1597134j3357943j9026149J0310447L8917619L1803341
41171C58314019K480151j3661233r857454m798063n522466l392919R81648k156940
41163C22386743q294036j885926J4491426J9300606O803416j415602Q630868J8935947
$$ y = [248541111, 236708735, 225079316, 216055501, 215855097, 225017079, 237629543, 249914374, 262978920, 275241812, 280439248, 278466835, 280263077, 293639427, 310368217, 316764301, 311916284, 304774641, 297988707, 288400663, 281820714, 291375305, 316730373, 337430842, 334257091, 310374650, 286626486, 281177004, 295768034, 315818592, 322927130, 313576431, 304268803, 309675042, 319582202, 312632876, 291599355, 283487621, 298069570, 309666704, 296308761, 277282612, 287593059, 326510678, 358314019, 360794170, 347132937, 337275483, 332477420, 326954954, 323562035, 324543683, 322386743, 314092707, 312206781, 326698207, 345998813, 352802229, 351386627, 360017495, 378953442]
41155C78953442Q332671j1073738j0637864R148926J6021918p442375l7090271
41148C46212709l9431761j5850798K322932k833052j5021970j0176860Q984951
41141B74206151J5702568n836930l7259500m3559908j3430954K3819392K8606601
41134B42247420k796664l3728727l4329065j9142825k0648070l5703858k8167472
41127F7730739J1016611L9725272K1709640j8860798l2157825j4654444n860726
41120F8648469j8890427k0913499N916150K8303517J3323596j8280796k5930135
41113C2176875j2334868j1171521k4480106j8704984J3953406L4133653J3160727
41106B6733182k1322079k4234076L640314K1180602O766009j6533011j8237658
$$ y = [378953442, 387286113, 376212375, 365574511, 374723437, 390745355, 383302980, 346212709, 306780948, 290930150, 293253082, 290420030, 275398060, 265221200, 274206151, 289908719, 284071789, 246812289, 203252381, 189821427, 213640819, 242247420, 239450756, 205722029, 171392964, 152250139, 131602069, 95898211, 67730739, 78747350, 118472622, 140182262, 121321464, 89163639, 74509195, 68648469, 49758042, 28844543, 34760693, 63064210, 76387806, 58107010, 32176875, 19842007, 8670486, -15809620, -34514604, -20561198, 13572455, 26733182, 5411103, -18822973, -15182659, 5997943, 12763952, -3769059, -22006717]
41099b2006717O75307J7372414K0172800J5816787R913371j965174j9410981k7784597
41091g216790j5721757N089075J1788623L74002j0134575n040697Q667995J6431984
41083D237860J3342593J105759j6973608k8764536j7122000J4892821L6208605
41076F927494K2534000j0665934k7115918j3740156J0936199K4633564K0090324
41069C3599573K667494j3693615j4229824j700318L050322o596854p809747J3005071
41061H292102K8753806J2375009j2223030n606878J6058579K494767m2010448
41054H133907n6370812k0048877J4332358J0408425L073419K4309001L7862664
41047B1700085N155424l5820492k6537924J4356362K3375778k359396r736764
$$ y = [-22006717, -21331410, -3958996, 16213804, 32030591, 41943962, 39978788, 20567807, -7216790, -22938547, -17849472, -6060849, -5686847, -15821422, -20862119, -12194124, 4237860, 17580453, 18686212, 1712604, -27051932, -44173932, -29281111, 6927494, 29461494, 18795560, -8320358, -22060514, -11124315, 13509249, 33599573, 36267067, 22573452, 8343628, 6643310, 9693632, 3096778, -4712969, 8292102, 37045908, 49420917, 37197887, 31591009, 47649588, 50144355, 8133907, -48236905, -68285782, -53953424, -43544999, -40471580, -16162579, 21700085, 26855509, -8964983, -35502907, -21146545, 2229233, -130163, -9866927]
41040i866927J1912076J6937577q651025k2454850n394671N213523j1169250j7615869
41032d1089416J1121920L6125559J6831542j9124690j8979584J4208167L3196576
41025C2290074J8038320r242144k7111955l1126383j8439683P290122K2727243
41018e574406R589790j3848665j6170967M46822R103573O314324J3886682L2396216
41010C6143369L1174659l388760l9854592m0065679o990384K1967540J9162550
41003A8148703p720943k9243590k6141544p804303K060415k820575m947850O712500
40995e1757187J7448697J2122228K460367O496800J4768124O012267j2078220
40988d526924j1649459O936839J1581034q857571k2966809m773254K5240366K9653421
$$ y = [-9866927, 2045149, 18982726, 10331701, -12123149, -17517820, -12304297, -23473547, -41089416, -29967496, 6158063, 22989605, 3864915, -15114669, -906502, 32290074, 50328394, 41086250, 13974295, -17152088, -35591771, -28301649, -5574406, 4015384, -9833281, -26004248, -25557426, -16453853, -10139529, 3747153, 36143369, 67318028, 63929268, 24074676, -15991003, -22981387, -1013847, 18148703, 10427760, -18815830, -44957374, -52761677, -50701262, -53521837, -58469687, -51757187, -34308490, -22186262, -19725895, -13229095, 1539029, 7551296, -4526924, -16176383, -9239544, 2341490, -6516081, -29482890, -34256144, -9015778, 20637643]
40980B0637643M367918k3749287l4878987k8985324j0871852J3400172K8263648
40973c1816069J8509897q546797k5135367j3102139J5747237L3452377K5910258
40966A5019397N991286l026592M576407J1083810K212298q372972L125493L0360604
40958F0969731L6190956J687016m3151194n4655567k8842566N56419J0091202
40951a7154003R196385J3366688J7674211R537197o055004j0922230R5442J1600618
40943B7339304R136880k806858j1205901j4375620j9408081k3330504j3039719
40936d7690499J1187325K7418835J8960841j469099r021838l41127O882595L325359
40928I252392j690316O09743O156073P585730K254979r882443k2766421k1606895
$$ y = [20637643, 25005561, 1256274, -33622713, -62608037, -73479889, -60079717, -31816069, -13306172, -21852969, -46988336, -60090475, -44343238, -10890861, 15019397, 21010683, 17984091, 22560498, 33644308, 35856606, 27483634, 30609127, 60969731, 97160687, 98847703, 55696509, 1040942, -27801624, -27245205, -17154003, -7957618, 5409070, 23083281, 32620478, 26565474, 15643244, 15738686, 27339304, 36476184, 33669326, 22463425, 8087805, -11320276, -34650780, -47690499, -36503174, -9084339, 9876502, 8407403, -614435, -955562, 5927033, 9252392, 7562076, 8171819, 14327892, 21913622, 24168601, 14286158, -8480263, -30087158]
40920c0087158j835014J3290632j359414l0390060l2227374n38848K4038227J6124020
40912d2984989J288475O857189J5416361K494371j2297758K225881K8003350K2045610
40904B3048490r455066j7057347J0505750K6558862K886278k5083234j6487154
40897e083421J2622942J9984733J813247j0382753k278584P819491J610986j5857789
40889A0248852k5907511j5678235R147092K4005080P866164k7106809m3498762
40882f0924129k5489193J000707P855285K502691O372252J6987705J8895111J6290096
40874a6509475K2834698K8432663J0384483k3941915l8674992j9075905R197815
40867b7352628J9386129J6149389J5697071J5889336N054680j2736846k0286819
$$ y = [-30087158, -31922172, -18631540, -19990954, -50381014, -82608388, -83147236, -59109009, -42984989, -41696514, -34839325, -19422964, -16928593, -29226351, -27000470, 1002880, 23048490, 13593424, -3463923, 7041827, 33600689, 36486967, 11403733, -5083421, 7539521, 27524254, 29337501, 18954748, 16676164, 24495655, 26106641, 10248852, -15658659, -31336894, -22189802, 1815278, 9681442, -17425367, -60924129, -86413322, -85412615, -77557330, -75054639, -68682387, -51694682, -32799571, -16509475, 6325223, 34757886, 45142369, 21200454, -17474538, -36550443, -27352628, -7966499, 8182890, 23879961, 39769297, 44823977, 32087131, 11800312]
40860A1800312j1039433L168293Q132169K930703k567753k276640j389520n890982
40852B867149r052709l69519J1668939M544073k1443290l2696321p891519K5181974
40844b7191223K5860961p37483j5056113m645134M514679k099962p471539j093749
40836b7919563L072067J305462J3115473L7962037L7893426n323776m8929944
40829A1175182m3720236n150921J2423435m386578j9345916j0346161M171283
40822e5179912O210887M616417Q954738J0590648M973141N889706K0633756L1613606
40814C8302987J9783412p739148k7517691k7046177j2252352K845187O359452
40807g264330l183991j3699950j2234382j555160N874950P911159J1262324J2063653
$$ y = [11800312, 760879, 3929172, 12061341, 14992044, 12424291, 10147651, 8758131, 2867149, -6185560, -6555079, 5113860, 9657933, -11785357, -44481678, -52373197, -27191223, -1330262, -2067745, -17123858, -21768992, -17254313, -19354275, -26825814, -27919563, -24847496, -23542034, -10426561, 27535476, 65428902, 60105126, 11175182, -32545054, -37695975, -25272540, -29659118, -49005034, -59351195, -55179912, -48969025, -44352608, -35397870, -24807222, -19834081, -13944375, 6689381, 38302987, 58086399, 50347251, 22829560, -4216617, -16468969, -13623782, -7264330, -10448321, -24148271, -36382653, -37937813, -32062863, -24151704, -12889380, -825727]
40799h25727q06238j9799121j9334844P989964L6158282L9014574K1151136K618509
40791F6166535r606125j8340503j9252042p233478Q207946J1626253K069170p954922
40783B5682834j0107592o716720m156038p596910j6449886j9447040m067793K2598828
40775b0260317L5109594K0859917l482158j6926122j9410031j8469069r167315
40768c1745501J1699581K6545323J7663687k897747j0059626m545980o824232
40761a64495j7178791j3866051O611653J8981450P996212r660255j4183081q867509
40753c0330867l617056M791325J8257192K2416282O642378j4783052k1483706
40746a8107504j6325966j5978395k0398085j3908041N063809J6187891M892793
$$ y = [-825727, -1631965, -21431086, -40765930, -32775966, 3382316, 42396890, 63548026, 66166535, 56560410, 38219907, 18967865, 11734387, 19942333, 31568586, 33637756, 25682834, 15575242, 8858522, 4702484, -2894426, -19344312, -38791352, -42859145, -20260317, 14849277, 35709194, 32227036, 15300914, -4109117, -22578186, -31745501, -20045920, 6499403, 24163090, 21265343, 11205717, 6659737, -164495, -17343286, -31209337, -24597684, -5616234, 2379978, -7280277, -21463358, -30330867, -33947923, -29156598, -10899406, 11516876, 18159254, 3376202, -18107504, -34433470, -50411865, -70809950, -84717991, -79654182, -63466291, -58573498]
40739e8573498j5841495j9685000K261944L0388682L6527961J4525805j1512723
40732b1908324j3947529O049744K1985185J6748169L76143r414654q538702j348842
40724i998810R507751J6973567R075659j0882458j8428967m46789J9713373J2184740
40716B7698066j4381184k4410050p716358Q675360M174173p626167n500411P333931
40708a1752640J2548497L601844j0227460j7289724j1342810N872022K2686837
40701e903434K6086860J6895815P699787L902154o43194p431121r369573p346410
40693B3890884j1805544k0532941j5841861M655596J6414006L687098j3865165
40686a3397927j1436330K705097M718426m305819m508663N977161J0389149M099798
$$ y = [-58573498, -74414993, -94099993, -91838049, -61449367, -24921406, -10395601, -21908324, -35855853, -29806109, -7820924, 8927245, 9303388, -111266, -8649968, -9998810, -491059, 16482508, 25558167, 14675709, -3753258, -4200047, 15513326, 27698066, 13316882, -11093168, -18809526, -10134166, -5959993, -13586160, -19086571, -11752640, 795857, 4397701, -5829759, -23119483, -34462293, -28590271, -5903434, 20183426, 37079241, 44779028, 48681182, 48037988, 40606867, 31237294, 23890884, 12085340, -8447601, -24289462, -19633866, -3219860, 467238, -13397927, -24834257, -22129160, -17410734, -21716553, -26225216, -20248055, -9858906, -5759108]
40678e759108k294893o185087j0749938m883103K1607178M5300816K9710867j7290075
40670D9456657m5649506l2420512r291825o445115j0965470m474491p93336j2481684
40662g3065282j5707820J0157988L6213664K3696559j0138738j5349866J2839200
40655c1354295K9912191J3059340j2436292k2012018k1031722j5867622N71784
40648e9158634K0192902J7251880p367859j7024902M731272K5167198J4119525
40641b088618r460285j2809453r50697J892251k265407L112544R963387r24954
40633a3531232j7577948q844742K3254680M0835018K3980476n282278j9656174
40626B3177800j7806626r608783K508559J3705490J0740654p436200j9316456
$$ y = [-5759108, -8054001, -14239088, -24989026, -29872129, -8264951, 37035865, 66746732, 49456657, 3807151, -28613361, -37905186, -44350301, -55315771, -59790262, -60583598, -73065282, -88773102, -78615114, -42401450, -18704891, -28843629, -44193495, -31354295, -1442104, 11617236, -819056, -22831074, -43862796, -59730418, -59158634, -38965732, -21713852, -29081711, -46106613, -41375341, -16208143, -2088618, -11548903, -24358356, -25309053, -23416802, -25682209, -22569665, -12606278, -13531232, -31109180, -39953922, -16699242, 24135776, 48116252, 42833974, 23177800, 5371174, -4237609, -1729050, 11976440, 22717094, 15280894, -4035562]
40619d035562p862265J3173981J6048650m207824k4493229k3421614m360699J3711094
40611b5447468J9621518J7456594J3565805N954992p347549j6668758j0426161
40604c291027M772965Q930358l114424j4029339j0806284k125763Q04196K742066
40596a6117252R955305J4735360J1016683Q299133J1306979M849156j7657169
40589B6388195l1055007j4607767P604190J027405j9588657j1873688J9735087
40582b2370242K5694595o623207k8807656r089982J8184951J2441469q469884
40575a9039956m411095J9840118K8720745J5366442K755506j553201j0384097
40568C1294462k2900910k2755113q657698M328934J1820875J9448474J9189303
$$ y = [-4035562, -11897827, 1276154, 17324804, 13116980, -11376249, -34797863, -39158562, -25447468, -5825950, 11630644, 25196449, 31151441, 23803892, 7135134, -3291027, 1481938, 10412296, 7297872, -6731467, -17537751, -19663514, -18859318, -16117252, -6161947, 8573413, 19590096, 27889229, 39196208, 44045364, 26388195, -4666812, -19274579, -11670389, -10642984, -30231641, -42105329, -22370242, 3324353, -3298854, -32106510, -41196492, -23011541, -10570072, -19039956, -23451051, -3610933, 25109812, 40476254, 43231760, 41678559, 31294462, 8393552, -14361561, -23019259, -18690325, -6869450, 12579024, 31768327]
40561C1768327j513306k7289621k4888413Q041188L3686074K3318875q745315
40554C4377809l0480107k9701979j5372821M17158J0453964J4658785K0126013
40547D478822K8117916K3592542l752856l1529345k5257825J0127761L0425361
40540C6202376J3711005j0608798j1670146l552988j3724183l1517972k5108368
40533d6269074M309250K3085083J5780777J335942k516633K54346M027663J2579428
40525A2586782K1013133J3830316o542876j4647408j018654Q165139q730442l1232854
40517f576864k6861693k187270Q766857j887361r519456l531550l096456j6591065
40509f1484858k0075678L695661L1969175L3027072J1677209k297202K246889
$$ y = [31768327, 30255021, 2965400, -21923013, -13881825, 19804249, 43123124, 34377809, 3897702, -25804277, -41177098, -40759940, -30305976, -15647191, 4478822, 32596738, 56189280, 52436424, 20907079, -4350746, 5777015, 36202376, 49913381, 39304583, 27634437, 24081449, 10357266, -21160706, -46269074, -41959824, -18874741, -3093964, -1758022, -4274655, -4020309, 7354, 12586782, 33599915, 47430231, 40887355, 26239947, 25221293, 33386432, 24655990, -6576864, -33438557, -35625827, -26858970, -28746331, -38265787, -41797337, -44893793, -61484858, -81560536, -77864875, -45895700, -12868628, -1191419, -3488621, -1241732]
40502a241732J1657131J5215860J2939822K283415j6630400k6504787j0605309
40495a2886000J6010008K0145391l040560k4229484k3769985j2798648m741864
40488d5311142L786881J2995294J1216740R70055L951256K1875889K3110708p283670
40480B5312011l4069753k0626556J3631312K2897887M183041n738873O205104
40473A1794173J3275755j134573j7194417j3522549K223099J1096335Q706223
40466A5244046J741950m177486m920284K64753L828238o42715o557189o751722
40458a970409r947384k3524858k9604932p891502K4303560L0432480J0847984
40451g355061L34918P087279O78366k6958043l7956268j0495574K1196878K2091829
$$ y = [-1241732, 10415399, 25631259, 38571081, 40854496, 24224096, -2280691, -12886000, 3124008, 23269399, 20228839, -4000645, -27770630, -40569278, -45311142, -41524261, -28528967, -17312227, -16342172, -12390916, 9484973, 32595681, 25312011, -8757742, -29384298, -15752986, 7144901, 11327942, 5589069, 11794173, 25069928, 23935355, 6740938, -6781611, -4558512, 6537823, 15244046, 16985996, 12808510, 7888226, 8152979, 11981217, 11338502, 4781313, -1970409, -11917793, -35442651, -65047583, -72939085, -48635525, -18203045, -7355061, -7020143, 67136, 745502, -26212541, -64168809, -74664383, -53467505, -31375676]
40443c1375676J0707909J7598522K6002280M348681k8547718k7556742L192631
40436b5630113J6107055j441838j1054468O313389J7786781l043234l0021814
40429c0984242k5675606L443034K2257206J5810846m171685k4203392l5469232
40422g8993071k7943929j615333K3720955K8682827J8252897J0428946Q938260
40415a8528448L695253p618942j5116048j1593899O41422J4973504K2521110J4714082
40407C688034m958721j8095847j2541812L35649L027075j508291J856841J2410143
40399a5786929J6072673J2769923J5324273J8550074q08846m0880920o0140470
40392e4900222k9853343J9364555L3065888M043750k3495466j7784927M885122
$$ y = [-31375676, -20667767, -3069245, 22933035, 27281716, -1266002, -28822744, -25630113, -9523058, -10964896, -22019364, -15705975, 2080806, -962428, -30984242, -56659848, -53216814, -30959608, -15148762, -19320447, -43523839, -78993071, -106937000, -108552333, -84831378, -56148551, -37895654, -27466708, -18528448, -14833195, -22452137, -37568185, -49162084, -48520662, -33547158, -11026048, 3688034, -1270687, -19366534, -31908346, -31572697, -28545622, -30053913, -28197072, -15786929, 285744, 13055667, 28379940, 46930014, 46121168, 5240248, -54900222, -84753565, -65389010, -32323122, -28279372, -51774838, -69559765, -64674643]
40385f4674643J4651525P996022j832256r904093j4498263m808356K2068549M2744445
40377h257070L1694515l23496j6984493o646888L237216r968018k9356671k4914929
40369f1519834J314193J9141166J3656103J870076K114500P137007J082941j0163820
40361b5367668o190417J3051633K1955611P099206r711010l703781J3387741J2502178
40353B3023493k796939k78361K3621369K9085145n743494m3692258m0195691r117219
40345b6093955K882942j0212760j2975821N068563J3288716j301601p655288J5206202
40337b1793002L8146653K6146036p644029k5146603j8605710q690562l347437
40330b0934654N808056J4025570N409551j4957100k0800253k360520J9306197
$$ y = [-64674643, -50023118, -42027096, -43859352, -53763445, -68261708, -73070064, -51001515, -8257070, 23437445, 23113949, 6129456, -517432, 2719784, -7248234, -36604905, -61519834, -60205641, -41064475, -27408372, -25538296, -23423796, -16286789, -15203848, -25367668, -31558085, -18506452, 3449159, 10548365, 837355, -2866426, 10521315, 23023493, 20226554, 19948193, 43569562, 72654707, 66911213, 23218955, -16976736, -26093955, -23211013, -33423773, -46399594, -41331031, -28042315, -29343916, -36999204, -21793002, 16353651, 42499687, 34855658, 9709055, -8896655, -17587217, -20934654, -15126598, -1101028, 4308523, -10648577, -31448830, -33809350, -14503153]
40323a4503153K2718062J1058534p98219p291200j0162435p883917J446469J1956746
40315F540887J2947160k58847k0203481l1724895k4850226n191339J2231742K0635846
40307b9873153K5418136K8420600K1053999J455043j4071303j0163335N884859
40300B8124846J5364604J3334038P757960J006715r833155j8277160j3134286
40293B4343562J707350Q930444J606579q895206j1272370p019014j302846O080485
40285A4178984J4583108J7046982P115249j0981672k3477150j7566258O542144
40278G441387L1599027L6005476J4716802j6451695l8420205m2627131k7877619
40271c5613958J44670K1560613J5372032q587673j2621845J6738469M2247663
$$ y = [-14503153, 8214909, 19273443, 18475224, 11184024, 1021589, -6862328, -5415859, 6540887, 19488047, 19229200, -974281, -32699176, -57549402, -62740741, -50508999, -29873153, -4455017, 23965583, 45019582, 46474625, 32403322, 22239987, 28124846, 43489450, 56823488, 64581448, 65588163, 55755008, 37477848, 24343562, 26050912, 34981356, 36587935, 27692729, 16420359, 9401345, 8098499, 14178984, 28762092, 45809074, 52924323, 41942651, 18465501, 899243, 7441387, 39040414, 75045890, 89762692, 73310997, 34890792, -7736339, -35613958, -35469288, -13908675, 1463357, -7124316, -19746161, -3007692, 39239971]
40264C9239971K5646712j7142676m0878795l3116035j5781687M77445K0672760
40257b0882305L1705606J1746963k3563218k9965127P45082K7501324K3388700
40250B0677025Q553198L320551n215194k3940817k5480721N109137L2502850K0677715
40242C6203744r925537j7923318p308443j0093893k3225591j7165054K879060
40235d6559032J499765j9948487j7894138J8431296L9801534J1103594l1388277
40228d4953745l2182714N483250L2633019K5769438O232672k905289l386005m187772
40220a7497146o239639j0575623k0277589k8242744k0583077K170815K2675759
40213g8569244L0011723K9445618K4858750J0901953q434804j3755395K381720
$$ y = [39239971, 64886683, 47744007, 6865212, -26250823, -42032510, -41555065, -20882305, 10823301, 22570264, -992954, -30958081, -30212999, -2711675, 20677025, 29230223, 32550774, 27335580, 3394763, -22085958, -16976821, 15526029, 36203744, 26278207, 8354889, 1046446, -9047447, -32273038, -49438092, -46559032, -45059267, -65007754, -82901892, -64470596, -24669062, -13565468, -44953745, -77136459, -71653209, -39020190, -13250752, -7018080, -9923369, -13309374, -17497146, -23736785, -34312408, -54589997, -82832741, -103415818, -101245003, -78569244, -48557521, -19111903, 5746847, 16648800, 8213996, -5541399, -3159679]
40206c159679J9978146K1503444J9127789K7966460L0044758K19768m1759808
40199G3920878m8116464j4139863J2499854N718599k584655J5276376L0400023
40192G2974748P640854k8339870k8426367L020071J9703534R260361J682497O777360
40184F4293188P25148j9557078k4280756o665883J006931j3786437j8811941M155409
40176a2921419K2819211Q277761j6400895j7120465j681470N493919P764375J5272250
40168A1503267J0846521j8292860m0995515k2555354J5404001K4701787M951349
40161a4436804k880433J2712527K2406273J3134064M516549L774786o273877k4292657
40153H660428k2512602K813954J6244926j470040k1701932j5601946J337310J400607
$$ y = [-3159679, 16818467, 38321911, 57449700, 85416160, 115460918, 115680686, 73920878, 25804414, 11664551, 24164405, 29883004, 27298349, 42574725, 72974748, 80615602, 52275732, 23849365, 26869436, 46572970, 55833331, 57515828, 64293188, 65018336, 45461258, 21180502, 14514619, 15521550, 1735113, -17076828, -12921419, 9897792, 18175553, 1774658, -15345807, -17027277, -11533358, -3768983, 11503267, 22349788, 4056928, -36938587, -59493941, -44089940, -19388153, -14436804, -17317237, -4604710, 17801563, 30935627, 35452176, 39226962, 32953085, 8660428, -13852174, -11038220, 5206706, 3736666, -17965266, -33567212, -32229902, -30829295]
40145c0829295p000270K948983K7690598L5981966J5020530j2909067k1808928
40138I094517j2257377n554321j6002732l2864464l0615285j02186L4329041L8965944
40130a5006863J0933280j8130206j9888252J727519K1805549K2276387M516934
40123H234348j5321727j9575291n130191J2780089J8716830J4296683Q493037
40116B2493778j60269j5412319k4806362j1592746J5611375K6843788Q790090
40109B1767335j8642081k8483178j5369949N385833J5610736R178824k803162
40102a3355642m746900n4719q787097l1538862l7361331r482450K0342647J6230379
40094f8753975l721818L481381L3623031M3374992K3814120R301069J0378348
$$ y = [-30829295, -37829565, -34880582, -7189984, 28791982, 43812512, 30903445, 9094517, -3162860, -8717181, -24719913, -57584377, -88199662, -88301848, -53972807, -15006863, -4073583, -22203789, -42092041, -40364522, -18558973, 3717414, 8234348, -7087379, -26662670, -31792861, -19012772, -295942, 14000741, 22493778, 22333509, 6921190, -17885172, -29477918, -13866543, 12977245, 21767335, 3125254, -25357924, -40727873, -35342040, -19731304, -10552480, -13355642, -18102542, -18157261, -26944358, -58483220, -95844551, -105327001, -84984354, -68753975, -72475793, -68994412, -35371381, 8003611, 31817731, 41118800, 51497148]
40087E1497148j862358l0895353l5375540k41523K9140123J7498608o770520p226130
40079A5764455q5472j2718423k4639971n218334K2404228J4196929j9596512l0593939
40071d0487039j0325536M874259R84731K201121J6714004J8910466j728763j7387665
40063b6244422n358291J7703820K2565114N523422j4087246j8411731m848050
40056b3157384J3147576J7744783Q501853M763592J4561657J7281695k464970
40049E0378802k2461316j3695990J2128376K0471709P498300j890003r68990n537673
40041D5923215j5436698j3381386k461922m198824j7332828j9125468r524079
40034c5537990j0308912j6869717J54951L5909016M6085412J7505575q112455
$$ y = [51497148, 49634790, 18739437, -16636103, -16877626, 12262497, 29761105, 22990585, 15764455, 15678983, 2960560, -21679411, -26897745, -4493517, 9703412, -9893100, -40487039, -50812575, -45938316, -44953585, -42752464, -26038460, -7127994, -8856757, -26244422, -31602713, -13898893, 8666221, 14189643, 102397, -18309334, -23157384, -10009808, 7734975, 16236828, 21000420, 35562077, 52843772, 50378802, 27917486, 14221496, 26349872, 46821581, 54319881, 52429878, 51460888, 45923215, 30486517, 17105131, 14643209, 10444385, -6888443, -26013911, -35537990, -45846902, -62716619, -62561668, -26652652, 19432760, 36938335, 28825880]
40027B8825880m054467N85370j8495920l1765063j0531386J5073964M837558k0811367
40019c6335431j5616870J3567471K2425303O586411K053184J5537831J5421658
40012B3639557n055190j4109997k081082k96639j9785113k3347170J0997359M3220625
40004A3182350K7421423j7437013l6106153j5986898O410975Q192918N194908
39997i127490J1103084J0988729p924972k6695760j8598936J0922141K9067417
39990b65787J6683286j1071853k6019918j7856501K7577Q834384L336233n409473
39982c1742052l132455J1851319K5412073K1455645m12104k2939076k8369585
39975b7876235j5854305L39766Q287002R864568J3617562K0259922K0663401R353158
$$ y = [28825880, 24771413, 25356783, 6860863, -24904200, -35435586, -20361622, -15524064, -36335431, -51952301, -38384830, -15959527, -9373116, -7319932, 8217899, 23639557, 18584367, 4474370, 2393288, 2096649, -17688464, -41035634, -30038275, 13182350, 40603773, 23166760, -12939393, -28926291, -22515316, -14322398, -9127490, 1975594, 12964323, 5039351, -21656409, -40255345, -29333204, -265787, 16417499, 5345646, -20674272, -38530773, -38503196, -29668812, -26332579, -31742052, -34874507, -23023188, 2388885, 23844530, 23432426, 493350, -27876235, -43730540, -43390774, -35103772, -25239204, -11621642, 8638280, 29301681, 38654839]
39967C8654839m950714q409451j007604K028369p422209j5167989l461742J9616445
39959A9879944K6281127P138640j4534647j5709369l987673K92194k074148M406103
39951B1692171J7288076J6216818l112938j9636072j8955559j2910455j5323855
39944a4741814j7216496l168734K0333676L1405345K1781947M112059o583489
39937C5922494o390490k01598L143243l716040j5859518j4785296R691009L9142581
39929D6946385M2910506J5377899j8143451l5878002m2777253m9744815m6698886
39922h8007617j7037991K7209145M8626386K9439060m716367j8004725p320859
39915b9812968M561627P700896J2294146J8998899J0701587j4366902k6179786
$$ y = [38654839, 33704125, 25294674, 24287070, 26315439, 18893230, 3725241, 263499, 19879944, 46161071, 53299711, 38765064, 23055695, 19068022, 19360216, 17286068, 21692171, 38980247, 55197065, 52084127, 32448055, 13492496, 582041, -14741814, -31958310, -35127044, -14793368, 16611977, 38393924, 42505983, 35922494, 29532004, 29330406, 32473649, 28757609, 12898091, -1887205, 7803804, 46946385, 89856891, 105234790, 87091339, 51213337, 8436084, -41308731, -88007617, -105045608, -77836463, -29210077, 228983, -4487384, -22492109, -29812968, -25251341, -17550445, -5256299, 13742600, 24444187, 10077285, -16102501]
39908a6102501j954404L3954549L6119257j896340l9857980m3881963k2141713
39901e5761095j680669O520798O486021M51379q855593j0201263M010552K1979341
39893c7050529K3524998O105782j1086159r859481P560960K2633696J9245377
39886B1074644j443912k1545236k2820705m770912J5449137K2134004J6023350
39879B4100370Q482286O191539O048407J958290p610522j7431195j8932051q390799
39871e583675O434032J1084906r50719j9466639k5757855j0672025J4911767K8841361
39863a158847K0221294K226541l995872K284541J032334j6138942k8845133j6296575
39855d0670659J0207546K1937555J1612280l417411j1595541j6553895j6617937
$$ y = [-16102501, -18056905, 15897644, 52016901, 50120561, 10262581, -33619382, -55761095, -57441764, -50920966, -44434945, -43983566, -52839159, -63040422, -59029870, -37050529, -13525531, -7419749, -18505908, -28365389, -20804429, 1829267, 21074644, 19630732, -1914504, -24735209, -29506121, -14056984, 8077020, 24100370, 32582656, 38774195, 44822602, 46780892, 39170370, 21739175, 2807124, -5583675, 850357, 11935263, 10984544, -8482095, -34239950, -44911975, -30000208, -1158847, 19062447, 21288988, 17293116, 19577657, 20609991, 4471049, -24374084, -40670659, -30463113, -8525558, 3086722, -330689, -11926230, -28480125, -45098062]
39848d5098062j673088K2153289K8845863O950112k0233234k3331415k719452
39841c5105987J7480597K0549438R637281l203255r144774p776870o530942j0965362
39833b5059874j4659067p215268P860054J5892992J2899690R880730J2327318
39826A1926575J1662647K275728q790611j4935766j7096521j2886602L339333
39819b4505217K3331833K7403366J2380877k452274n857105q818478j6921025
39812D561977j3473419J1299258L5439527L2196010P262481j1651832j1502866
39805E4131136k405476J190576o482979j9598662k2263692n639227J2290661N132138
39797A6354475j8755756k1343407O255896K6499598J6201610M341454J8543606
$$ y = [-45098062, -46771150, -24617861, 4228002, 11178114, -9055120, -32386535, -35105987, -17625390, 2924048, 12561329, 9358074, 213300, -7563570, -14094512, -25059874, -39718941, -46934209, -39074155, -23181163, -10281473, -400743, 11926575, 23589222, 25864950, 17074339, 2138573, -14957948, -27844550, -24505217, -1173384, 26229982, 38610859, 36158585, 30301480, 21483002, 4561977, -8911442, 2387816, 37827343, 70023353, 77285834, 65634002, 54131136, 51725660, 52916236, 46433257, 26834595, 4570903, -1068324, 11222337, 16354475, -2401281, -23744688, -17488792, 9010806, 25212416, 29553870, 48097476]
39790D8097476L3338118J4440697j8344674k3197889o863387q368659k8624638
39783A0477044l3626036j9357292j4852992k1230176o769437K8976529M3198827
39776a3183533J9016521m783502L549485K1257521J4180808r899222k1338462
39769H799616j3941201j855035P615096J3734059J1649209J762134m009922O83601
39761B4437557P069365P506369M971282P56407p619469j2274036k160596J1883474
39753C4570353O612749j4012391j9505429j142906J3581447O636350m384188j723943
39745B0632042M011539J34313m297464j924765m880972j6918677j6622049O586460
39737a3279573K6050398J4470690j4917444k9251171j9390333l78018J2878424
$$ y = [48097476, 81435594, 95876291, 77531617, 54333728, 47470341, 39101682, 10477044, -23148992, -42506284, -57359276, -78589452, -85358889, -56382360, -13183533, 5832988, 1049486, 4598971, 25856492, 40037300, 30138078, 8799616, -5141585, -6996620, 618476, 14352535, 26001744, 27763878, 23753956, 24437557, 31506922, 39013291, 43984573, 44740980, 37121511, 24847475, 22686879, 34570353, 41183102, 27170711, 7665282, 6522376, 20103823, 26740173, 22355985, 20632042, 24643581, 24777894, 20480430, 18555665, 13674693, -3243984, -19866033, -13279573, 12770825, 27241515, 12324071, -16927100, -36317433, -36695451, -23817027]
39730b3817027J1531649n476340j9584669o443166K3849140L0594854L705097
39723A4359538j5304661K638103K8171778K3511083N75409r437772r323244j4744579
39715B0445655j2318375J1157578K5015819m369865m8300432m8012794q98387
39708e7280801L9040382L9088381J5246757j0688214k9447617k5071830R494784
39701a9618158L9924389K6300877j0730454j5243937J3645696J9792704j4589259
39694C9481858l9069989k0500732O274197L845321r707872o136176L67448j0563983
39686c6009928j8703802N70556K6149598K3753124L305216j036013J1681980J5406774
39678B5117505O247851L306588Q953374O772473n324834j3804039j7505074k4941811
$$ y = [-23817027, -12285378, -17761718, -37346387, -43789553, -19940413, 10654441, 14359538, -945123, 1692980, 29864758, 53375841, 53951250, 44513478, 35190234, 20445655, 8127280, 19284858, 44300677, 39930812, -8369620, -56382414, -57280801, -18240419, 20847962, 36094719, 25406505, -4041112, -29112942, -19618158, 20306231, 46607108, 35876654, 20632717, 34278413, 54071117, 39481858, 411869, -20088863, -13814666, -9969345, -19677217, -25813393, -25445945, -36009928, -54713730, -54143174, -27993576, -4240452, -935236, -1971249, 9710731, 25117505, 31365356, 34671944, 43625318, 50397791, 45072957, 31268918, 13763844, -11177967]
39670a1177967k6884226n070874K9875698M1519759J6974981j3643129j8960480
39663A2633762n834912k006340j4661178k4657674j7007908p14835O560626L933100
39655d1755359O284100J8632603K5159986J2754077n846047q451562L761017R450451
39647A9989266M63097r790421j2224740j3157861j5173158j0621835j256454j74563
39639d1946669n189009L590415K6692631L3455752O766357k5309022k7162405
39632b9101950n001515P947023K48569j1016665j1880183l966879Q004831J8720854
39624b6045915J8015334L814151p464510j983596Q776607N931120o197971r916181
39616a5070961n580778p736726j5614189j3979626j384000P900908J0065502J4939485
$$ y = [-11177967, -38062193, -43133067, -13257369, 28262390, 45237371, 31594242, 12633762, 6798850, 4792510, -9868668, -34526342, -51534250, -52249085, -45688459, -41755359, -35471259, -16838656, 8321330, 21075407, 15229360, 6777798, 10538815, 19989266, 20452363, 10661942, -1562798, -14720659, -29893817, -40515652, -41772106, -41946669, -47135678, -43545263, -16852632, 16603120, 23369477, -1939545, -29101950, -34103465, -26156442, -25907873, -36924538, -48804721, -52771600, -44766769, -26045915, -8030581, -4216430, -11680940, -13664536, -4887929, 1043191, -5154780, -15070961, -20651739, -28388465, -44002654, -57982280, -59366280, -51465372, -41399870, -26460385]
39608b6460385K1474944J5614261k081574j0866826q03183J1389081P843850o792291
39600I317877j7992827k1662728j9731759r506824P917540J8317342R236420r651801
39592c3756760j5160817j54729J7228137J8345065Q361180N675670J1945380R098958
39584B1582084q474665j7195312K010520K6554429J7721292j9400636l5968591
39577a3170879q806470K4963750K3572036n27176q633536J827723K596040j0932285
39569A0889203j3369569K912501J3125163K399281r650794j793911J5115521J4644085
39561C4271480q458749l1610958k9144261P28354K9754312K5457518q403447k8407909
39553a5813660m849736L4781547M1497044J3443663n936217M030173J5205396
$$ y = [-26460385, -4985441, 10628820, 8547246, -2319580, -3122763, 8266318, 16110168, 9317877, -8674950, -30337678, -50069437, -59576261, -51658721, -33341379, -24104959, -33756760, -48917577, -49072306, -31844169, -13499104, -5137924, 537746, 12483126, 21582084, 13107419, -4087893, -2077373, 24477056, 42198348, 22797712, -13170879, -21977349, 2986401, 26558437, 26031261, 17397725, 19225448, 21821488, 10889203, -2480366, 432135, 13557298, 15956579, 6305785, 4511874, 19627395, 34271480, 25812731, -5798227, -34942488, -34214134, -4459822, 20997696, 12594249, -15813660, -20663396, 14118151, 55615195, 69058858, 63122641, 67152814, 82358210]
39546H2358210K652330j5375123j0747024R841214J8767845P571908r670097k0543841
39538F4855422k3118156j9705134j5455658j4765493j1710689K643325J8308068
39531A051685J2511087j2838112k4561930n384120J6840750R851445j4626105
39524a7155300k1497308n174682R773460J1334188J0732215J2619511N569319
39517F201403j2655910k5614135k2302355j1915191o766834n696644j725717N878612
39509g4596771J3602413J8958480K0034468J6920262J4137022J4270598J1343842
39502C4670314k15516j3269426j5952736q823082j467480M298797J2360895J6162272
39494B7764038L915866j8134301k7482833j6809746n294997q829983j6016484
$$ y = [82358210, 85010540, 69635417, 58888393, 68729607, 87497452, 95069360, 85399263, 64855422, 41737266, 22032132, 6576474, -8189019, -19899708, -17256383, 1051685, 13562772, 724660, -23837270, -29221390, -12380640, -2529195, -17155300, -38652608, -43827290, -34053830, -22719642, -11987427, 632084, 6201403, -6454507, -32068642, -54370997, -66286188, -73053022, -78749666, -80475383, -74596771, -60994358, -42035878, -22001410, -5081148, 9055874, 23326472, 34670314, 34454798, 21185372, 5232636, -3590446, -5057926, -759129, 11601766, 27764038, 31679904, 13545603, -13937230, -30746976, -36041973, -44871956, -60888440]
39487f0888440q151945R955888J7044940P131955l184995N71868J2511740J7186219
39479g822770R779502o44301m360078j598843J240094K626211Q170957K0327961
39471B7718733L0832294K8744930J3408901o075505k1378477k8338363k3899872
39464B1012641j0117138O57539k978783j4552224j7187505r016195m427577o050846
39456d2660088K922186K6251977L6754120J3398953k0471176k5766177n300050
39449a4870255J990470j5570640k3324569K418206L3996591L4298338J0897809
39442B9835950l516864l954970q683702j4947517k886289J7430514R112509k8649738
39434f260107m4173672n827685M4344093M5484187K245252k7178703j4879414
$$ y = [-60888440, -69040385, -59084497, -42039557, -34907602, -38092597, -37520729, -25008989, -7822770, 1956732, 1312431, -3047647, -4646490, -3406396, -780185, 7390772, 27718733, 58551027, 87295957, 100704858, 94629353, 73250876, 44912513, 21012641, 10895503, 11553042, 8574259, -5977965, -23165470, -32181665, -36609242, -42660088, -39737902, -13485925, 23268195, 36667148, 16195972, -9570205, -14870255, -12879785, -28450425, -51774994, -49356788, -15360197, 18938141, 29835950, 26319086, 22364116, 13680414, -1267103, -4153392, 13277122, 22389631, -6260107, -50433779, -56261464, -11917371, 33566816, 35812068, 8633365, -6246049]
39427f246049R090248J3531598P634192J0708094J4869612K993820j7230437k3986335
39419A1364743j5899228j1583981j7469393j7944926j982616J7800511K3130828
39412a2584062J6509822J5486489K3207770K0761094l419364k9286417k7242398
39405C432934k26220J6986075M882252j5560847j6456094j595986P601565P713212
39397F776891R379278R685790j104314j0765685L120270L0567103L3500829L038133
39389H4198295k1535978r626258J5347836J3936457j0104708k1539263j0502391
39382D0173990j991684j0647970j8621682p378168J2005842J4745691l580992
39375B4705027k2028810k0319386j948591J1065844N188516p598259n968265J0725147
$$ y = [-6246049, 2844199, 16375797, 24009989, 34718083, 49587695, 52581515, 35351078, 11364743, -4534485, -16118466, -33587859, -51532785, -53515401, -35714890, -12584062, 3925760, 19412249, 42620019, 63381113, 59961749, 30675332, 3432934, 3206714, 20192789, 25075041, 9514194, -6941900, -8537886, -936321, 6776891, 16156169, 25841959, 24737645, 13971960, 17092230, 47659333, 81160162, 84198295, 62662317, 53036059, 68383895, 82320352, 72215644, 50676381, 40173990, 38182306, 27534336, 8912654, 1534486, 13540328, 28286019, 24705027, 2676217, -17643169, -19591760, -8525916, -3337400, -10935659, -16903924, -6178777]
39367f178777K1267191J3299052k89921l024761K588665N542433M485239M16209
39359C8105330j4434242m0269914n3403914l1340883R872851K8940563J2287038
39352e0243171r828926p173807J2074900J9691901P926052n399705m578820P169307
39344c0362269J7388334J8292806Q461135r289329k5178407k4410875k781617
39337d7880222K0706585K0104197l280107j7128803p34691K2922660J8877344
39330A3586963o864726j6571368m68892R807095l486565j4388960n94779J4839192
39322d142040K024169k3197628k4727707n012389M682095R92111R073110K9098420
39314a1209859K9607258K571400j8469677j1584417K85959q576287k3153461j4045231
$$ y = [-6178777, 15088414, 28387466, 28097545, 25072784, 27661449, 33203882, 37689121, 38105330, 23671088, -16598826, -70002740, -101343623, -91470772, -62530209, -50243171, -60072097, -67245904, -55171004, -35479103, -27553051, -32952756, -37531576, -30362269, -12973935, 5318871, 13780006, 4490677, -20687730, -45098605, -47880222, -27173637, -7069440, -10349547, -27478350, -28213041, -5290381, 13586963, 6722237, -9849131, -10318023, -510928, -3997493, -18386453, -18981232, -4142040, -2117871, -25315499, -50043206, -55055595, -50373500, -49381389, -40308279, -11209859, 18397399, 20968799, 2499122, -9085295, -8799336, -17375623, -40529084, -54574315]
39306e4574315J4607122L1996201K3610829L879220p709171n279391M839535J1893885
39298B3263915R955833N140790P254414J2242067N241439j5104623l0281670k6437167
39290h725002j1320927j74472J539072l871819j0200376n176965J6691829L4897091
39282A3658431K1009107j5368268k7477020M835052M0543506L1770506j1256776
39275E7714538m0459508l6675568k0457171p225370Q699869K4762558K2316267
39268H675615m17109j6464233p521456P576168N20135k3391931l0236699l361703
39260f4621213L1828321L6002654K587388l2926867l2910650P15601L3169640
39253b6155126L9466620K5630697Q586192m923739j2133719o867519P293338J1636034
$$ y = [-54574315, -39967193, -7970992, 15639837, 19519057, 11809886, 6530495, 11370030, 23263915, 33219748, 38360538, 45614952, 57857019, 63098458, 47993835, 17712165, -8725002, -20045929, -20220401, -18681329, -22553148, -32753524, -37930489, -21238660, 13658431, 34667538, 19299270, -8177750, -3342698, 37200808, 68971314, 57714538, 17255030, -19420538, -39877709, -47103079, -38403210, -13640652, 8675615, 8258506, -8205727, -15727183, -8151015, -7630880, -31022811, -61259510, -64621213, -32792892, 3209762, 5797150, -27129717, -60040367, -59324766, -26155126, 13311494, 38942191, 47528383, 42604644, 30470925, 23603406, 30896744, 42532778]
39245D2532778l607692k1696032k1614606o029402R448891K1414208L2127267
39238E2575412L0117550L742095l1926645m8158083m0301053k7681416j8237898
39231g9870038j604273K0794561K9503287J9764872J2046146J6642115J4654322
39224C1930992p149665k6560738j6119188J3483563K7477498J5008780l850994
39217C4220248j4295573k1581694k7169026j8248516O682482K3980632J4896148
39210a515299n070175p275723Q510734J6445850N664958o041883m780317j728077
39202D210068p894905j0177342M733021J8918979N195683k6761858l8073896j5811833
39194f5662083J0542618J5485100R930441J2615445J6991905Q628462n488046
$$ y = [42532778, 38925086, 17229054, -4385552, -10414954, -966063, 20448145, 52575412, 82692962, 86435057, 54508412, 6350329, -33950724, -61632140, -79870038, -81474311, -60679750, -31176463, -11411591, 634555, 17276670, 31930992, 24781327, -1779411, -17898599, -4415036, 23062462, 38071242, 34220248, 19924675, -1657019, -28826045, -47074561, -40392079, -16411447, -1515299, -6585474, -13861197, -5350463, 11095387, 16760345, 10718462, 5938145, 4210068, -3684837, -13862179, -9129158, 9789821, 14985504, -11776354, -49850250, -65662083, -55119465, -39634365, -29703924, -17088479, -96574, 8531888, 3043842]
39187C043842r587856o148171o617733p110718K632322J4891058J2763672j590915
39179B275501r592028m458922K739260L422497O55641m84705K394453J0448040
39171G399737J8071775J3683765k110344j1486946o729952n364479j8209396k2845977
39163b7591817K082424L4437939L6840440J4099445J865452P126716N444078o136379
39155F8168298l748976J0822518M287650k7441849m2933310k1130365L889419
39148h086615J311643q873000q72655P422129o834285j9547615K436640L7204727
39140D160969L6163641K158434j5720716j707042N787571j8710172m6802536m1307254
39132g5977105p746133K0681715K6031858J4403020j226871r763691m378788J0171531
$$ y = [3043842, -6544014, -12692185, -19309918, -26420636, -23788314, -8897256, 3866416, 2275501, -7316527, -11775449, -9036189, -5613692, -4958051, -5442756, -3048303, 7399737, 25471512, 39155277, 37044933, 25557987, 18828035, 13463556, -4745840, -27591817, -25509393, 8928546, 45768986, 59868431, 61733883, 68860599, 74304677, 68168298, 64419322, 75241840, 79529490, 52087641, 9154331, -11976034, -8086615, -6774972, -15647972, -16520627, -9098498, -15932783, -35480398, -33043758, 4160969, 40324610, 42483044, 26762328, 25055286, 30842857, 12132685, -34669851, -75977105, -83723238, -63041523, -37009665, -22606645, -23833516, -33597207, -37975995, -27804464]
39124b7804464J8407025J0497330o541302j7753487j5456068l905893O295413
39117c6261446P771219L458718K164082N592397O584088K826899J368536M015001
39109b480506J658263q409061j4541529j1017166r079083j3383873p464018J6169252
39101d8547721L1333386J2872985j9039785k4158571l167607N142127j2540286
39094e8105472k3292841j657829L0628341L7679501J7725865j879196k334516
39087a236147J0863182K0161437J2535610q919175k4839675j9720303k539742
39080a3694813N559500K196009L214256J0983691P662781j2598327k8578179k2174615
39072d7429697m202063M839601L813475M919889J0564272J1807498L329482j0811205
$$ y = [-27804464, -9397439, 1099891, -5441411, -23194898, -38650966, -42556859, -36261446, -28490227, -25031509, -22867427, -17275030, -10690942, -7864043, -6495507, -2480506, -822243, -9231304, -23772833, -34789999, -43869082, -57252955, -64716973, -48547721, -17214335, -4341350, -23381135, -47539706, -50707313, -45565186, -58105472, -81398313, -83056142, -52427801, -14748300, 2977565, 1098369, -1236147, 9627035, 29788472, 42324082, 33404907, 8565232, -11155071, -13694813, -8135313, -5939304, -2725048, 8258643, 15921424, 3323097, -25255082, -47429697, -51631760, -46792159, -42978684, -38058795, -27494523, -15687025, -12357543, -23168748]
39064b3168748k1401978j9256187m128174R647330Q133066r35305K015155J6131237
39056c2963604J9125228L847788q307987j465578J0850444J0783281L051160q28936
39048D091796m387832j1902048j1711715K571121J1324932l561886k3429334j4743848
39040e1748814K0158530M2788019K8814590m761632k5022503j8098435K562581
39033e307664J0463569q354537l4798309l3131049m5464K1962372K402351k7201538
39025g4010269j5902374K8786430M9461779K2297740j3808465j9394639k621120
39018b5190918J0351815J3997788J0837667n401365k8313600k9828975p03083
39011e4250671K5074674J5546937j1887757j9366686m424572P444566R241701
$$ y = [-23168748, -44570726, -63826913, -67955087, -58307757, -50174691, -51109996, -49094841, -32963604, -13838376, -9990588, -18298575, -19764153, -8913709, 1869572, 4920732, 4091796, -296036, -12198084, -23909799, -21338678, -10013746, -13575632, -37004966, -51748814, -31590284, 11197735, 40012325, 35250693, 10228190, -7870245, -5307664, 5155905, -3198632, -37996941, -71127990, -71173454, -49211082, -46808731, -74010269, -89912643, -61126213, -11664434, 10633306, -3175159, -22569798, -25190918, -14839103, -841315, 9996352, 4594987, -23718613, -53547588, -54250671, -29175997, -13629060, -25516817, -44883503, -49308075, -41863509, -32621808]
39004c2621808J3359011J7209069P787607m938038P35320J5062767O477009k2088354
38996I82583l0520645o601557J0824181m775851k2617143n051606L0280050L8136978
38988A0656990J3671909q180724r559446o665802j3099599k0715787j9384622
38981e3277081q477669J2424701L9287038N1406654L0913320n237818k1455431
38974D5583714j3266839r706896k2180717k7009656j0594528M831741Q39867n214412
38966c6717726N655023J7169172P112033j0227140p524975O706288K325468j8533573
38958c4035430k2323726J391021K3854459K2319564R184601N311570J0505593
38951A6207652J2702859O603056o405895k0530597k3417206r686897K478874q651702
$$ y = [-32621808, -19262797, -2053728, 5733879, 795841, 1531161, 16593928, 23070937, 982583, -29538062, -36139619, -25315438, -30091289, -52708432, -57760038, -27479988, 10656990, 24328899, 16148175, 6588729, -77073, -13176672, -33892459, -53277081, -61754750, -49330049, -10043011, 41363643, 72276963, 67039145, 45583714, 32316875, 22609979, 429262, -26580394, -37174922, -32343181, -31503314, -36717726, -31062703, -13893531, -6781498, -17008638, -24533613, -17827325, -15501857, -34035430, -56359156, -54968135, -31113676, -8794112, 390489, 5702059, 16207652, 28910511, 35513567, 29107672, 8577075, -14840131, -24527028, -22048154, -30699856]
38943c0699856l0411124k6746511O747649L1762603K4603785J0032489J5011195
38936C00230K1530906M91552l0553049k6518279J5465375M6160986L0551048p480550
38928D9948219k0435785L423727L1521834K8332075o372313l9471880m1119798
38921E826079j7337678J2334l743061p903246Q718992L1271597K8973070K979583
38913D8797670j2926946j483663J3768118M562061k1078795l1419294j5123802
38906a4904651N676375P220645n281426q016769O354664J7437439O126449j6525144
38898a912418k3914815j2197570l942739j0797118j5047771k80740K0233171K4977580
38890b2882420J7730950J5649653J5643294J807669j8035586j5559313J2247397
$$ y = [-30699856, -61110980, -87857491, -81109842, -49347239, -24743454, -14710965, 300230, 21831136, 22322688, -8230361, -34748640, -19283265, 26877721, 57428769, 49948219, 29512434, 32936161, 64457995, 92790070, 86417757, 46945877, 5826079, -11511599, -11499265, -15242326, -23145572, -14426580, 16845017, 45818087, 48797670, 35870724, 34387061, 48155179, 52717240, 31638445, 219151, -14904651, -9228276, -2007631, -7289057, -15305826, -8951162, 8486277, 14612726, -1912418, -25827233, -38024803, -41967542, -52764660, -67812431, -68093171, -47860000, -22882420, -5151470, 10498183, 26141477, 27949146, 9913560, -5645753, 6601644]
38883F601644L0169144J2841223j7224602k0700584L667533J8920663J139932
38876C5414953l0079244l8141745j3342714J9167723K9976725J4640192q099066
$$ y = [6601644, 36770788, 49612011, 32387409, 11686825, 15354358, 34275021, 35414953, 5335709, -32806036, -46148750, -26981027, 2995698, 17635890, 9536824]
$$ [...]
##END NTUPLES=NMR SPECTRUM
##END=
