##TITLE=31Pdec_LR-701-RM1
 CDCl3, 88 sc
 18.11.2019
##JCAMPDX= 6.0         $$ Bruker NMR JCAMP-DX V2.0
##DATA TYPE= NMR SPECTRUM
##DATA CLASS= NTUPLES
##ORIGIN= UXNMR, Bruker Analytische Messtechnik GmbH
##OWNER= root
$$ XWIN-NMR		Version 3.5
$$ Tue Nov 19 15:42:19 2019 Russian Standard Time (UT+4h)  she@DPX200
##.OBSERVE FREQUENCY= 81.013821
##.OBSERVE NUCLEUS= ^31P
##.ACQUISITION MODE= SIMULTANEOUS
##.ACQUISITION SCHEME= undefined
##.AVERAGES= 24
##.DIGITISER RES= 17
##SPECTROMETER/DATA SYSTEM= spect
##.PULSE SEQUENCE= zgpg30
##.SOLVENT NAME= THF
##.SHIFT REFERENCE= (INTERNAL, THF, 0, 182.463)
##AUDIT TRAIL= $$ (NUMBER, WHEN, WHO, WHERE, WHAT)
$$ ##TITLE= Audit trail, XWIN-NMR		Version 3.5
$$ ##JCAMPDX= 5.01
$$ ##ORIGIN= Bruker BioSpin GmbH
$$ ##OWNER= she
$$ F:/spectra/data/she/nmr/P31/1/pdata/1/auditp.txt
$$ ##AUDIT TRAIL=  $$ (NUMBER, WHEN, WHO, WHERE, WHAT)
(   1,<2019-11-19 15:40:48.57 +0400>,<she>,<DPX200>,
      <created by zg, POWCHK disabled, PULCHK disabled
       configuration hash MD5:
       00 E9 B6 7A A2 85 ED C7 34 08 36 98 17 FE 4E 26
       data hash MD5: 32K
       B8 D1 50 3A 26 2C 5C D9 93 14 7B 74 94 E3 A4 91>)
(   2,<2019-11-19 15:40:52.59 +0400>,<she>,<DPX200>,
      <Start of raw data processing
       efp BC_mod = 2 LB = 1 FT_mod = 6 PKNL = 1 PHC0 = -1419.174 PHC1 = 474.001 SI = 64K 
       data hash MD5: 64K
       0B B7 37 D1 43 B0 F8 8C 7E CE 70 0F F3 20 40 3C>)
(   3,<2019-11-19 15:41:16.48 +0400>,<she>,<DPX200>,
      <pk PHC0 = 133.898 PHC1 = -507.8 
       data hash MD5: 64K
       FA EA DF 70 6F FA FA AC D2 7B 5B AC 28 4B B2 3D>)
(   4,<2019-11-19 15:41:27.54 +0400>,<she>,<DPX200>,
      <abs ABSG = 5 
       data hash MD5: 64K
       13 3D 17 21 65 E7 67 A9 BD 17 21 AF AF AD CE 00>)
$$ ##END=
$$ 
$$ hash MD5
$$ 0B 1E BF D7 34 7F 1E CA 74 4C D8 DD BC 07 A7 05
##$RELAX= 
##$RELAX= 
##$RELAX= 
##$RELAX= 
##$RELAX= 
##$RELAX= 
##$RELAX= 
##$RELAX= 
$$ Bruker specific parameters
$$ --------------------------
##$DU= <F:/spectra>
##$EXPNO= 1
##$NAME= <P31>
##$PROCNO= 1
##$TYPE= <nmr>
##$USER= <she>
##$AMP= (0..31)
100 100 100 100 100 100 100 100 100 100 100 100 100 100 100 100 100 100 
100 100 100 100 100 100 100 100 100 100 100 100 100 100 
##$AQSEQ= 0
##$AQ_mod= 1
##$AUNM= <au_zg>
##$AUTOPOS= <>
##$BF1= 81.014009
##$BF2= 200.13
##$BF3= 200.13
##$BF4= 200.13
##$BF5= 200.13
##$BF6= 200.13
##$BF7= 200.13
##$BF8= 200.13
##$BYTORDA= 1
##$CFDGTYP= 0
##$CFRGTYP= 5
##$CHEMSTR= <none>
##$CNST= (0..31)
1 1 145 1 1 1 1 1 1 1 1 1 1 1 1 1 1 1 1 1 1 1 1 1 1 1 1 1 1 1 1 1 
##$CPDPRG= <waltz16>
##$CPDPRG1= <>
##$CPDPRG2= <waltz16>
##$CPDPRG3= <>
##$CPDPRG4= <mlev>
##$CPDPRG5= <mlev>
##$CPDPRG6= <mlev>
##$CPDPRG7= <mlev>
##$CPDPRG8= <mlev>
##$CPDPRGB= <>
##$CPDPRGT= <>
##$D= (0..31)
0 1 0 0 0 0 0 0 0 0 0 0.03 2e-05 3e-06 0 0 0 0 0 0 0 0 0 0 0 0 0 0 0 0 
0 0 
##$DATE= 1574163648
##$DBL= (0..7)
120 120 120 11 120 120 24 19 
##$DBP= (0..7)
150 150 150 150 150 150 150 150 
##$DBP07= 0
##$DBPNAM0= <>
##$DBPNAM1= <>
##$DBPNAM2= <>
$$ [...]
##$SUBNAM3= <"">
##$SUBNAM4= <"">
##$SUBNAM5= <"">
##$SUBNAM6= <"">
##$SUBNAM7= <"">
##$SUBNAM8= <"">
##$SUBNAM9= <"">
##$SW= 369.568048894756
##$SWIBOX= (0..15)
0 1 3 0 0 0 0 0 0 0 0 0 0 0 0 0 
##$SW_h= 29940.119760479
##$TD= 32768
##$TD0= 1
##$TE= 0
##$TE2= 300
##$TE3= 300
##$TEG= 300
##$TL= (0..7)
0 120 53 12 22 120 120 120 
##$TP= (0..7)
150 150 150 150 150 150 150 150 
##$TP07= 0
##$TPNAME0= <>
##$TPNAME1= <>
##$TPNAME2= <>
##$TPNAME3= <>
##$TPNAME4= <>
##$TPNAME5= <>
##$TPNAME6= <>
##$TPNAME7= <>
##$TPOAL= (0..7)
0.5 0.5 0.5 0.5 0.5 0.5 0.5 0.5 
##$TPOFFS= (0..7)
0 0 0 0 0 0 0 0 
##$TUNHIN= 0
##$TUNHOUT= 0
##$TUNXOUT= 0
##$USERA1= <user>
##$USERA2= <user>
##$USERA3= <user>
##$USERA4= <user>
##$USERA5= <user>
##$V9= 5
##$VALIST= <valist>
##$VCLIST= <CCCCCCCCCCCCCCC>
##$VD= 0
##$VDLIST= <DDDDDDDDDDDDDDD>
##$VPLIST= <PPPPPPPPPPPPPPP>
##$VTLIST= <TTTTTTTTTTTTTTT>
##$WBST= 1024
##$WBSW= 4
##$XGAIN= (0..3)
0 0 0 0 
##$XL= 0
##$YL= 0
##$YMAX_a= 12701
##$YMIN_a= -11419
##$ZGOPTNS= <>
##$ZL1= 120
##$ZL2= 120
##$ZL3= 120
##$ZL4= 120
##$ABSF1= 182.463
##$ABSF2= -187.1042
##$ABSG= 5
##$ABSL= 3
##$ALPHA= 0
##$AQORDER= 0
##$ASSFAC= 0
##$ASSFACI= 0
##$ASSFACX= 0
##$ASSWID= 0
##$AUNMP= <proc_1d>
##$AZFE= 0.1
##$AZFW= 0.5
##$BCFW= 0
##$BC_mod= 2
##$BYTORDP= 0
##$COROFFS= 0
##$CY= -3
##$DATMOD= 1
##$DC= 0
##$DFILT= <>
##$DTYPP= 0
##$F1P= 0
##$F2P= 0
##$FCOR= 1
##$FTSIZE= 65536
##$FT_mod= 6
##$GAMMA= 0
##$GB= 0
##$INTBC= 1
##$INTSCL= 5.30512e-09
##$ISEN= 30
##$LB= 1
##$LEV0= 0
##$LPBIN= 0
##$MAXI= 10000
##$MC2= 0
##$MEAN= 0
##$ME_mod= 0
##$MI= 50
##$NCOEF= 0
##$NC_proc= -5
##$NLEV= 6
##$NOISF1= 182.463
##$NOISF2= 159.3651
##$NSP= 0
##$NTH_PI= 0
##$NZP= 0
##$OFFSET= 182.463
##$PC= 4
##$PHC0= -1285.276
##$PHC1= -33.79898
##$PH_mod= 1
##$PKNL= yes
##$PPARMOD= 0
##$PSCAL= 0
##$PSIGN= 0
##$REVERSE= no
##$SF= 81.0140089999434
##$SI= 65536
##$SIGF1= 159.3651
##$SIGF2= -187.1042
##$SINO= 113.3802
##$SIOLD= 16384
##$SREGLST= <1H.CDCl3>
##$SSB= 0
##$STSI= 65536
##$STSR= 0
##$SW_p= 29940.119760479
##$SYMM= 0
##$S_DEV= 0
##$TDeff= 32768
##$TDoff= 0
##$TI= <>
##$TILT= no
##$TM1= 0
##$TM2= 0
##$TOPLEV= 0
##$USERP1= <user>
##$USERP2= <user>
##$USERP3= <user>
##$USERP4= <user>
##$USERP5= <user>
##$WDW= 1
##$XDIM= 65536
##$YMAX_p= 333280003
##$YMIN_p= -12692467
$$ End of Bruker specific parameters
$$ ---------------------------------
##NTUPLES= NMR SPECTRUM
##VAR_NAME=  FREQUENCY,     SPECTRUM/REAL,   SPECTRUM/IMAG
##SYMBOL=    X,             R,               I
##VAR_TYPE=  INDEPENDENT,   DEPENDENT,       DEPENDENT
##VAR_FORM=  AFFN,          ASDF,            ASDF
##VAR_DIM=   65536,         65536,           65536
##UNITS=     HZ,            ARBITRARY UNITS, ARBITRARY UNITS
##FACTOR=    0.456856943014862, 1,           1
##FIRST=     14782.0589164792, 0,            0
##LAST=      -15158.0608439998, 0,           0
##MIN=       -15158.0608439998, -12692467,   0
##MAX=       14782.0589164792, 333280003,    0
$$ Real data points
##PAGE= N=1
##DATA TABLE= (X++(R..R)), XYDATA
$$ [...]
$$ plain form
43670 1229156 909068 1297918 1827829 1795055 1368131 1254832 1643830 1983628 1768585 1176491
43660 1176491 852588 1239722 2165719 3006206 3233610 2816833 2087977 1339565 702272
43651 702272 306768 280028 543623 837457 1003205 1081269 1113218 1022316 714948 198858
43641 198858 -327090 -432999 197589 1122189 1233564 64806 -1274662 -1243621 115974
43632 115974 1188003 951620 176187 1538 275182 149001 -334397 -342159 294414 783211
43622 783211 643462 381996 561575 903116 829386 423695 222565 265113 10764 -698231
43612 -698231 -1165958 -725375 233835 648697 124305 -667569 -1059227 -1250304 -1689489 -2118881
43602 -2118881 -1930965 -1216673 -669588 -476646 -110860 588254 905669 253734 -881292
$$ packed form
43670A229156l20088L88850N29911l2774m26924j13299L88998L39798k15043n92094
43660A176491l23903L87134R25997Q40487K27404m16777p28856p48412o37293
43651G02272l95504k6740K63595K93834J65748P8064L1949r0902l07368n16090
43641A98858n25948j05909O30588R24600J11375j168758j339468L1041J359595
43632A15974J072029k36383p75433j74649K73644j26181m83398p762O36573M88797
43622G83211j39749k61466J79579L41541p3730m05691k01130M2548k54349p08995
43612f98231m67727M40583R59210M14862n24392p91874l91658j91077m39185m29392
43602b118881J87916P14292N47085J92942L65786O99114L17415o51935j135026
$$ plain form
43593 -881292 -1498080 -1224780 -475330 239310 727087 1016542 1186959 1245039 1085998 754215
43583 754215 655758 1050715 1379443 812842 -376997 -862465 -77185 925465 1089566
43574 1089566 913714 1384878 2107598 1842612 578369 -334249 -145557 479279 826343
43565 826343 1055436 1288342 959458 -113271 -889430 -320344 1094368 1884199 1481221
43556 1481221 683785 354692 456295 501672 307068 -1404 -305675 -501086 -440269 -165366
43546 -165366 -43643 -382641 -961314 -1223425 -990734 -732189 -968632 -1604530 -2079290 -2047703
43536 -2047703 -1638238 -1144620 -809329 -846742 -1232224 -1430295 -827491 432205 1543388
43527 1543388 2095780 2376862 2389081 1491363 -286435 -1419916 -525171 1601077 2784110
$$ packed form
43593h81292o16788K73300P49450P14640M87777K89455J70417N8080j59041l31783
43583G54215r8457L94957L28728n66601j189839m85468P85280J002650J64101
43574A089566j75852M71164P22720k64986j264243r12618J88692O24836L47064
43565H26343K29093K32906l28884j072729p76159N69086J414712P89831m02978
43556A481221p97436l29093J01603M5377j94604l08472l04271j95411O0817K74903
43546a65366J21723l38998n78673k62111K32691K58545k36443o35898m74760L1587
43536b047703M09465M93618L35291l7413l85482j98071O02804J259696J111183
43527A543388N52392K81082J2219q97718j777798j133481Q94745K126248J183033
$$ plain form
43518 2784110 2191677 1080002 789515 1250092 1806396 2291690 2593400 2158012 849558
43509 849558 -358780 -475163 138332 318131 -275352 -906746 -978432 -703029 -568828 -810700
43499 -810700 -1458759 -2280622 -2572755 -1662163 86596 1270906 865343 -644686 -1876930
43490 -1876930 -2045304 -1453567 -707161 -23315 531643 635191 8353 -1057689 -1938923
43481 -1938923 -2423521 -2760919 -2906316 -2309221 -819860 688769 1195231 758686 257865
43472 257865 76405 -216807 -837440 -1210789 -783135 120065 679451 530124 -18602 -499555
43462 -499555 -712233 -716130 -602032 -308186 256044 818274 750123 -160530 -1166698 -1334020
43452 -1334020 -717913 -123367 192897 688654 1311077 1193018 104069 -752713 -240476
$$ packed form
43518B784110n92433j111675k90487M60577N56304M85294L01710m35388j308454
43509H49558j208338j16383O13495J79799n93483o31394p1686K75403J34201k41872
43499h10700o48059q21863k92133R10592J748759J184310m05563j510029j232244
43490a876930j68374N91737P46406O83846N54958J03548o26838j066042q81234
43481a938923m84598l37398j45397N97095J489361J508629N06462m36545n00821
43472B57865j81460k93212o20633l73349M27654R03200N59386j49327n48726m80953
43462d99555k12678l897J14098K93846N64230N62230o8151r10653j006168j67322
43452a334020O16107N94546L16264M95757O22423j18059j088949q56782N12237
$$ plain form
43443 -240476 1083942 1786018 1541062 1270537 1485825 1572976 918417 -101950 -658706
43434 -658706 -472644 91564 619250 1014974 1403275 1814759 1929322 1228381 -341980
43425 -341980 -1900544 -2207778 -925773 887209 1775350 1340390 513780 348311 791997
43416 791997 955810 464893 -26533 101818 456185 303039 -204216 -288930 164675 517614
43406 517614 565763 839813 1504073 1915774 1667258 1198278 932962 658273 237654 39650
43396 39650 75713 -344285 -1377392 -2032279 -1668684 -1151132 -1428120 -1885670 -1455601 -592046
43386 -592046 -559252 -1227406 -1269707 -409635 173317 -203902 -874635 -1172919 -1251996 -1225429
43376 -1225429 -812410 -269118 -435693 -1335534 -1851483 -1349594 -593088 -484851 -878653
$$ packed form
43443b40476J324418P02076k44956k70525K15288Q7151o54559j020367n56756
43434f58706J86062N64208N27686L95724L88301M11484J14563p00941j570361
43425c41980j558564l07234J282005J812982Q88141m34960q26610j65469M43686
43416G91997J63813m90917m91426J28351L54367j53146n07255q4714M53605L52939
43406E17614M8149K74050O64260M11701k48516m68980k65316k74689m20619j98004
43396C9650L6063m19998j033107o54887L63595N17552k76988m57550M30069Q63555
43386e92046L2794o68154m2301Q60072N82952l77219o70733k98284p9077K6567
43376a225429M13019N43292j66575q99841n15949N01889P56506J08237l93802
$$ plain form
43367 -878653 -1199248 -1292926 -1080172 -287391 856224 1513302 1415516 1294191 1600163 1761768
43357 1761768 1350507 948234 1041921 1054873 452798 -88625 263963 1022425 1136448 678649
43347 678649 589684 1131882 1724277 2044288 2230859 2173283 1590134 739544 228744 211672
43337 211672 426192 741366 991975 712472 -142032 -694177 -315884 214192 -139765 -872903
43327 -872903 -714023 132352 217412 -619941 -751814 655922 2189450 2265624 1377396 1087945
43317 1087945 1679530 2076505 1653423 936423 564732 465650 252203 -95925 -190795 275757
43307 275757 1062360 1467844 1102432 472522 380078 799056 949912 532571 102457 -50935
43297 -50935 -535913 -1767956 -2960632 -3041161 -2148807 -1360036 -1149671 -1002833 -530133 -80373
$$ packed form
43367h78653l20595r3678K12754P92781J143615O57078r7786j21325L05972J61605
43357A761768m11261m02273R3687J2952o02075n41423L52588P58462J14023m57799
43347F78649q8965N42198N92395L20011J86571n7576n83149q50590n10800j7072
43337B11672K14520L15174K50609k79503q54504n52145L78293N30076l53957p33138
43327h72903J58880Q46375Q5060q37353j31873J407736J533528P6174q88228k89451
43317A087945N91585L96975m23082p17000l71691r9082k13447l48128r4870M66552
43307B75757P86603M05484l65412o29910r2444M18978J50856m17341m30114j53392
43297e0935m84978j232043j192676q0529Q92354P88771K10365J46838M72700M49760
$$ plain form
43287 -80373 30518 176442 788137 1470985 1349740 246096 -936859 -1170820 -416937
43278 -416937 404261 441036 -310694 -1222106 -1742313 -1770901 -1560939 -1484770 -1761992 -2193026
43268 -2193026 -2264473 -1728099 -950099 -454437 -272609 -35126 441440 995528 1400131 1415329
43258 1415329 724370 -674371 -2078438 -2632587 -2294744 -1734827 -1281198 -636380 222444
43249 222444 625868 145038 -613394 -699671 4968 780318 1022149 796589 569921 698061
43239 698061 1098607 1260110 750018 -161159 -662784 -370928 187211 309364 27678 -62322
43229 -62322 317570 758915 619790 -321383 -1571164 -2238802 -1872824 -1002764 -524155 -553566
43219 -553566 -407066 195473 596087 219781 -526072 -915311 -913079 -872497 -704288 -158780
$$ packed form
43287h0373J10891J45924O11695O82848j21245j103644j182955k33961P53883
43278d16937Q21198L6775p51730r11412n20207k8588K09962P6169k77222m31034
43268b193026p1447N36374P78000M95662J81828K37483M76566N54088M04603J5198
43258A415329o90959j398741j404067n54149L37843N59917M53629O44818Q58824
43249B22444M03424m80830p58432q6277P04639P75350K41831k25560k26668J28140
43239F98061M00546J61503n10092r11177n01625K91856N58139J22153k81686r0000
43229f2322L79892M41345j39125r41173j249781o67638L65978Q70060M78609k9411
43219e53566J46500O02539M00614l76306p45853l89239K232M0582J68209N45508
$$ plain form
43209 -158780 364380 179841 -568010 -962102 -553377 177985 711075 1090111 1386154 1264585
43199 1264585 567756 -164547 -312089 -57404 -150011 -876322 -1680980 -1848271 -1257246 -370287
43189 -370287 294719 510599 302553 -159661 -566974 -622704 -437199 -620239 -1602737 -2865453
43179 -2865453 -3281301 -2404409 -1020727 -128315 256229 832824 1814470 2557795 2422381
43170 2422381 1558375 666428 207952 20357 -345067 -991498 -1478041 -1357766 -779196
43161 -779196 -242811 136188 582729 847445 210217 -1316031 -2533357 -2477216 -1685924
43152 -1685924 -1258226 -1196636 -724238 124125 481952 185067 69877 516497 897267 895550
43142 895550 1183033 2087664 2655135 2008734 854000 539614 1132151 1519577 1125955
$$ packed form
43209a58780N23160j84539p47851l94092M08725P31362N33090L79036K96043j21569
43199A264585o96829p32303j47542K54685r2607p26311q04658j67291N91025Q86959
43189c70287O65006K15880k08046m62214m07313n5730J85505j83040r82498j262716
43179b865453m15848Q76892J383682Q92412L84544N76595R81646P43325j35414
43170B422381q64006q91947m58476j87595l65424o46431m86543J20275N78570
43161g79196N36385L78999M46541K64716o37228j526248j217326N6141P91292
43152a685924M27698O1590M72398Q48363L57827k96885j15190M46620L80770j717
43142H95550K87483R04631N67471o46401j154734l14386N92537L87426l93622
$$ plain form
43133 1125955 441242 -38480 -352967 -511387 -370356 -272138 -876052 -1999439 -2460622
43124 -2460622 -1583308 -182585 510104 318916 -120959 -544386 -1120585 -1587701 -1289076
43115 -1289076 -226223 685161 745787 314234 146093 335831 389632 82879 -260574 -276909
43105 -276909 53369 535055 942600 1039434 715424 209228 -24227 211276 632723 797658
43095 797658 564771 229323 242472 688534 979426 352822 -1063774 -2016273 -1475976 -41180
43085 -41180 686426 112045 -732925 -768221 -239115 -44084 -395992 -832749 -1077362 -1160769
43075 -1160769 -995014 -508350 8384 301778 659082 1372551 1980706 1826663 1181542
43066 1181542 913044 1071523 775461 -308586 -1296786 -1287875 -477046 378040 957272 1331670
$$ packed form
43133A125955o84713m79722l14487j58420J41031R8218o03914j123387m61183
43124b460622Q77314J400723O92689j91188m39875m23427n76199m67116K98625
43115a289076J062853R11384O0626m31553j68141J89738N3801l06753l43453j6335
43105b76909L30278M81686M07545R6834l24010n06196k33455K35503M21447J64935
43095G97658k32887l35448J3149M46062K90892o26604j416596r52499N40297J434796
43085d1180P27606n74381q44970l5296N29106J95031l51908m36757k44613q3407
43075a160769J65755M86664N16734K93394L57304P13469O08155j54043o45121
43066A181542k68498J58479k96062j084047r88200Q911Q10829Q55086N79232L74398
$$ plain form
43056 1331670 1425566 1071443 331602 -552463 -1236922 -1183897 -75522 1396122 1820976
43047 1820976 673304 -899723 -1434191 -801182 94638 743315 1309464 1765092 1680692
43038 1680692 970141 149832 -317349 -433754 -299323 190727 1059955 1963837 2388617
43029 2388617 2034106 1013910 -178819 -998685 -1329091 -1526386 -1843239 -2067080 -1972795
43020 -1972795 -1785599 -1774610 -1704506 -1260867 -801753 -1001467 -1787566 -2309105 -2053966 -1384665
43010 -1384665 -832156 -486572 -318834 -477573 -878657 -1013136 -618574 -137317 -43806 -95201
43000 -95201 190970 617245 557906 22557 -277501 -56230 69818 -383362 -841205 -412361
42990 -412361 745162 1514299 1256409 489016 -35359 -262994 -448058 -413910 99925 643779
$$ packed form
43056A331670R3896l54123p39841q84065o84459N3025J108375J471644M24854
43047A820976j147672j573027n34468O33009Q95820O48677N66149M55628q4400
43038A680692p10551q20309m67181j16405J34431M90050Q69228R03882M24780
43029B388617l54511j020196j192729q19866l30406j97295l16853k23841R4285
43020a972795J87196J0989P0104M43639M59114j99714p86099n21539K55139O69301
43010a384665N52509L45584J67738j58739m01084j34479L94562M81257R3511n1395
43000i5201K86171M26275n9339n35349l00058K21271J26048m53180m57843M28844
42990d12361J157523P69137k57890p67393n24375k27635j85064L4148N13835N43854
$$ plain form
42980 643779 401650 -634698 -1492669 -1393728 -584630 173333 435858 180356 -407910 -928375
42970 -928375 -946132 -499102 -104512 -54566 -110140 -69844 -89113 -164019 46237 470301 413835
42959 413835 -318438 -824829 -416331 187560 861 -499854 -95256 1059430 1498514
42950 1498514 655157 -413761 -797924 -885411 -1239712 -1558169 -1458837 -1270543 -1261835 -988693
42940 -988693 -231722 246050 -223197 -1102354 -1544711 -1689924 -2004074 -1994192 -934058 475161
42930 475161 641145 -645695 -1793188 -1599799 -728310 -457791 -904980 -1210172 -878079
42921 -878079 -192201 400659 709752 715197 494106 229232 72972 24997 13631 -9800
42911 -9800 -77886 -158477 -131347 -4370 -48402 -424082 -801890 -767089 -501629 -520704 -744204
$$ packed form
42980F43779k42129j036348q57971R8941Q09098P57963K62525k55502n88266n20465
42970i28375j7757M47030L94590M9946n5574M0296j9269p4906K10256M24064n6466
42959D13835p32273n06391M08498O03891j86699n00715M04598J154686M39084
42950A498514q43357j068918l84163q7487l54301l18457R9332J88294Q708K73142
42940i88693P56971M77772m69247q79157m42357j45213l14150R882J060134J409219
42930D75161J65984j286840j147493J93389Q71489K70519m47189l05192L32093
42921h78079O85878N92860L09093N445k21091k64874j56260m7975j1366k3431
42911i800o8086q0591K7130J26977m4032l75680l77808L4801K65460j9075k23500
$$ plain form
42900 -744204 -494306 412197 1254217 1450817 1395564 1713535 2169071 1986344 1017176 -52345
42890 -52345 -594941 -610173 -403183 -171266 1597 94981 209159 455158 770382 1028108
42880 1028108 1246045 1435563 1362807 824222 128210 -94873 346839 950843 1140434 895361
42870 895361 662926 844157 1442328 2049105 2161620 1700733 1185422 1162940 1533135 1742549
42860 1742549 1560914 1233665 896095 396652 -173967 -373634 -116284 50806 -243897
42851 -243897 -609558 -574815 -379846 -510000 -837230 -893439 -697933 -597402 -525206 -220113
42841 -220113 -13517 -461597 -1176866 -1035849 179548 1291683 1320480 709115 375359
42832 375359 334953 68502 -337608 -360650 -55390 246 -296846 -409761 -66510 313896
$$ packed form
42900g44204K49898R06503Q42020J96600n5253L17971M55536j82727r69168j069521
42890e2345n42596j5232K06990K31917J72863R3384J14178K45999L15224K57726
42880A028108K17937J89518p2756n38585o96012k23083M41712O04004J89591k45073
42870H95361k32435J81231N98171O06777J12515m60887n15311k2482L70195K09414
42860A742549j81635l27249l37570m99443n70619j99667K57350J67090k94703
42851b43897l65661L4743J94969j30154l27230n6209J95506J00531P2196L05093
42841b20113K06596m48080p15269J41017J215397J112135K8797o11365l33756
42832C75359m0406k66451m06110k3042L05260N5636k97092j12915L43251L80406
$$ plain form
42822 313896 277672 -48375 -210863 -34529 187262 54082 -355847 -344788 576222 1679985
42812 1679985 1513352 -230345 -2020507 -2306089 -1389725 -655871 -538296 -420555 -202945
42803 -202945 -560962 -1535952 -2160502 -1880236 -1290489 -1020146 -855050 -474554 -151810 -132931
42793 -132931 -111117 102609 142167 -111746 -100166 380252 532474 -232684 -1182975 -1292459
42783 -1292459 -750520 -431921 -401399 -82324 436084 441638 -173053 -792691 -1147285 -1497919
42773 -1497919 -1769532 -1527852 -932452 -722482 -1029707 -1116476 -580642 37436 215692 238522
42763 238522 579462 1134157 1520027 1638190 1553127 1243859 781792 365643 -15449 -520267
42753 -520267 -958404 -935323 -634558 -762485 -1446248 -1896082 -1538257 -789842 -252515 150880
$$ packed form
42822C13896l6224l26047j62488J76334K21791j33180m09929J1059R21010J103763
42812A679985j66633j743697j790162k85582R16364P33854J17575J17741K17610
42803b02945l58017r74990o24550K80266N89747K70343J65096L80496L22744J8879
42793a32931K1814K13726L9558k53913J1580M80418J52222p65158r50291j09484
42783a292459N41939L18599L0522L19075N18408N554o14691o19638l54594l50634
42773a497919k71613K41680N95400K09970l07225q6769N35834O18078J78256K2830
42763B38522L40940N54695L85870J18163q5063l09268m62067m16149l81092n04818
42753e20267m38137K3081L00765j27927o83763m49834L57825P48415N37327M03395
$$ plain form
42743 150880 611346 637898 -349719 -1953873 -3068092 -3100320 -2415013 -1712162 -1414273 -1513536
42733 -1513536 -1645244 -1453968 -1097959 -1064424 -1299820 -1101504 -255194 400690 183797 -291516
42723 -291516 -36570 741799 1006128 528087 75096 44607 17849 -193261 -113294 436476
42713 436476 844752 629333 118772 -230378 -515863 -875723 -900261 -190494 881298 1545534
42703 1545534 1540346 1217711 965849 865866 699172 68092 -1142205 -2209662 -2032248 -560671
42693 -560671 791808 794268 -45475 -365982 24264 94348 -517555 -787297 74157 1269011
42683 1269011 1460190 580201 -249520 -324470 -51762 -40098 -232535 -212375 118749 514794
42673 514794 759895 764504 461170 -111262 -692002 -976371 -866058 -428061 226919 815011
$$ packed form
42743A50880M60466K6552r87617j604154j114219l2228O85307P02851K97889r9263
42733a513536j31708J91276L56009L3535k35396J98316Q46310O55884k16893m75313
42723b91516K54946P78369K64329m78041m52991l0489k6758k11110P9967N49770
42713D36476M08276k15419n10561l49150k85485l59860k4538P09767J071792O64236
42703A545534n188l22635k51862r9983j66694o31080j210297j067457J77414J471577
42693e60671J352479K460q39743l20507L90246P0084o11903k69742Q61454J194854
42683A269011J91179q79989q29721p4950K72708J1664j92437K0160L31124L96045
42673E14794K45101M609l03334n72432n80740k84369J10313M37997O54980N88092
$$ plain form
42663 815011 852119 183510 -527439 -365055 653732 1480399 1399471 954078 1006025 1355102
42653 1355102 1098264 159139 -489294 -275450 190921 188811 -57528 2236 243289 295680
42643 295680 489886 1393305 2620307 3138845 2792122 2479904 2590317 2337582 1239634
42634 1239634 266330 552015 1603584 1927387 1176438 508040 718991 1136917 828266
42625 828266 38997 -282340 112353 592830 670795 542109 592588 842262 995341 757624
42615 757624 54987 -821881 -1266518 -798758 449182 1803330 2592079 2520416 1673747
42606 1673747 475078 -405148 -502635 -78831 95898 -355289 -990675 -1217390 -1084367
42597 -1084367 -1068568 -1287373 -1405142 -1301315 -1304810 -1540070 -1475189 -562179 864418 1799536
$$ packed form
42663H15011L7108o68609p10949J62384J018787Q26667q0928m45393N1947L49077
42653A355102k56838r39125o48433K13844M66371k110k46339N9764K41053N2391
42643B95680J94206R03419J227002N18538l46723l12218J10413k52735j097948
42634A239634r73304K85685J051569L23803p50949o68398K10951M17926l08651
42625H28266p89269l21337L94693M80477P7965j28686N0479K49674J53079k37717
42615G57624p02637q76868m44637M67760J247940J354148P88749p1663q46669
42606A673747j198669q80226r7487M23804J74729m51187o35386k26715J33023
42597a084367J5799k18805j17769J03827l495k35260O4881R13010J426597R35118
$$ plain form
42587 1799536 1687657 941069 267580 -112825 -378251 -616397 -800519 -1023187 -1330422
42578 -1330422 -1428716 -990597 -246394 156094 -24021 -309825 -152422 447143 1094895 1428535
42568 1428535 1222935 477362 -327380 -437697 329267 1229523 1448839 1044138 629401
42559 629401 424298 168813 -196634 -402778 -418118 -587860 -1085489 -1638381 -1881670 -1642101
42549 -1642101 -907964 48937 586632 296672 -291052 -251250 392753 617728 -31914 -625503
42539 -625503 -152349 1002307 1626846 1323377 809987 781502 1192291 1650828 1912399 1879437
42529 1879437 1548760 1058281 520789 -134857 -888979 -1372167 -1266069 -808252 -464926
42520 -464926 -258346 67316 351813 146347 -449608 -766109 -554968 -361764 -616191 -963655
$$ packed form
42587A799536j11879p46588o73489l80405k65426k38146j84122k22668l07235
42578a330422r8294M38119P44203M02488j80115k85804J57403N99565O47752L33640
42568A428535k05600p45573q04742j10317P66964R00256K19316m04701m14737
42559F29401k05103k55485l65447k06144j5340j69742m97629n52892k43289K39569
42549a642101P34137R56901N37695k89960n87724L9802O44003K24975o49642n93589
42539f25503M73154J154656O24539l03469n13390k8485M10789M58537K61571l2962
42529A879437l30677m90479n37492o55646p54122m83188J06098M57817L43326
42520d64926K06580L25662K84497k05466n95955l16501K11141J93204k54427l47464
$$ plain form
42510 -963655 -951157 -859812 -1227584 -1826681 -1805687 -876270 177770 374326 -400111 -1405194
42500 -1405194 -1935748 -1956895 -1888868 -1984664 -2078210 -1881171 -1312796 -472943 472676 1187190
42490 1187190 1184841 343629 -688105 -1038447 -634326 -269225 -509556 -972916 -1006290 -716356
42480 -716356 -826267 -1610110 -2443718 -2544146 -1866891 -1067343 -686689 -587510 -285610 257115
42470 257115 432441 -230465 -1261228 -1625809 -949355 52534 557981 631064 837307
42461 837307 1212064 1243613 830053 575764 872969 1226547 969986 327774 159389 704498
42451 704498 1207681 1011782 499657 491016 1024340 1339350 1005457 437086 103046 -195540
42441 -195540 -820622 -1466905 -1439267 -663541 134134 368768 301562 597939 1450162 2369114
$$ packed form
42510i63655J2498R1345l67772n99097K0994R29417J054040J96556p74437j005083
42500a405194n30554k1147O8027r5796r3546J97039N68375Q39853R45619P14514
42490A187190k349q41212j031734l50342M04121L65101k40331m63360l3374K89934
42480g16356j09911p83843q33608j00428O77255P99548L80654R9179L01900N42725
42470B57115J75326o62906j030763l64581O76454J001889N05447P3083K06243
42461H37307L74757L1549m13560k54289K97205L53578k56561o42212j68385N45109
42451G04498N03183j95899n12125q641N33324L15010l33893n68371l34040k98586
42441a95540o25082o46283K7638P75726P97675K34634o7206K96377Q52223R18952
$$ plain form
42431 2369114 2722593 2308106 1442658 614594 103670 -52124 162530 727797 1299061
42422 1299061 1295993 588311 -170085 -291319 51626 133995 -271051 -701986 -796494 -637945
42412 -637945 -275177 396507 1057123 973277 13065 -918770 -963380 -375339 5289 -71385
42402 -71385 -230379 -317849 -611996 -1268265 -2071527 -2693743 -2822980 -2224417 -1124753 -324266
42392 -324266 -383567 -857967 -901291 -442916 -76211 79170 521062 1285215 1650368 1273722
42382 1273722 788927 736151 617419 -247027 -1415488 -1717383 -766969 632846 1552190
42373 1552190 1772565 1530425 1023483 399567 -136616 -436770 -472465 -263504 46996 105095
42363 105095 -333769 -984244 -1280531 -1100660 -864454 -804820 -599428 -34462 347757 -222888
$$ packed form
42431B369114L53479m14487q65448q28064n10924j55794K14654N65267N71264
42422A299061l068p07682p58396j21234L42945Q2369m05046m30935r4508J58549
42412f37945L62768O71684O60616q3846r60212r31835m4610N88041L80628p6674
42402g1385j58994q7470k94147o56269q03262o22216j29237N98563J099664Q00487
42392c24266n9301m74400m3324M58375L66705J55381M41892P64153L65153l76646
42382A273722m84795n2776j18732q64446j168461l01895R50414J399815R19344
42373A552190K20375k42140n06942o23916n36183l00154l5695K08961L10500N8099
42363A05095m38864o50475k96287J79871K36206N9634K05392N64966L82219n70645
$$ plain form
42353 -222888 -1665056 -2962056 -3262197 -2747161 -2234303 -2130900 -2037485 -1371191 -189630
42344 -189630 745266 731672 -131242 -1052399 -1364889 -1103771 -759002 -650733 -704231 -712627
42334 -712627 -586541 -347094 -74767 62693 -139303 -745521 -1564823 -2203157 -2244734 -1548839
42324 -1548839 -512209 135197 74950 -160077 163819 952129 1364742 981641 334747
42315 334747 43172 -1019 -130699 -109703 474686 1341169 1814159 1871445 2084020 2472063
42305 2472063 2278986 1174998 -77639 -629569 -608733 -642086 -825912 -834598 -728146 -929523
42295 -929523 -1462489 -1800742 -1551210 -898805 -317635 -100190 -142149 14234 789910 1991658
42285 1991658 2828142 2776437 2163113 1537687 831623 -300497 -1588403 -2315742 -2289119
$$ packed form
42353b22888j442168j297000l00141N15036N12858J03403R3415O66294J181561
42344a89630R34896j3594q62914r21157l12490K61118L44769J08269n3498q396
42334g12627J26086K39447K72327J37460k01996o06218q19302o38334m1577O95895
42324a548839J036630O47406o0247k35027L23896P88310M12613l83101o46894
42315C34747k91575m4191j29680K0996N84389Q66483M72990N7286K12575L88043
42305B472063j93077j103988j252637n51930K0836l3353j83826q686J06452k01377
42295i29523n32966l38253K49532O52405N81170K17445m1959J56383P75676J201748
42285A991658Q36484n1705o13324o25426p06064j132120j287906p27339K6623
$$ plain form
42276 -2289119 -1939109 -1498803 -851167 -245343 -292301 -969588 -1438637 -1248408 -944251 -976273
42266 -976273 -820039 37016 908751 729687 -311725 -1032511 -1019231 -1027548 -1482278 -1695429
42256 -1695429 -1111459 -440249 -712440 -1678949 -2032549 -1139830 178798 753928 413202
42247 413202 -83145 -126980 123578 182155 -53048 -252939 -228532 -240266 -554446 -885747
42237 -885747 -646242 214136 984475 1041719 656370 599962 1083542 1516665 1366633 825993
42227 825993 396606 170310 -74153 -267957 -80556 416795 653565 390259 196151 639070
42217 639070 1301312 1236543 366248 -256140 178960 1160970 1597995 1230770 733910 595935
42207 595935 541006 165411 -360295 -502960 -26133 775522 1366993 1400744 986072 555998
$$ packed form
42276b289119L50010M40306O47636O05824m6958o77287m69049J90229L04157l2022
42266i76273J56234Q57055Q71735j79064j041412p20786J3280q317m54730k13151
42256a695429N83970O71210k72191r66509l53600Q92719J318628N75130l40726
42247D13202m96347m3835K50558N8577k35203j99891K4407j1734l14180l31301
42237h85747K39505Q60378P70339N7244l85349n6408M83580M33123j50032n40640
42227H25993m29387k26296k44463j93804J87401M97351K36770k63306j94108M42919
42217F39070O62242o4769q70295o22388M35100R82010M37025l67225m96860j37975
42207E95935n4929l75595n25706j42665M76827Q01655N91471L3751m14672m30074
$$ plain form
42197 555998 321854 -33653 -798459 -1477005 -1179728 70751 1037727 706630 -438619
42188 -438619 -1103691 -782387 -52473 442770 566454 352655 -104750 -337967 174543 1150688
42178 1150688 1633585 1255756 734184 763843 1061731 966945 405846 -260978 -815485 -1062988
42168 -1062988 -713907 -35804 -23380 -1084330 -2100369 -1818848 -742159 -410668 -1061851
42159 -1061851 -1428942 -931241 -539591 -977503 -1462527 -1070861 -238479 87478 -43731
42150 -43731 56130 476073 812763 1037983 1315211 1326584 698150 -176530 -580075 -508239
42140 -508239 -494865 -661264 -720976 -685202 -778715 -879984 -786219 -729203 -851856 -606230 358194
42129 358194 1158353 743488 -331958 -595778 55846 331962 -149232 -282832 384282
$$ packed form
42197E55998k34144l55507p64806o78546K97277J250479R66976l31097j145249
42188d38619o65072L21304P29914M95243J23684k13799m57405k33217N12510R76145
42178A150688M82897l77829n21572K9659K97888r4786n61099o66824n54507k47503
42168a062988L49081O78103J2424j060950j016039K81521J076689L31491o51183
42159a061851l67091M97701L91650m37912m85024L91666Q32382L25957j31209
42150d3731R9861M19943L36690K25220K77228J1373o28434q74680m03545P1836
42140e08239J3374j66399n9712L5774r3513j01269R3765N7016j22653K45626R64424
42129C58194Q00159m14865j075446k63820O51624K76116m81194j33600O67114
$$ plain form
42120 384282 716569 2261 -733155 -539484 -218824 -806793 -1573425 -1161706 94928
42111 94928 673550 212586 -247066 -143288 27568 4310 190869 605575 684917 408853
42101 408853 427888 728597 371466 -898632 -1881518 -1520254 -400385 200929 82504
42092 82504 -24419 84154 -140907 -803075 -1131443 -623192 52271 -132872 -1138250 -1839567
42082 -1839567 -1460816 -491188 93626 75786 -53480 -86042 -276645 -535954 -310012 409492
42072 409492 748006 150572 -783477 -1315841 -1699982 -2406192 -2859614 -2160817 -743587
42063 -743587 -6112 -312806 -652332 -464055 -477572 -1237814 -2003905 -1895513 -1202833 -704150
42053 -704150 -439587 -97949 -39209 -879543 -2301001 -3198718 -2987289 -2070459 -1057287
$$ packed form
42120C84282L32287p14308p35416J93671L20660n87969p66632M11719J256634
42111I4928N78622m60964m59652J03778J70856k3258J86559M14706P9342k76064
42101D08853J9035L00709l57131j270098r82886L61264J119869O01314j18425
42092H2504j06923J08573k25061o62168l28368N08251O75463j85143j005378p01317
42082a839567L78751R69628N84814j7840j29266l2562j90603k59309K25942P19504
42072D09492L38514n97434r34049n32364l84141p06210m53422O98797J417230
42063g43587P37475l06694l39526J88277j3517p60242p66091J08392O92680M98683
42053g04150K64563L41638N8740q40334j421458q97717K11429R16830J013172
$$ plain form
42044 -1057287 -169841 524438 882414 888391 759228 719560 830862 1001143 1018296 721154
42034 721154 299046 197534 543615 964004 1181852 1364955 1543975 1212008 107173
42025 107173 -1017385 -1177051 -501095 -12535 -169372 -467404 -529529 -667759 -1059997 -1209060
42015 -1209060 -758633 -223302 -283356 -777996 -1014775 -767437 -333799 175758 887343 1516679
42005 1516679 1391397 376685 -728406 -1046210 -527029 283743 1012833 1555911 1680453
41996 1680453 1162751 373779 160023 838792 1680683 1762923 1099090 499547 438301 560602
41986 560602 391515 54204 -18855 205242 334878 164831 -35307 67770 403713 618144
41976 618144 569857 521276 789655 1335788 1809588 1934345 1704037 1242083 664845 115335
$$ packed form
42044a057287Q87446O94279L57976N977j29163l9668J11302J70281J7153k97142
42034G21154m22108j01512L46081M20389K17848J83103J79020l31967j104835
42025A07173j124558j59666O75956M88560j56837k98032o2125j38230l92238j49063
42015a209060M50427N35331o0054m94640k36779K47338M33638N09557P11585O29336
42005A516679j25282j014712j105091l17804N19181Q10772P29090N43078J24542
41996A680453n17702p88972k13756O78769Q41891Q2240o63833n99543o1246J22301
41986E60602j69087l37311p3059K24097J29636j70047k00138J03077L35943K14431
41976F18144m8287m8581K68379N46133M73800J24757k30308m61954n77238n49510
$$ plain form
41966 115335 -265153 -454333 -454999 -113898 611744 1185064 858441 -209401 -820242 -247351
41956 -247351 707169 933558 749982 1285660 2391515 2583266 1325428 6531 -41286
41947 -41286 640593 716838 45555 -520346 -698330 -950093 -1389598 -1628962 -1631517 -1759002
41937 -1759002 -1986647 -1949300 -1766382 -1932072 -2311204 -2139749 -1218237 -269502 154161 325698
41927 325698 584186 709748 514765 363698 532725 591232 32263 -852726 -1300418 -1040382
41917 -1040382 -470330 -61137 27153 -91083 -134505 94942 345269 75351 -771458 -1493866
41907 -1493866 -1457908 -884580 -465615 -486084 -684199 -693668 -267852 615374 1476281 1515956
41897 1515956 562578 -494327 -763024 -517169 -644293 -1205961 -1377493 -757292 110796
$$ packed form
41966A15335l80488j89180o66L41101P25642N73320l26623j067842o10841N72891
41956b47351R54520K26389j83576N35678J105855J91751j257838j318897m7817
41947d1286O81879P6245o71283n65901j77984k51763m39505k39364k555j27485
41937a759002k27645L7347J82918j65690l79132J71455R21512R48735M23663J71537
41927C25698K58488J25562j94983j51067J69027N8507n58969q84989m47692K60036
41917a040382N70052M09193Q8290j18236m3422K29447K50327k69918q46809p22408
41907a493866L5958N73328M18965k0469j98115r469M25816Q83226Q60907L9675
41897A515956r53378j056905k68697K45855j27124n61668j71532O20201Q68088
$$ plain form
41888 110796 649540 915069 1113614 1133621 874029 468986 -90507 -961123 -1776755 -1691403
41878 -1691403 -624281 196218 -292806 -1409540 -1529337 -310341 806525 485559 -884233
41869 -884233 -1839754 -1590070 -642375 43229 55723 -310868 -605729 -744725 -954264 -1261330
41859 -1261330 -1272167 -663355 260557 828531 795680 544207 467660 523442 522017 497860 550742
41848 550742 580417 436507 139601 -261231 -820103 -1418592 -1604628 -1084104 -207616 463331
41838 463331 959192 1715587 2536475 2417582 847798 -1147537 -1915646 -1078298 32131
41829 32131 -5665 -1099975 -1993695 -1885503 -1176323 -629845 -354942 44520 642324 1017143
41819 1017143 891366 518118 270393 137904 -135174 -584744 -945549 -974338 -660712 -129525
$$ packed form
41888A10796N38744K65529J98545K0007k59592m05043n59493q70616q15632Q5352
41878a691403J067122Q20499m89024j116734j19797J218996J116866l20966j369792
41869h84233r55521K49684R47695O85604J2494l66591k94861j38996k09539l07066
41859a261330j0837O08812R23912N67974l2851k51473p6547N5782j425k4157N2882
41848E50742K9675j43910k96906m00832n58872n98489j86036N20524Q76488O70947
41838D63331M95861P56395Q20888j18893j569784j995335p68109Q37348J110429
41829C2131l7796j094310q93720J08192P09180N46478K74903L99462N97804L74819
41819A017143j25777l73248k47725j32489k73078m49570l60805k8789L13626N31187
$$ plain form
41809 -129525 499553 1089431 1403010 1183309 458164 -249339 -299822 250746 489526 -278797
41799 -278797 -1490487 -1964886 -1523075 -1170827 -1510124 -1910974 -1758796 -1562132 -1927641
41790 -1927641 -2227080 -1510363 -275498 66450 -635701 -1072536 -611328 -172839 -458841
41781 -458841 -688399 -3603 953664 983839 133696 -531357 -489688 -93639 327342 737223
41771 737223 959126 818377 606271 701618 900961 778912 459108 326395 281992 86777
41761 86777 115209 787409 1476184 1111466 -130469 -884734 -526272 58807 -30722 -486884
41751 -486884 -594195 -386500 -360180 -634302 -948751 -1064581 -818448 -233688 232843 141995
41741 141995 -119313 224282 952287 967080 165555 -62591 1011254 1999813 1279895 -576727
$$ packed form
41809a29525O29078N89878L13579k19701p25145p07503n0483N50568K38780p68323
41799b78797j211690m74399M41811L52248l39297m00850J52178J96664l65509
41790a927641k99439P16717J234865L41948p02151m36835M61208M38489k86002
41781d58841k29558O84796R57267L0175q50143o65053M1669L96049M20981M09881
41771G37223K21903j40749k12106R5347J99343j22049l19804j32713m4403j95215
41761H6777K8432O72200O88775l64718j241935p54265L58462N85079q9529m56162
41751d86884j07311K07695K6320k74122l14449j15830K46133N84760M66531r0848
41741A41995k61308L43595P28005J4793q01525k28146J073845R88559p19918j856622
$$ plain form
41731 -576727 -1628768 -1231776 -448189 -137675 -123723 -216303 -615759 -1044018 -746873 207340
41721 207340 707221 165803 -639315 -822319 -597333 -596608 -778218 -791731 -827907 -1252924
41711 -1252924 -1767730 -1742081 -1187111 -669863 -376320 17745 511802 518238 -292230 -1373397
41701 -1373397 -1925612 -1913938 -2093402 -3000309 -4159362 -4483648 -3458531 -1756788 -539142
41692 -539142 -266951 -446215 -464493 -290578 -239055 -431310 -757902 -1084684 -1176322 -668344
41682 -668344 456077 1492638 1604074 826629 74757 30351 420838 583888 328741
41673 328741 -125920 -723115 -1497644 -2028787 -1616110 -247977 1071312 1330804 555870
41664 555870 -495670 -1337161 -1917302 -2020187 -1290946 -30139 721107 333090 -582423
$$ packed form
41731e76727j052041L96992P83587L10514J3952r2580l99456m28259K97145R54213
41721B07340M99881n41418q05118j83004K24986P25j81610j3513l6176m25017
41711a252924n14806K5649N54970N17248K93543L94065M94057O436q10468j081167
41701a373397n52215J1674j79464r06907j159053l24286J025117J701743J217646
41692e39142K72191j79264j8278J73915N1523j92255l26592l26782r1638N07978
41682f68344J124421J036561J11436p77445p51872m4406L90487J63050k55147
41673C28741m54661n97195p74529n31143M12677J368133J319289K59492p74934
41664E55870j051540q41491n80141j02885P29241J260807P51246l88017r15513
$$ plain form
41655 -582423 -930269 -428520 277683 546340 286868 -286239 -920862 -1312723 -1261123 -982591
41645 -982591 -991322 -1540183 -2328924 -2781248 -2492049 -1524373 -485888 -154593 -689488 -1301720
41635 -1301720 -1074254 -50051 884990 1154190 1051866 1098225 1317896 1352255 926906 37373
41625 37373 -1002854 -1568498 -1160081 -48817 831979 842729 209864 -480848 -980079 -1348366
41615 -1348366 -1607391 -1720230 -1675867 -1396611 -832317 -259580 -85107 -218177 -168380 36094
41605 36094 -267369 -1171002 -1674139 -1073082 -147130 1262 -327098 -97393 474670 152302
41595 152302 -1070920 -1586243 -584988 621006 625274 23706 224889 1087338 1278946
41586 1278946 563334 152195 721131 1461839 1490312 1069924 879779 954057 993262 1066238
$$ packed form
41655e82423l47846N01749P06203K68657k59472n73107o34623l91861N1600K78532
41645i82591q731n48861p88741m52324K89199R67676J038485L31295n34895o12232
41635a301720K27466J024203R35041K69200j02324M6359K19671L4359m25349q89533
41625C7373j040227n65644M08417J111264Q80796J0750o32865o90712m99231l68287
41615a348366k59025j12839M4363K79256N64294N72737J74473j33070M9797K04474
41605C6094l03463r03633n03137O01057R25952J48392l28360K29705N72063l22368
41595A52302j223222n15323J001255J205994M268o01568K01183Q62449J91608
41586A278946p15612m11139N68936P40708K8473m20388j90145P4278L9205P2976
$$ plain form
41576 1066238 1338944 1574064 1503820 1328922 1299531 1167713 661922 200402 433358 1206741
41566 1206741 1665597 1407941 925539 787514 941875 1046642 1043313 1102314 1280022 1485484
41556 1485484 1614320 1559440 1253156 791941 332207 -182458 -919161 -1694790 -1947225 -1381469
41546 -1381469 -395314 382755 795793 1162915 1739933 2438133 3001509 3230229 3045822
41537 3045822 2505862 1770660 986771 241046 -351039 -634720 -546177 -129942 579354 1480286
41527 1480286 2193900 2272237 1781835 1347507 1362067 1474263 1206419 763726 712436 1017463
41517 1017463 1003768 343106 -435252 -613311 -86793 694768 1250119 1294495 766318 -14732
41507 -14732 -378008 119890 1099551 1593979 1005830 -265521 -1226971 -1259254 -613130 7533
$$ packed form
41576A066238K72706K35120p0244j74898k9391j31818n05791m61520K32956P73383
41566A206741M58856k57656m82402j38025J54361J04767l329N9001J77708K05462
41556A485484J28836n4880l06284m61215m59734n14665p36703p75629k52435N65756
41546a381469R86155P78069M13038L67122N77018O98200N63376K28720j84407
41537C045822n39960p35202p83889p45725n92085k83681Q8543M16235P09296R00932
41527A480286P13614P8337m90402m34328J4560J12196k67844m42693n1290L05027
41517A017463j3695o60662p78358j78059N26518P81561N55351M4376n28177p81050
41507a4732l63276M97898R79661M94428n88149j271351r61450l2283O46124O20663
$$ plain form
41497 7533 208217 159695 202452 416987 642098 728942 627978 337042 -64550 -362474
41487 -362474 -317520 149220 883947 1536454 1695614 1203931 428559 13892 223871 703568
41477 703568 998284 1054601 1048895 1046077 1117403 1489668 2179742 2715357 2668029 2293152 2167454
41466 2167454 2324768 2274439 1811303 1260340 912703 759697 823951 1181610 1548388 1430859
41456 1430859 893079 635571 1067351 1789902 2235861 2300831 2073643 1509292 757199 290581
41446 290581 247324 94408 -578177 -1362573 -1626979 -1364501 -907277 -272450 524106 946592
41436 946592 585836 32509 181523 843868 1053923 695553 675719 1297494 1681765 1331241
41426 1331241 1123336 1883151 2886502 2890316 2045640 1560750 1762822 1778318 1176904 686571
$$ packed form
41497G533K00684m8522M2757K14535K25111Q6844j00964k90936m01592k97924
41487c62474M4954M66740P34727O52507J59160m91683p75372m14667K09979M79697
41477G03568K94716N6317n706k818P1326L72265O90074N35615m7328l74877j25698
41466B167454J57314n0329m63136n50963l47637j53006O4254L57659L66778j17529
41456A430859n37780k57508M31780P22551M45959O4970k27188n64351p52093m66618
41446B90581m3257j52916o72585p84396k64406K62478M57224O34827P96556M22486
41436I46592l60756n53327J49014O62345K10055l58370j9834O21775L84271l50524
41426A331241k07905P59815J003351L814q44676m84890K02072J5496o01414m90333
$$ plain form
41416 686571 885069 1228680 1004599 463960 304427 600128 945442 1190404 1297747 877247
41406 877247 -273232 -1395316 -1466628 -654393 -191645 -681702 -1374758 -1370146 -706900 106473
41396 106473 836909 1286646 1058723 234149 -320180 -36409 484291 426118 43031 93868
41386 93868 470706 491085 285806 673010 1647361 2197159 1847225 1273912 1052801 880327
41376 880327 515712 436513 877979 1142978 680588 102837 269874 979165 1445012 1562467
41366 1562467 1772816 2089254 2244286 2566976 3724803 5595475 7194891 7810707 7677684
41357 7677684 7649359 8719352 11517062 15443279 18480052 18780588 16520229 13475488 10887986
41348 10887986 8639695 6476701 4856016 4138437 3858449 3388533 2717305 2101726 1526114
$$ packed form
41416F86571J98498L43611k24081n40639j59533K95701L45314K44962J07343m20500
41406H77247j150479j122084p1312Q12235M62748m90057o93056M612O63246Q13373
41396A06473P30436M49737k27923q24574n54329K83771N20700n8173l83087N0837
41386I3868L76838K0379k05279L87204R74351N49798l49934n73313k21111j72474
41376H80327l64615p9199M41466K64999m62390n77751J67037P09291M65847J17455
41366A562467K10349L16438J55032L22690J157827J870672J599416O15816j33023
41357G677684k8325J069993K797710L926217L036773L00536k260359l044741k587502
41348A0887986k248291k162994j620685p17579k79988m69916o71228o15579n75612
$$ plain form
41339 1526114 977274 723278 818237 790237 335050 -67306 244298 1173249 2009808 2306277
41329 2306277 2188366 1962712 1795148 1685579 1499226 1113886 658344 401423 337101 223110
41319 223110 120629 409860 1063087 1456182 1248883 896409 836314 760152 335294 95117
41309 95117 704874 1650822 1683881 574467 -522671 -658891 -195212 41272 -57861 -94940
41299 -94940 -10633 -53237 -179072 -91939 194901 325710 166608 35696 266625 771309
41289 771309 1137233 1041948 526555 -65531 -397141 -394205 -163073 271350 919089 1495814
41279 1495814 1500660 883589 351397 597823 1364982 1726065 1280279 581959 282799 347934
41269 347934 376399 246920 52892 -252521 -657379 -762204 -187129 769507 1374632 1349931
$$ packed form
41339A526114n48840k53996R4959k8000m55187m02356L11604R28951Q36559K96469
41329B306277j17911k25654j67564j09569j86353l85340m55542k56921o4322j13991
41319B23110j02481K89231O53227L93095k07299l52474o0095p6162m24858k40177
41309I5117O09757R45948L3059j109414j097138j36220M63679K36484r9133l7079
41299i4940Q4307m2604j25835Q7133K86840J30809j59102j30912K30929N04684
41289G71309L65924r5285n15393n92086l31610K936K31132M34423O47739N76725
41279A495814M846o17071n32192K46426P67159L61083m45786o98320k99160O5135
41269C47934K8465j29479j94028l05413m04858j04825N75075R56636O05125k4701
$$ plain form
41259 1349931 1056047 802381 509841 153525 -12435 102613 228242 227596 350836 729354
41249 729354 1062839 1119216 1105045 1212807 1302129 1434841 2124116 3401541 4166992 3361286
41239 3361286 1521828 259483 285743 861629 1193342 1353054 1547852 1457543 887360
41230 887360 387360 551442 1116472 1344626 1012705 504331 138523 -92624 -217134 -135823
41220 -135823 208451 750182 1342561 1732464 1641123 1052899 294207 -315964 -729557 -969857
41210 -969857 -918302 -499530 140164 859453 1723317 2732418 3530167 3670709 3104173 2176787
41200 2176787 1223142 364819 -342019 -781249 -852760 -572169 -42681 648636 1447654 2172075
41190 2172075 2402219 1812347 727333 8596 77345 352884 93764 -485706 -545655 87799
$$ packed form
41259A349931k93884k53666k92540l56316j65960J15048J25629o46J23240L78518
41249G29354L33485N6377j4171J07762Q9322J32712O89275J277425P65451q05706
41239C361286j839458j262345K6260N75886L31713J59712J94798r0309n70183
41230H87360n00000J64082N65030K28154l31921n08374l65808k31147j24510Q1311
41220a35823L44274N41731N92379L89903r1341n88224p58692o10171m13593k40300
41210i69857N1555M18772O39694P19289Q63864J009101P97749J40542n66536r27386
41200B176787r53645q58323p06838m39230p1511K80591N29488O91317P99018P24421
41190B172075K30144n89872j085014p18737O8749K75539k59120n79470n9949O33454
$$ plain form
41180 87799 670123 605973 93342 -409719 -705736 -685771 -294191 125274 97412 -152501
41170 -152501 158378 1118614 1789807 1530945 873762 548865 407479 -9702 -511181 -644716
41160 -644716 -508518 -403920 -163221 417442 964884 1144236 1376081 2048670 2530253 2033869
41150 2033869 1068462 837158 1424319 1833599 1741629 1878855 2526036 2962176 2788612 2579950
41140 2579950 2673534 2424585 1369241 178936 -345427 -453004 -777566 -1143647 -955987
41131 -955987 -335514 52075 59999 110323 281146 123712 -524295 -1153487 -1210419 -750261
41121 -750261 -315284 -351929 -776213 -1009003 -550607 367695 922852 666793 82657 -80447
41111 -80447 264756 638028 748420 684969 502818 154749 -144333 14716 628827 1130161
$$ packed form
41180H7799N82324o4150n12631n03061k96017J9965L91580M19465k7862k49913
41170a52501L10879R60236O71193k58862o57183l24897j41386m17181n01479j33535
41160f44716J36198J04598K40699N80663N47442J79352K31845O72589M81583m96384
41150B033869r65407k31304N87161M09280r1970J37226O47181M36140j73564k08662
41140B579950R3584k48949j055344j190305n24363j07577l24562l66081J87660
41131i55987O20473L87589P924N0324J70823j57434o48007o29192n6932M60158
41121g50261M34977l6645m24284k32790M58396R18302N55157k56059n84136j63104
41111h0447L45203L73272J10392o3451j82151l48069k99082J59049O14111N01334
$$ plain form
41101 1130161 1097834 846763 963891 1370304 1246641 55603 -1610559 -2516883 -2088382
41092 -2088382 -926863 34559 523679 820219 1013936 902595 539528 320042 375043
41083 375043 312847 -198771 -902322 -1247037 -1003909 -385221 266059 711876 872622 812780
41073 812780 638197 392980 135384 2545 -16672 -226902 -783891 -1226954 -956468 -146482
41063 -146482 430062 558660 825434 1437556 1640656 922659 79132 172741 862910 819374
41053 819374 -295456 -1299771 -1177725 -398594 -70528 -420297 -730410 -449644 214364
41044 214364 711843 736877 397025 61304 33244 225130 250794 -14123 -149751 266345
41034 266345 974833 1250938 808225 161362 1702 469167 1127777 1394428 886964 -312225
$$ packed form
41101A130161l2327k51071J17128M06413j23663j191038j666162r06324M28501
41092b088382J161519R61422M89120K96540J93717j11341l63067k19486N5001
41083C75043o2196n11618p03551l44715K43128O18688O51280M45817J60746n9842
41073H12780j74583k45217k57596j32839j9217k10230n56989m43063K70486Q09986
41063a46482N76544J28598K66774O12122K03100p17997q43527R3609O90169m3536
41053H19374j114830j004315J22046P79131L28066l49769l10113K80766O64008
41044B14364M97479K5034l39852l35721k8060J91886K5664k64917j35628M16096
41034B66345P08488K76105m42713o46863j59660M67465O58610K66651n07464j199189
$$ plain form
41024 -312225 -1485513 -1678331 -679810 531911 743180 -130020 -1019408 -1025598 -288142 561436
41014 561436 1276428 1973258 2600042 2876917 2641921 1958338 1017114 197197 23819 678868
41004 678868 1614852 2009735 1632124 1002518 705411 808595 1002729 1073252 1109200 1337496
40994 1337496 1818812 2305169 2430917 2033482 1214086 187098 -698215 -909348 -176937
40985 -176937 936424 1432010 1049564 523884 398398 231275 -495785 -1286405 -1219275 -254072
40975 -254072 843097 1618776 2171570 2485023 2433245 2395308 2903887 3556277 3246041 1849210
40965 1849210 823255 1531451 3586526 5601983 7319897 10188410 15456325 21911064
40957 21911064 26044131 25040956 19699706 13817359 10370700 8941622 7401054 5176950
$$ packed form
41024c12225j173288j92818R98521J211721K11269q73200q89388o190P37456Q49578
41014E61436P14992O96830O26784K76875k34996o83583r41224q19917j73378O55049
41004F78868R35984L94883l77611o29606k97107J03184J94134P0523L5948K28296
40994A337496M81316M86357J25748l97435q19396j026988q85313k11133P32411
40985a76937J113361M95586l82446n25680j25486j67123p27060p90620O7130R65203
40975b54072J097169P75679N52794L13453n1778l7937N08579O52390l10236j396831
40965A849210j025955P08196K055075K015457J717914K868513N267915O454739
40957B1911064M133067j003175n341250n882347l446659j429078j540568k224104
$$ plain form
40949 5176950 3584305 3417365 3857048 3974172 3882059 3833248 3363165 2149276 889730
40940 889730 468198 736423 833022 398000 -70783 117540 1121464 2304775 2650085
40931 2650085 1804399 643334 241471 435633 239954 -423740 -574064 61325 410173
40922 410173 -247664 -1104203 -1120175 -507368 -20375 390898 1207228 2215194 2749724 2707089
40912 2707089 2515593 2391328 2267120 2151559 2032899 1781800 1548395 1756371 2339921
40903 2339921 2649505 2516445 2578602 3018499 2960342 1925344 937153 1118232 1938347 2029244
40893 2029244 1201112 466986 411391 678021 946575 1442533 2428965 3787342 5009935
40884 5009935 5296073 4138839 2213909 1007564 1063441 1406212 1247896 1170859 1745264
$$ packed form
40949E176950j592645j66940M39683J17124r2113m8811m70083j213889j259546
40940H89730m21532K68225R6599m35022m68783J88323J003924J183311L45310
40931B650085q45686j161065m01863J94162j95679o63694j50324O35389L48848
40922D10173o57837q56539j5972O12807M86993M11273Q16330J007966N34530m2635
40912B707089j91496j24265j24208j15561j18660k51099k33405K07976N83550
40903B339921L09584j33060O2157M39897n8157j034998r88191J81079Q20115R0897
40893B029244q28132p34126n5595K66630K68554M95958R86432J358377J222593
40884E009935K86138j157234j924930j206345N5877L42771j58316p7037N74405
$$ plain form
40875 1745264 2149401 1463362 413265 366578 1233656 1785485 1550728 1040124 535225
40866 535225 -21766 -324917 -128481 48024 -213885 -245763 601233 1568594 1613196 1207787
40856 1207787 1459713 2113035 2159576 1856178 2259243 3167889 3435549 3026141 2859453 2876197
40846 2876197 2229933 1240185 1142992 1922612 2327421 2039660 1934816 2221742 2250869 2136769
40836 2136769 2648750 3568039 4057302 4389347 5241582 5733816 4615732 2994087 3100076
40827 3100076 4599880 5148605 4481590 4635476 5998990 6720870 6470904 7104283 8922364
40818 8922364 10045247 10317115 11923852 15221109 18093499 20414295 24619623 30931077
40810 30931077 37284791 45076515 58692534 78294305 101866549 136897473 196754694
$$ packed form
40875A745264M04137o86039j050097m6687Q67078N51829k34757n10604n04899
40866E35225n56991l03151J96436J76505k61909l1878Q46996R67361M4602m05409
40856A207787K51926O53322M6541l03398M03065R08646K67660m09408j66688J6744
40846B876197o46264r89748r7193P79620M04809k87761j04844K86926K9127j14100
40836B136769N11981R19289M89263L32045Q52235M92234j118084j621645J05989
40827C100076J499804N48725o67015J53886J363514P21880k49966O33379J818081
40818H922364J122883K71868J606737L297257K872390K320796M205328O311454
40810C0931077O353714P791724J3616019J9601771K3572244L5030924N9857221
$$ plain form
40803 196754694 274924771 333280003 332975821 275925247 202506154 148322064 116360737
40796 116360737 92556152 71558950 57203823 48948907 41308477 33250273 28299841
40789 28299841 26614528 24429811 20704397 18073729 17356508 16377864 14390549 13104200
40781 13104200 12904592 11979697 9837972 8386367 8768851 9814528 10237897 10101581 9641124
40772 9641124 8703888 7799788 7946298 9109294 10230820 10878936 11543058 12495181 13778215
40763 13778215 16021569 19797413 24588754 29962176 37066982 46713611 56106917 59990007
40755 59990007 55860942 46436669 36374138 28120348 21635021 16508624 12918112 11081111
40747 11081111 10729498 11033044 10883115 9708223 8109322 7172252 7130795 7255257 6964753
$$ packed form
40803A96754694P8170077N8355232l04182n7050574p3419093n4184090l1961327
40796A16360737k3804585k0997202j4355127q254916p640430q058204m950432
40789B8299841j685313k184717l725414k630668p17221r78644j987315j286349
40781A3104200j99608r24895k141725j451605L82484J045677M23369j36316m60457
40772I641124r37236r04100J46510J162996J121526O48116O64122R52123J283034
40763A3778215K243354L775844M791341N373422P104806R646629R393306L883090
40755E9990007m129065r424273j0062531q253790o485327n126397l590512j837001
40747A1081111l51613L03546j49929j174892j598901r37070m1457J24462k90504
$$ plain form
40738 6964753 6353074 5649337 4885199 4153972 3589001 3079244 2525384 2206514 2283717 2212853
40728 2212853 1452387 558013 651694 1828850 2986724 3312385 3097355 2922025 2832887
40719 2832887 2607187 2201432 1656722 1030821 595134 657325 1062783 1284045 1108290 877437
40709 877437 978955 1396897 1790445 1821388 1520456 1472272 2290085 3642385 4294718 3594628
40699 3594628 2427493 2067054 2520293 2787970 2427342 1954182 1814857 1833073 1763821 1710324
40689 1710324 1836183 2102979 2321002 2175866 1442830 529648 376794 1258002 2122328
40680 2122328 1843197 743170 95339 447775 1267783 1910188 2028126 1347886 74477
40671 74477 -711936 -181037 860038 870017 -190599 -794308 -132178 854971 1089012 764203
$$ packed form
40738F964753o11679p03737p64138p31227n64971n09757n53860l18870P7203p0864
40728B212853p60466q94374R3681J177156J157874L25661k15030j75330q9138
40719B832887k25700m05755n44710o25901m35687O2191M05458K21262j75755k30853
40709H77437J01518M17942L93548L0943l00932m8184Q17813J352300O52333p00090
40699C594628j167135l60439M53239K67677l60628m73160j39325J8216o9252n3497
40689A710324J25859K66796K18023j45136p33036r13182j52854Q81208Q64326
40680B122328k79131j100027o47831L52436Q20008O42405J17938o80240j273409
40671G4477p86413N30899J041075R979j060616o03709O62130R87149K34041l24809
$$ plain form
40661 764203 590115 670730 765914 830487 759113 389801 195152 1034022 2661398 3476937
40651 3476937 2522695 839214 -53856 -193204 -600782 -1354918 -1562984 -984498 -360564
40642 -360564 -49723 474111 1414223 1958707 1405699 278038 -380217 -366979 -249154 -194685
40632 -194685 264435 1233045 2086826 2578068 3598399 5970616 8791315 10017497 8862925
40623 8862925 6709398 5280592 4801451 4604959 4746170 5958026 8297279 10755488 12173861
40614 12173861 11938803 10042251 7241311 4970495 4200486 4354102 4083064 3050185 2117567
40605 2117567 1823190 1677514 1180779 611953 434623 655719 1110896 1721191 2194107
40596 2194107 2165439 1895818 2056733 2521612 2253416 889397 -442856 -619026 -105874
$$ packed form
40661G64203j74088Q0615R5184O4573p1374l69312j94649Q38870J627376Q15539
40651C476937r54242j683481q93070j39348m07578p54136k08066N78486O23934
40642c60564L10841N23834R40112N44484n53008j127661o58255J3238J17825N4469
40632a94685M59120R68610Q53781M91242J020331K372217K820699J226182j154572
40623H862925k153527j428806m79141j96492J41211J211856K339253K458209J418373
40614A2173861k35058j896552k800940k270816p70009J53616k71038j032879r32618
40605B117567k94377j45676m96735n68826j77330K21096M55177O10295M72916
40596B194107k8668k69621J60915M64879k68196j364019j332253j76170N13152
$$ plain form
40587 -105874 -176486 -1025583 -1608033 -1160313 -44142 937864 1396050 1381863 1046579 529147
40577 529147 27258 -168790 184104 949792 1500455 1287673 561623 113290 209163 268869
40567 268869 -194443 -824778 -964227 -530994 47011 473673 757943 937248 971783 833879
40557 833879 527753 128447 -152920 -140915 89403 448454 1168939 2441210 3785539
40548 3785539 4395307 4141085 3591266 2987154 1982318 578315 -550591 -1036349 -1306698
40539 -1306698 -1655922 -1648415 -996454 -217381 251240 805398 1758822 2426700 2079023 1200111
40529 1200111 769667 790941 634675 417727 755488 1328110 1076804 10293 -447259
40520 -447259 607640 2257516 2993650 2535892 1851613 1893160 2858080 4310801 5525692
$$ packed form
40587a05874p0612q49097n82450M47720J116171R82006M58186j4187l35284n17432
40577E29147n01889j96048L52894P65688N50663k12782p26050m48333R5873N9706
40567B68869m63312o30335j39449M33233N78005M26662K84270J79305L4535j37904
40557H33879l06126l99306k81367J2005K30318L59051P20485J272271J344329
40548C785539O09768k54222n49819o04112j004836j404003j128906m85758k70349
40539a306698l49224P507O51961P79073M68621N54158R53424O67878l47677q78912
40529A200111m30444K1274j56266k16948L37761N72622k51306j066511m57552
40520d47259J054899J649876P36134m57758o84279M1547R64920J452721J214891
$$ plain form
40511 5525692 5948878 5734594 5664730 6214319 6836271 6488863 4840635 2712008 1262467
40502 1262467 866335 913164 706938 328906 330365 716090 800811 261545 -255299 -44219
40492 -44219 599993 855353 589107 367727 395417 250793 -209253 -413988 136957 1157064
40482 1157064 1953069 2154403 1828111 1246535 823913 947962 1527992 1937719 1747925
40473 1747925 1356015 1521048 2325776 2986223 2825810 2151623 1880594 2403276 3159820
40464 3159820 3416612 3108918 2636209 2113636 1317671 304221 -438531 -557110 -131736
40455 -131736 669680 1743222 2704667 2962245 2468252 1938070 1969335 2375697 2731016 3040884
40445 3040884 3385336 3418147 2886112 2271474 2209816 2525475 2539582 2128977 1762231 1638621
$$ packed form
40511E525692M23186k14284o9864N49589O21952l47408j648228k128627j449541
40502A262467l96132M6829k06226l78032J459L85725Q4721n39266n16844K11080
40492d4219O44212K55360k66246k21380K7690j44624m60046k04735N50945J020107
40482A157064P96005K01334l26292n81576m22622J24049N80030M09727j89794
40473A747925l91910J65033Q04728O60447j60413o74187k71029N22682P56544
40464C159820K56792l07694m72709n22573p95965j013450p42752j18579M25374
40455a31736Q01416J073542R61445K57578m93993n30182L1265M06362L55319L09868
40445C040884L44452L2811n32035o14638o1658L15659J4107m10605l66746j23610
$$ plain form
40435 1638621 1554937 1568122 1997409 2675836 2910236 2356540 1355550 314355 -600886
40426 -600886 -1046733 -541730 737093 1841493 2178491 2242127 2754560 3527756 3772034
40417 3772034 3278760 2654181 2366177 2100500 1318794 163463 -550391 -256299 709402
40408 709402 1542738 1882564 1967739 1948577 1532976 561399 -459031 -817559 -432412 122172
40398 122172 308017 59730 -344327 -562378 -411452 -71 441572 885305 1366952 1526331
40388 1526331 867705 -296723 -858521 -351329 281151 17139 -758363 -958905 -494192
40379 -494192 -235945 -554951 -948679 -1061145 -1082994 -1090273 -906078 -730915 -1044887 -1713125
40369 -1713125 -1971266 -1481072 -705142 -118598 262428 503833 612481 791132 1123837
$$ packed form
40435A638621q3684J3185M29287O78427K34400n53696j000990j041195r15241
40426f00886m45847N05003J278823J104400L36998O3636N12433P73196K44278
40417C772034m93274o24579k88004k65677p81706j155331p13854K94092R65701
40408G09402Q33336L39826Q5175j9162m15601r71577j020430l58528L85147N54584
40398A22172J85845k48287m04057k18051J50926M11381M41643M43733M81647J59379
40388A526331o58626j164428n61798N07192O32480k64012p75502k00542M64713
40379d94192K58247l19006l93728j12466k1849p279J84195J75163l13972o68238
40369a713125k58141M90194P75930N86544L81026K41405J08648J78651L32705
$$ plain form
40360 1123837 1117084 410043 -246011 165368 1207599 1475412 863904 765496 1615964 1979538
40350 1979538 938158 -245461 -135286 562992 275073 -823135 -1194184 -417956 420792
40341 420792 679735 936600 1638301 2271561 2286802 1907638 1595948 1365109 970490 347331
40331 347331 -334589 -748947 -561724 159931 793946 785114 282667 -165236 -290662 -114420
40321 -114420 345694 873668 935381 341977 -305602 -418033 -259646 -333554 -421883 -110793
40311 -110793 181359 -196606 -771534 -430789 756875 1477952 1150889 734966 1121740
40302 1121740 1853139 2097143 1944128 1932799 2012674 1816388 1452274 1248816 1104397 795635
40292 795635 551714 588367 428270 -454210 -1520032 -1644989 -734511 72779 47521 -180451
$$ packed form
40360A123837o753p07041o56054M11379J042231K67813o11508r8408Q50468L63574
40350A979538j041380j183619J10175O98278k87919j098208l71049P76228Q38748
40341D20792K58943K56865P01701O33260J5241l79164l11690k30839l94619o23159
40331C47331o81920m14358J87223P21655O34015q832n02447m47903j25426J76242
40321a14420M60114N27974O1713n93404o47579j12431J58387p3908q8329L11090
40311a10793K92152l77965n74928L40745J187664P21077l27063m15923L86774
40302A121740P31399K44004j53015j1329P9875j96286l64114k03458j44419l08762
40292G95635k43921L6653j60097q82480j065822j24957R10478Q07290k5258k27972
$$ plain form
40282 -180451 210333 910290 1075178 700720 482719 562753 423273 83035 356013 1493686
40272 1493686 2447340 2160436 956373 -101498 -675267 -1098304 -1320255 -999684 -450423
40263 -450423 -366179 -622332 -487843 -84031 -344742 -1263211 -1586832 -822111 -121160 -305703
40253 -305703 -410032 565272 1679279 1423310 179838 -450476 -208447 -185354 -513127
40244 -513127 -26052 1527223 2756757 2738816 2365491 2846824 4121263 5596033 7432501
40235 7432501 10151424 13599854 16982978 19356062 19700442 17399633 13286348 9446309
40227 9446309 7271050 6295274 5450417 4607706 4159522 3945535 3595244 3322013 3377099
40218 3377099 3216827 2239999 961206 397730 557851 574144 133031 -311144 -631663
$$ packed form
40282a80451L90784O99957J64888l74458k18001Q0034j39480l40238K72978J137673
40272A493686R53654k86904j204063j057871n73769m23037k21951L20571N49261
40263d50423Q4244k56153J34489M03812k60711r18469l23621P64721P00951j84543
40253c05703j04329R75304J114007k55969j243472o30314K42029K3093l27773
40244e13127M87075J553275J229534j7941l73325M81333J274439J474770J836468
40235G432501K718923L448430L383124K373084L44380k300809m113285l840039
40227I446309k175259r75776q44857q42711m48184k13987l50291k73231N5086
40218C377099j60272r76828j278793n63476J60121J6293m41113m44175l20519
$$ plain form
40209 -631663 -1160233 -1626253 -1162288 241045 1320410 1160090 429448 378761 1231959
40200 1231959 2219518 2698617 2558464 1882915 929783 280367 364042 836806 907903 288772
40190 288772 -553031 -1016639 -850455 -109360 876828 1495681 1343672 833329 791326 1280991
40180 1280991 1404987 610431 -409798 -682953 -312994 -67711 78424 948573 2606165
40171 2606165 3806210 3505347 2197803 1143442 818853 821408 898246 1249945 1916746
40162 1916746 2570497 2985578 3213261 3262922 3072306 2814339 2784565 2941544 2970206 2829244
40152 2829244 2821162 3076492 3361673 3426399 3158360 2430982 1285719 275092 61256 552508
40142 552508 982850 1013829 1172841 1907916 2769316 2987667 2480373 1802724 1329211 926930
$$ packed form
40209f31663n28570m66020M63965J403333J079365j60320p30642n0687Q53198
40200A231959R87559M79099j40153o75549r53132o49416Q3675M72764P1097o19131
40190B88772q41803m63608J66184P41095R86188O18853j52009n10343m2003M89665
40180A280991J23996p94556j020229k73155L69959K45283J46135Q70149J657592
40171B606165J200045l00863j307544j054361l24589K555P6838L51699O66801
40162A916746O53751M15081K27683M9661j90616k57967k9774J56979K8662j40962
40152B829244q082K55330K85181O4726k68039p27378j145263j010627k13836M91252
40142E52508M30342L0979J59012P35075Q61400K18351n07294o77649m73513m02281
$$ plain form
40132 926930 354222 -351241 -894650 -997626 -689831 -330303 -189303 -81367 295010 743423
40122 743423 766157 389882 220354 506872 746010 509469 73246 -200574 -532572 -1174552
40112 -1174552 -1643703 -1258244 -224643 539567 622964 497569 631066 869838 916224 859463
40102 859463 865331 720187 121963 -751018 -1358095 -1434856 -1180360 -821368 -392873 -91066
40092 -91066 -385452 -1331392 -2052425 -1557622 -78090 1067005 1099591 582749 282706 48709
40082 48709 -513685 -987209 -743784 -132692 32947 -91983 338878 1234725 1507950 828611
40072 828611 175366 266298 691164 1151926 2275805 4306804 6097333 6550037 6307721
40063 6307721 6868761 8534315 10246898 11003608 10464462 8665213 6233185 4512643 4301618
$$ packed form
40132I26930n72708p05463n43409j02976L07795L59528J41000J07936L76377M48413
40122G43423K2734l76275j69528K86518K39138k36541m36223k73820l31998o41980
40112a174552m69151L85459J033601P64210Q3397j25395J33497K38772M6386n6761
40102H59463N868j45144n98224q72981o07077p6761K54496L58992M28495L01807
40092i1066k94386r45940p21033M94803J479532J145095L2586n16842l00043k33997
40082D8709n62394m73524K43425O11092J65639j24930M30861Q95847K73225o79339
40072H28611o53245R0932M24866M60762J123879K030999J790529M52704k42316
40063F307721N61040J665554J712583P56710n39146j799249k432028j720542k11025
$$ plain form
40054 4301618 4656439 4051939 2547458 1612749 1887130 2440720 2443550 2221816 2156673 1773362
40044 1773362 771242 40457 602674 1996511 2682654 1937906 603614 -70287 270911
40035 270911 1072009 1681585 1878742 1796597 1635307 1507842 1436034 1402750 1432746 1633135
40025 1633135 2032159 2319959 1995836 1021784 87008 -187195 -82090 -225473 -377226
40016 -377226 344379 1911249 3050572 2903775 2141546 1838909 2076546 2390698 2789665
40007 2789665 3362050 3550525 2930251 2227435 2387772 2957301 2624191 1238051 62545
39998 62545 -32596 521649 1053616 1505357 1896940 1905034 1434928 916313 677044 590784
39988 590784 532939 570789 549081 123285 -627987 -1184497 -1244211 -866228 -80076 940407
$$ packed form
40054D301618L54821o04500j504481r34709K74381N53590K830k21734o5143l83311
40044A773362j002120p30785N62217J393837O86143p44748j334292o73901L41198
40035B70911Q01098O09576J97157q2145j61290j27465p1808l3284K9996K00389
40025A633135L99024K87800l24123r74052r34776k74203J05105j43383j51753
40016c77226P21605J566870J139323j46797p62229l02637K37637L14152L98967
40007B789665N72385J88475o20274p02816J60337N69529l33110j386140j175506
39998F2545r5141N54245N31967M51741L91583Q094m70106n18615k39269q6260
39988E90784n7845L7850k1708m25796p51272n56510n9714L77983P86152J020483
$$ plain form
39978 940407 1494926 1063190 293949 275261 890790 1081324 740414 903154 1737009 1902753
39968 1902753 673897 -664848 -570208 637392 1471035 1287818 553975 -225898 -755511
39959 -755511 -580776 476703 1718321 2190463 1753084 988274 375818 112883 362278
39950 362278 1042219 1627102 1669206 1284950 806464 361924 100403 275698 739722 947085
39940 947085 801680 777179 864380 384716 -583808 -720889 668279 2295704 2535609 1591895
39930 1591895 785615 438607 -82365 -743771 -855287 -512261 -542691 -1008133 -1124700 -780735
39920 -780735 -799923 -1420647 -1736286 -1080112 35035 782991 962853 694624 12141 -789715
39910 -789715 -1088155 -656479 48991 592809 1018840 1395427 1493350 1211513 841580 642285
$$ packed form
39978I40407N54519m31736p69241j8688O15529J90534l40910J62740Q33855J65744
39968A902753j228856j338745R4640J207600Q33643j83217p33843p79873n29613
39959g55511J74735J057479J241618M72142m37379p64810o12456k62935K49395
39950C62278O79941N84883M2104l84256m78486m44540k61521J75295M64024K07363
39940I47085j45405k4501Q7201m79664r68524j37081J389168J627425K39905r43714
39930A591895q06280l47008n20972o61406j11516L43026l0430m65442j16567L43965
39920g80735j9188o20724l15639O56174J115147P47956J79862k68229o82483q01856
39910g89715k98440M31676P05470N43818M26031L76587R7923k81837l69933j99295
$$ plain form
39900 642285 533366 379415 213790 74417 -59886 -159656 -268419 -596433 -1135299 -1436108
39890 -1436108 -1219769 -851487 -639533 -133221 1069952 2260850 2395848 1646655 1070002
39881 1070002 967436 810000 629614 1030994 1737874 1663074 762490 296035 711632 815650
39871 815650 -137165 -1000321 -505409 739803 1303662 1033360 768276 677509 275484 -343242
39861 -343242 -599355 -534387 -657929 -821347 -329567 825476 1794300 2005581 1689922 1239053
39851 1239053 780004 443130 380012 415646 216211 -177605 -457345 -584100 -684728 -560650
39841 -560650 41241 724017 708935 -103304 -949214 -1201251 -990950 -690476 -324252 235679
39831 235679 878082 1317938 1337771 878557 141414 -381654 -294602 232354 659888 738919
$$ packed form
39900F42285j08919j53951j65625j39373j34303r9770j08763l28014n38866l00809
39890a436108K16339L68282K11954N06312J203173J190898J34998p49193n76653
39881A070002j02566j57436j80386M01380P06880p4800r00584m66455M15597J04018
39871H15650r52815q63156M94912J245212N63859k70302k65084r0767m02025o18726
39861c43242k56113O4968j23542j63418M91780J155043R68824K11281l15659m50869
39851A239053m59049l36874o3118L5634j99435l93816k79740j26755j00628J24078
39841e60650O01891O82776j5082q12239q45910k52037K10301L00474L66224N59931
39831B35679O42403M39856J9833m59214p37143n23068Q7052N26956M27534P9031
$$ plain form
39821 738919 630386 385721 -203642 -1049845 -1483067 -884681 559575 1999820 2706902
39812 2706902 2509414 1590079 225365 -1140020 -1868777 -1602706 -805182 -465628 -1028242
39803 -1028242 -1889260 -2263065 -2242591 -2484251 -3042346 -3237180 -2751616 -2143617 -1993261 -2154365
39793 -2154365 -2214709 -2144766 -2048160 -1752682 -1151817 -559342 -220861 168007 920699 1655430
39783 1655430 1727223 1167709 633443 534298 701257 806157 637262 50094 -880275 -1674170
39773 -1674170 -1814608 -1325382 -715672 -393863 -350352 -313795 -37289 421500 602979 114897
39763 114897 -710880 -1080966 -813181 -548571 -626037 -499988 219460 934954 1006293 790889
39753 790889 818285 620623 -411347 -1498999 -1235745 242973 1272578 1015570 466694
$$ packed form
39821G38919j08533k44665n89363q46203m33222N98386J444256J440245P07082
39812B706902j97488r19335j364714j365385p28757K66071P97524L39554n62614
39803a028242q61018l73805K0474k41660n58095j94834M85564O07999J50356j61104
39793b154365o0344O9943R6606K95478O00865N92475L38481L88868P52692P34731
39783A655430P1793n59514n34266r9145J66959J04900j68895n87168r30369p93895
39773a674170j40438M89226O09710L21809M3511L6557K76506M58789J81479m88082
39763A14897q25777l70086K67785K64610p7466J26049P19448P15494P1339k15404
39753G90889K7396j97662j031970j087652K63254J478718J029605k57008n48876
$$ plain form
39744 466694 687585 1263895 1228059 597191 150581 199181 303911 1619 -625542 -987187
39734 -987187 -479960 804537 1925500 2069072 1551743 1264559 1299388 986815 253886
39725 253886 -131040 76095 49327 -779703 -1763845 -2030071 -1650879 -1176875 -713043 -193348
39715 -193348 28351 -335552 -858004 -990299 -977630 -1470837 -2460112 -3254844 -3382026 -2947199
39705 -2947199 -2218905 -1353045 -487978 232593 685129 680701 119290 -629314 -916590 -622895
39695 -622895 -320161 -369216 -410531 -130234 67473 -288886 -891059 -1053957 -617903 62444
39685 62444 669434 987739 838599 463446 537562 1249425 1813735 1500038 697331 305242
39675 305242 504054 821591 983285 940392 481843 -340315 -769139 -221400 685807 874556
$$ packed form
39744D66694K20891N76310l5836o30868m46610M8600J04730l02292o27161l61645
39734i87187N07227J284497J120963J43572n17329k87184L4829l12573p32929
39725B53886l84926K07135k6768q29030r84142k66226L79192M74004M63832N19695
39715a93348K21699l63903n22452j32295J2669m93207r89275p94732j27182M34827
39705b947199P28294Q65860Q65067P20571M52536m428n61411p48604k87276K93695
39695f22895L02734m9055m1315K80297J97707l56359o02173j62898M36054O80347
39685F2444O06990L18305j49140l75153P4116P11863N64310l13697q02707l92089
39675C05242J98812L17537J61694m2893m58549q22158m28824N47739R07207J88749
$$ plain form
39665 874556 283710 -313786 -651783 -1052158 -1376743 -1092850 -392866 -105089 -350925 -343111
39655 -343111 304459 1072164 1518967 1765085 1793830 1314943 593503 369966 629272 501827
39645 501827 -242815 -713667 -381950 88104 99937 89936 478591 752410 531827 573306
39635 573306 1601659 2911526 3267009 2597991 1724362 972264 233935 -71200 606235
39626 606235 1770823 2269889 1813284 1131836 736341 521769 513224 920549 1368581 1084589
39616 1084589 57728 -833310 -1014554 -758189 -434537 -54991 294699 384983 379409 657309
39606 657309 974248 662669 -160017 -520969 -5985 692502 968299 1036666 1032173 471697
39596 471697 -648144 -1209694 -405752 915267 1349457 838746 464623 767143 1313276
$$ packed form
39665H74556n90846n97496l37997m00375l24585K83893O99984K87777k45836P814
39655c43111O47570P67705M46803K46118K8745m78887p21440k23537K59306j27445
39645E01827p44642m70852L31717M70054J1833j0001L88655K73819k20583M1479
39635E73306J028353J309867L55483o69018q73629p52098p38329l05135O77435
39626F06235J164588M99066m56605o81448l95495k14572q545M07325M48032k83992
39616A084589j026861q91038j81244K56365L23652L79546L49690R0284n574K77900
39606F57309L16939l11579q22686l60952N14984O98487K75797O8367m493n60476
39596D71697j119841n61550Q03942J321019M34190n10711l74123L02520N46133
$$ plain form
39587 1313276 1687207 1893741 1868884 1507568 1165023 1311205 1697761 1654052 1182116 915536
39577 915536 962596 711718 -9978 -471447 -109676 652111 1071986 984059 645577 241224
39567 241224 -63960 -59475 155620 198049 68755 246426 764378 837158 -32812 -1115424
39557 -1115424 -1290738 -447966 598745 1246060 1448346 1218511 614284 158684 477155
39548 477155 1370512 1856249 1302589 53836 -1155159 -1902345 -2071996 -1662991 -883957
39539 -883957 -141665 268612 317724 135758 13529 361913 1217897 1864403 1477927 197102
39529 197102 -938781 -1134985 -430170 773561 2042066 2710141 2212706 957506 141080
39520 141080 292699 665470 468089 -58779 -355280 -583136 -1182106 -1931522 -2244296 -2004169
$$ packed form
39587A313276L73931K06534k4857l61316l42545J46182L86556m3709m71936k66580
39577I15536M7060k50878p21696m61469L61771P61787M19875q7927l38482m04353
39567B41224l05184M485K15095M2429j29294J77671N17952P2780q69970j082612
39557a115424j75314Q42772J046711O47315K02286k29835o04227m55600L18471
39548D77155Q93357M85737n53660j248753j208995p47186j69651M09005P79034
39539h83957P42292M10277M9112j81966j22229L48384Q55984O46506l86476j280825
39529A97102j135883j96204P04815J203731J268505O68075m97435j255200q16426
39520A41080J51619L72771j97381n26868k96501k27856n98970p49416l12774K40127
$$ plain form
39510 -2004169 -1435663 -598545 284218 532725 -93627 -694424 -382585 314508 284490 -371445
39500 -371445 -646005 -425987 -514971 -938183 -815806 -108603 151749 -199109 14773 1109652
39490 1109652 1564214 378268 -1105107 -1210065 -529845 -785769 -1954424 -2444918 -1752351
39481 -1752351 -1068846 -1219348 -1633857 -1654088 -1460729 -1290945 -907628 -297996 74263 108831
39471 108831 284671 709940 827666 409673 2798 27097 205412 178856 -107577 -821776
39461 -821776 -2053160 -2955729 -2315443 -516736 354998 -740368 -2163361 -1906320 -490187
39452 -490187 6988 -849394 -1417231 -663109 426118 573721 18619 -184213 166165
39443 166165 278576 -405564 -1409126 -1643731 -535836 1207866 2156385 1740877 945723
$$ packed form
39510b004169N68506Q37118Q82763K48507o26352o00797L11839O97093l0018o55935
39500c71445k74560K20018q8984m23212J22377P07203K60352l50858K13882J094879
39490A109652M54562j185946j483375j04958O80220k55924j168655m90494O92567
39481a752351O83505j50502m14509k0231J93359J69784L83317O09632L72259L4568
39471A08831J75840M25269J17726m17993m06875K4299J78315k6556k86433p14199
39461h21776j231384r02569O40286J798707Q71734j095366j422993K57041J416133
39452d90187M97175q56382n67837P54122J089227J47603n55102k02832L50378
39443A66165J12411o84140j003562k34605J107895J743702R48519m15508p95154
$$ plain form
39434 945723 927999 1395555 1239242 490282 404635 1415730 2274121 1869467 860185 536954
39424 536954 803791 463826 -775454 -1757473 -1511177 -533579 -8478 -295295 -697568
39415 -697568 -507730 152034 566618 274558 -462577 -1027900 -1185626 -1298628 -1749048 -2294215
39405 -2294215 -2241612 -1344728 -348676 -347600 -1468082 -2450070 -1956594 -274489 842983
39396 842983 275895 -1095820 -1642126 -1072251 -450080 -453272 -701638 -845682 -1164845 -1686973
39386 -1686973 -1766684 -1187526 -780948 -1154761 -1617723 -1333505 -820450 -1090911 -1809555 -1736570
39376 -1736570 -822224 -326513 -659565 -639102 486651 1649697 1584450 797340 703587 1443196
39366 1443196 1829488 1210475 199269 -474835 -823226 -1088013 -1198592 -1067602 -839782
$$ packed form
39434I45723j7724M67556j56313p48960q5647J011095Q58391m04654j009282l23231
39424E36954K66837l39965j239280r82019K46296R77598N25101k86817m02273
39415f97568J89838O59764M14584k92060p37135n65323j57726j13002m50420n45167
39405b294215N2603Q96884R96052J076j120482r81988M93476J682105J117472
39396H42983n67088j371715n46306N69875O22171l192k48366j44044l19163n22128
39386a686973p9711N79158M06578l73813m62962K84218N13055k70461p18644P2985
39376a736570R14346M95711l33052K0463J125753J163046o5247p87110r3753P39609
39366A443196L86292o19013j011206o74104l48391k64787j10579J30990K27820
$$ plain form
39357 -839782 -570456 -152165 233000 132825 -419295 -696335 -226732 473972 585836 86834
39347 86834 -328908 -245789 73357 231708 161159 -55804 -444827 -1006002 -1519125 -1691388
39337 -1691388 -1463835 -1067320 -760070 -549605 -241582 200408 486449 411014 341199 891962
39327 891962 2006727 2796901 2583506 1718533 997332 650946 461412 503276 961834 1352504
39317 1352504 859540 -386096 -1259192 -1212502 -1020933 -1410448 -1805389 -1301579 -225415
39308 -225415 369504 396623 719968 1475954 1634079 591850 -808516 -1443319 -1322453
39299 -1322453 -1162949 -1114138 -692592 263817 1276711 1851603 1953248 1832625 1699351
39290 1699351 1590257 1378958 950064 440778 141489 81145 -15038 -244005 -375866 -388203
$$ packed form
39357h39782K69326M18291L85165j00175n52120k77040M69603P00704J11864m99002
39347H6834m15742Q3119L19146J58351p0549k16963l89023n61175n13123j72263
39337a691388K27553L96515L07250K10465L08023M41990K86041p5435o9815N50763
39327H91962J114765P90174k13395q64973p21201l46386j89534M1864M58558L90670
39317A352504m92964j245636q73096M6690J91569l89515l94941N03810J076164
39308b25415N94919K7119L23345P55986J58125j042229j400366o34803J20866
39299a322453J59504M8811M21546R56409J012894N74892J01645j20623j33274
39290A699351j09094k11299m28894n09286k99289o0344r6183k28967j31861j2337
$$ plain form
39280 -388203 -691803 -1432741 -1976192 -1651384 -793492 -444799 -1034192 -1851327 -1938642 -1171215
39270 -1171215 -320852 -203851 -817782 -1319349 -983602 -125194 293429 -32890 -427905
39261 -427905 -385589 -284727 -498127 -591400 -176398 141919 -309316 -925637 -601448 448237
39251 448237 919742 381161 -297116 -516453 -580059 -522578 216143 1396864 1669263 509313
39241 509313 -715610 -599119 397833 935535 762203 502885 256559 -257842 -657788
39232 -657788 -338361 314164 382871 -77870 -175723 304240 713415 852640 1232701 1838027
39222 1838027 1823842 874497 -114369 -236807 279879 627300 539222 412150 680369 1351985
39212 1351985 1910947 1690174 704189 -106322 -48136 213746 -396549 -1549031 -1823006
$$ packed form
39280c88203l03600p40938n43451L24808Q57892L48693n89393q17135q7315P67427
39270a171215Q50363J17001o13931n01567L35747Q58408M18623l26319l95015
39261d27905M2316J00862k13400r3273M15002L18317m51235o16321L24189J049685
39251D48237M71505n38581o78277k19337o3606N7481P38721J180721K72399j159950
39241E09313j224923J16491R96952N37702j73332k59318k46326n14401l99946
39232f57788L19427O52525O8707m60741r7853M79963M09175J39225L80061O05326
39222A838027j4185r49345r88866j22438N16686L47421q8078j27072K68219O71616
39212A351985N58962k20773r85985q10511N8186K61882o10295j152482k73975
$$ plain form
39203 -1823006 -852207 177783 472274 660482 1252765 1441951 494650 -735604 -944445
39194 -944445 -304346 16555 -217974 -171122 463717 951087 726356 140693 -243883 -348327
39184 -348327 -298639 -38161 476700 1027562 1278750 1033393 395125 -172996 -157162 408811
39174 408811 910893 951359 792384 701425 399409 -280046 -678677 -36171 1343296 2388801
39164 2388801 2550896 2113352 1438853 688784 174940 168091 335280 99499 -417340 -531713
39154 -531713 -104741 250367 168142 -16833 5788 59056 -25233 -84224 -27005 25740 176089
39143 176089 684593 1276438 1201699 295484 -637706 -824925 -366051 183278 477065 359397
39133 359397 -174959 -658127 -415451 466333 1046573 787401 250622 94663 64346 -428154
$$ packed form
39203a823006R70799J029990K94491J88208N92283J89186r47301j230254k08841
39194i44445O40099L20901k34529M6852O34839M87370k24731n85663l84576j04444
39184c48327M9688K60478N14861N50862K51188k45357o38268n68121J5834N65973
39174D08811N02082M0466j58975r0959l02016o79455l98631O42506J379467J045505
39164B388801J62095m37544o74499p50069n13844o849J67189k35781n16839j14373
39154e31713M26972L55108q2225j84975K2621N3268q4289n8991N7219N2745J50349
39143A76089N08504N91845p4739r06215r33190j87219M58874N49329K93787j17668
39133C59397n34356m83168K42676Q81784N80240k59172n36779j55959l0317m92500
$$ plain form
39123 -428154 -1303020 -2027323 -2349526 -2256587 -1708251 -981765 -726099 -1060313 -1222006 -787861
39113 -787861 -518460 -1078319 -1649206 -1067076 163201 453873 -437492 -1095261 -721252
39104 -721252 -214495 -460953 -892947 -578347 295614 968274 1352497 1747922 1874702 1239614
39094 1239614 186052 -399695 -377864 -502228 -1182718 -1835960 -1729160 -935287 -123802
39085 -123802 263684 329434 406759 683409 1065022 1262291 1048737 518794 70628 83416
39075 83416 600466 1308045 1795500 1856724 1580361 1163883 679172 92472 -492128 -736559
39065 -736559 -328111 660829 1709940 2176303 1748946 671945 -455095 -1134639 -1269067
39056 -1269067 -1068248 -774003 -509080 -271746 27170 446429 846484 941050 637500 229607
$$ packed form
39123d28154q74866p24303l22203R2939N48336P26486K55666l34214j61693M34145
39113g87861K69401n59859n70887N82130J230277K90672q91365o57769L74009
39104g21252N06757k46458m31994L14600Q73961O72660L84223L95425J26780o35088
39094A239614j053562n85747K1831j24364o80490o53242J06800P93873Q11485
39085a23802L87486O5750P7325K76650L81613J97269k13554n29943m48166J2788
39075H3416N17050P07579M87455O1224k76363m16478m84711n86700n84600k44431
39065g36559M08448R88940J049111M66363m27357j077001j127040o79544j34428
39056a269067K00819K94245K64923K37334K98916M19259M00055R4566l03550m07893
$$ plain form
39046 229607 94511 251485 369579 193510 -148310 -263575 87727 631678 709404 9099
39036 9099 -864641 -964218 -251603 239305 -198897 -948033 -1035968 -626604 -688833 -1387009
39026 -1387009 -1781230 -1280847 -512067 -329055 -639131 -746567 -409725 7945 205452
39017 205452 272546 410866 649930 848177 837896 605379 339344 181199 8051 -286303
39007 -286303 -408168 28528 848805 1455365 1650448 1780837 1975697 1857948 1236279 487796
38997 487796 -40139 -438393 -751368 -731567 -476497 -617703 -1311837 -1691164 -1009936 238837
38987 238837 1125405 1638936 2285142 2780023 2325613 1065501 91837 -144631 -372959
38978 -372959 -1148381 -1932450 -2022276 -1614734 -1335067 -1265623 -1078373 -791568 -798291 -1242219
$$ packed form
39046B29607j35096J56974J18094j76069l41820j15265L51302N43951P7726p00305
39036I099q73740r9577P12615M90908m38202p49136q7935M09364o2229o98176
39026a387009l94221N00383P68780J83012l10076j07436L36842M17670J97507
39017B05452O7094J38320K39064J98247j0281k32517k66035j58145j73148k94354
39007b86303j21865M36696Q20277O06560J95083J30389J94860j17749o21669p48483
38997D87796n27935l98254l12975J9801K55070j41206o94134l79327O81228J248773
38987B38837Q86568N13531O46206M94881m54410j260112r73664k36468k28328
38978c72959p75422p84069q9826M07542K79667O9444J87250K86805o723m43928
$$ plain form
38968 -1242219 -1759784 -1844433 -1317806 -507441 31482 126748 223652 720586 1249045 1136058
38958 1136058 480613 60544 98373 -50534 -663930 -960762 -273408 755229 970346
38949 970346 304561 -276735 -241498 -35575 -116050 -252583 -104688 99109 -92382 -647107
38939 -647107 -1101007 -1173603 -1003678 -825099 -700760 -623677 -634226 -683594 -544473 -95915
38929 -95915 348966 265998 -472134 -1457714 -2291486 -2933175 -3339665 -3193662 -2425084 -1666974
38919 -1666974 -1593941 -1957813 -1890925 -1104536 -159677 427288 635609 432199 -371036 -1470544
38909 -1470544 -2037923 -1747180 -1189506 -864637 -474867 241734 714970 356493 -379459
38900 -379459 -597723 -244917 31889 -11205 -112851 -265336 -654765 -939606 -499870 542549
$$ packed form
38968a242219n17565q4649N26627Q10365N38923R5266R6904M96934N28459j12987
38958A136058o55445m20069L7829j48907o13396k96832O87354J028637K15117
38949I70346o65785n81296L5237K05923q0475j36533J47895K03797j91491n54725
38939f47107m53900p2596J69925J78579J24339P7083j0549m9368J39121M48558
38929i5915M44881q2968p38132r85580q33772o41689m06490J46003P68578P58110
38919a666974P3033l63872O6888P86389R44859N86965K08321k03410q03235j099508
38909a470544n67379K90743N57674L24869L89770P16601M73236l58477p35952
38900c79459k18264L52806K76806m3094j01646j52485l89429k84841M39736J042419
$$ plain form
38890 542549 1349373 1469258 1174361 720765 163856 -19917 835094 2377139 3206641
38881 3206641 2583269 1377886 749445 627379 239286 -487052 -954302 -975601 -933954 -974350
38871 -974350 -812914 -391245 -77800 -83285 -169125 -92954 37866 11322 -182477 -431755
38861 -431755 -683775 -932605 -1153137 -1298126 -1292574 -1087932 -816527 -762163 -1009949 -1264976
38851 -1264976 -1245166 -1119994 -1250618 -1561451 -1545512 -980744 -317597 -143221 -450961 -700121
38841 -700121 -557739 -325785 -496814 -1032231 -1353404 -1107454 -663905 -608128 -947234 -1200551
38831 -1200551 -1178854 -1168858 -1267527 -1094196 -470100 100815 108148 -141290 64585 787168
38821 787168 1374619 1406544 1120818 829857 503492 180448 274564 1028155 1944488 2218172
$$ packed form
38890E42549Q06824J19885k94897m53596n56909j83773Q55011J542045Q29502
38881C206641o23372j205383o28441j22066l88093p26338m67250k1299M1647m0396
38871i74350J61436M21669L13445n485q5840P6171J30820k6544j93799k49278
38861d31755k52020k48830k20532j44989N552K04642K71405N4364k47786k55027
38851a264976J9810J25172j30624l10833J5939N64768O63147J74376l07740k49160
38841g00121J42382K31954j71029n35417l21173K45950M43549N5777l39106k53317
38831a200551K1697R996r8669J73331O24096N70915P333k49438K05875P22583
38821G87168N87451L1925k85726k90961l26365l23044R4116P53591R16333K73684
$$ plain form
38811 2218172 1647310 786174 245599 150245 283683 457330 616352 775308 984143 1272402
38801 1272402 1572930 1786397 1916792 1996589 1899976 1491302 1009451 929471 1209926 1093115
38791 1093115 150371 -783035 -478284 893012 1689495 850515 -762631 -1650021 -1621876
38782 -1621876 -1619704 -2022183 -2162271 -1506097 -409762 473223 829084 575461 -179460 -857250
38772 -857250 -774358 -71505 346776 76026 -249540 -18616 455340 553851 234164 -221422
38762 -221422 -730936 -1153761 -1139039 -832384 -1052577 -2027964 -2666748 -2038611 -934360 -747948
38752 -747948 -1269997 -1022036 337358 1432675 1249873 445783 76010 171737 246134 253347
38742 253347 269897 -32331 -786598 -1326809 -920460 245537 1378507 2009964 2105863 1684922
$$ packed form
38811B218172n70862q61136n40575r5354J33438J73647J59022J58956K08835K88259
38801A272402L00528K13467J30395P9797r6613m08674m81851p9980K80455j16811
38791A093115r42744r33406L04751J371296P96483q38980j613146q87390K8145
38782a621876K172m02479j40088O56174J096335Q82985L55861k53623p54921o77790
38772h57250Q2892P02853M18281k70750l25566K30924M73956R8511l19687m55586
38762b21422n09514m22825J4722L06655k20193r75387o38784O28137J104251J86412
38752g47948n22049K47961J359394J095317j82802q04090l69773R5727P4397P213
38742B53347J6550l02228p54267n40211M06349J165997J132970O31457R5899m20941
$$ plain form
38732 1684922 942460 447344 630444 1269874 1899212 2405917 2767494 2592228 1570353
38723 1570353 168673 -737612 -830814 -479549 -80568 224164 355176 383010 686255 1441847
38713 1441847 2025757 1549418 73469 -1268502 -1533422 -925778 -314423 -168359 -222473
38704 -222473 7422 595062 1068736 900629 157200 -500058 -595891 -401242 -479575 -908941
38694 -908941 -1287801 -1324699 -1037289 -501031 192761 800839 1127792 1320340 1654926 2140049
38684 2140049 2644507 3234499 3971409 4551001 4625033 4337048 4017149 3495940 2368481
38675 2368481 901920 -17494 38503 619336 1169462 1606695 1955730 2026540 1741695 1300311
38665 1300311 815881 274909 -51864 175427 559537 175594 -1030657 -1859769 -1448423
$$ packed form
38732A684922p42462m95116J83100O39430O29338N06705L61577j75266j021875
38723A570353j401680r06285r3202L51265L98981L04732J31012K7834L03245P55592
38713A441847N83910m76339j475949j341971k64920O07644O11355J46064n4114
38704b22473K29895N87640M73674j68107p43429o57258r5833J94649p8333m29366
38694i08941l78860l6898K87410N36258O93792O08078L26953J92548L34586M85123
38684B140049N04458N89992P36910N79592P4032k87985l19899n21209j127459
38675B368481j466561r19414N5997N80833N50126M37233L49035P0810k84845m41384
38665A300311m84430n40972l26773K27291L84110l83943j206251q29112M11346
$$ plain form
38656 -1448423 -504869 -223765 -616384 -835517 -694477 -800470 -1335468 -1724953 -1624245
38647 -1624245 -1397527 -1406944 -1498683 -1423939 -1206785 -873951 -324116 299089 541192 190287
38637 190287 -432478 -899659 -1087846 -1078881 -1008966 -1076195 -1287675 -1162499 -231808 1026098
38627 1026098 1388383 373216 -1037940 -1613395 -1295532 -860720 -659671 -506165 -541402
38618 -541402 -1208340 -2220665 -2459650 -1392643 7891 373637 -371617 -1060583 -880017
38609 -880017 -280803 -184343 -813078 -1608383 -1970008 -1714436 -972309 -3345 876271 1421043
38599 1421043 1557935 1272494 515075 -580130 -1523743 -1850722 -1640426 -1336028 -1088555
38590 -1088555 -706239 -273178 -246432 -701311 -1037619 -848328 -584369 -795701 -1128049 -805824
$$ packed form
38656a448423R43554K81104l92619k19133J41040j05993n34998l89485J00708
38647a624245K26718r417r1739P4744K17154L32834N49835O23205K42103l50905
38637A90287o22765m67181j88187Q965O9915o7229k11480J25176R30691J257906
38627A026098L62285j015167j411156n75455L17863M34812K01049J53506l5237
38618e41402o66938j012325k38985J067007J400534L65746p45254o88966J80566
38609h80017N99214R6460o28735p95305l61625K55572P42127R68964Q79616N44772
38599A421043J36892k85441p57419j095205r43613l26979K10296L04398K47473
38590a088555L82316M33061K6746m54879l36308J89291K63959k11332l32348L22225
$$ plain form
38580 -805824 118643 795452 791535 459324 32461 -745528 -1770888 -2213937 -1599161 -632426
38570 -632426 -282239 -495306 -538446 -266385 -218153 -560050 -746746 -365916 330366 934546
38560 934546 1351879 1502354 1110141 236823 -357451 37700 1047590 1410992 366405
38551 366405 -1414783 -2449891 -1889149 -227716 1308970 1875064 1480196 638840 -138354
38542 -138354 -530480 -429004 13947 487213 791160 884666 639058 -130700 -1179695 -1716669
38532 -1716669 -1195188 -68997 656782 554442 63595 -261951 -308519 -172857 108208
38523 108208 411481 512730 422240 397001 461088 314808 -62176 -170171 277801 758992
38513 758992 555293 -264582 -952521 -1031003 -675847 -237256 126263 292923 110890 -332673
$$ packed form
38580h05824R24467O76809l917l32211m26863p77989j025360m43049O14776R66735
38570f32426L50187k13067m3140K72061M8232l41897j86696L80830O96282O04180
38560I34546M17333J50475l92213q73318n94274L95151J009890L63402j044587
38551C66405j781188j035108N60742J661433J536686N66094l94868q41356p77194
38542a38354l92126J01476M42951M73266L03947R3506k45608p69758j048995n36974
38532a716669N21481J126191P25779j02340m90847l25546m6568J35662K81065
38523A08208L03273J01249r0490k5239O4087j46280l76984j07995M47972M81191
38513G58992k03699q19875o87939p8482L55156M38591L63519J66660j82033m43563
$$ plain form
38503 -332673 -667003 -635868 -363157 -122293 -11267 38919 48418 -121625 -656448 -1492082
38493 -1492082 -2103602 -1819546 -583635 757678 1248627 849034 381201 521069 1175861
38484 1175861 1830862 2116729 1945600 1426236 793039 203562 -426308 -1125140 -1456119
38475 -1456119 -865399 438617 1425650 1345297 541347 -117044 -282684 -250459 -290217 -291333
38465 -291333 -14190 589602 1282281 1633374 1353003 656745 87997 -129408 -235305 -299646
38455 -299646 24314 731831 1018073 295924 -712397 -774046 95988 623041 143031 -478241
38445 -478241 -234098 532643 726253 61980 -729995 -997192 -733821 -151671 614153 1261211
38435 1261211 1373415 986275 701212 954460 1452742 1608507 1307272 925271 729630
$$ packed form
38503c32673l34330L1135K72711K40864J11026N0186R499j70043n34823q35634
38493a492082o11520K84056J235911J341313M90949l99593m67833J39868O54792
38484A175861O55001K85867j71129n19364o33197n89477o29870o98832l30979
38475a456119N90720J304016R87033q0353q03950o58391j65640L2225l9758j116
38465b91333K77143O03792O92679L51093k80371o96258n68748k17405j05897o4341
38455b99646L23960P07517K86242p22149j008321o1649Q70034N27053m80010o21272
38445d78241K44143P66741J93610o64273p91975k67197K63371N82150P65824O47058
38435A261211J12204l87140k85063K53248M98282J55765l01235l82001j95641
$$ plain form
38426 729630 633379 551393 637506 988802 1354865 1410467 1227770 1203960 1485155 1694830
38416 1694830 1378615 613232 35527 255598 1239604 2234749 2385777 1587100 667041
38407 667041 488032 913935 1049644 536294 41384 157857 414662 28992 -768469 -1047996
38397 -1047996 -722212 -795788 -1800661 -2853381 -2850963 -1982143 -1318706 -1268532 -1238849 -773243
38387 -773243 -268097 -309842 -806808 -1169697 -1139194 -1057569 -1274158 -1532824 -1215504 -231946
38377 -231946 615889 480402 -423749 -1003504 -674763 -91459 -186500 -893600 -1319484 -976346
38367 -976346 -290683 105379 85479 -113788 -341580 -557625 -619703 -348425 192015 645108
38357 645108 678228 319463 -86324 -277038 -335475 -461560 -609242 -572352 -362310 -203168
$$ packed form
38426G29630r6251q1986Q6113L51296L66063N5602j82697k3810K81195K09675
38416A694830l16215p65383n77705K20071R84006R95145J51028p98677r20059
38407F67041j79009M25903J35709n13350m94910J16473K56805l85670p97461k79527
38397a047996L25784p3576j004873j052720K418Q68820O63437N0174K9683M65606
38387g73243N05146m1745m96966l62889L0503Q1625k16589k58666L17320R83558
38377b31946Q47835j35487r04151n79755L28741N83304r5041p07100m25884L43138
38367i76346O85663L96062j9900j99267k27792k16045o2078K71278N40440M53093
38357F45108L3120l58765m05787j90714n8437j26085j47682L6890K10042J59142
$$ plain form
38347 -203168 -162357 -129870 -171446 -446573 -681722 -298426 652237 1266709 959100 329481
38337 329481 275330 706447 879475 638097 436350 331827 -62419 -599228 -541084 285410
38327 285410 1120363 1344685 1131808 718213 -88321 -1135466 -1491400 -576599 820154
38318 820154 1463445 1234834 1000513 1198109 1379372 1086896 446975 -187950 -617216 -724355
38308 -724355 -500849 -221686 -222069 -463070 -635314 -635495 -589669 -514440 -376691 -371940 -636096
38297 -636096 -759615 -184266 885318 1572057 1438068 904122 414002 -118414 -702225
38288 -702225 -833994 -269443 312967 174349 -287802 -52233 899155 1367432 616948 -493186
38278 -493186 -621439 284066 1026050 808716 116125 -214686 -135101 -119892 -199625 29678
$$ packed form
38347b03168M0811L2487m1576k75127k35149L83296R50663O14472l07609o29619
38337C29481n4151M31117J73028k41378k01747j04523l94246n36809N8144Q26494
38327B85410Q34953K24322k12877m13595q06534j047145l55934R14801J396753
38318H20154O43291k28611k34321J97596J81263k92476o39921o34925m29266j07139
38308g24355K23506K79163l83k41001j72244j81M5826P5229J37749M751k64156
38297f36096j23519N75349J069584O86739j33989n33946m90120n32416n83811
38288g02225j31769N64551N82410j38618m62151K35569R51388M68277p50484j110134
38278d93186j28253R05505P41984k17334o92591l30811P9585J5209p9733K29303
$$ plain form
38268 29678 516326 616767 78234 -487911 -552060 -532795 -1062139 -1779605 -1734662 -892693
38258 -892693 -274024 -358749 -294948 707993 1943373 2055069 947103 -115699 -279486
38249 -279486 -49183 -190034 -486522 -207902 645234 1285194 1251370 966289 1010753 1286454
38239 1286454 1224686 610893 -148087 -551908 -520039 -303910 -105285 57483 213350 338661
38229 338661 378451 272239 -11224 -381133 -608318 -499517 -81295 414978 671227 383508
38219 383508 -519750 -1608075 -2155907 -1919880 -1511364 -1616942 -2032916 -1998357 -1388093 -887090
38209 -887090 -869329 -854582 -440393 -79072 -349191 -989607 -1326558 -1247003 -1043029 -680951
38199 -680951 -71463 243851 -290466 -1048028 -788587 437472 1143616 558362 -286643
$$ packed form
38268B9678M86648J00441n38533n66145o4149J9265n29344p17466M4943Q41969
38258h92693O18669q4725O3801J002941J235380J11696j107966j062802j63787
38249b79486K30303j40851k96488K78620Q53136O39960l3824k85081M4464K75701
38239A286454o1768o13793p58980m03821L1869K16129J98625J62768J55867J25311
38229C38661L9790j06212k83463l69909k27185J08801M18222M96273K56249k87719
38219C83508r03258j088325n47832K36027M08516j05578m15974L4559O10264N01003
38209h87090J7761J4747M14189L61321k70119o40416l36951P9555K03974L62078
38199f80951O09488L15314n34317p57562K59441J226059P06144n85254q45005
$$ plain form
38190 -286643 -302507 13076 -247928 -587300 62697 1254821 1448852 456927 -169930 428246
38180 428246 1102122 568140 -624955 -1051112 -460789 280349 747433 1216885 1587691
38171 1587691 1254328 216560 -654015 -775734 -543664 -532087 -681583 -683832 -588392 -522811
38161 -522811 -268903 314677 777945 602586 52429 -135804 130814 149890 -469680 -1179445
38151 -1179445 -1332227 -1144340 -1256067 -1616154 -1490265 -605783 351213 656550 468111
38142 468111 396718 505287 301545 -384406 -1077160 -1282086 -968726 -312900 561748 1344654
38132 1344654 1495496 845814 -35452 -475040 -501252 -649959 -1142198 -1651859 -1778213 -1382933
38122 -1382933 -589713 146607 115943 -975350 -2418320 -3091957 -2694116 -1925249 -1445367
$$ packed form
38190b86643j5864L15583k61004l39372O49997J192124J94031r91925o26857N98176
38180D28246O73876n33982j193095m26157N90323P41138M67084M69452L70806
38171A587691l33363j037768q70575j21719K32070J1577j49496k249R5440O5581
38161e22811K53908N83580M63268j75359n50157j88233K66618J9076o19570p09765
38151a179445j52782J87887j11727l60087J25889Q84482R56996L05337j88439
38142D68111p1393J08569k03742o85951o92754k04926L13360O55826Q74648P82906
38132A344654J50842o49682q81266m39588k6212j48707m92239n09661j26354L95280
38122a382933P93220P36320l0664j091293j442970o73637L97841P68867M79882
$$ plain form
38113 -1445367 -1239415 -1125991 -1207214 -1476133 -1571324 -1364398 -1286366 -1582653 -1736193 -1242676
38103 -1242676 -534364 -376566 -621395 -421888 385781 1008476 960977 772996 1076352 1683323
38093 1683323 2048340 2077497 1927593 1471766 614173 -199944 -499718 -597783 -1089386 -1611811
38083 -1611811 -1045992 764904 2385914 2492897 1550127 1002320 1260207 1479540 1165850
38074 1165850 848267 890636 717264 -87121 -714104 -125446 1305113 2121807 1631322
38065 1631322 512423 -434962 -1202149 -1934469 -2232543 -1701732 -732408 -163040 -382477
38056 -382477 -1129905 -1945858 -2487015 -2608279 -2447043 -2290151 -2200714 -2015462 -1792654 -1810700
38046 -1810700 -1914471 -1441631 -251945 690981 411935 -747941 -1594914 -1653923 -1517523
$$ packed form
38113a445367K05952J13424q1223k68919r5191K06926P8032k96287j53540M93517
38103a242676P08312J57798k44829J99507Q07669O22695m7499j87981L03356O06971
38093A683323L65017K9157j49904m55827q57593q14117k99774r8065m91603n22425
38083a611811N65819J810896J621010J06983r42770n47807K57887K19333l13690
38074A165850l17583M2369j73372q04385o26983N88658J430559Q16694m90485
38065A631322j118899r47385p67187p32320k98074N30811R69324N69368k19437
38056c82477p47428q15953n41157j21264J61236J56892Q9437J85252K22808j8046
38046a810700j03771M72840J189686R42926k79046j159876q46973n9009J36400
$$ plain form
38037 -1517523 -1679338 -1816721 -1474072 -868250 -625122 -976736 -1487991 -1509251 -849563 -42986
38027 -42986 193641 -133755 -238140 354585 1053875 1025824 438261 239236 831960 1611429
38017 1611429 1812854 1281068 402688 -256239 -319455 -50433 -207282 -909113 -1053229 254606
38007 254606 2014657 2292727 868933 -378565 -45784 1131721 1758224 1689571 1588837
37998 1588837 1574207 1358640 1037929 740215 67541 -1125923 -1914439 -1330322 122829
37989 122829 1030191 934340 652049 842570 1237093 1333840 1033706 521480 189520 590823
37979 590823 1716881 2461143 1728049 87568 -649828 305028 1797001 2349430 1828102
37970 1828102 1060262 596567 461196 576903 798972 803934 412122 -133131 -463059 -479337
$$ packed form
38037a517523j61815j37383L42649O05822K43128l51614n11255k1260O59688Q06577
38027d2986K36627l27396j04385N92725O99290k8051n87563j99025N92724P79469
38017A611429K01425n31786q78380o58927o3216K69022j56849p01831j44116J307835
38007B54606J760051K78070j423794j247498L32781J177505O26503o8653j00734
37998A588837j4630k15567l20711k97714o72674j193464p88516N84117J453151
37989A22829R07362r5851k82291J90521L94523R6747l00134n12226l31960M01303
37979E90823J126058P44262p33094j640481p37396R54856J491973N52429n21328
37970A828102p67840m63695j35371J15707K22069M962l91812n45253l29928j6278
$$ plain form
37960 -479337 -336448 -278321 -516316 -926582 -912958 -66408 1060383 1464433 1029668 615292
$$ packed form
37960d79337J42889N8127k37995m10266J3624Q46550J126791M04050m34765m14376
$$ [...]
##END NTUPLES=NMR SPECTRUM
##END=
