##TITLE=31Pdec_LR-702-RM1
 CDCl3, 24 sc
 18.11.2019
##JCAMPDX= 6.0         $$ Bruker NMR JCAMP-DX V2.0
##DATA TYPE= NMR SPECTRUM
##DATA CLASS= NTUPLES
##ORIGIN= UXNMR, Bruker Analytische Messtechnik GmbH
##OWNER= root
$$ XWIN-NMR		Version 3.5
$$ Mon Nov 18 15:38:31 2019 Russian Standard Time (UT+4h)  she@DPX200
##.OBSERVE FREQUENCY= 81.013821
##.OBSERVE NUCLEUS= ^31P
##.ACQUISITION MODE= SIMULTANEOUS
##.ACQUISITION SCHEME= undefined
##.AVERAGES= 24
##.DIGITISER RES= 17
##SPECTROMETER/DATA SYSTEM= spect
##.PULSE SEQUENCE= zgpg30
##.SOLVENT NAME= CDCl3
##.SHIFT REFERENCE= (INTERNAL, CDCl3, 0, 182.463)
##AUDIT TRAIL= $$ (NUMBER, WHEN, WHO, WHERE, WHAT)
$$ ##TITLE= Audit trail, XWIN-NMR		Version 3.5
$$ ##JCAMPDX= 5.01
$$ ##ORIGIN= Bruker BioSpin GmbH
$$ ##OWNER= she
$$ F:/spectra/data/she/nmr/P31/1/pdata/1/auditp.txt
$$ ##AUDIT TRAIL=  $$ (NUMBER, WHEN, WHO, WHERE, WHAT)
(   1,<2019-11-18 15:37:39.96 +0400>,<she>,<DPX200>,
      <created by zg, POWCHK disabled, PULCHK disabled
       configuration hash MD5:
       00 E9 B6 7A A2 85 ED C7 34 08 36 98 17 FE 4E 26
       data hash MD5: 32K
       93 E3 C4 87 77 D8 37 44 D1 1E C8 4B 8E 80 ED 96>)
(   2,<2019-11-18 15:37:42.56 +0400>,<she>,<DPX200>,
      <Start of raw data processing
       efp BC_mod = 2 LB = 1 FT_mod = 6 PKNL = 1 PHC0 = -1452.977 PHC1 = 518.801 SI = 64K 
       data hash MD5: 64K
       B9 A0 50 D4 FB CD 85 7C A0 66 13 6F 47 72 9B E2>)
(   3,<2019-11-18 15:37:59.59 +0400>,<she>,<DPX200>,
      <pk PHC0 = 30.75586 PHC1 = -44.8 
       data hash MD5: 64K
       00 3A 52 5A 4F 8F 00 B1 0D 9B E0 B3 38 C1 C2 84>)
(   4,<2019-11-18 15:38:03.28 +0400>,<she>,<DPX200>,
      <abs ABSG = 5 
       data hash MD5: 64K
       72 06 26 DE 9A 31 9D 3D 75 29 AD 6F 7C C1 44 9E>)
$$ ##END=
$$ 
$$ hash MD5
$$ 22 E9 79 B8 6E 9A FD C0 A0 3A 46 A9 01 08 37 1E
##$RELAX= 
##$RELAX= 
##$RELAX= 
##$RELAX= 
##$RELAX= 
##$RELAX= 
##$RELAX= 
##$RELAX= 
$$ Bruker specific parameters
$$ --------------------------
##$DU= <F:/spectra>
##$EXPNO= 1
##$NAME= <P31>
##$PROCNO= 1
##$TYPE= <nmr>
##$USER= <she>
##$AMP= (0..31)
100 100 100 100 100 100 100 100 100 100 100 100 100 100 100 100 100 100 
100 100 100 100 100 100 100 100 100 100 100 100 100 100 
##$AQSEQ= 0
##$AQ_mod= 1
##$AUNM= <au_zg>
##$AUTOPOS= <>
##$BF1= 81.014009
##$BF2= 200.13
##$BF3= 200.13
##$BF4= 200.13
##$BF5= 200.13
##$BF6= 200.13
##$BF7= 200.13
##$BF8= 200.13
##$BYTORDA= 1
##$CFDGTYP= 0
##$CFRGTYP= 5
##$CHEMSTR= <none>
##$CNST= (0..31)
1 1 145 1 1 1 1 1 1 1 1 1 1 1 1 1 1 1 1 1 1 1 1 1 1 1 1 1 1 1 1 1 
##$CPDPRG= <waltz16>
##$CPDPRG1= <>
##$CPDPRG2= <waltz16>
##$CPDPRG3= <>
##$CPDPRG4= <mlev>
##$CPDPRG5= <mlev>
##$CPDPRG6= <mlev>
##$CPDPRG7= <mlev>
##$CPDPRG8= <mlev>
##$CPDPRGB= <>
##$CPDPRGT= <>
##$D= (0..31)
0 1 0 0 0 0 0 0 0 0 0 0.03 2e-05 3e-06 0 0 0 0 0 0 0 0 0 0 0 0 0 0 0 0 
0 0 
##$DATE= 1574077059
##$DBL= (0..7)
120 120 120 11 120 120 24 19 
##$DBP= (0..7)
150 150 150 150 150 150 150 150 
##$DBP07= 0
##$DBPNAM0= <>
##$DBPNAM1= <>
##$DBPNAM2= <>
$$ [...]
##$SUBNAM3= <"">
##$SUBNAM4= <"">
##$SUBNAM5= <"">
##$SUBNAM6= <"">
##$SUBNAM7= <"">
##$SUBNAM8= <"">
##$SUBNAM9= <"">
##$SW= 369.568048894756
##$SWIBOX= (0..15)
0 1 3 0 0 0 0 0 0 0 0 0 0 0 0 0 
##$SW_h= 29940.119760479
##$TD= 32768
##$TD0= 1
##$TE= 0
##$TE2= 300
##$TE3= 300
##$TEG= 300
##$TL= (0..7)
0 120 53 12 22 120 120 120 
##$TP= (0..7)
150 150 150 150 150 150 150 150 
##$TP07= 0
##$TPNAME0= <>
##$TPNAME1= <>
##$TPNAME2= <>
##$TPNAME3= <>
##$TPNAME4= <>
##$TPNAME5= <>
##$TPNAME6= <>
##$TPNAME7= <>
##$TPOAL= (0..7)
0.5 0.5 0.5 0.5 0.5 0.5 0.5 0.5 
##$TPOFFS= (0..7)
0 0 0 0 0 0 0 0 
##$TUNHIN= 0
##$TUNHOUT= 0
##$TUNXOUT= 0
##$USERA1= <user>
##$USERA2= <user>
##$USERA3= <user>
##$USERA4= <user>
##$USERA5= <user>
##$V9= 5
##$VALIST= <valist>
##$VCLIST= <CCCCCCCCCCCCCCC>
##$VD= 0
##$VDLIST= <DDDDDDDDDDDDDDD>
##$VPLIST= <PPPPPPPPPPPPPPP>
##$VTLIST= <TTTTTTTTTTTTTTT>
##$WBST= 1024
##$WBSW= 4
##$XGAIN= (0..3)
0 0 0 0 
##$XL= 0
##$YL= 0
##$YMAX_a= 16273
##$YMIN_a= -10937
##$ZGOPTNS= <>
##$ZL1= 120
##$ZL2= 120
##$ZL3= 120
##$ZL4= 120
##$ABSF1= 182.463
##$ABSF2= -187.1042
##$ABSG= 5
##$ABSL= 3
##$ALPHA= 0
##$AQORDER= 0
##$ASSFAC= 0
##$ASSFACI= 0
##$ASSFACX= 0
##$ASSWID= 0
##$AUNMP= <proc_1d>
##$AZFE= 0.1
##$AZFW= 0.5
##$BCFW= 0
##$BC_mod= 2
##$BYTORDP= 0
##$COROFFS= 0
##$CY= -3
##$DATMOD= 1
##$DC= 0
##$DFILT= <>
##$DTYPP= 0
##$F1P= 0
##$F2P= 0
##$FCOR= 1
##$FTSIZE= 65536
##$FT_mod= 6
##$GAMMA= 0
##$GB= 0
##$INTBC= 1
##$INTSCL= 5.30512e-09
##$ISEN= 30
##$LB= 1
##$LEV0= 0
##$LPBIN= 0
##$MAXI= 10000
##$MC2= 0
##$MEAN= 0
##$ME_mod= 0
##$MI= 50
##$NCOEF= 0
##$NC_proc= -9
##$NLEV= 6
##$NOISF1= 182.463
##$NOISF2= 159.3651
##$NSP= 0
##$NTH_PI= 0
##$NZP= 0
##$OFFSET= 182.463
##$PC= 4
##$PHC0= -1422.221
##$PHC1= 474.001
##$PH_mod= 1
##$PKNL= yes
##$PPARMOD= 0
##$PSCAL= 0
##$PSIGN= 0
##$REVERSE= no
##$SF= 81.0140089999434
##$SI= 65536
##$SIGF1= 159.3651
##$SIGF2= -187.1042
##$SINO= 113.3802
##$SIOLD= 16384
##$SREGLST= <1H.CDCl3>
##$SSB= 0
##$STSI= 65536
##$STSR= 0
##$SW_p= 29940.119760479
##$SYMM= 0
##$S_DEV= 0
##$TDeff= 32768
##$TDoff= 0
##$TI= <>
##$TILT= no
##$TM1= 0
##$TM2= 0
##$TOPLEV= 0
##$USERP1= <user>
##$USERP2= <user>
##$USERP3= <user>
##$USERP4= <user>
##$USERP5= <user>
##$WDW= 1
##$XDIM= 65536
##$YMAX_p= 396024928
##$YMIN_p= -147471857
$$ End of Bruker specific parameters
$$ ---------------------------------
##NTUPLES= NMR SPECTRUM
##VAR_NAME=  FREQUENCY,     SPECTRUM/REAL,   SPECTRUM/IMAG
##SYMBOL=    X,             R,               I
##VAR_TYPE=  INDEPENDENT,   DEPENDENT,       DEPENDENT
##VAR_FORM=  AFFN,          ASDF,            ASDF
##VAR_DIM=   65536,         65536,           65536
##UNITS=     HZ,            ARBITRARY UNITS, ARBITRARY UNITS
##FACTOR=    0.456856943014862, 1,           1
##FIRST=     14782.0589164792, 0,            0
##LAST=      -15158.0608439998, 0,           0
##MIN=       -15158.0608439998, -147471857,  0
##MAX=       14782.0589164792, 396024928,    0
$$ Real data points
##PAGE= N=1
##DATA TABLE= (X++(R..R)), XYDATA
$$ [...]
48027h328257l379426n715486q60849N288057N702226M708262R190326J3397260
48019B0002113N959381r974533j7823822j0931866j393540j65441j145474N511138
48011i962044J4738602J4224985M497577k479859j975737l17220j059864j191692
48003A6474748k035806r201299j8044075j4447765K644691J3916193N617999r559806
47995a4635120j1013622L19611P120352L994701K577160R058383J3616045P018929
47987A8056439m541899p954689M47189J2136226J6211180R340307k041112r379976
47979C2273665j2161743j5823730j8556213j0689104O390635J3860075J385234
47972c321181j2569915n752438J1717657J1437755o792227j2633421N606392K0221365
$$ plain form
48027 -8328257 -11707683 -17423169 -18284018 -12995961 -7293735 -2585473 6604853 20002113
48019 20002113 25961494 15986961 -1836861 -12768727 -14162267 -14327708 -15473182 -9962044
48011 -9962044 4776558 19001543 23499120 21019261 19043524 18726304 17666440 16474748
48003 16474748 14438942 5237643 -12806432 -27254197 -24609506 -10693313 -5075314 -14635120
47995 -14635120 -25648742 -25329131 -18208779 -14214078 -11636918 -2578535 11037510 18056439
47987 18056439 13514540 5559851 6007040 18143266 34354446 43694753 41653641 32273665
47979 32273665 20111922 4288192 -14268021 -24957125 -18566490 -4706415 -3321181
47972 -3321181 -15891096 -21643534 -9925877 1511878 -5280349 -17913770 -12307378 7913987
47964G913987P235447j6174596j8974364j500180J1208564Q721561K964908L041072
47956D436399N051261N170042M245991M13269p217948j0148986j593949P571568
47948G927647J821901j2550062j3989498R83030J2205286P782374M78668L580956
47940H240302R228452L566948j0293469j7859216j2724961K21383J3112438J7718160
47932A1210037Q317137q692432j5850406m492326J3467806K1475247J7490456
47925D2925519Q722618k215617j3756088j7374759q209047K515977R28678q229775
47917E307506r413580j475507K563764n04038K93450P848514R599086o68359j0665746
47908B885090q694698k68029M870544Q620550J4687649J5196120K995359j1305383
$$ plain form
47964 7913987 15149434 -1025162 -19999526 -21499706 -10291142 -1569581 1395327 4436399
47956 4436399 9487660 14657702 18903693 19316962 12099014 1950028 356079 7927647
47948 7927647 9749548 -2800514 -16790012 -15806982 -3601696 4180678 4659346 8240302
47940 8240302 17468754 21035702 10742233 -7116983 -19841944 -19620561 -6508123 11210037
47932 11210037 19527174 10834742 -5015664 -9507990 3959816 25435063 42925519
47925 42925519 51648137 49432520 35676432 18301673 10092626 12608603 13537281 5307506
47917 5307506 -4106074 -5581581 -3017817 -3521855 -3228405 4620109 14219195 13550836 2885090
47908 2885090 -5809608 -6077637 -1207093 7413457 22101106 37297226 40292585 28987202
47900B8987202j1715052j360139K354988n032668r729703k948489O508433P652297
47892A4716869K033113l179323o037374o928429l698676L250947P818740O416657
47884A4392524L420212L140447K751426j120007n309109o186212o619398r389194
47876d919311r393356j403683Q609576R883914K626040k503984o58751R37650
47868C178095m633282j3199604j5362008q384347J759882P777481P717479N353143
47860a5793161N363231P996771Q952752M972175j930120o610109n462484R41634
47852a569311O662115K770247j2495534k5409078j8378780N714305K1628373J2807393
47844h270270n919543r262173L474918J1142892M041126n364534o621325o567872
$$ plain form
47900 28987202 17272150 15912011 18266999 13234331 3504628 556139 7064572 14716869
47892 14716869 16749982 13570659 7533285 604856 -3093820 157127 7975867 14392524
47884 14392524 17812736 20953183 23704609 22584602 17275493 11089281 4469883 -4919311
47876 -4919311 -14312667 -15716350 -7106774 2777140 5403180 2899196 2240445 3178095
47868 3178095 -1455187 -14654791 -30016799 -38401146 -36641264 -28863783 -21146304 -15793161
47860 -15793161 -10429930 -2433159 6519593 11491768 9561648 2951539 -2510945 -1569311
47852 -1569311 5092804 7863051 -4632483 -30041561 -48420341 -42706036 -21077663 -8270270
47844 -8270270 -14189813 -23451986 -19977068 -8834176 -4793050 -10157584 -16778909 -23346781
47836b3346781j2631314j6806353q038927R541137K1976956K2574138J4587593
47829G856449K882785p754163j0478132k410752Q281455Q966565k847060j5704168
47821a1207021j5827416j108480J6143408K0784102J0652061j451478m556568
47814A3428608l157473o725038j1370209n213730R742528J6776614Q199370m797083
47806A6883587j0409449r648984o234495P65206O476988m84238j7277690k2248269
47798d2177344n168887J3978421J3517396K316263K800522J4363128J7935268
47791A7564767Q914627K06983l445018q988368j4064017p521401O958417J1513831
47783A1139821K629725l438500R50387L509312l613477j0309777q889295o772036
$$ plain form
47836 -23346781 -35978095 -52784448 -60823375 -51282238 -29305282 -6731144 7856449
47829 7856449 10739234 2985071 -7493061 -9903813 -1622358 7344207 4497147 -11207021
47821 -11207021 -27034437 -28142917 -11999509 8784593 19436654 17985176 13428608
47814 13428608 10271135 3546097 -7824112 -13037842 -3295314 13481300 21680670 16883587
47806 16883587 6474138 -3174846 -9409341 -8644135 -2167147 -2651385 -19929075 -42177344
47798 -42177344 -47346231 -33367810 -19850414 -17534151 -14733629 -370501 17564767
47791 17564767 26479394 26686377 23241359 14252991 188974 -7332427 -374010 11139821
47783 11139821 13769546 10331046 11281433 14790745 11177268 867491 -8021804 -14793840
47775a4793840p712383j462574J4117111K1213368R419741l666021Q99759J2461681
47767C0476842R318348m938922r533895k730424k292558j1765156j3678491j099860
47759f244116Q432507Q60556j1568803r111015O522883J6316953J0351832k614787
47751A2946010r752131q144287k851389K015555N998871Q157729N012239m328269
47743I054328j3141515j2697393l559993M624590O402710O281775P837677O223301
47735A1025480j390311o737706k215164N274023M522263j363471p98583N263159
47727A3579690M516171m563156q935580k950509K542062m18637m314431k399101
47719b943491k360879j0494532j5324781m285233J2233003J3240572n87018p801500
$$ plain form
47775 -14793840 -22506223 -23968797 -9851686 11361682 20781423 17115402 18015161 30476842
47767 30476842 39795190 34856268 25322373 22591949 20299391 8534235 -5144256 -6244116
47759 -6244116 2188391 3048947 -8519856 -17630871 -11107988 5208965 15560797 12946010
47751 12946010 3193879 -4950408 -7801797 -5786242 212629 8370358 13382597 9054328
47743 9054328 -4087187 -16784580 -20344573 -15719983 -9317273 -3035498 4802179 11025480
47735 11025480 9635169 2897463 682299 5956322 10478585 9115114 8316531 13579690
47727 13579690 18095861 13532705 4597125 1646616 4188678 3770041 -544390 -2943491
47719 -2943491 -5304370 -15798902 -31123683 -35408916 -23175913 -9935341 -10522359 -18323859
47711a8323859m857O677219N73373n637922K249873J3382108P479760j1663449
47703e267754j9601363o869597Q782423J0109418K625913K04935K892011J925966
47695e198048k600991l214755N50445K137614L23385K52443K929476L905244K120567
47686A205380N96708r24594m207695m879156J629559P520742O83801j3301625
47678a1676880j4260017J978370J3935335N858068q070847o192890P758866J3520240
47670B850245O855863J789534M109716M362324j273005l176424L000271O841781
47662B5360305M97821q383778j0173325p955144q443888q016701J2311J0334105
47654f768294J0558941n53434j0470943r540357k128861J507742j210703l779013
$$ plain form
47711 -18323859 -18328716 -11651497 -11078124 -16716046 -14466173 -1084065 6395695 -5267754
47703 -5267754 -24869117 -31738714 -22956291 -12846873 -10220960 -10016025 -7124014 -5198048
47695 -5198048 -7799039 -11013794 -10463349 -8325735 -8002350 -7749907 -4820431 -915187 1205380
47686 1205380 1802088 877494 -3330201 -8209357 -6579798 940944 1624745 -11676880
47678 -11676880 -25936897 -23958527 -10023192 -4165124 -12235971 -18428861 -10669995 2850245
47670 2850245 9706108 11495642 15605358 19967682 18694677 15518253 18518524 25360305
47662 25360305 25858126 17474348 7301023 -654121 -9098009 -17114710 -17102399 -6768294
47654 -6768294 3790647 3237213 -7233730 -16774087 -18902948 -17395206 -18605909 -22384922
47646b2384922n66312N606560P387214L241982M80087N402555J3028119J1845369
47638B4040652j077275j4877388j6820318n938676P055019J0695125K460218r451161
47630c913804j2942934l488018J0476241J6407298J1592240M066522k524l417066
47622A8777955j0092543j6106701j3592251j048886J3847397K0679945J4480127
47615B6945043O3621j0806643r752407m98848N681861L440745k066463m401970
47607H604939l652650k867835k611640k566019l627449m808210k611971L061848
47599a1078987P126836O760379N131587L914700r80809j0241514j4822984p620378
47591b1811170L763922O243157J12470k362829L829351J0095882Q544920J963048
$$ plain form
47646 -22384922 -22951234 -17344674 -9957460 -6715478 -6235391 -832836 12195283 24040652
47638 24040652 22963377 8085989 -8734329 -14673005 -7617986 3077139 5537357 -3913804
47630 -3913804 -16856738 -20344756 -9868515 6538783 18131023 22197545 22195021 18777955
47622 18777955 8685412 -7421289 -21013540 -22062426 -8215029 12464916 26945043
47615 26945043 27008664 16202021 6449614 5950766 11632627 15073372 13006909 8604939
47607 8604939 4952289 2084454 -527186 -3093205 -6720654 -11528864 -14140835 -11078987
47599 -11078987 -3952151 2808228 7939815 11854515 10873706 632192 -14190792 -21811170
47591 -21811170 -18047248 -11804091 -11691621 -14054450 -10225099 -129217 8415703 10378751
47583A0378751l583937o365113n334579J250919Q070398L609968j2872302k3969361
47575b8815256j4778497N253137J4033694O935559M56885N264091J1427013O913370
47567F689996k923961n485832j183443j48881l632277k943227L548453O120198
47559D1026O2877n304790o68753Q820025J1256753M648883k444454l956407k073017
47550A0382143o25980M46849K558866M684354M114438l76958o417904q906331
47542E859477m831797K114399M603936M21502n328861p713995o688692k776251
47534a4340282N051514J3411236J3943045M884119l639916l395671l92153m198279
47526A1323613j1355280j1321992m449427n10166j422205L65226O050708P302232
$$ plain form
47583 10378751 6794814 429701 -4904878 -3653959 4416439 8026407 -4845895 -28815256
47575 -28815256 -43593753 -38340616 -24306922 -17371363 -16914478 -11650387 -223374 6689996
47567 6689996 3766035 -1719797 -2903240 -3052121 -6684398 -9627625 -6079172 41026
47559 41026 103903 -5200887 -5869640 2950385 14207138 18856021 16411567 12455160 10382143
47550 10382143 9756163 10203012 12761878 17446232 21560670 21183712 14765808 5859477
47542 5859477 1027680 3142079 7746015 8167517 2838656 -4875339 -11564031 -14340282
47534 -14340282 -9288768 4122468 18065513 22949632 19309716 15914045 15521892 11323613
47526 11323613 -31667 -11353659 -15803086 -16313252 -17735457 -17370231 -11319523 -4017291
47518d017291J417607l506052k241771Q25872K297022M763626P123829L001184
47510I664026n831854q072378j600741Q06090o803559j1232935j646916J0907783
47502a3810484J1007020L686872L579700Q696352N618859m801255q592043l850813
47494A534208l310817r855132j0398181K10758Q637766N313106L9693L752452
47486d076147R271317M500121o044979q628327k499165J099260q89080L80267
47478f886733Q136298J2678978O586687l233914n799790j523870K91817m311802
47470E937671r984975j1415152r478455o585196k117230L885144P357269N824957
47462a6575967M107829P818659J2768253Q821987m572003j4739086j1460153J81445
$$ plain form
47518 -4017291 -2599684 -6105736 -8347507 -7521635 -5224613 -460987 6662842 9664026
47510 9664026 3832172 -4240206 -5840947 -5034857 -11838416 -23071351 -24718267 -13810484
47502 -13810484 -2803464 883408 4463108 13159460 18778319 13977064 5385021 1534208
47494 1534208 -1776609 -11631741 -22029922 -21819164 -13181398 -7868292 -7828599 -4076147
47486 -4076147 5195170 9695291 3650312 -4978015 -7477180 -6377920 -7267000 -6886733
47478 -6886733 1249565 13928543 20515230 17281316 11481526 9957656 10249473 5937671
47470 5937671 -4047304 -15462456 -24940911 -31526107 -33643337 -29758193 -22400924 -16575967
47462 -16575967 -12468138 -4649479 8118774 16940761 12368758 -2370328 -13830481 -13649036
47454a3649036P468725N261599j687712o917519o915787j347878N561150O860681
47446e365777J034476n202788o618545o411666p715363n586414L103028Q619450
47438b4143599M45908j3279091j3450814K732966J7036044J5784459O094201Q65510
47430g914416O81724n45367k220080k32807K549318p35772r710019j5911202j2480187
47421d6518808p70354J0922425J3256424M347788n740273m374611P363302J4343976
47413g170131P030003n701831q951522o34599Q975711J1748520Q449336L892151
47405A7637638J681802K242131K009071l072860j0617423j2677998o509728J138628
47397h168739M016997L879031L639422J388108k304763k72212Q788476J2522818
$$ plain form
47454 -13649036 -6180311 -918712 -2606424 -9523943 -16439730 -17787608 -12226458 -5365777
47446 -5365777 -4331301 -9534089 -16152634 -22564300 -30279663 -35866077 -32763049 -24143599
47438 -24143599 -23697691 -36976782 -50427596 -47694630 -30658586 -14874127 -8779926 -7914416
47430 -7914416 -7232692 -7778059 -9998139 -10230946 -7681628 -8417400 -18127419 -34038621 -46518808
47421 -46518808 -47289162 -36366737 -23110313 -18762525 -24502798 -28877409 -21514107 -7170131
47413 -7170131 -140128 -5841959 -14793481 -15428080 -6452369 5296151 13745487 17637638
47405 17637638 19319440 21561571 23570642 20497782 9880359 -2797639 -9307367 -8168739
47397 -8168739 -4151742 -272711 3366711 4754819 2450056 2177844 10966320 23489138
47389B3489138J679189j2731700j3555750l330943Q41239m377209m441546O752576
47381e675006J5478700J0183142j502009p473735q957594j1991849j2894107o017336
47373b8849794K281795J745697m784493n805851R65410P976872J2168237J6184050
47365A881923J6718656O814535q391144j3152664l220465P022005N990451K56951
47357A3920248m79837p81427q421331j5833468r459479O872009J4997746Q724388
47349I538849J191784L019033P777934N233901l198038r747561j1264776p598945
47341e047819J875537J2301059J2812075J192160q850742n289001M442599M791994
47333A8227862m735888j0783706o730957J319379P150136R735405O806013l166415
$$ plain form
47389 23489138 25168327 12436627 -1119123 -4450066 -3608827 -7986036 -12427582 -5675006
47381 -5675006 9803694 19986836 18484827 11011092 2053498 -9938351 -22832458 -28849794
47373 -28849794 -26567999 -24822302 -29606795 -35412646 -34447236 -26470364 -14302127 1881923
47365 1881923 18600579 25415114 17023970 3871306 650841 7672846 13663297 13920248
47357 13920248 13440411 12658984 4237653 -11595815 -21055294 -14183285 814461 9538849
47349 9538849 10730633 13749666 21527600 26761501 23563463 13815902 2551126 -5047819
47341 -5047819 -3172282 9128777 21940852 23133012 14282270 8993269 13435868 18227862
47333 18227862 13491974 2708268 -4022689 -2703310 4446826 14182231 20988244 17821829
47325A7821829j1703569o620915R778528K1134905J8402396Q665917J41065p868607
47317D9751549j5543024j6979462j0701632l589561J566930R414722J7283778
47310C1203300J3344223j402844p016289N581550J5703364K701077j9666660k2099694
47302A8348027l520888R946302N783285j849846j456692n42985n165715o292435
47294A5249053J370418N611704l588773j4550768r844405P234411J7150070J0321385
47286B8953095l901559j2160720j0407907k741202M654059O961668L124655l364053
47278A1118036p129121m492693L790804J0466561N780543r634315j8854102o550684
47270a5504971J7387994K5475548P668021j4869464j8409247o071737K526021
$$ plain form
47325 17821829 6118260 -502655 9275873 30410778 48813174 57479091 57620156 49751549
47317 49751549 34208525 17229063 6527431 2937870 4504800 13919522 31203300
47310 31203300 44547523 43144679 36128390 41709940 57413304 60114381 40447721 18348027
47302 18348027 14827139 24773441 30556726 28706880 27250188 26707203 21541488 15249053
47294 15249053 16619471 22231175 18642402 4091634 -5752771 1481640 18631710 28953095
47286 28953095 25051536 12890816 2482909 -258293 4395766 11357434 14482089 11118036
47278 11118036 3988915 -503778 3287026 13753587 19534130 9899815 -8954287 -15504971
47270 -15504971 1883023 27358571 35026592 20157128 1747881 -4323856 -1797835
47263a797835L37309k856074M78286O596815R284215O734848O04p155719q333907
47254C288542j919623M111164K295944l196090m071617j675964k284342l290265
47246f742251J781305P115478N77621j2836254j2393742O466890J9595904O522729
47238A0087680j8615279k5587352q833901R309861J2950003J0076508J1884138
47231A271658J3027190L789972r719150j1854180j1994J1207919Q831958m342658
47223A2200715j5959445j7320850q332166M318114J0925062O331132k747706l181375
47215a3766519P790102J6914183J1803872k025355r141503n223645J43214K55702
47207F750051o48359J840492M286466K744612r72039n450726j2994078k0447076
$$ plain form
47263 -1797835 -1460526 -4316600 -3838314 2758501 12042716 18777564 18778168 11622449 3288542
47254 3288542 1368919 5480083 7776027 4579937 508320 -1167644 -3451986 -6742251
47246 -6742251 -4960946 2154532 2732153 -10104101 -22497843 -16030953 3564951 10087680
47238 10087680 -8527599 -34114951 -42948852 -33638991 -20688988 -10612480 1271658
47231 1271658 14298848 18088820 8369670 -3484510 -3496504 7711415 16543373 12200715
47223 12200715 -3758730 -21079580 -29411746 -25093632 -14168570 -7837438 -10585144 -13766519
47215 -13766519 -5976417 10937766 22741638 20716283 11574780 6351135 6494349 6750051
47207 6750051 6101692 7942184 12228650 14973262 14001223 8550497 -4443581 -24890657
47199b4890657j6633916J126253J6255939J1805618m644788r470625M565354J9043746
47191b843076J6183546J265672p899353m141839M568596P698655J855903q358041
47183H330063j3733300q140315K978359O384818k063150j0012991m975704P243704
47175a3988516J0381890J518872m752327J736359J1455899Q794946n869451j6622585
47167g344913j2495074M31889Q649971P080666K038800J505662O290086J0676771
47159A6833858R541176L676051j763021l405336l014120m011586o294579o867638
47151D694805m742243j784711J321161N441586P882335K611604r910996j8068871
47143a2555330j1581769L772302J2269308Q629088L053504M031580O239817J346345
$$ plain form
47199 -24890657 -41524573 -40398320 -24142381 -12336763 -16981551 -26452176 -21886822 -2843076
47191 -2843076 13340470 14606142 6706789 2564950 7133546 14832201 16688104 8330063
47183 8330063 -5403237 -13543552 -10565193 -4180375 -6243525 -16256516 -21232220 -13988516
47175 -13988516 -3606626 -2087754 -6840081 -5103722 6352177 15147123 9277672 -7344913
47167 -7344913 -19839987 -19408098 -10758127 -3677461 -1638661 -132999 6157087 16833858
47159 16833858 26375034 30051085 28288064 24882728 21868608 17857022 11562443 4694805
47151 4694805 -47438 -1832149 -510988 4930598 12812933 15424537 5513541 -12555330
47143 -12555330 -24137099 -20364797 -8095489 533599 3587103 7618683 13858500 15204845
47135A5204845p648355j1492875q640350m849772k123957K302443P123083O861696
47127c263242J878903j44939M328893Q781266N937472k414095q691686q460768
47119b048196k795782M698321J0067918J0980463Q872959O776684M256937j536695
47111C9272609r008372j1919961q346082l966718l111069k770421j74183M55599
47103D31402m086730p048437m50181J0547733J2767003L869341m716531n218558
47095F095042k867879l609912l073313M313060J2958734J2770042M208553k752220
47087B8042107l121192j671942l150419n514978m696344l67568M458222N204743
47079A9182629k255931j5418793k2234253j3164958L391926Q486003j581591r153787
$$ plain form
47135 15204845 7556490 -3936385 -12576735 -17426507 -19550464 -17248021 -10124938 -3263242
47127 -3263242 -1384339 -1529278 2799615 11580881 17518353 15104258 6412572 -2048196
47119 -2048196 -4843978 -145657 9922261 20902724 29775683 36552367 40809304 39272609
47111 39272609 30264237 18344276 9998194 6031476 2920407 149986 -24197 431402
47103 431402 -3655328 -10703765 -11153946 -606213 12160790 16030131 11313600 6095042
47095 6095042 3227163 -382749 -3456062 856998 13815732 26585774 30794327 28042107
47087 28042107 24920915 23248973 20098554 14583576 9887232 9519664 13977886 19182629
47079 19182629 16926698 1507905 -20726348 -33891306 -30499380 -22013377 -23594968 -32748755
47071c2748755j597185R405852P094561l176238l486566O543406J0028658K561036
47063e375231j99481R635264J7341755R882520k416046l808501J032459k412260
47055B3680479j1561537j1186724r39929K609025o794659j4741970q957569L098765
47047b4794119P599683L160766k678101o220523p395024l799537N464424J4117304
47039a4545127J4969021R415591M469669K681958P24303l554114p636467p745259
47031a220425l280681J647508J302006m220289n918519L658292J7301119J9215615
47023B8484626O156121p433180r571808n081158k778089k13977O859467R653655
47015B6075657k344295j9686383k0673744k066036J4369355J1264164k576847
$$ plain form
47071 -32748755 -34345940 -24940088 -17845527 -21021765 -24508331 -17964925 -7936267 -5375231
47063 -5375231 -5574712 4060552 21402307 31284827 28868781 25060280 26092739 23680479
47055 23680479 12118942 932218 -7711 2601314 -4193345 -18935315 -27892884 -24794119
47047 -24794119 -17194436 -14033670 -16711771 -22932294 -30327318 -34126855 -28662431 -14545127
47039 -14545127 423894 9839485 14309154 16991112 17715415 14161301 6524834 -1220425
47031 -1220425 -4501106 -2853598 -1551592 -5771881 -11690400 -8032108 9269011 28484626
47023 28484626 34640747 27207567 17635759 12554601 9776512 9562535 16422002 26075657
47015 26075657 23731362 4044979 -16628765 -18694801 -4325446 6938718 4361871
47008D361871q099964k118860L834381L500375J883022L036752L348437k81776
47000I464238l747454k348510O04048j897824q836855j0423300j813623P819900
46992a1179380O193510m608848r818485k192320Q059952P983773q95012o848628
46984a3305438m141991K648575P103052O691014K656881j8230L626699R239543
46976A4500105M324427j2845254k3757425j2463590Q974234J5378288M746333
46969a142882j797499L365760K947146j1937485k2008948r664260J1510134J7667626
46961a1060408R961211N929865P060880J138817q643387m852844J2080306J8841333
46953C0455773M053000j3679831j3598836q95863N956763J892557m867426r307360
$$ plain form
47008 4361871 -3738093 -5856953 -2022572 1477803 3360825 6397577 9746014 9464238
47000 9464238 5716784 3368274 3972322 2074498 -6762357 -17185657 -18999280 -11179380
46992 -11179380 -4985870 -9594718 -19413203 -21605523 -13545571 -5561798 -6456810 -13305438
46984 -13305438 -17447429 -14798854 -7695802 -1004788 1652093 1633863 5260562 14500105
46976 14500105 18824532 5979278 -17778147 -30241737 -21267503 -5889215 -1142882
46969 -1142882 -2940381 425379 3372525 -8564960 -30573908 -40238168 -28728034 -11060408
46961 -11060408 -1099197 4830668 11891548 13030365 4386978 -465866 11614440 30455773
46953 30455773 34508773 20828942 7230106 6334243 12291006 14183563 9316137 8777
46945H777j1641409r450078j073149O817181O228159p39k582990k8324R56724
46936a0765848j719915j700499N050026J2493046J1083651m82746j2432300j3589756
46928a2064341m394492K440477j623532p388789P6856J7346896K4076693J2027248
46920C0497016k340288k975511K473924j808923j2786420j4878553o315212k12488
46912h346455j838725k785838J933115P436269J0909654J4284692J3397960Q66048
46904C5856720j7282351k4594901j7957960j1066950r287231j321577J4931289
46897c0722961K0088118L053649j5572871j1098721P774061J2918135j45028q829014
46889b2534632j179168Q309553N532499k164851j908203L370875K029302o514786
$$ plain form
46945 8777 -11632632 -21082710 -22155859 -15338678 -9110519 -9111258 -11694248 -11722572 -10765848
46936 -10765848 -12485763 -14186262 -9136236 3356810 14440461 13957715 1525415 -12064341
46928 -12064341 -16458833 -14018356 -15641888 -23030677 -22953821 -5606925 18469768 30497016
46920 30497016 28156728 25181217 27655141 25846218 13059798 -1818755 -8133967 -8346455
46912 -8346455 -10185180 -12971018 -11037903 -3601634 7308020 21592712 34990672 35856720
46904 35856720 18574369 -6020532 -23978492 -35045442 -44332673 -45654250 -30722961
46897 -30722961 -10634843 -7581194 -23154065 -34252786 -26478725 -13560590 -13705618 -22534632
46889 -22534632 -23713800 -15404247 -9871748 -12036599 -13944802 -10573927 -8544625 -15059411
46881a5059411j0361274r52149J6039418K5416444J7033758k801525j6337476
46874A2977785j3803839l881527q0996l024016m660080l504343l510464k551777
46866b2039257L660642R081892M542797l798464o60560J2642624J7484427P012770
46858B7926871l342444j752518K695425p60843n951960m348592k506773q467993
46850C491173j3558635n899775P393437R931591J305530n178022m937721m407146
46842a1859568m245074J329055Q856230O900552m625106j1679386o245818L801399
46834a7767716Q638161Q325724O515319L006882k424235o856353q647163q622059
46826a7831440n622553J829966R063570Q755280J564675m749250o623370o453996
$$ plain form
46881 -15059411 -25420685 -26372834 -10333416 15083028 32116786 29315261 12977785
46874 12977785 -826054 -4707581 -4788577 -7812593 -12472673 -15977016 -19487480 -22039257
46866 -22039257 -18378615 -9296723 -4753926 -8552390 -9212950 3429674 20914101 27926871
46858 27926871 24584427 22831909 25527334 24766491 18814531 14465939 11959166 3491173
46850 3491173 -10067462 -15967237 -8573800 1357791 2663321 -2514701 -7452422 -11859568
46842 -11859568 -16104642 -14775587 -5919357 981195 -3643911 -15323297 -21569115 -17767716
46834 -17767716 -9129555 -803831 5711488 8718370 6294135 -562218 -9209381 -17831440
46826 -17831440 -23453993 -21624027 -12560457 -3805177 -2240502 -6989752 -13613122 -20067118
46818b0067118m184341K290475Q519021O805598q60855m470925j514446J150926
46810a2331665J746208N800341J1315976P148706p888039j8564547j3608706j50627
46802b6532353R703382J4212574J5542879J0769473M4825o984907l972932J968909
46794A4751850K653484J453183L360748L382366k861532p532859l759987o37356
46786A0809897q786838j9276961j5506391n13232P479013M197455L141613R050555
46778i404889Q675010n121785j7856290j2773327O177371K0984142K1273096J1091462
46770B3044790L07279l593953J79693M173798l23947j0991589j4729081m744888
46762f677898Q422075R627048p09746o995685M92125J1602129Q436287j0343356
$$ plain form
46818 -20067118 -24251459 -21960984 -13441963 -6636365 -7497220 -11968145 -13482591 -12331665
46810 -12331665 -10585457 -4785116 6530860 13679566 5791527 -12773020 -26381726 -26532353
46802 -26532353 -16828971 -2616397 12926482 23695955 23740780 16755873 12782941 14751850
46794 14751850 17405334 18858517 22219265 25601631 22740099 15207240 11447253 10809897
46786 10809897 2023059 -17253902 -32760293 -33273525 -25794512 -21597057 -18455444 -9404889
46778 -9404889 -729879 -5851664 -23707954 -36481281 -30303910 -9319768 11953328 23044790
46770 23044790 23352069 19758116 19937809 24111607 23787660 12796071 -1933010 -6677898
46762 -6677898 1744177 11371225 10661479 3665794 4157919 15760048 24196335 13852979
46754A3852979k4444526j5931792O743309J8357963R491141l299722l659411K765387
46746C875328K781324j457372L8644L938539o44944r504849p154720O105874J1340500
46737I318324K45982j1442121q510818J837526M146466j785148m758863j460032
46729a2408684J069066j330319m497028l130641K605423P314836N294313k231724
46721g314758n332165L120512J4703406J3446548j895065j4141647j0187180L027898
46713d572451J0435912P220473j071722q234311j0256542n420137K298938N714825
46705c885015M140849L683781N686460M649802L39370j56080L439802K251151
46697B0150120m102928l198782P980958J3000722Q48678j4457711j4771094m886592
$$ plain form
46754 13852979 -10591547 -26523339 -19780030 -1422067 8069074 4769352 1109941 3875328
46746 3875328 6656652 5199280 5237924 9176463 8531519 -973330 -8128050 -2022176 9318324
46737 9318324 9564306 -1877815 -10388633 -8551107 -4404641 -6189789 -10948652 -12408684
46729 -12408684 -11339618 -12669937 -17166965 -20297606 -17692183 -10377347 -5083034 -7314758
46721 -7314758 -12646923 -9526411 5176995 18623543 16728478 2586831 -7600349 -4572451
46713 -4572451 5863461 13083934 12012212 3777901 -6478641 -11898778 -9599840 -3885015
46705 -3885015 255834 3939615 9626075 14275877 14615247 14459167 17898969 20150120
46697 20150120 16047192 12848410 20829368 33830090 34678768 20221057 5449963 563371
46689E63371j071293m063894l117117J772890K151971k11551L143136R046123
46681H213636O948001j352108m632756k486082m087317q379619m548523P354281
46673b970487J4218483R866583J545076l984110n998184k930894M562428O795324
46665B1104219j708491p355092L488113J6574474P317219j6778045k2321695j311583
46657i90881J6479533J0418504m250921r147369r983868j3466216p654037J1727439
46649f867816K2126834P356230j2411673j0740968M584787R102398K129621l34028
46641A4945385R94060o151804j6497429j3730119k31480P133169N509919M588786
46633c439513L417516m559881j0366817k052105Q179924L95861j5016084j0078885
$$ plain form
46689 563371 -507922 -4571816 -7688933 -5916043 -3764072 -3975623 -832487 8213636
46681 8213636 15161637 13809529 9176773 6690691 2603374 -5776245 -10324768 -2970487
46673 -2970487 11247996 21114579 22659655 18675545 12677361 9746467 14308895 21104219
46665 21104219 19395728 12040636 15528749 32103223 39420442 22642397 320702 -990881
46657 -990881 15488652 25907156 21656235 12508866 2524998 -10941218 -18595255 -6867816
46649 -6867816 15259018 22615248 10203575 -537393 4047394 13149792 15279413 14945385
46641 14945385 15939445 9787641 -6709788 -20439907 -20671387 -13538218 -8028299 -3439513
46633 -3439513 -21997 -4581878 -14948695 -17000800 -8820876 -8425015 -23441099 -33519984
46625c3519984J2548402K1297046P432975l718919L59004J268039r746259j3229165
46617a7308861j424192J906322j4608782k2442375L23227K6760676K1074423m361271
46609a0080833j0999207M922088J4152417O514918N15889L806890K186065q107588
46601B910639j0379738K223342J3742376J1675878L361355k047380p080546j3051930
46593A353996j2684907m519404J698760J644961K873914Q158223Q819786K097953
46585I443282j525300K636021L364765o534957j5029786q466176P521099J7440223
46577H849171J6320300Q870327j935704j2892751j5776406p502535J742230K386032
46569F0664K43519M955907J1384971P652500l778243r420310o157764k794211
$$ plain form
46625 -33519984 -20971582 325464 7758439 4039520 4398524 5666563 -4079696 -17308861
46617 -17308861 -18733053 -16826731 -31435513 -53877888 -53554661 -26793985 -5719562 -10080833
46609 -10080833 -21080040 -16157952 -2005535 4509383 5025272 8832162 11018227 2910639
46601 2910639 -7469099 -5245757 8496619 20172497 23533852 21486472 14405926 1353996
46593 1353996 -11330911 -15850315 -14151555 -12506594 -9632680 -1474457 7345329 9443282
46585 9443282 7917982 10554003 13918768 7383811 -7645975 -16112151 -8591052 8849171
46577 8849171 25169471 34039798 32104094 19211343 3434937 -4067598 -2325368 60664
46569 60664 304183 5260090 16645061 24297561 20519318 11099008 4941244 2147033
46561B147033j629468L680825J0413802O015925q687387j3709960J252609J7205719
46553A6689098J0816423j0805774j8472709r13215K1024268K2923238N461881
46546D6723210j1830188j5408255q202640j064544j399854q002750j2208117o304035
46538a7697173N899835J0928604K617431p746837n706216N807534J0564270K936385
46530G603833m402497m59061Q004560Q626952K630091K26629K067980r58306r563742
46521A3776439j1542821q01007J0124946O047777q639578j4791514m336970R342707
46513h20021J0265249N24925n359662k094720O98660m370411r636831l883760
46505a4676571R202219J4128743M518349q288976j0137589k94094J0966632J4998403
$$ plain form
46561 2147033 517565 4198390 14612192 20628117 11940730 -1769230 -516621 16689098
46553 16689098 27505521 16699747 -1772962 -2686177 18338091 41261329 46723210
46546 46723210 34893022 19484767 11282127 10217583 8817729 814979 -11393138 -17697173
46538 -17697173 -11797338 -868734 1748697 -5998140 -11704356 -5896822 4667448 7603833
46530 7603833 3201336 2742275 10746835 19373787 22003878 22230507 24298487 23340181 13776439
46521 13776439 2233618 1432611 11557557 17605334 8965756 -5825758 -10162728 -820021
46513 -820021 9445228 9970153 4610491 2515771 3214431 -1155980 -10792811 -14676571
46505 -14676571 -5474352 8654391 13172740 4883764 -5253825 -5547919 5418713 20417116
46497B0417116J0423972Q61037p904660j1120924q919276m951091o46509M371182
46489B530847O285094J19638r176735r585849p88017K487307n899110j0588559
46481b4615384R78469J4741116J0059573o048165q701609N045960J2697975M465917
46473H623852k302778M618677J1135491K395111j1737761j4665648r538747q328423
46465a9800226q217696J8143J0244142R567715K152599K518512Q837695N388740
46457A0709624q495622j4338127l732760Q445798P608726q44358m752730l718666
46449i118115l552007l622052j390578j218216p049586j1899528n784922Q566357
46441c5068647J7549982J3667222L324405k602629l19345N699011Q990122O868161
$$ plain form
46497 20417116 30841088 31702125 23797465 12676541 3757265 -1193826 -1840335 2530847
46489 2530847 8815941 8935579 -241156 -9827005 -10615022 -8127715 -14026825 -24615384
46481 -24615384 -23636915 -8895799 1163774 -4884391 -13586000 -8540040 4157935 8623852
46473 8623852 6321074 10939751 22075242 24470353 12732592 -1933056 -11471803 -19800226
46465 -19800226 -28017922 -27999779 -17755637 -8187922 -6035323 -3516811 5320884 10709624
46457 10709624 2214002 -12124125 -15856885 -7411087 197639 -646719 -5399449 -9118115
46449 -9118115 -12670122 -16292174 -17682752 -18900968 -25950554 -37850082 -43635004 -35068647
46441 -35068647 -17518665 -3851443 -527038 -3129667 -3449012 2249999 11240121 18108282
46433A8108282J500191l440028o148819n980360j709721N843052J0918640P914353
46425B7005590l55669m898926k120265K235881K256585p71944k717927k847283
46417A7786042k328326j274231q91858m145829j0325227j3060601q274885p79924
46409b3294839J750973j173810l521355j576118K538903N341898N794737M448629
46401i690982J953142p05932k016931o68371L340213P425561O880138p24474j0914265
46392e121901j4776879p709254N577531J5329940J4870591N402084m772687o792945
46384B006480n6575O815249P087983M711944N990609O415181l440331j9595620
46376I934920k5486448j5014886j935913Q73474q49333L725734J0424147Q177864
$$ plain form
46433 18108282 19608473 16168445 10019626 4039266 2329545 8172597 19091237 27005590
46425 27005590 26649921 21750995 19630730 21866611 24123196 23351252 20633325 17786042
46417 17786042 15457716 14183485 13291627 9145798 -1179429 -14240030 -22514915 -23294839
46409 -23294839 -21543866 -22717676 -26239031 -27815149 -25276246 -19934348 -14139611 -9690982
46401 -9690982 -7737840 -8443772 -10460703 -11129074 -7788861 -363300 6516838 5792364 -5121901
46392 -5121901 -19898780 -27608034 -22030503 -6700563 8170028 13572112 8799425 2006480
46384 2006480 1949905 8765154 15853137 20565081 26555690 32970871 29530540 9934920
46376 9934920 -15551528 -30566414 -32502327 -31628853 -32478186 -28752452 -18328305 -10150441
46368a0150441j58642k055255K562957R21219r457407j4034902l515116J1291769
46360b4595818J5389465R457726M135267K932356J716652j22909R30553L962681
46352A3805973L770575p92516n901814r493697j1818416j0116866j196379R598136
46344a2145004J0784552l0151j0614487r286545K9590M579755O26636l447492
46336a9503146p40357N291187P277405L424849k208694n059348l280569J467224
46328a3331449M703571L153556j111318l541978l763241m325203l069582N154054
46320a6131590J6624873J8202594N117343r287336j0615173k693934J372542M31017
46312C020336K691391O420648J717319p993447o125928R496064J8316565O966949
$$ plain form
46368 -10150441 -10309083 -12364338 -9801381 -8880162 -18337569 -32372471 -35887587 -24595818
46360 -24595818 -9206353 251373 4386640 7318996 9035648 8912739 9843292 13805973
46352 13805973 17576548 16784032 10882218 1388521 -10429895 -20546761 -21743140 -12145004
46344 -12145004 -1360452 -1390603 -12005090 -21291635 -21262045 -16682290 -16055654 -19503146
46336 -19503146 -20243503 -14952316 -7674911 -4250062 -6458756 -11518104 -14798673 -13331449
46328 -13331449 -8627878 -5474322 -6585640 -10127618 -13890859 -18216062 -21285644 -16131590
46320 -16131590 493283 18695877 23813220 14525884 3910711 1216777 2589319 3020336
46312 3020336 5711727 12132375 13849694 5856247 -269681 9226383 27542948 34509897
46304C4509897r589232j1462121l679159l854851j0928927q922938K625961O031307
46296e270063m050979r621140K205415J7384450J4704835m160184j8280224j4901553
46288b1989443o50788J1712755J6123302J2425637K655301q046483j2603929q592799
46280h966447j421423J999696J271566J317696M077170N511582K349670k495472
46272C644038n200845p734242j2449177j3008828j383473J5681910K0308495Q570738
46264H428616j788703J936428P056284k868241j7857602j4634342N539875J6451146
46256B263461O057859p390361n490014N325134J0185751Q658443O743298J261654
46248B7615225j0862155j8901676j1533448L525621R406468M005584j568067l278757
$$ plain form
46304 34509897 24920665 13458544 9779385 5924534 -5004393 -13927331 -11301370 -5270063
46296 -5270063 -9321042 -18942182 -16736767 647683 15352518 11192334 -7087890 -21989443
46288 -21989443 -22640231 -10927476 5195826 17621463 20276764 12230281 -373648 -8966447
46280 -8966447 -10387870 -8388174 -7116608 -5798912 -1721742 3789840 6139510 3644038
46272 3644038 -1556807 -9291049 -21740226 -34749054 -36132527 -20450617 -142122 8428616
46264 8428616 6639913 8576341 15632625 12764384 -5093218 -19727560 -14187685 2263461
46256 2263461 8321320 930959 -4559055 766079 10951830 19610273 26353571 27615225
46248 27615225 16753070 -2148606 -13682054 -10156433 -749965 3255619 1687552 -1591205
46240a591205o102474q857822m650291L783413N897718J941588L427771J1932681
46232E781379J3854521K294010j0865079j2874112p074496k734518J47352M817840
46224f653103O596496O75484n833060l008910M945423N203519l125847p451951
46216h651949k030799L032148j664970r448798p152019N347443J4132362R369431
46208B932849k327306o560790R72336R459527O759267m916085j1376074m590084
46200i646360O869229R274195J607352m545668j845886L742580L376866j788706
46192G043602l946255j186421M05952l088350p679249p964289m189444M33141
46184b0171313N011032R018724Q911858L283448p78679N041970J5998787J6607147
$$ plain form
46240 -1591205 -7693679 -16551501 -21201792 -17418379 -11520661 -9579073 -6151302 5781379
46232 5781379 19635900 21929910 11064831 -1809281 -8883777 -11618295 -11470943 -6653103
46224 -6653103 -56607 618877 -5214183 -8223093 -3277670 1925849 -1199998 -8651949
46216 -8651949 -10682748 -7650600 -9315570 -18764368 -25916387 -20568944 -6436582 2932849
46208 2932849 605543 -5955247 -4982911 4476616 11235883 6319798 -5056276 -9646360
46200 -9646360 -2777131 6497064 8104416 3558748 1712862 5455442 8832308 7043602
46192 7043602 3097347 1910926 2316878 -771472 -8450721 -16415010 -20604454 -20171313
46184 -20171313 -15160281 -6141557 2770301 6053749 5275070 10317040 26315827 42922974
46176D2922974J483870j4850553j6482195p285799l121846p467594q377464p2916
46168a3251523O690706J979471o945039o453602L166397R189526N486865j53152
46160b90351J377550Q305540J1233596M544605p450609j4187900r197483J933642
46152c731410O818400J685770l649017r17216L417220n32068p497899m223592
46144h629812O439911O197635r283345j9312222p481618J2912604J8348750Q737286
46136G929189K516657N092410M479770k347644k209703Q828704J4069316K373387
46128D0732086j1583347r144671L223323N180457n315944j1153489m833197J464507
46120H569725k363671q974180o871017K501687Q611710N737152k633595q641626
$$ plain form
46176 42922974 44406844 29556291 13074096 5788297 2666451 -4801143 -13178607 -13251523
46168 -13251523 -6560817 -4581346 -11526385 -17979987 -14813590 -5624064 -137199 -290351
46160 -290351 1087199 9392739 20626335 25170940 17720331 3532431 -5665052 -3731410
46152 -3731410 3086990 4772760 1123743 206527 3623747 3091679 -4406220 -8629812
46144 -8629812 -2189901 4007734 -5275611 -24587833 -32069451 -19156847 -808097 7929189
46136 7929189 10445846 15538256 20018026 17670382 15460679 24289383 38358699 40732086
46128 40732086 29148739 20004068 23227391 28407848 23091904 11938415 7105218 8569725
46120 8569725 6206054 -2768126 -9639143 -7137456 1474254 7211406 4577811 -4063815
46112d063815o646122O11840K866612m326981r949511k006847J0801623Q119900
46104d593301r427626j6123816J558792K2458536K0451738R73120j1354684r509006
46096e566247n643423l401101N277380J6369541J3093178m983622j5720296p296315
46088g870905L931752J589857m776310J16274Q349998L278365q497997o045503
46080i924469R546080J4953966K839095o476786j89181N361108n667107j8225947
46072g783241q602801J5918715K5764058J2998873L85031L324286P415675m693488
46064D4727108k3448501k6281037j0120115O897968J0660798L296544o716827
46057i84062j3142821j1909699m424062j66183m942354q795161R39989J6437884
$$ plain form
46112 -4063815 -10709937 -10098097 -7231485 -11558466 -21507977 -23514824 -12713201 -4593301
46104 -4593301 -14020927 -30144743 -28585951 -6127415 14324323 15297443 3942759 -5566247
46096 -5566247 -11209670 -14610771 -9333391 7036150 20129328 15145706 -574590 -7870905
46088 -7870905 -3939153 -2349296 -7125606 -7009332 1340666 4619031 -3878966 -9924469
46080 -9924469 -378389 14575577 17414672 10937886 10748705 16109813 10442706 -7783241
46072 -7783241 -16386042 -467327 25296731 38295604 38680635 42004921 49420596 44727108
46064 44727108 21278607 -5002430 -15122545 -8224577 2436221 5732765 -984062
46057 -984062 -14126883 -26036582 -30460644 -30626827 -35569181 -44364342 -43424353 -26986469
46049b6986469J6782694O55901q239011L585547J8151448J3820870k267006q182985
46041G320989j560887J691279l579009o622550l442396l056080q087468q445142
46033b5781264j27291O720545N678586M332194Q258353R590093K142630n255127
46025E558719l014398K537674K43839o884176q036026l392868j763911l714138
46017a8465285j937505L410001M134836j019997m075926j853999L46871J329604
46009a8131400P015043J6101311J5656087l43102j7907196j9102150n231750O627938
46001a5315219O863278K164311J368238L267302K718490Q33481J830117L702458
45993G432456K21196p849629j1283565n292449K562107K950895j771433k511074
$$ plain form
46049 -26986469 -10203775 -9547874 -17786885 -14201338 3950110 17770980 15503974 7320989
46041 7320989 5760102 7451381 3872372 -2750178 -6192574 -9248654 -17336122 -25781264
46033 -25781264 -25908555 -19188010 -13509424 -9177230 -918877 8671216 10813846 5558719
46025 5558719 2544321 5081995 5325834 -1558342 -9594368 -12987236 -14751147 -18465285
46017 -18465285 -20402790 -16992789 -12857953 -13877950 -17953876 -19807875 -19461004 -18131400
46009 -18131400 -11116357 4984954 20641041 20297939 2390743 -16711407 -21943157 -15315219
46001 -15315219 -8451941 -6287630 -4919392 -1652090 1066400 1899881 3729998 7432456
45993 7432456 7653652 -195977 -11479542 -16771991 -14209884 -11258989 -13030422 -15541496
45985a5541496J510979K795603K6191O24358N837403N635492m374034j2067764
45977a5553268n456794Q263411J2801076N980246n97378j200017p11971j156944
45969B368361J401509N137671K237733o319844r756426n725873n038342j1492090
45961b7187301j2122641J617195J6303934J4608565J318669m691784J491339P463985
45953a198039N781835K914332M147008M363669r01349o529938o291652k189773
45945I6093N42750J675544L758097O016516N183372J04329o709822r944290m429001
45936c706412Q112277J6170861R521153o175498j4154983q141548K0673j408502
45928B38021p909980q310942k415417J088971n46357j878310K46508L245498N009898
$$ plain form
45985 -15541496 -14030517 -11234914 -11208723 -10584365 -4746962 888530 -3485504 -15553268
45977 -15553268 -21010062 -12746651 54425 6034671 5437293 4237276 3525305 2368361
45969 2368361 3769870 8907541 11145274 4825430 -4930996 -10656869 -15695211 -27187301
45961 -27187301 -39309942 -37692747 -21388813 -6780248 -5461579 -10153363 -8662024 -1198039
45953 -1198039 4583796 7498128 11645136 16008805 15107456 8577518 2285866 96093
45945 96093 638843 2314387 6072484 12089000 17272372 17376701 10666879 722589 -3706412
45936 -3706412 4405865 20576726 30097879 23922381 9767398 1625850 1646523 238021
45928 238021 -7671959 -15982901 -18398318 -17309347 -17855704 -19734014 -19487506 -16242008 -11232110
45919a1232110N531289L256527k234086n026103O81404R227020Q604476j670420
45911G137997q279935l176030N270123N787486l18286m526599m219603k014221
45903d339068J726190O465837O543987j276185q683507m943489O335875J0365069
45895A2194709J544963r564417j1461923m245685N797349J4434290J7800735J1555057
45887C8055078j662018j0848346r602092m637522m326083m815277K683928J4393072
45879A9240740J5604879J395378j4250002j5235299l107977O323840L256412n936878
45871G291093r546891n611588j352442l35579K199773Q885166J2441412N372679
45863A9343623o945729j2070002p826931l698540m256661k658160N330316J1987074
$$ plain form
45919 -11232110 -5700821 -2444294 -4678380 -9704483 -9023079 203941 8808417 7137997
45911 7137997 -1141938 -4317968 952155 6739641 6421355 1894756 -2324847 -4339068
45903 -4339068 -2612878 3852959 10396946 9120761 437254 -4506235 1829640 12194709
45895 12194709 13739672 4175255 -7286668 -11532353 -5735004 8699286 26500021 38055078
45887 38055078 36393060 25544714 15942622 11305100 6979017 2163740 4847668 19240740
45879 19240740 34845619 36240997 21990995 6755696 3647719 9971559 13227971 7291093
45871 7291093 -2255798 -7867386 -9219828 -9555407 -7355634 1529532 13970944 19343623
45863 19343623 12397894 327892 -7499039 -11197579 -15454240 -18112400 -12782084 -795010
45855g95010R522014K175907j928513l140587n390829o359423k990130l84303
45847i290874l710224o932915k233156M581631K732255l458113j62291J1646870
45839f826817J6099507Q483401K007189L320115J268267j0155866j6643815o012472
45831h460491R641576J1810533M026949L082874R449819P340207p752108k0981071
45823H158288j9968069q918865K571837J0925668J4099734Q247043m185235j1965468
45815a035067p490391M027837J2090001J2064829N676643l303904r838086r480010
45807B711852l634160R02323M50475j340445J93314M411924P342547O187186Q28859
45798A8053875n057551m463403N626432J6969323J7018641M788746p031129q000667
$$ plain form
45855 -795010 8727004 10902911 8974398 5833811 442982 -5916441 -8906571 -9290874
45847 -9290874 -13001098 -19934013 -22167169 -17585538 -14853283 -18311396 -18473687 -6826817
45839 -6826817 9272690 17756091 19763280 23083395 24351662 14195796 -2448019 -8460491
45831 -8460491 1181085 12991618 17018567 20101441 29551260 36891467 29139359 8158288
45823 8158288 -11809781 -20728646 -18156809 -7231141 6868593 15115636 10930401 -1035067
45815 -1035067 -8525458 -4497621 7592380 19657209 25333852 22029948 12191862 2711852
45807 2711852 -922308 -19985 430490 -909955 -716641 3695283 11037830 17225016 18053875
45798 18053875 12996324 8532921 14159353 31128676 48147317 52936063 45904934 37904267
45790C7904267j233171L561684J236804p377509j7725953k1716926j3357856J566929
45782a7141731R060724M561277j305429L97515M271439K489883p90181J945644
45774C489141O525295L874163l189638l637387L614616Q235413M674631j907714
45766B1678520n930626o563529k721596N668804J1237002O344188k245862O65666
45758B8132567J5186685K2930197J2735837l588731q935977k269914O539257J2011179
45750H2741100J2776577O098698n289907r068868J079244J2142911P293569j0147278
45742I7626046k1748964j9280692j0793261l541526L924847J1501290J3490707
45735G1178447Q505562K425969j320757m343267m938275Q30985P631482M164263
$$ plain form
45790 37904267 36671096 40232780 41469584 34092075 16366122 -5350804 -18708660 -17141731
45782 -17141731 -8081007 -3519730 -4825159 -4427644 -156205 2333678 1543497 3489141
45774 3489141 10014436 13888599 10698961 7061574 10676190 18911603 23586234 21678520
45766 21678520 15747894 9184365 6462769 12131573 23368575 29712763 27466901 28132567
45758 28132567 43319252 66249449 78985286 75396555 66460578 64190664 70729921 82741100
45750 82741100 95517677 101616375 96326468 87257600 88336844 100479755 107773324 97626046
45742 97626046 75877082 56596390 45803129 42261603 46186450 57687740 71178447
45735 71178447 79684009 82109978 80789221 76445954 71507679 72338664 79970146 84134409
45727H4134409p599033j1003791p3362Q115518j932468j9087689k0305392l176503
45719B9071689J2014146J0271472k204378j0857932j0030147m554721j882972
45712B1827157n127925r549875o451819N324165J4937515J2475659K242730m783275
45704C0894332p369071j2039574j7514005j4710106l422732M466681K832049L74828
45696a6487598N517240J2880675J3160706P849381M456816L415109J48581l716866
45688B7224044j891486M754779P330767J321248p106464r246384l581159M019662
45680B2825007O335006P43815p608333r342683j376899P518510O920578p93180
45672B5221821l434130L149854R050685N825262o73410l77915M830234N492384
$$ plain form
45727 84134409 76535376 65531585 65458223 73573741 71641273 52553584 32248192 29071689
45719 29071689 41085835 51357307 49152929 38294997 28264850 23710129 21827157
45712 21827157 16699232 7149357 697538 6021703 20959218 33434877 35677607 30894332
45704 30894332 23525261 11485687 -6028318 -20738424 -24161156 -19694475 -16862426 -16487598
45696 -16487598 -10970358 1910317 15071023 22920404 27377220 30792329 30940910 27224044
45688 27224044 25332558 30087337 37418104 38739352 31632888 22386504 18805345 22825007
45680 22825007 29160013 29903828 22295495 12952812 11575913 19094423 26015001 25221821
45672 25221821 21787691 24937545 33988230 39813492 39140082 38762167 43592401 49084785
45664D9084785J736276L643110J3258642J8631885J1558407Q85482o99901M934922
45656A03033608P341295O089951R783375J8690476K3236536K1449773K3006222
45649B12631236L0957285L4155552K6320086J8749597K1976161K6875207J9457371
45642C91122495M902433j511856j048893p897040k0804842k1514167o104698M177404
45634C41320836o274445k4401090k9920184k4427273k2518181k5473759k3024806
45627A85281098j5316086j3735109k0372846k3560955j6783533q146093o249590
45620H1116886p840612n576163Q7988K899798n22241q385113j5818735j6620934
45612B9340874q043961L476491P200729K129005l62297O834356J4155557Q420436
$$ plain form
45664 49084785 50821061 54464171 67722813 86354698 97913105 98798587 98098686 103033608
45656 103033608 110374903 116464854 126248229 144938705 168175241 189625014 212631236
45649 212631236 243588521 277744073 304064159 322813756 344789917 371665124 391122495
45642 391122495 396024928 394513072 393464179 385567139 364762297 343248130 337143432 341320836
45634 341320836 335046391 310645301 280725117 256297844 233779663 208305904 185281098
45627 185281098 169965012 156229903 135857057 112296102 95512569 87366476 81116886
45620 81116886 73276274 67700111 67788099 70687897 70165656 61780543 45961808 29340874
45612 29340874 21296913 24773404 31974133 34103138 33740841 40575197 54730754 63151190
45604F3151190o409614j3512640p879534l128329q452613j2125181j86356J7653792
45596B9110715J8315204o30120j6135800j3102985m068843n240486r767211j721343
45588c240869J4869823K0986088J1046073k843923j2240866j8844669k0701778
45581a0970121j2147968N54049L442108j673182J728954J5255588J9111724M011676
45573A9312828j2475116j3680659o827807l709991M71805J0696782J4469860K580474
45565A0838176r646264n805024K441404l810968j4775943p581256J2033655J7061737
45557G55517L836014m601330K47348J767752o446239q233123K443617P582466
45549b647978k379113j0048514j331064J0406350Q475238j52395r65587L234297
$$ plain form
45604 63151190 56741576 43228936 35349402 32221073 23768460 11643279 11456923 29110715
45596 29110715 47425919 46795799 30659999 17557014 13488171 8247685 -1519526 -3240869
45588 -3240869 11628954 32615042 43661115 40817192 28576326 9731657 -10970121
45581 -10970121 -23118089 -22564040 -19121932 -20795114 -19066160 -3810572 15301152 19312828
45573 19312828 6837712 -6842947 -13670754 -17380745 -16908940 -6212158 8257702 10838176
45565 10838176 1191912 -4613112 -2171708 -5982676 -20758619 -28339875 -16306220 755517
45557 755517 4591531 -9799 237549 2005301 -4440938 -12674061 -10230444 -2647978
45549 -2647978 -5027091 -15075605 -16406669 -6000319 2474919 2322524 1356937 4591234
45541D591234K736517N53777K924489L882068k453801o527179J653236J3115404
45533B0475745J3167249M234904j522234k982884o339388r375551o835605l810814
45525G011422o766822q679495n04710R748228Q063251j372506k784028M084872
45517H800212M044041o591459j2813720m492490Q721093J1676820K146236r272917
45509B217816j0882013o93500R774909O239830q776268j5429203l717374J0044065
45501a1221738O747056o910869j0696383k261086M198079M149048N426957Q313393
45493b255543N549746R56253N298205J3344124Q555562p228987j3304179l980455
45485F934726K213917m777846r851546r18465R718670P985030J570209K810283
$$ plain form
45541 4591234 7327751 7881528 10806017 14688085 12234284 5707105 7360341 20475745
45533 20475745 33642994 37877898 36355664 33372780 27033392 17657841 10822236 7011422
45525 7011422 244600 -8434895 -8939605 808623 8871874 7499368 4715340 8800212
45517 8800212 12844253 6252794 -6560926 -11053416 -2332323 9344497 11490733 2217816
45509 2217816 -8664197 -9357697 417212 6657042 -2119226 -17548429 -21265803 -11221738
45501 -11221738 -4474682 -11385551 -22081934 -24343020 -20144941 -15995893 -10568936 -2255543
45493 -2255543 3294203 4250456 9548661 22892785 31448347 24219360 10915181 6934726
45485 6934726 9148643 4370797 -5480749 -6399214 3319456 11304486 12874695 15684978
45477A5684978N560653r84524r587988p039658J730274K576985k616001o68233
45469D656486P708754Q450528j097754p342285k531423N117613P277582O770131
45461B9009632P423080N156559l540566j3214029j6513498j3270856o945881J760480
45453a0135079J1345816J4812410O857700n985956j0444469l066608N086398L777250
45445A2247462k541632l014834J579043k33426j0588730j4966230k092526J7687074
45437a923799K4483703J4292782J128349l759510l117356l875463o949469r409539
45429A0869698q670028k680192O914984J1615288M565723p471496j0353042k071620
45421B719315M391755N20822o072079m501580L827923Q840953N030405l979527
$$ plain form
45477 15684978 21245631 20261107 10673119 3633461 5363735 7940720 5324719 4656486
45469 4656486 12365240 20815768 19718014 12375729 9844306 14961919 22239501 29009632
45461 29009632 36432712 41589271 38048705 24834676 8321178 -4949678 -11895559 -10135079
45453 -10135079 1210737 16023147 22880847 16894891 6450422 3383814 8470212 12247462
45445 12247462 9705830 6690996 8270039 8036613 -2552117 -17518347 -19610873 -1923799
45437 -1923799 22559904 36852686 37981035 34221525 31104169 27228706 20279237 10869698
45429 10869698 2199670 -480522 6434462 18049750 22615473 15143977 4790935 2719315
45421 2719315 7111070 7631892 1559813 -2941767 886156 9727109 14757514 10777987
45413A0777987j0121331p626300J280341P613824O917334N921853J0520566J2465584
45405C7749858P23846j7299024k1966098r202178M221714N684395P36299j862298
45397a213486k868478m645736n396388o454077j0688247j0515777M480366K4189606
45389a3112217K4107591K028399j5083597j1372494l580114p138712p976060Q798411
45381b3328793K5683562J7404915p408031j8739911q802627M300901Q373269O700336
45373D183621K377104l053815j865900P077086P564218q618314j8976649k263865
45365a3576514K0294883J2670919j5999474k2244658K064997J7326862K088122
45358B625137j4720136o015949J0362311P211516p178138r810849k312121J203992
$$ plain form
45413 10777987 656656 -6969644 -5689303 1924521 8841855 14763708 25284274 37749858
45405 37749858 38473704 21174680 -791418 -9993596 -5771882 -87487 648812 -1213486
45397 -1213486 -4081964 -8727700 -14124088 -20578165 -31266412 -41782189 -37301823 -13112217
45389 -13112217 10995374 13023773 -2059824 -13432318 -17012432 -24151144 -32127204 -23328793
45381 -23328793 2354769 19759684 12351653 -6388258 -15190885 -10889984 -2516715 4183621
45373 4183621 6560725 3506910 1641010 8718096 16282314 7664000 -11312649 -13576514
45365 -13576514 6718369 19389288 3389814 -18854844 -16789847 537015 2625137
45358 2625137 -12094999 -18110948 -7748637 -537121 -7715259 -17526108 -19838229 -18634237
45350a8634237M485723J6186318K3032132P882503j6082757j9897086j767185
45343d794589J2475862R039178K1305k728722l220730o454134q095014n387310
45335i144154l196523l571629j436153M866143R116715P080505K227210j043102
45327D899012k444119k514736j036959N41163R79465K593000O526603P214733
45319A6758162j73792q737257o291158O782872J5869637J0810465k054507j0247095
45311B2717327j0461675q037973n843844j014177O907561J0610242L051890j0428009
45303G501342j4989279m853550P467110P785739L88765k8996O627528M848419
45295A4747078r898625k0397982j2348784L954707Q875787N84738o288021k760701
$$ plain form
45350 -18634237 -14148514 2037804 25069936 32952439 16869682 -3027404 -4794589
45343 -4794589 7681273 16720451 16741756 14013034 10792304 4338170 -3756844 -9144154
45335 -9144154 -12340677 -15912306 -17348459 -12482316 -3365601 3714904 5942114 4899012
45327 4899012 2454893 -59843 -1096802 -555639 423826 3016826 9543429 16758162
45319 16758162 16584370 7847113 1555955 8338827 24208464 35018929 32964422 22717327
45311 22717327 12255652 4217679 -1626165 -2640342 4267219 14877461 17929351 7501342
45303 7501342 -7487937 -12341487 -4874377 2911362 3300127 3271131 9898659 14747078
45295 14747078 4848453 -15549529 -27898313 -23943606 -15067819 -14483081 -20771102 -23531803
45287b3531803O565770J3856535J4791404P427512n316748j3572412r971875l263
45279i754880M747404J728030j801847q17289K841174O450892R084106Q790350
45271B1267940M036410k107030m818879m079139l640909m648356m849815l039825
45263a879603m73377R74267k12367l607983n019897o96281N355705M495312m058679
45254e122903j1079212j0109597m198903K387182Q752152J0507193J487999j1589541
45246a8965630j0540266Q654501K5262495K0791625M014751m545413j495992J394341
45238B4570412j701561p266655j2220413j3032243l985191J0286670J2385154
45231I036173k354483j2415046j527479J2535020O109118q630962k974069J7447272
$$ plain form
45287 -23531803 -16966033 -3109498 11681906 19109418 13792670 220258 -9751617 -9754880
45279 -9754880 -5007476 -3279446 -5081293 -5898582 -3057408 3393484 12477590 21267940
45271 21267940 25304350 23197320 18378441 14299302 10658393 6010037 1160222 -1879603
45263 -1879603 -2352980 -1378713 -1591080 -5199063 -10218960 -10915241 -5559536 -1064224 -5122903
45254 -5122903 -16202115 -26311712 -30510615 -28123433 -19371281 -8864088 -7376089 -18965630
45246 -18965630 -29505896 -20851395 4411100 25202725 29217476 24672063 23176071 24570412
45238 24570412 22868851 15602196 3381783 -9650460 -13635651 -3348981 9036173
45231 9036173 6681690 -5733356 -7260835 5274185 11383303 2752341 -221728 17225544
45223A7225544J9269501l523567k0793228j7136160j2155359j8643846j8636617
45216e4393732K73261J8177292J5553868N027163N891414J0861420M476738n563333
45208C04091l354275M538951J359467q237568o099086P308536J4115013Q103313
45200A8038442j36093m279743p858180j0364162o293200K368220P702008Q040733
45192G218025O017643j53058r907293j2542016k271441P019329M88549j2101401
45184a6231663j0675686K116396O413650m28889j733438O191392P691081j326188
45176g983345l621621Q286485J6313321O014181r656356j1907302l916799O8787
45168f402649q51558J325026N305536M334517Q16638J118508J742595l986226
$$ plain form
45223 17225544 36495045 32971478 12178250 -4957910 -17113269 -35757115 -54393732
45216 -54393732 -54120471 -35943179 -20389311 -15362148 -9470734 1390686 5867424 304091
45208 304091 -3050184 1488767 2848234 -5389334 -11488420 -4179884 9935129 18038442
45200 18038442 17902349 13622606 5764426 -4599736 -10892936 -8524716 -822708 7218025
45192 7218025 13235668 13082610 3175317 -9366699 -11638140 -4618811 -4130262 -16231663
45184 -16231663 -26907349 -24790953 -18377303 -18806192 -20539630 -14348238 -6657157 -7983345
45176 -7983345 -11604966 -3318481 12994840 19009021 9352665 -2554637 -6471436 -6402649
45168 -6402649 -7254207 -5929181 -623645 3710872 4527510 5646018 7388613 3402387
45160C402387j0348203o193897N007497P781285k064089j0921207p353101L327529
45152a7361799R553083R229885Q166582Q489697O000723j918552j0775788j3339851
45144a956020q388156k767987k841115n366002j305506J0558371J9243923J4435936
45136B1613444j95279j1221029j0771357l245692J901628o2388o184707r396337
45128a7561717n017093M294734J0608818R202865L740655J387550M321837Q094136
45120A9071785P243593Q15190o709243q918492l512360M116002N411918j788986
45112A5729407j0216047j1158581l670244N437913Q727271M070814m173490q426886
45104c679843m385334M440902J0309803R424653M002931k831980r213481j1499276
$$ plain form
45160 3402387 -6945816 -13139713 -8132216 -350931 -2415020 -13336227 -20689328 -17361799
45152 -17361799 -7808716 1421169 9587751 18077448 24078171 22159619 11383831 -1956020
45144 -1956020 -10344176 -13112163 -15953278 -21319280 -22624786 -12066415 7177508 21613444
45136 21613444 21418165 10197136 -574221 -3819913 -1918285 -1980673 -8165380 -17561717
45128 -17561717 -22578810 -18284076 -7675258 1527607 5268262 6655812 10977649 19071785
45120 19071785 26315378 27130568 20421325 11502833 7990473 12106475 17518393 15729407
45112 15729407 5513360 -5645221 -9315465 -3877552 4849719 8920533 4747043 -3679843
45104 -3679843 -8065177 -3624275 6685528 16110181 20113112 17281132 8067651 -3431625
45096c431625n997221L501476O602391n14266q378941o431542K779249Q171350
45088c699129N184355r84030m722681n105828k788278J130610L361221J687379
45080e936381m15009J762597O166649O957825M022595J633832j007782p767796
45072E416530j4044916r700995L057854P944769k000502j1769606o011991P597203
45064a9511654J1069978M120724J742517P348956P954142j647157q846431m656449
45056b425374J322102j657048o672984j836066P922205P757020l325047j1115188
45048a0030380p315000J757378P924346R780596O917523j902783j1074293j0075489
45040a4018102J598699J1093370R280424K020178j605160k665223n813279q033431
$$ plain form
45096 -3431625 -9428846 -5927370 675021 160755 -8218186 -14649728 -11870479 -3699129
45088 -3699129 1485226 501196 -4221485 -9327313 -12115591 -10984981 -7623760 -5936381
45080 -5936381 -6351390 -4588793 1577856 8535681 12558276 14192108 13184326 5416530
45072 5416530 -8628386 -18329381 -15271527 -7326758 -9327260 -21096866 -27108857 -19511654
45064 -19511654 -8441676 -4320952 -2578435 4770521 12724663 11077506 2231075 -2425374
45056 -2425374 -1103272 -2760320 -9433304 -11269370 -3347165 4409855 1084808 -10030380
45048 -10030380 -17345380 -15588002 -7663656 2116940 9034463 7131680 -3942613 -14018102
45040 -14018102 -12419403 -1326033 7954391 9974569 8369409 5704186 -109093 -8142524
45032h142524m430486R28381J138148q69737K500155Q321786O080781l871097
45024A655407p953883N71056J0869999J0776386M173321K624913O228572M593542
45016C3539313n010534j2387190j0022021l953761k941544m473280p57414N829056
45008a77375N092980k938840m915533N465714J5153242R515715o046699j4774900
45000F374304j2892073j0093245q750116j019432J1040965J2012535j792151j1470807
44992a6590020k808080J0647302Q626615l638396m896285P197833J3391842M731814
44984A6662625m715318k402669M073902K102473o435361j1536663j0912154q799598
44976b1962763n629501J207715R593863J3314566R500218J617618l817035k785157
$$ plain form
45032 -8142524 -12573010 -11644629 -10506481 -11376218 -8876063 -554277 5526504 1655407
45024 1655407 -6298476 -5727420 5142579 15918965 20092286 22717199 28945771 33539313
45016 33539313 28528779 16141589 6119568 2165807 -775737 -5249017 -6006431 -177375
45008 -177375 4915605 1976765 -2938768 2526946 17680188 27195903 21149204 6374304
45000 6374304 -6517769 -16611014 -25361130 -26380562 -15339597 -3327062 -5119213 -16590020
44992 -16590020 -19398100 -8750798 -124183 -3762579 -8658864 -1461031 11930811 16662625
44984 16662625 11947307 9544638 13618540 15721013 9285652 -2251011 -13163165 -21962763
44976 -21962763 -27592264 -26384549 -16790686 -3476120 6024098 7641716 3824681 1039524
44968A039524J325808p6996q806054j3702506n313635O963283O055067n746838
44960a8262347q507753L440992J1315042K682656p522482k145390R324590P587063
44952b087629l399916m098272O717522J0686125J305006p103367m919537k0799
44944b920867O14583J977191N937079M062570m545355o209996M174304R881267
44936A2970776k269144j8164240j6651742j777755O257966M085504N617627J2883559
44928B952551J1210778l276127j3986203r465110M65379L810666M327950Q557969
44920D597853J0770012N496658J650145P117097J0350274k760375k1168336k0387695
44912d334367J83308J4660384Q521303l055554k681689L779362K412197m303874
$$ plain form
44968 1039524 2365332 2288336 -6517718 -20220224 -25533859 -18570576 -12515509 -18262347
44960 -18262347 -26770100 -23329108 -12014066 -9331410 -16853892 -18999282 -9674692 -2087629
44952 -2087629 -5487545 -9585817 -2868295 7817830 9122836 2019469 -2900068 -2920867
44944 -2920867 -2306284 -329093 5607986 9670556 5125201 -1084795 3089509 12970776
44936 12970776 10701632 -7462608 -24114350 -25892105 -19634139 -15548635 -9931008 2952551
44928 2952551 14163329 10887202 -3099001 -12564111 -12098732 -8288066 -3960116 4597853
44920 4597853 15367865 20864523 22514668 29631765 39982039 37221664 16053328 -4334367
44912 -4334367 -4151059 10509325 19030628 15975074 13293385 17072747 19484944 15181070
44904A5181070m863771O1134P58577l325421m224068q33551O83052q8301K017231
44895E365952N304668K224874o355085j0355882n917171p6070K296567M600677
44887b911470Q168797P492072R51490m159147l214835j171458j760455J91621
44879C586615P825244J3062752Q049189j828635o569330o616883q317612j0099577
44871i08237n850865J422365K644956j743401k344443K476087L641759k156076
44863b817855o075764k342210K377073K082762K467987Q792934J2635796M071580
44855B1192303r303706j0740351M68031P742143K790871l135641N10110O492002
44847A6015762L454305m671161o759834m518686q228050j5398079j1271297O451205
$$ plain form
44904 15181070 10317299 10378433 11137010 7811589 3587521 2753970 3437022 3348721 5365952
44895 5365952 10670620 12895494 6540409 -3815473 -9732644 -9808714 -7512147 -2911470
44887 -2911470 5257327 12749399 13700889 9541742 6326907 5155449 3394994 3586615
44879 3586615 11411859 24474611 32523800 30695165 24125835 17508952 9191340 -908237
44871 -908237 -6759102 -5336737 -2691781 -4435182 -6779625 -4303538 -661779 -2817855
44863 -2817855 -8893619 -11235829 -8858756 -6775994 -4308007 4484927 17120723 21192303
44855 21192303 11888597 1148246 1616277 9358420 12149291 9013650 9523760 16015762
44847 16015762 19470067 14798906 8039072 3520386 -4707664 -20105743 -31377040 -24925835
44839b4925835J9609163J4132614j53926m720312K003567O247499P92788o956817
44831F028741p557540n99174P311980R306865L395218m658624o097138j015649
44823F114679k12849q850840j5086813n498838J3100323K0292832Q985376o988389
44815A1855481j2643862p278926J371600P034527O441835Q93186k001570K451443
44807H123714N645763l297649j6905220j6008354N70826J1399761M281754n792777
44799a1982182j735239R503897J1079202L236052j109995J199957K487213o9782
44791A2609123k708859m827941p460435o763419j255504O69418o079723r844381
44783b5661721J404934J6256971J2680970p106697j6288024j789675J7002221
$$ plain form
44839 -24925835 -5316672 8815942 8662016 3941704 5945271 12192770 12985558 6028741
44831 6028741 -1528799 -2127973 5184007 14490872 17886090 13227466 7130328 6114679
44823 6114679 5901830 -2949010 -18035823 -23534661 -10434338 9858494 18843870 11855481
44815 11855481 -788381 -8067307 -6695707 338820 6780655 7673841 5672271 8123714
44807 8123714 13769477 10471828 -6433392 -22441746 -21870920 -10471159 -6189405 -11982182
44799 -11982182 -13717421 -4213524 6865678 10101730 8991735 10191692 12678905 12609123
44791 12609123 9900264 5072323 -2388112 -9151531 -10407035 -9737617 -15817340 -25661721
44783 -25661721 -24256787 -7999816 4681154 -2425543 -18713567 -20503242 -3501021
44776c501021J6418309o01915j2997084r978206N68352O104805K583664m150269
44768e553365n180845J470016O905272J951966q630243j0108102K345200J5744030
44760a056071J5302052K221059r242736q773070j9045N139011N58345o643859
44752b514314n057298M479553Q090282j720579j4421276j6742359j0833539o121934
44744d4841464j460827R253007J9353743J5750537J742412n059903N93461N156831
44736D87797N14984l708761N38153M982472L1814q870919j0934525n725244M88606
44727b2195623M803697N523470o77048j0931130j4691388q298453j594170j737619
44719d9798264j045047Q746922K0122824J9905081Q080373n175490j4261277j8210416
$$ plain form
44776 -3501021 12917288 12315373 -681711 -10659917 -10091565 -3986760 -1403096 -5553365
44768 -5553365 -10734210 -9264194 -2358922 -406956 -9037199 -19145301 -16800101 -1056071
44760 -1056071 14245981 16467040 7224304 -1548766 -1567811 3571200 4129545 -2514314
44752 -2514314 -7571612 -3092059 4998223 3277644 -11143632 -27885991 -38719530 -44841464
44744 -44841464 -46302291 -37049284 -17695541 -1945004 -202592 -5262495 -4669034 487797
44736 487797 1002781 -2705980 -2167827 2814645 2846459 -6024460 -16958985 -22684229 -22195623
44727 -22195623 -17391926 -11868456 -12545504 -23476634 -38168022 -46466475 -48060645 -49798264
44719 -49798264 -50843311 -42096389 -21973565 -2068484 6011889 836399 -13424878 -31635294
44711c1635294j3084178K066674J6225447J6937523P566422K151512M994362P156124
44703A2378592K580009l753459n231198k085815J557386K647228J54597m116740
44695D130600n909015l428661q110J295601J798123K294997J1248m443280m132286
44686h390783L119091P939751K588413n983736o706050j690837o91286l249988
44678a3065425l58156Q356315J3063992R402821L161548j362288n753419r177448
44670D267940p556970k969418k546438n811722m497890K463471N887063K103060
44662h660904p89378J874886K749854k298995k681792J0400325K4738100K0288641
44654D5620737j444864j6957920j1911823J121946K782565o260460r843969k058208
$$ plain form
44711 -31635294 -44719472 -42652798 -26427351 -9489828 -1923406 228106 5222468 12378592
44703 12378592 14958601 11205142 5973944 3888129 5445515 8092743 8247340 4130600
44695 4130600 -1778415 -5207076 -5215186 -3919585 -2121462 173535 184783 -4258497 -8390783
44686 -8390783 -5271692 2668059 5256472 -727264 -7433314 -9124151 -9815437 -13065425
44678 -13065425 -13423581 -5067266 7996726 17399547 20561095 19198807 13445388 4267940
44670 4267940 -3289030 -6258448 -8804886 -14616608 -19114498 -16651027 -10763964 -8660904
44662 -8660904 -9450282 -7575396 -4825542 -7124537 -9806329 593996 25332096 45620737
44654 45620737 44175873 27217953 15306130 16428076 19210641 12950181 3106212 1048004
44646A048004N155405J593071o169404o305508K51939L502403J333035Q56778
44638A265723L778467L116142k550492l777415M257843J1308505O248582n836336
44630A7811019j0871106n002380L569230Q512891J0625822J0384071N367444l270976
44622C7126015r392439r499033o827099n814630n813817k133390P482053J7585154
44614B2712814J7811513M804463r565369q953739O928263K0506266J8446438P431334
44606H0121983L331206J2840118L1025067M8364956N4244398M2837582K2648826
44599B95414136J0993897J2333850J3208502N693437O06409N767809Q073379m736597
44591C47354822j9131972j5363313j131651J15445j1785369j4082566K91438J1722131
$$ plain form
44646 1048004 6203409 7796480 1627076 -4678432 -4426493 -924090 408945 1265723
44638 1265723 5044190 8160332 5609840 1832425 6090268 17398773 23647355 17811019
44630 17811019 6939913 1937533 5506763 14019654 24645476 35029547 40396991 37126015
44622 37126015 27733576 18234543 11407444 5592814 -221003 -2354393 5127660 22712814
44614 22712814 40524327 45328790 35763421 26809682 33737945 54244211 72690649 80121983
44606 80121983 83453189 96293307 127318374 175683330 229927728 272765310 295414136
44599 295414136 306408033 318741883 331950385 337643822 338250231 344018040 352091419 347354822
44591 347354822 328222850 312859537 311727886 311843331 300057962 285975396 286266834 297988965
44583B97988965N982717o852017j2900448j3190786j3475648j2888416j1030132
44576B33634235j1752154j3732731j1065884o883169j1011556k1112088k3467570
44569A34609083j6112510j2313680j6299638j5880033o133657M05589l560648
44562F4714506p525538m081854k556015r357662j3780142p217137J364036L322736
44554B4882930N775643J3919982J6189683M553286p619858p009745l155392r155203
44546C8381326j5734676q407874L565577K067623o815420l230748R873612J0707847
44538C0407267k804459q604421J787552R529276J316105q896005m557298O512374
44530B4690391O290249m957623j1276912o413976j452484o108187j3274047q736458
$$ plain form
44583 297988965 303971682 297119665 284219217 271028431 257552783 244664367 233634235
44576 233634235 221882081 208149350 197083466 190200297 179188741 158076653 134609083
44569 134609083 118496573 106182893 89883255 74003222 67869565 68275154 64714506
44562 64714506 57188968 53107114 50551099 41193437 27413295 20196158 21560194 24882930
44554 24882930 30658573 44578555 60768238 65321524 57701666 50691921 47536529 38381326
44546 38381326 22646650 14238776 17804353 19871976 13056556 9825808 19699420 30407267
44538 30407267 27602808 18998387 20785939 30315215 31631320 22735315 18178017 24690391
44530 24690391 30980640 26023017 14746105 8332129 6879645 771458 -12502589 -21239047
44522b1239047P512350J8360488J1680931k299181n467863J956502N091750J915326
44514A7511256N747914J6139479J2367551j1171592k7598205j5936991M643963
44507A703375N080326p193846m233863J2231959J3750709m554295j4172364k25491
44499B386510J5281909J0336213m830556r465795m690687m889803j1134709j2010539
44491a9017457l856783M522020N102273k8817j930029N079173J4820461J3658722
44483A8349563j210526j3927250j0125887K180565N631727J43209j681623K16843
44475d23379m623340j2304821p165914Q342980J2245069j796986j2534348m171174
44467b2431913J1246485J5886605R631215m57424j3405529k3384658j5848682
$$ plain form
44522 -21239047 -13726697 4633791 16314722 14015541 8547678 10504180 15595930 17511256
44514 17511256 23259170 39398649 51766200 40594608 12996403 -2940588 1703375
44507 1703375 6783701 -410145 -4644008 7587951 21338660 16784365 2612001 2386510
44499 2386510 17668419 28004632 23174076 13708281 9017594 4127791 -7006918 -19017457
44491 -19017457 -22874240 -18352220 -13249947 -13278764 -15208793 -10129620 4690841 18349563
44483 18349563 17139037 3211787 -6914100 -4733535 898192 1041401 -640222 -423379
44475 -423379 -5046719 -17351540 -24517454 -16174474 -3929405 -5726391 -18260739 -22431913
44467 -22431913 -11185428 4701177 14332392 13874968 469439 -22915219 -38763901
44460c8763901Q872031K5825151J6768726l932801j1576627m484526K670156M949032
44452C27241O874028O910772J666909k391467J441672O516199M440013J111876
44444B6897243M622052O878271l586225j8125576j7817546k595162Q890113O597098
44436A1760268j459754o337384q215839q450329n710350j690588N6450Q55427
44428a9192099L583114N459943L308853J364615L714550M607344k328717j1056288
44420a0538685j1528459n292755k79986L228743P716654P022572l927059j4268390
44412b7867365r823441M059951J0298998O543730M616899O739051L608910l975993
44404e799260l152858Q158933J5810710J1110223P31074q173862j4937540j4470522
$$ plain form
44460 -38763901 -29891870 -4066719 12702007 8769206 -2807421 -7291947 -4621791 327241
44452 327241 7201269 14112041 15778950 13387483 14829155 21345354 25785367 26897243
44444 26897243 31519295 38397566 34811341 16685765 -1131781 -3726943 5163170 11760268
44436 11760268 10300514 3963130 -4252709 -12703038 -18413388 -20103976 -20047526 -19192099
44428 -19192099 -15608985 -10149042 -6840189 -5475574 -1761024 2846320 517603 -10538685
44420 -10538685 -22067144 -27359899 -27639885 -24411142 -16694488 -9671916 -13598975 -27867365
44412 -27867365 -37690806 -33630855 -23331857 -16788127 -12171228 -5432177 -1823267 -5799260
44404 -5799260 -8952118 -793185 15017525 26127748 26858822 18684960 3747420 -10723102
44396a0723102N80532K0742207K2799700J589220j8721771j6281346N62609R078087
44388I626136L081636n254712n895223q42319K501158P6461m551099l054669N738784
44379A426153R591830j232173j5335278j3257657K115970Q087579k440779j0539517
44371b1583872l583918N253875K681225j394784N763952J4126224P283989q133960
44363D12731j1799959j135421P290438M268205k172302k387463L655235J0334857
44355H466321J1346375L316888p740446r856080k598319n65658r201073j1487526
44347a8319518M870457K1487838J3853214q427644j3833434K832368J4404715
44340A6867996O118491l616366K671898J3189705R051818n117658j1529633p013563
$$ plain form
44396 -10723102 -10142570 10599637 33399337 34988557 16266786 -14560 548049 9626136
44388 9626136 12707772 7453060 1557837 715518 3216676 3293137 -1257962 -4312631 1426153
44379 1426153 11017983 9785810 -5549468 -18807125 -16691155 -8603576 -11044355 -21583872
44371 -21583872 -25167790 -19913915 -17232690 -18627474 -12863522 1262702 8546691 412731
44363 412731 -11387228 -12522649 -5232211 -964006 -3136308 -5523771 -1868536 8466321
44355 8466321 19812696 23129584 15389138 5533058 2934739 2369081 -6831992 -18319518
44347 -18319518 -13449061 8038777 21891991 13464347 -369087 2463281 16867996
44340 16867996 22986487 19370121 22042019 35231724 44283542 39165884 27636251 20622688
44332B0622688k449165k538090k179346J082482L704587L273081L03649m691669
44324A7128217r928179j1859942j0342104q760405n734738M387951J7672908J8565396
44316A1129104J127094j7647788j7792833k190860J0283519J1311952Q676493
44309D896681R056551J0350213J0875657J2502689J2796275O008126n352687j0659360
44301E0474145o412945j925257n605947j3503846j6005850j0003926p21543M333043
44293F27874J662897m164852l856038M393925R950934M975988j133862M231392
44285A6688258J3210058O914918j1566335j6513618J396010J8595793J3973113
44278D2698197r91466n363965k430805o955916j4331601r868094J126232J455544
$$ plain form
44332 20622688 18173523 15635433 13456087 14538569 18243156 21516237 21819886 17128217
44324 17128217 7200038 -4659904 -15002008 -23762413 -29497151 -25109200 -7436292 11129104
44316 11129104 12256198 -5391590 -23184423 -25375283 -15091764 -3779812 4896681
44309 4896681 13953232 24303445 35179102 47681791 60478066 66486192 61133505 50474145
44301 50474145 44061200 42135943 36529996 23026150 7020300 -2983626 -3705169 627874
44293 627874 2290771 -1874081 -5730119 -1336194 8614740 13590728 12456866 16688258
44285 16688258 29898316 36813234 25246899 8733281 10129291 28725084 42698197
44278 42698197 41706731 36342766 33911961 26956045 12624444 2756350 3882582 5338126
44270E338126n505930j503260J0464391P677000j1308822j9728306n893171P757289
44262a2702683L034214n772431p71846Q755278P113570J232936L991295P583554
44254A2463887K0566q269719k508271N973867k263960j7713287j5632067J056027
44246b6872957P401000R22454L307697J6486429J5982196l591156j4507592k304186
44238c176115R351200O35446j0220493j152235J3274213P606487r257723r871201
44230b810421L852163N034022j0788470j8266365n552990O923861J300809j0247299
44222c0554690q032185M244976Q839756K808744j64125P109962J5180609J3064286
44214A2497333L759671r04054K960481O038244j046427j3976264j9539947j2510610
$$ plain form
44270 5338126 -167804 -1671064 8793327 16470327 5161505 -14566801 -20459972 -12702683
44262 -12702683 -9668469 -15440900 -16212746 -7457468 -343898 889038 4880333 12463887
44254 12463887 12484453 4214734 1706463 7680330 5416370 -12296917 -27928984 -26872957
44246 -26872957 -19471957 -18549503 -15241806 1244623 17226819 13635663 -871929 -3176115
44238 -3176115 6175085 6810531 -3409962 -4562197 8712016 16318503 7060780 -2810421
44230 -2810421 1041742 6075764 -4712706 -22979071 -28532061 -21608200 -20307391 -30554690
44222 -30554690 -38586875 -34341899 -25502143 -22693399 -22857524 -15747562 -566953 12497333
44214 12497333 16257004 15352950 18313431 24351675 23305248 9328984 -10210963 -22721573
44206b2721573r42941N834015O972869N688761L076632L80025K30551J297448
44198a84213j143344n391193l012227O342642J0069115N87903j1474086j1959889
44190a6165292k555652N120818O789612N354464J143227m988457n720415K059737
44182h961958P322660M10224q160770j864605J3802504J7430236M199147q686684
44174A5490754j0660611j0195700j2858445q530734P931603K0942122J4524288
44167A6643277k936075r688871k13040R734061N580446q844293j7360286r425453
44159a6510234Q487454J8555562J0659882n533966j2522777o531639J526721M698733
44151B829736O758040Q763772L800972q083863j3185149k978009J0454778J0037740
$$ plain form
44206 -22721573 -23664514 -17830499 -10857630 -5168869 -2092237 -1712212 -1481661 -184213
44198 -184213 -1327557 -6718750 -9730977 -3388335 6680780 7268683 -4205403 -16165292
44190 -16165292 -18720944 -13600126 -6810514 -1456050 -312823 -5301280 -11021695 -8961958
44182 -8961958 -1639298 -1229074 -9389844 -11254449 2548055 19978291 24177438 15490754
44174 15490754 4830143 -5365557 -18224002 -26754736 -18823133 2118989 16643277
44167 16643277 13707202 4018331 3805291 13539352 19119798 10275505 -7084781 -16510234
44159 -16510234 -8022780 10532782 21192664 15658698 3135921 -3395718 -1868997 2829736
44151 2829736 9587776 18351548 22152520 14068657 883508 -2094501 8360277 18398017
44143A8398017k028305q422961j988301N540087J380765j0951543j6574381p720077
44135b2366699O870640J2226458N333832j639073J150002P195511N072906k066485
44127A1777092j430180P431925J1115111M190269l583700n825059q353836j2694621
44119B627001q585461O151353J5079999O897703n003789l423155N218721L699691
44111B2662063o252173q961815l009203j522666o765855o911095Q58354N296392
44103d605998K590751K848026R448503J0816382Q92293r018722q504677l405938
44095A060620k493241k271072K842511O536522N16154r357940j0164586n77546
44087a3908578Q951789J1363164Q374707L466614j004796j200540M946370J1696172
$$ plain form
44143 18398017 16369712 7946751 5958450 11498537 12879302 1927759 -14646622 -22366699
44135 -22366699 -15496059 -3269601 2064231 425158 1575160 8770671 13843577 11777092
44127 11777092 10346912 17778837 28893948 33084217 29500517 23675458 15321622 2627001
44119 2627001 -5958460 192893 15272892 22170595 17166806 13743651 18962372 22662063
44111 22662063 16409890 7448075 4438872 2916206 -3849649 -10760744 -9902390 -4605998
44103 -4605998 -2015247 832779 10281282 21097664 21989957 12971235 4466558 1060620
44095 1060620 -1432621 -3703693 -861182 5675340 6191494 -3166446 -13331032 -13908578
44087 -13908578 -4956789 6406375 14781082 18247696 17242900 16042360 20988730 32684902
44079C2684902R480662l908445j9760336k6114887j7689362q57048J0049997O057028
44071a0057489n092521o970396M055880J3728111J0254291k32525n555616m630421
44063d500686k706594J025609P967971R805411p99815j3876852j3051115l91329
44055a6527400P015482M604212M765094J0790897Q053852r241981k2221152j3516956
44047b6277952N540379J1767707L887041J02479P370236J2753704N768885p188627
44039A3723852j4109796j0672980N81305J3583266J8903461J1037289k031793
44032C1014604o680293k995912m617042j5907923k2621714j2802209M583799J2159544
44024a7867146O897840m78611k807693j937018k86933K234396L629854Q80569
$$ plain form
44079 32684902 42165564 38257119 18496783 -7618104 -25307466 -26164514 -16114517 -10057489
44071 -10057489 -15150010 -22120406 -18064526 -4336415 5917876 5685351 129735 -4500686
44063 -4500686 -7207280 -6181671 1786300 11591711 10791896 -3084956 -16136071 -16527400
44055 -16527400 -9511918 -4907706 -142612 10648285 18702137 9460156 -12760996 -26277952
44047 -26277952 -20737573 -8969866 -5082825 -4980346 2389890 15143594 20912479 13723852
44039 13723852 -385944 -11058924 -10477619 3105647 22009108 33046397 31014604
44032 31014604 24334311 21338399 16721357 813434 -21808280 -34610489 -30026690 -17867146
44024 -17867146 -10969306 -11447917 -14255610 -16192628 -16479561 -14245165 -10615311 -9734742
44016i734742m002883n406513j457785M948904J0746373J3242847R015789j258181
44008A6093809r541916r302759n235777n952974r320109n604294M816995Q811294
44000a5235731n20304j2574803j3500840l815457N857514J0447767J2457670J1728869
43992e155315M178552p592988j2090033l640532O498813K778635j2160570j7984055
43984d5167493l761003J5179377J7249710M757144l45266J0694192K1712719J7421995
43976C7741375M426666l440372o229947j0309579j1607857l909560M143357n17625
43968A0296458j2307572j3738553l395901K789317j171409l562688J562454L839472
43960a5688422k803253p877894k852772M525211N402449M188983O171525N419693
$$ plain form
44016 -9734742 -13737625 -19144138 -20601923 -15653019 -4906646 8336201 17351990 16093809
44008 16093809 6551893 -2750866 -7986643 -13939617 -23259726 -28864020 -24047025 -15235731
44000 -15235731 -15756035 -28330838 -41831678 -45647135 -39789621 -29341854 -16884184 -5155315
43992 -5155315 -976763 -8569751 -20659784 -24300316 -17801503 -15022868 -27183438 -45167493
43984 -45167493 -48928496 -33749119 -16499409 -11742265 -12087531 -1393339 20319380 37741375
43976 37741375 42168041 38727669 32497722 22188143 10580286 6670726 10814083 10296458
43968 10296458 -2011114 -15749667 -19145568 -16356251 -17527660 -21090348 -19527894 -15688422
43960 -15688422 -18491675 -26369569 -29222341 -24697130 -19294681 -15105698 -8934173 -3514480
43952c514480j951355o278642m43360N600718K140591j300685O917678J5633038
43944A6803503N866066j5527123k1588623m602821J2930524J1346894j637980
43937C590440p482453k328986M580895P659830R121299J0690002R463623K488702
43929C7783352p278944j1215135m122420O536202O925978m443974j2817384q054941
43921C312734Q01785J603158j156586K818315Q280010K661825r789700j2719235
43913d187694m744089n63829l768034r17958J1479943J5998344J430136j6855973
43905b129154j7348816m38618J6536350K1763930J4761265o34747j6497739k0970663
43897d958192j0050665M939721J0376884O139268J079248j092251k662289l559613
$$ plain form
43952 -3514480 -5465835 -11744477 -12187837 -6587119 -4446528 -5747213 1170465 16803503
43944 16803503 22669569 7142446 -14446177 -19048998 -6118474 5228420 3590440
43937 3590440 -3892013 -6220999 -1640104 6019726 15141025 25831027 35294650 37783352
43929 37783352 30504408 19289273 15166853 21703055 28629033 24185059 11367675 3312734
43921 3312734 4114519 5717677 4561091 7379406 15659416 18321241 8531541 -4187694
43913 -4187694 -8931783 -9495612 -13263646 -14181604 -2701661 13296683 14726819 -2129154
43905 -2129154 -19477970 -19916588 -3380238 18383692 33144957 32510210 16012471 -4958192
43897 -4958192 -15008857 -10069136 307748 6447016 7526264 6434013 3771724 212111
43889B12111j119615M063488Q223378Q379302L353287m719196q388923k041555
43881G962277O904832M434677q534870j3903753k913886Q900965M892686p126213
43873F16715q095222K671848R068194M714514l26023J003991L211605J116456
43865A3982078j528588r85907m30303k985677o010219o480966n414963l701342
43857a3555887K49142N529367O941612J687187n905042q906143m597332L850735
43849a4706361R606412O506336m796610j4882202j3906205k817907O972005O053318
43841b1971214l196611r962682o610988L605129J0438140Q460798K999096J729659
43833a4508673L694130K926647K05559J268684M048688N08553o670906m585640
$$ plain form
43889 212111 -907504 3155984 11379362 19758664 23111951 18392755 10003832 7962277
43881 7962277 14867109 19301786 10766916 -3136837 -6050723 2850242 7742928 616715
43873 616715 -7478507 -4806659 4261535 8976049 8650026 9654017 12865622 13982078
43865 13982078 12453490 11467583 11037280 8051603 2041384 -4439582 -9854545 -13555887
43857 -13555887 -13306745 -7777378 -835766 851421 -5053621 -13959764 -18557096 -14706361
43849 -14706361 -5099949 1406387 -3390223 -18272425 -32178630 -34996537 -28024532 -21971214
43841 -21971214 -25167825 -35130507 -41741495 -38136366 -27698226 -19237428 -16238332 -14508673
43833 -14508673 -10814543 -7887896 -7682337 -6413653 -2364965 -1856412 -8527318 -13112958
43825a3112958O630160Q285159p301416j8741330n624438J6814955J7120027n334101
43817a263942j9281035p877161R876437J1145592L5159o022232l393500p98320
43809a7579002j773835k888945l402623n212884o672752m808743p90929K711263
43801d0418450O044072R616985J0602442P147532K014195j591011l816125n347186
43793a5747546n649440n712371o645054m756713L774827J2369931R436178k434816
43785a5365004o105151M253694J1293670N58371j4442669j0641087R100166J9178949
43777b169061Q272059o792604q114698j8386L133141j366167o032314o970958
43769b0058988m918024J119313J0062597J2952610K791581j1469039j2741713
$$ plain form
43825 -13112958 -6482798 1802361 -5499055 -24240385 -29864823 -13049868 4070159 -1263942
43817 -1263942 -20544977 -28422138 -18545701 -7400109 -7364950 -13387182 -16780682 -17579002
43809 -17579002 -19352837 -22241782 -25644405 -30857289 -37530041 -42338784 -43129713 -40418450
43801 -40418450 -34374378 -24757393 -14154951 -7007419 -4993224 -6584235 -10400360 -15747546
43793 -15747546 -21396986 -27109357 -33754411 -38511124 -34736297 -22366366 -12930188 -15365004
43785 -15365004 -21470155 -17216461 -5922791 -5364420 -19807089 -30448176 -21348010 -2169061
43777 -2169061 6102998 -689606 -8804304 -8822690 -5689549 -7055716 -13088030 -20058988
43769 -20058988 -24977012 -23857699 -13795102 -842492 1949089 -9519950 -22261663
43762b2261663J283989J4382322J3997595N671940m19838n189859j2221507j3831476
43754a8588497j349786J5567771J7647371M228662m974132k20722M627348k398683
43746A4539332j0311585m416771P758810Q599249r83334n260956n89460K114076
43738A1449361k92279N72110M672153O95787j2055157j8429818j1410909l229411
43730b8028163l424385l309172N826745J4995460J2632717M474190K512727M483211
43722A0163330Q95014n524044m665429J869602L395944r78183k204128J085644
43714D037750M12015o192188j0171642p294841l347704j647338K415792R267368
43706a2520788R484639j867930j4083297j3237699q25884Q605082O468436p11974
$$ plain form
43762 -22261663 -20977674 -6595352 7402243 13074183 12654345 7464486 -4757021 -18588497
43754 -18588497 -19938283 -4370512 13276859 17505521 12531389 12310667 16938015 14539332
43746 14539332 4227747 -189024 7569786 16169035 15185701 9924745 9335285 11449361
43738 11449361 11157082 11729192 16401345 17097132 5041975 -13387843 -24798752 -28028163
43730 -28028163 -31452548 -34761720 -28934975 -13939515 -1306798 3167392 5680119 10163330
43722 10163330 11058344 5534300 868871 2738473 6134417 5156234 2952106 4037750
43714 4037750 4449765 -1742423 -11914065 -19208906 -22556610 -24203948 -21788156 -12520788
43706 -12520788 -3036149 -4904079 -18987376 -32225075 -33050959 -24445877 -17977441 -18689415
43698a8689415k085366L219813O614747L300583k57907M279455J3480680J5052701
43690B4915291M907892o827262j0450207r075100r913127j0813740n282204L935777
43682a8602680P524762M359953L008708P573648J1171543O237205n181826j4063888
43674B027425j3232253k709885J0170616J6364115J3812186Q560362M693992j336813
43666C8349745j1036318j5743504q064397L814551N487703k603572o483340n81641
43658C139227N062659J715905o299280j0680365r551537m896961J169479M460488
43650a5880385K087333k50568N339192J3642605J0191943o115996j8254484j4756043
43642b3996403m013947K609841O805674J1750804R846753k695859j1695610l861447
$$ plain form
43698 -18689415 -20774781 -17554968 -10940221 -7639638 -7897545 -3618090 9862590 24915291
43690 24915291 29823183 22995921 12545714 3470614 -6442513 -17256253 -22538457 -18602680
43682 -18602680 -11077918 -6717965 -3709257 3864391 15035934 21273139 16091313 2027425
43674 2027425 -11204828 -13914713 -3744097 12620018 26432204 34992566 39686558 38349745
43666 38349745 27313427 11569923 3505526 7320077 12807780 10204208 3720868 3139227
43658 3139227 8201886 9917791 3618511 -7061854 -16613391 -21510352 -20340873 -15880385
43650 -15880385 -13793052 -14043620 -8704428 4938177 15130120 9014124 -9240360 -23996403
43642 -23996403 -28010350 -25400509 -18594835 -6844031 3002722 306863 -11388747 -15250194
43634a5250194R299283O628567r331420j5833953n143631O116114N668011J470684
43626a6376539J303924k374208j3812704j7991733j950815J9382033J9778236
43619a2041806n52696j4614517o872722P967038J0591230L442548l67078k29358
43611a2677361l541245o735683j43075J0744443R052879n161058j0332121L724880
43603a5068341J6876299P912904j2231505j6865488l276630P689646P516991R131834
43595A685710J7321625J6769892N06080j2822509o526377P197987O834077n531150
43587B5435335j1334330o089026j439814j948127q91694K226106k94791p342704
43579a679045p677069J101682P609836M409263k939993p612503r005727o020985
$$ plain form
43634 -15250194 -5950911 677656 -8653764 -24487717 -29631348 -23515234 -17847223 -16376539
43626 -16376539 -15072615 -17446823 -31259527 -49251260 -51202075 -31820042 -12041806
43619 -12041806 -12594502 -27209019 -34081741 -26114703 -15523473 -12080925 -12448003 -12677361
43611 -12677361 -16218606 -22954289 -23097364 -12352921 -3300042 -8461100 -18793221 -15068341
43603 -15068341 1807958 9720862 -2510643 -19376131 -22652761 -14963115 -7446124 1685710
43595 1685710 19007335 35777227 36283307 23460798 16934421 24132408 30966485 25435335
43587 25435335 14101005 8011979 6572165 4624038 3732344 5958450 5663659 -1679045
43579 -1679045 -9356114 -8254432 -644596 3764667 824674 -6787829 -15793556 -21814541
43571b1814541K973269J0676731O698611l505316k557252J0513830J5030542J283168
43563A9299042j1424028m327749J0910508J1687820J51504l967471J994043J438894
43555B5762563j0417586j7381267q985934L584618O330310J598376q99863k94819
43547g03602j791289n519588o992983m360583N31729M988321O429460M246872
43539c171663J550424M80397k625072r979551j3108559k899530J1889268J1891634
43531e972652l552956j1629315P05248J5491368J0045192r004163j6342979m566797
43523b4827054R502856J2338362Q713409P300914P464447N652331L059717J315566
43515C0520548j111996m371935n991577n912743n697050k844111N014443J0653208
$$ plain form
43571 -21814541 -18841272 -8164541 -1465930 -4971246 -7528498 2985332 18015874 19299042
43563 19299042 7875014 3547265 14457773 26145593 26297097 22329626 24323669 25762563
43555 25762563 15344977 -2036290 -11022224 -7437606 -1107296 491080 -408783 -703602
43547 -703602 -2494891 -8014479 -15007462 -19368045 -18836316 -13847995 -7418535 -3171663
43539 -3171663 -1621239 -1140842 -3765914 -13745465 -26854024 -29753554 -17864286 -5972652
43531 -5972652 -9525608 -21154923 -20449675 -4958307 5086885 -3917278 -20260257 -24827054
43523 -24827054 -15324198 -2985836 5727573 13028487 20492934 26145265 29204982 30520548
43515 30520548 29408552 25036617 19045040 13132297 7435247 4591136 9605579 20258787
43507B0258787L890565j0442921j4350080j502658J2376036J1531621J236835
43500B2998185l097796J172736L633025j714272r494777j1523834m804792O957911
43492D126386J4601586J0085861l239960j2086333r880993m885106n323171n524150
43484a2125880K791416J3532154J4211290N755178n34032l011359j0360507k1606005
43476a1347745k2487804p628932P901248Q285356j790473n565161K355041J0913728
43468a9364742Q938750j166061p277648j596842J0745772J7269886J2054781J535795
43460B1139691m943479n756508m285227j318391K768017L359825j602066m513353
43452D848509J228530P439345J671210j1063088j3587742l872247J532164m462621
$$ plain form
43507 20258787 24149352 13706431 -643649 -2146307 10229729 21761350 22998185
43500 22998185 19900389 21073125 24706150 22991878 13497101 1973267 -2831525 4126386
43492 4126386 18727972 28813833 25573873 13487540 3606547 -1278559 -6601730 -12125880
43484 -12125880 -9334464 4197690 18408980 24164158 23630126 20618767 10258260 -11347745
43476 -11347745 -33835549 -41464481 -33563233 -25277877 -27068350 -32633511 -30278470 -19364742
43468 -19364742 -10425992 -11592053 -18869701 -20466543 -9720771 7549115 19603896 21139691
43460 21139691 16196212 10439704 6154477 4836086 7604103 10963928 9361862 4848509
43452 4848509 6077039 13516384 15187594 4124506 -9463236 -13335483 -11803319 -16265940
43444a6265940p593211K462528J3234157R522660k598223p664078m991754m025596
43436a7919457m520565N69519P943751P524866Q12425o37667N479570R384176
43428H636618O344498K704681K727667J919353l178315q655903r941704p067679
43420f510784j734215L880748N708248K551262M97496M330611P860217L354699
43412A9938282l295457q24809O365078K565702j2414598j9233231q058452N438510
43404i518975L308620r356768j4651612p216406L371635Q815510Q867854N947511
43396a0432631K934123L814612Q905902J1862951P332318j504023p883474r864402
43388E165376r118061o128754j568787K087309M371875O898418O806749j442691
$$ plain form
43444 -16265940 -23859151 -21396623 -8162466 1360194 -1238029 -8902107 -13893861 -17919457
43436 -17919457 -22440022 -21870503 -13926752 -6401886 -5589461 -6227128 -747558 8636618
43428 8636618 14981116 17685797 20413464 22332817 19154502 10498599 556895 -6510784
43420 -6510784 -8244999 -4364251 1343997 3895259 4392755 8723366 16583583 19938282
43412 19938282 16642825 15818016 22183094 24748796 12334198 -6899033 -14957485 -9518975
43404 -9518975 -6210355 -15567123 -30218735 -37435141 -34063506 -25247996 -16380142 -10432631
43396 -10432631 -7498508 -3683896 5222006 17084957 24417275 22913252 15029778 5165376
43388 5165376 -3952685 -10081439 -11650226 -9562917 -5191042 1707376 8514125 7071434
43380G071434j3329879j4113555N64332J4437243J1886006R080l896298J180063
43372C808426K264767l716726o344055j439432K776162J747616J089617K754483
43364B940858l34229r285712j2616106l554704P476094Q015293J817915L05107
43356e235484K960678q7308q748259r973676L285057K0002971K3164818Q972034
43348C4340831j0181323j9466091j5273376n835326l38022Q41748L716397R933294
43340b261868J3064312P646844k432638q808556q837623n781401j164707N924538
43332b651099J1720464Q080134n669078j6952041j2912846K988824J4189075J1060828
43324I854261J202066k625357J442563N541121M784745J352955k560450p521690
$$ plain form
43380 7071434 -6258445 -20372000 -19807668 -5370425 6515581 6524661 2628363 3808426
43372 3808426 6073193 2356467 -3987588 -5427020 -2650858 -903242 186375 2940858
43364 2940858 2606629 -6679083 -19295189 -22849893 -15373799 -7358506 -5540591 -5235484
43356 -5235484 -2274806 -2362114 -11110373 -21084049 -17798992 2203979 25368797 34340831
43348 34340831 24159508 4693417 -10579959 -16415285 -16753307 -15911559 -12195162 -2261868
43340 -2261868 10802444 18449288 16016650 7208094 -1629529 -7410930 -8575637 -2651099
43332 -2651099 9069365 17149499 11480421 -5471620 -18384466 -15395642 -1206567 9854261
43324 9854261 11056327 8430970 9873533 15414654 20199399 21552354 18991904 11470214
43316A1470214j0942625o495364N585627J3752093P894676o331638j3517374p847682
43308f432073J243309L884744K376948M347456Q912395P170889m037800j5187952
43300B277916j4144697p58526J2154227J2766706K624278o808066q235378n347647
43292e471187m935524o730266n249100L97057M184793J882247k365314j401409
43284a9688703N262151J0901595J0374061N824718K189837J61571k800998n968761
43276F255471n188018o65475O34726n097119j0600014o703787K765774M327739
43268a4270703n796655j5060817j1660461J02674Q181836R507790R435826R217916
$$ plain form
43316 11470214 527589 -5967775 -382148 13369945 21264621 14932983 1415609 -6432073
43308 -6432073 -5188764 -1304020 1072928 5420384 14332779 21503668 17465868 2277916
43300 2277916 -11866781 -12625307 -471080 12295626 14919904 8111838 -123540 -5471187
43292 -5471187 -10406711 -17136977 -22386077 -21989020 -17804227 -15921980 -18287294 -19688703
43284 -19688703 -14426552 -3524957 6849104 12673822 14863659 15025230 12224232 6255471
43276 6255471 1067453 401978 1036704 -4060415 -14660429 -21364216 -18598442 -14270703
43268 -14270703 -20067358 -35128175 -46788636 -46685962 -38504126 -28996336 -19560510 -10342594
$$ [...]
##END NTUPLES=NMR SPECTRUM
##END=
