##TITLE=31Pdec_LR-702-C1
 CDCl3, 96 sc
 20.11.2019
##JCAMPDX= 6.0         $$ Bruker NMR JCAMP-DX V2.0
##DATA TYPE= NMR SPECTRUM
##DATA CLASS= NTUPLES
##ORIGIN= UXNMR, Bruker Analytische Messtechnik GmbH
##OWNER= root
$$ XWIN-NMR		Version 3.5
$$ Wed Nov 20 15:43:15 2019 Russian Standard Time (UT+4h)  she@DPX200
##.OBSERVE FREQUENCY= 81.013821
##.OBSERVE NUCLEUS= ^31P
##.ACQUISITION MODE= SIMULTANEOUS
##.ACQUISITION SCHEME= undefined
##.AVERAGES= 96
##.DIGITISER RES= 17
##SPECTROMETER/DATA SYSTEM= spect
##.PULSE SEQUENCE= zgpg30
##.SOLVENT NAME= THF
##.SHIFT REFERENCE= (INTERNAL, THF, 0, 182.463)
##AUDIT TRAIL= $$ (NUMBER, WHEN, WHO, WHERE, WHAT)
$$ ##TITLE= Audit trail, XWIN-NMR		Version 3.5
$$ ##JCAMPDX= 5.01
$$ ##ORIGIN= Bruker BioSpin GmbH
$$ ##OWNER= she
$$ F:/spectra/data/she/nmr/P31/1/pdata/1/auditp.txt
$$ ##AUDIT TRAIL=  $$ (NUMBER, WHEN, WHO, WHERE, WHAT)
(   1,<2019-11-20 15:41:57.18 +0400>,<she>,<DPX200>,
      <continue with go, POWCHK disabled, PULCHK disabled
       configuration hash MD5:
       00 E9 B6 7A A2 85 ED C7 34 08 36 98 17 FE 4E 26
       data hash MD5: 32K
       6F 02 19 06 9D 39 B0 0A D5 C6 D0 03 2B 7A 4F A7>)
(   2,<2019-11-20 15:42:25.09 +0400>,<she>,<DPX200>,
      <Start of raw data processing
       efp BC_mod = 2 LB = 1 FT_mod = 6 PKNL = 1 PHC0 = -1338.366 PHC1 = 179.801 SI = 64K 
       data hash MD5: 64K
       F6 55 4D AE C7 DC CD CC DF CF 59 1E 2B A9 1D 91>)
(   3,<2019-11-20 15:42:52.25 +0400>,<she>,<DPX200>,
      <pk PHC0 = -32.34324 PHC1 = 123.6 
       data hash MD5: 64K
       47 9E E0 70 7E 51 E1 66 3B C3 B2 FB 08 5B 22 6B>)
(   4,<2019-11-20 15:42:55.43 +0400>,<she>,<DPX200>,
      <abs ABSG = 5 
       data hash MD5: 64K
       07 C1 ED 0F E0 33 4D 9E 8B 8C 61 A7 0A 78 A8 E0>)
$$ ##END=
$$ 
$$ hash MD5
$$ EF B4 98 59 6E A2 3A 51 3E 88 B3 AF 9A 04 70 D4
##$RELAX= 
##$RELAX= 
##$RELAX= 
##$RELAX= 
##$RELAX= 
##$RELAX= 
##$RELAX= 
##$RELAX= 
$$ Bruker specific parameters
$$ --------------------------
##$DU= <F:/spectra>
##$EXPNO= 1
##$NAME= <P31>
##$PROCNO= 1
##$TYPE= <nmr>
##$USER= <she>
##$AMP= (0..31)
100 100 100 100 100 100 100 100 100 100 100 100 100 100 100 100 100 100 
100 100 100 100 100 100 100 100 100 100 100 100 100 100 
##$AQSEQ= 0
##$AQ_mod= 1
##$AUNM= <au_zg>
##$AUTOPOS= <>
##$BF1= 81.014009
##$BF2= 200.13
##$BF3= 200.13
##$BF4= 200.13
##$BF5= 200.13
##$BF6= 200.13
##$BF7= 200.13
##$BF8= 200.13
##$BYTORDA= 1
##$CFDGTYP= 0
##$CFRGTYP= 5
##$CHEMSTR= <none>
##$CNST= (0..31)
1 1 145 1 1 1 1 1 1 1 1 1 1 1 1 1 1 1 1 1 1 1 1 1 1 1 1 1 1 1 1 1 
##$CPDPRG= <waltz16>
##$CPDPRG1= <>
##$CPDPRG2= <waltz16>
##$CPDPRG3= <>
##$CPDPRG4= <mlev>
##$CPDPRG5= <mlev>
##$CPDPRG6= <mlev>
##$CPDPRG7= <mlev>
##$CPDPRG8= <mlev>
##$CPDPRGB= <>
##$CPDPRGT= <>
##$D= (0..31)
0 1 0 0 0 0 0 0 0 0 0 0.03 2e-05 3e-06 0 0 0 0 0 0 0 0 0 0 0 0 0 0 0 0 
0 0 
##$DATE= 1574249975
##$DBL= (0..7)
120 120 120 11 120 120 24 19 
##$DBP= (0..7)
150 150 150 150 150 150 150 150 
##$DBP07= 0
##$DBPNAM0= <>
##$DBPNAM1= <>
##$DBPNAM2= <>
$$ [...]
##$SUBNAM3= <"">
##$SUBNAM4= <"">
##$SUBNAM5= <"">
##$SUBNAM6= <"">
##$SUBNAM7= <"">
##$SUBNAM8= <"">
##$SUBNAM9= <"">
##$SW= 369.568048894756
##$SWIBOX= (0..15)
0 1 3 0 0 0 0 0 0 0 0 0 0 0 0 0 
##$SW_h= 29940.119760479
##$TD= 32768
##$TD0= 1
##$TE= 0
##$TE2= 300
##$TE3= 300
##$TEG= 300
##$TL= (0..7)
0 120 53 12 22 120 120 120 
##$TP= (0..7)
150 150 150 150 150 150 150 150 
##$TP07= 0
##$TPNAME0= <>
##$TPNAME1= <>
##$TPNAME2= <>
##$TPNAME3= <>
##$TPNAME4= <>
##$TPNAME5= <>
##$TPNAME6= <>
##$TPNAME7= <>
##$TPOAL= (0..7)
0.5 0.5 0.5 0.5 0.5 0.5 0.5 0.5 
##$TPOFFS= (0..7)
0 0 0 0 0 0 0 0 
##$TUNHIN= 0
##$TUNHOUT= 0
##$TUNXOUT= 0
##$USERA1= <user>
##$USERA2= <user>
##$USERA3= <user>
##$USERA4= <user>
##$USERA5= <user>
##$V9= 5
##$VALIST= <valist>
##$VCLIST= <CCCCCCCCCCCCCCC>
##$VD= 0
##$VDLIST= <DDDDDDDDDDDDDDD>
##$VPLIST= <PPPPPPPPPPPPPPP>
##$VTLIST= <TTTTTTTTTTTTTTT>
##$WBST= 1024
##$WBSW= 4
##$XGAIN= (0..3)
0 0 0 0 
##$XL= 0
##$YL= 0
##$YMAX_a= 31118
##$YMIN_a= -12672
##$ZGOPTNS= <>
##$ZL1= 120
##$ZL2= 120
##$ZL3= 120
##$ZL4= 120
##$ABSF1= 182.463
##$ABSF2= -187.1042
##$ABSG= 5
##$ABSL= 3
##$ALPHA= 0
##$AQORDER= 0
##$ASSFAC= 0
##$ASSFACI= 0
##$ASSFACX= 0
##$ASSWID= 0
##$AUNMP= <proc_1d>
##$AZFE= 0.1
##$AZFW= 0.5
##$BCFW= 0
##$BC_mod= 2
##$BYTORDP= 0
##$COROFFS= 0
##$CY= -3
##$DATMOD= 1
##$DC= 0
##$DFILT= <>
##$DTYPP= 0
##$F1P= 0
##$F2P= 0
##$FCOR= 1
##$FTSIZE= 65536
##$FT_mod= 6
##$GAMMA= 0
##$GB= 0
##$INTBC= 1
##$INTSCL= 5.30512e-09
##$ISEN= 30
##$LB= 1
##$LEV0= 0
##$LPBIN= 0
##$MAXI= 10000
##$MC2= 0
##$MEAN= 0
##$ME_mod= 0
##$MI= 50
##$NCOEF= 0
##$NC_proc= -8
##$NLEV= 6
##$NOISF1= 182.463
##$NOISF2= 159.3651
##$NSP= 0
##$NTH_PI= 0
##$NZP= 0
##$OFFSET= 182.463
##$PC= 4
##$PHC0= -1370.709
##$PHC1= 303.401
##$PH_mod= 1
##$PKNL= yes
##$PPARMOD= 0
##$PSCAL= 0
##$PSIGN= 0
##$REVERSE= no
##$SF= 81.0140089999434
##$SI= 65536
##$SIGF1= 159.3651
##$SIGF2= -187.1042
##$SINO= 113.3802
##$SIOLD= 16384
##$SREGLST= <1H.CDCl3>
##$SSB= 0
##$STSI= 65536
##$STSR= 0
##$SW_p= 29940.119760479
##$SYMM= 0
##$S_DEV= 0
##$TDeff= 32768
##$TDoff= 0
##$TI= <>
##$TILT= no
##$TM1= 0
##$TM2= 0
##$TOPLEV= 0
##$USERP1= <user>
##$USERP2= <user>
##$USERP3= <user>
##$USERP4= <user>
##$USERP5= <user>
##$WDW= 1
##$XDIM= 65536
##$YMAX_p= 522586797
##$YMIN_p= -75855701
$$ End of Bruker specific parameters
$$ ---------------------------------
##NTUPLES= NMR SPECTRUM
##VAR_NAME=  FREQUENCY,     SPECTRUM/REAL,   SPECTRUM/IMAG
##SYMBOL=    X,             R,               I
##VAR_TYPE=  INDEPENDENT,   DEPENDENT,       DEPENDENT
##VAR_FORM=  AFFN,          ASDF,            ASDF
##VAR_DIM=   65536,         65536,           65536
##UNITS=     HZ,            ARBITRARY UNITS, ARBITRARY UNITS
##FACTOR=    0.456856943014862, 1,           1
##FIRST=     14782.0589164792, 0,            0
##LAST=      -15158.0608439998, 0,           0
##MIN=       -15158.0608439998, -75855701,   0
##MAX=       14782.0589164792, 522586797,    0
$$ Real data points
##PAGE= N=1
##DATA TABLE= (X++(R..R)), XYDATA
$$ [...]
44795A3670162Q276863R059310J005305p555991q692307l455333R51776K71557
44787A3531342l299568m976829k312264K392231L546784j300283o419845m274343
44779c112775K608102L872132k286621n150514P33283N552842J543095j892785
44771A866759N026679J1329274R54998j7211485j8893373k649924P332543O32621
44763a1611908m641148L149879P342665n041544j4351813J597910K6221369K5031937
44755B7697347j128859j7186241p192987O499554M145364k650188J935685Q259561
44747B0379236K12298j4138965j4748554k163377M975289J45011m662894k007212
44739a2009168J415305J387772M435919J2569338J4767809L700404r975085j1199119
$$ y = [13670162, 21947025, 31006335, 32011640, 24455649, 15763342, 12308009, 13259785, 13531342, 10231774, 5254945, 2942681, 5334912, 8881696, 7581413, 1161568, -3112775, -504673, 3367459, 1080838, -4069676, -3336393, 2216449, 3759544, 1866759, 6893438, 18222712, 19177710, 1966225, -16927148, -19577072, -12244529, -11611908, -16253056, -13103177, -5760512, -10802056, -25153869, -23555959, 2665410, 27697347, 26568488, 9382247, 2189260, 8688814, 12834178, 10183990, 12119675, 20379236, 20591534, 6452569, -8295985, -10459362, -5484073, -5339062, -10001956, -12009168, -10593863, -9206091, -4770172, 7799166, 22566975, 26267379, 16292294, 5093175]
44731E093175j150631O713559O188581K251985j857543q615098j5646289j3301877
44723b0324138J082223J5068380J5089456L185262p844214j1542114j1015899
44716a6301044q084228o98704P761202Q192697k65428n676578K47909R498203
44708e325971J0373998N159309L466311L596788m206468j7130996j9310887o271472
44700b9649388N967879M854388J38699N798372J4763799R618926p245960j4404899
44692a0158184l529173Q401870N844485l277181m134170n2890m182019j3490012
44684b4577274j0551113Q065334K2841256J7521898Q93452p512811l853550N1685
44676B878877k292334m694612j794374K210224K203887L95127M94499N02601k351358
$$ y = [5093175, 3942544, 10656103, 16844684, 19096669, 17239126, 8624028, -7022261, -20324138, -19241915, -4173535, 10915921, 14101183, 6256969, -5285145, -16301044, -24385272, -25083976, -17322774, -9130077, -9395505, -15072083, -14824174, -5325971, 5048027, 10207336, 13673647, 17270435, 13063967, -4067029, -23377916, -29649388, -23681509, -18827121, -18688422, -12890050, 1873749, 11492675, 4246715, -10158184, -13687357, -5285487, 558998, -2718183, -6852353, -6905243, -11087262, -24577274, -35128387, -27063053, -4221797, 13300101, 14193553, 6680742, 2827192, 2878877, 586543, -4108069, -5902443, -3692219, -1488332, -1093205, -598706, -96105, -2447463]
44667b447463m458809q22263N558888O638591J118734l489159k008364R02678
44659I92833k229969j0473684j4433875p438324N668120J2939313R013582K175423
44651c786581M192714J3765520J6338293L554438j3410061j6952954n635634N302776
44643C368511N160758j71094K2429N938373R217348N237209j929780m598258J282696
44634B3528192J1354650J4260316K665430j5336105k2121818j1375881L566113
44627F540897P223121P42616m417614n042388p169970j1462197j0296449j549846
44619b5431830N433089K696601n116336q258371n262101k470035l021842k626543
44611d4057368L291334J2297712J6923195J3128063N233273J017668K279058L245063
$$ y = [-2447463, -6906272, -7728535, -2169647, 4468944, 5587678, 2098519, 90155, 992833, -1237136, -11710820, -26144695, -33583019, -27914899, -14975586, -5962004, -3786581, 406133, 14171653, 30509946, 34064384, 20654323, 3701369, -1934265, 3368511, 8529269, 8358175, 8380604, 14318977, 23536325, 28773534, 26843754, 22245496, 23528192, 34882842, 49143158, 51808588, 36472483, 14350665, 2974784, 6540897, 13764018, 14506634, 10089020, 5046632, -2123338, -13585535, -23881984, -25431830, -19998741, -17302140, -22418476, -30676847, -35938948, -38408983, -41430825, -44057368, -40766034, -28468322, -11545127, 1582936, 6816209, 7833877, 10112935, 13357998]
44603A3357998l72645m924114n209112l336782m924391q861285q614221l361785
44595b6246337L63260l92062m59175L994018Q825624Q968619N717917K370265
44587C142129j334826n255779n393405p26808J982752k369613p729797n378832
44579b3064179J802843L530112j349041l632521R9708J546529m713787j0450292
44571c6230628n057445Q508543J6986569J3008567J399958q744115j1893177o918532
44563b8940260L201508J1255347J0985989M992666K976114Q672372J2635869L759411
44555B9539016j3903817k3221374j4852742N99273O365089N19199m397174n54154
44547a9906684N826843O283627K458736J107030K953051L519105J572942k7674
$$ y = [13357998, 12985353, 8061239, 2852127, -484655, -5409046, -14270331, -22884552, -26246337, -25883077, -26275139, -26734314, -22740296, -13914672, -4946053, 771864, 3142129, 1807303, -3448476, -8841881, -9568689, -7585937, -9955550, -17685347, -23064179, -21261336, -17731224, -19080265, -22712786, -22613078, -21066549, -25780336, -36230628, -41288073, -32779530, -15792961, -2784394, -1384436, -10128551, -22021728, -28940260, -25738752, -14483405, -3497416, 1495250, 4471364, 13143736, 25779605, 29539016, 15635199, -7586175, -22438917, -21839644, -15474555, -14955356, -19352530, -19906684, -14079841, -7796214, -5337478, -4230448, -1277397, 2241708, 3814650, 3786976]
44539C786976j32705j21761l00436n44297k520804n842712m887677L307693J0573705
44530C317982O518910m920215q914519j334821N177919J476291m105983q99544
44522c683980N557760K840323p039590r967064j464178P382724P099276J273380
44514A998651k441375k959418k989263l375632m369688n949870l956756O240825
44506a7802526J8767657J9476485N329000p887865o060696L595415M984797j852561
44498A8549706l443556K458904K559859q460241j6513559q833870O128133J0782330
44490C227706K596235n350671l916472K587113N166134J41545r213530j4936733
44482a9698673r833132L507723J1825349O224117m857716o287350K485106P435183
$$ y = [3786976, 3654271, 3532510, 3232074, 2687777, 166973, -5675739, -10563416, -7255723, 3317982, 9836892, 4916677, -3997842, -5332663, -154744, 1321547, -2784436, -3683980, 1873780, 4714103, -2325487, -12292551, -13756729, -6374005, 725271, 1998651, -442724, -3402142, -6391405, -9767037, -14136725, -20086595, -24043351, -17802526, 965131, 20441616, 25770616, 17882751, 11822055, 15417470, 20402267, 18549706, 15106150, 17565054, 20124913, 11664672, -4848887, -13682757, -7554624, 3227706, 5823941, 473270, -3443202, -856089, 4310045, 4451590, -4761940, -19698673, -29531805, -26024082, -14198733, -7974616, -12832332, -19119682, -16634576, -9199393]
44474i199393J196626p385531q049115k625906J773630L973772O177373P284623
44466f853921O034862N346991O771752N771466n06972n819149l242582L004584
44458A0507031K983033m193983r838517q778609m431588r18026J691592L306541
44450i672526K398666J42191m85743p76368m761028j0589378j1022325m653930
44442c9420441J255615K457826L936492R207938J1599926M549940n263109n363774
44434a7039587M420783J1669443R312286L500214N60361l565174j3314616k0517696
44426b4973986j2863992O412288J8765238J3180489p59724q066718p743786p853180
44418b3903371q007948l66272J3005380J8078063Q663584l463728n331629j7993
$$ y = [-9199393, -8002767, -15388298, -23437413, -26063319, -24289689, -20315917, -14138544, -6853921, -819059, 4527932, 11299684, 17071150, 16564178, 10745029, 7502447, 10507031, 13490064, 9296081, -542436, -9321045, -13752633, -14670659, -12979067, -9672526, -7273860, -7131669, -7617412, -8393780, -13154808, -23744186, -34766511, -39420441, -38164826, -35707000, -31770508, -22562570, -10962644, -6412704, -11675813, -17039587, -12618804, -949361, 8362925, 11863139, 12423500, 8858326, -4456290, -24973986, -37837978, -31425690, -12660452, 520037, -239687, -8306405, -16050191, -23903371, -31911319, -32277591, -19272211, -1194148, 7469436, 4005708, -1325921, -1343914]
44410a343914J628316j521978k451026J20017O28588k986999p564950j1208655
44402b4700601j2402449n933864R075289J9638282J1357935q937665j7681225
44395b9584298n651197R663176R773867j25259k981563M086606R308758O289260
44387G79350P81913j407714j473620j021413J840437O306030O184386j636429
44379A0352940j0726345j2513310p703765m441678n120959j837044J0653635K2861421
44371A524895K0296099M108733q586330p813082k884053n082763j0097744q732173
44363a7266418m205984l461841m03097J2383373K1474298P027745k0925500k8048940
44355c3426364m589454J8143446J3300558m801277q583268O48236L874784J093936
$$ y = [-1343914, 284402, -1237576, -3688602, -3568585, -2939997, -5926996, -13491946, -24700601, -37103050, -43036914, -33961625, -14323343, -2965408, -11903073, -29584298, -35235495, -25572319, -15798452, -15923711, -18905274, -14818668, -5509910, 779350, 1561263, 153549, -1320071, -2341484, -501047, 5804983, 11989369, 10352940, -373405, -12886715, -20590480, -25032158, -30153117, -31990161, -21336526, 1524895, 21820994, 25929727, 17343397, 9530315, 6646262, 1563499, -8534245, -17266418, -21472402, -24934243, -25337340, -12953967, 8520331, 15548076, -5377424, -33426364, -38015818, -19872372, -6571814, -11373091, -19956359, -19308123, -15433339, -14339403]
44347a4339403P035476J8352849J5181663m674973j9423341j5498137m156677
44340a7522543L04879j78691J857440M955645M318315J083305j288393j810620
44332h280663Q70202P564243J2189060O036447q472134j7612012j3272489j960978
44324b2938324N190493L624212l889617r175485k427600J5515791K6504647J3959102
44316B6363219j2235389k4907019j4625839J065001O017251M331941M511017L761035
44308e718783r36398k111204M855463J0281267M629494o362979j2433830j3789021
44300b1585991j3820044q289239M858391J5078963J2852529N178613L892260P238380
44292E403862P057570M913304N307422K366306q219251j2730307K742639K3456835
$$ y = [-14339403, -7303927, 11048922, 26230585, 21555612, 2132271, -13365866, -17522543, -17217664, -17396355, -15538915, -10583270, -6264955, -5181650, -6470043, -8280663, -7410461, 153782, 12342842, 18379289, 9907155, -7704857, -20977346, -22938324, -17747831, -14123619, -18013236, -27188721, -29616321, -14100530, 12404117, 26363219, 14127830, -10779189, -25405028, -24340027, -18322776, -13990835, -9479818, -5718783, -6655181, -8766385, -3910922, 6370345, 10999839, 4636860, -7796970, -21585991, -35406035, -43695274, -38836883, -23757920, -10905391, -5726778, -1834518, 5403862, 12461432, 17374736, 22682158, 25048464, 16829213, 4098906, 6841545, 30298380]
44284C0298380K0478789n892003k3123539j2621758N781768O593746n989326j1653795
44276C872262o012345L92349M603506J2392478K0713577J7581258J411647j3550024
44268D1404708j5425494q317534l232902l601664n695631p523543r787205j0174423
44260b2353688m202578O651476J3324057R582382O20391l663559j765124m68458
44252b275101k164324r15939N345881P279243l287062j8636405k2987436j3350467
44244e0991610k689900j148368l585326j86151Q024510J1489751O611346O03555
44236c1872193J217666O896372J0092243P508032K837391j69019k203437l482218
44228i175163L91552J1220006J9770938J3614631n424241k0263911j8754854p532502
$$ y = [30298380, 50777169, 44885166, 21761627, 9139869, 14921637, 21515383, 15526057, 3872262, -2140083, -1747734, 2855772, 15248250, 35961827, 53543085, 54954732, 41404708, 25979214, 17661680, 14428778, 10827114, 5131483, -2392060, -12179265, -22353688, -26556266, -19904790, -6580733, 3001649, 3622040, -41519, -1806643, -2275101, -4439425, -5355364, -9483, 7269760, 3982698, -14653707, -37641143, -50991610, -53681510, -54829878, -58415204, -58601355, -50576845, -39087094, -32475748, -31872193, -30654527, -23758155, -13665912, -6157880, -3320489, -3489508, -5692945, -9175163, -8783611, 2436395, 22207333, 35821964, 30397723, 10133812, -8621042, -16153544]
44220a6153544q36547k322268m595554j741895M931155J0667332J0846417L512083
44212D307179o728891j0623090m777986L653802P203049P410835Q188822O641794
44204A5275514q05402q621260q870858m177125l301411n995053l492578O039091
44196a3949082J3256009J0704743J572891o599596r886290q112048l124702J723429
44188a4414646M480606O182687O409443J913413n048125m373295O471389J2317771
44180A3939243m56086j9780378k0228628J491000K1141810J9781942N270180m363772
44172A6795311l881180K78010J755319k476238j0739884j3517912k244090J5113343
44164A082679K0095257R583857L99468J904352J707210j0316606k1195093j4597337
$$ y = [-16153544, -16990091, -19312359, -23907913, -25649808, -20718653, -10051321, 795096, 4307179, -2421712, -13044802, -17822788, -14168986, -6965937, 444898, 8633720, 15275514, 14470112, 5848852, -3022006, -7199131, -10500542, -16495595, -19988173, -13949082, -693073, 10011670, 11584561, 4984965, -4901325, -13013373, -16138075, -14414646, -9934040, -3751353, 2658090, 4571503, -476622, -4849917, 1621472, 13939243, 13483157, -6297221, -26525849, -25034849, -3893039, 15888903, 21159083, 16795311, 12914131, 13192141, 14947460, 12471222, 1731338, -11786574, -14030664, 1082679, 21177936, 30761793, 31161261, 33065613, 34772823, 24456217, 3261124, -11336213]
44156a1336213J788368P620779L74364m320797J736616J0750280J4004209J0375985
44148C0993591R49060j1133139j6526849q840064K742900L328980n562455q018900
44140a2066876R96545P775092J961231p724504q114992j015254K150321j733660
44132a7772097n158430k755281K371426N267403N710607N964153N582018J918577
44124A128376m431941p802253l668083M690450R473014P863046L547259j136982
44116I662886p550122j3214995j0483106J540991J1065304P599163l303859p861973
44108a2545711k847514K580789J905151q85747R25154P458840J1743633N997876
44100A4332471r203007k0513511j3744017N598288J4120597J759900j0659574
$$ y = [-11336213, -9547845, -1927066, -1552702, -5873499, -4136883, 6613397, 20617606, 30993591, 31942651, 20809512, 4282663, -4557401, -1814501, 1514479, -4047976, -12066876, -11070331, -3295239, -1334008, -9058512, -17173504, -18188758, -16038437, -17772097, -22930527, -25685808, -23314382, -18046979, -12336372, -6372219, -790201, 1128376, -3303565, -11105818, -14773901, -10083451, -610437, 7252609, 10799868, 9662886, 2112764, -11102231, -21585337, -20044346, -8979042, -1379879, -4683738, -12545711, -15393225, -12812436, -10907285, -11793032, -10867878, -3409038, 8334595, 14332471, 5129464, -15384047, -29128064, -23529776, -9409179, -7649279, -18308853]
44093a8308853l52922K1059671K2288096l87346j6713691q106709O231503K527233
44085H236982j0048478o592695J2018997J9801301N064187j3436678j4920708
44078A22908l862332J214573m749858r697098m698087L968227N868266J487836
44070a0345565m80960K601485M236757Q61711j660151J410221M322679M93851
44062A440028m397391p12788O766823L251355j1778115k0099098j1111496J651015
44054c4989667J642632m852897K9340J5236225K0329718O405928r741672r293629
44046a5234022L811995J1913117Q547931K106119j035694l620491o742816m386292
44038d640153N074465J0923400L129480j1302475j5519722n512253M911203M110935
$$ y = [-18308853, -18661775, 2397896, 24685992, 24298646, 7584955, -521754, 5709749, 8236982, -1811496, -8404191, 3614806, 23416107, 28480294, 15043616, 122908, -3739424, -2524851, -7274709, -16971807, -21669894, -17701667, -11833401, -10345565, -10826525, -8225040, -3988283, -3126572, -4786723, -3376502, 946177, 1440028, -2957363, -3670151, 3096672, 6348027, -5430088, -25529186, -36640682, -34989667, -33347035, -38199932, -38170592, -22934367, -2604649, 3801279, -5940393, -15234022, -11422027, 491090, 9039021, 11145140, 10109446, 6488955, -253861, -4640153, 434312, 11357712, 14487192, 3184717, -12335005, -17847258, -12936055, -8825120]
44030h825120k898208n869457n664022q733035j1259525k657768J4734139K2770940
44022h402056J0629858q330004j2078324J989926J4278373Q718971p430547j4532457
44014a5156260o098097M724022M348379l753992o233616Q17251Q395208R003878
44006c953227M965410M12486n484454j2132250j2518790k315734J1087872J5998641
43998c940046R549173j951179j1032302j1914272j993028J1726813J4538064K265380
43990G248603r061783l868294R124550R440511l098535q249616K135680J1973581
43982A5644697P494562k808045n107889j514552j578621m605350m291212k281186
43974I52404l572590m810734p7328O472537O198373P53082p00326L063590M151303
$$ y = [-8825120, -11723328, -17592785, -23256807, -31989842, -43249367, -45907135, -31172996, -8402056, 2227802, -6102202, -18180526, -16190600, -1912227, 6806744, -623803, -15156260, -21254357, -16530335, -12181956, -15935948, -22169564, -21352313, -12957105, -3953227, 1012183, 1424669, -4059785, -16192035, -28710825, -31026559, -19938687, -3940046, 5609127, 3657948, -7374354, -19288626, -21281654, -9554841, 4983223, 7248603, -1813180, -5681474, 3443076, 12883587, 9785052, 1535436, 3671116, 15644697, 23139259, 20331214, 15223325, 13708773, 12130152, 7524802, 3233590, 952404, -2620186, -7430920, -7508248, -1035711, 5162662, 5915744, 5215418, 8279008, 12430311]
43965A2430311p33558n695806n367322p94223M700181Q166862O069498j778677
43957A6997266p923687m767324L880161O683254L43219o911769q162833n620689
43949e482402l635379k204453q44180j467006k919676Q96273J1797428K0854127
43941A6994732J7295992J678069j4572789k1051478j5850340l470735R077126
43934i899423J4365887Q877091j910553o880567j691089N060224L235620l469191
43926G687999j847819R720095J4866375J544282j7714032k0609975o129972M793397
43918g689650O69355n557297p5606R192005O987542l673461p082416j31506N177827
43909b183207K840519j89333K57973j231559o029953n723709K524312P878941
$$ y = [12430311, 11696753, 6000947, 633625, -160598, 4539583, 12706445, 18775943, 16997266, 9073579, 4306255, 8186416, 14869670, 15212889, 8301120, 138287, -5482402, -9117781, -11322234, -12166414, -13633420, -16553096, -15656823, -3859395, 16994732, 34290724, 35968793, 21396004, 344526, -15505814, -18976549, -9899423, 4466464, 13343555, 11433002, 4552435, 2861346, 7921570, 11157190, 7687999, 5840180, 15560275, 30426650, 31970932, 14256900, -6353075, -12483047, -7689650, -7020295, -12577592, -12653198, -3461193, 3526349, -147112, -7229528, -7361034, -2183207, 657312, 467979, 725952, -505607, -6535560, -12259269, -9734957, -1856016]
43901a856016K975386k157238M042241J3625422R515777p254100j7197736r943701
43893h249965L287221Q950608Q521697Q751263P258442l75073q040098p313220
43885A2790875k926980n754482j3190507j2046606j197045N225369J193244j310388
43877a7216520O339397J3834167R458216l50775l374911k139748n454954q929243
43869g834371l115717N588205L341345n492219l795764P603638R001118m373655
43861I22580j2347716k852022Q141626L537074p909550q483025L28494M790504
43853a3872035K447342R27611J567941K65921j807112j989286l863376r052457
43845b5375451r497961k48429R364596J0191319Q005026R366921N772054r258649
$$ y = [-1856016, 1119370, -1037868, 3004373, 16629795, 26145572, 18891472, 1693736, -8249965, -4962744, 3987864, 12509561, 21260824, 28519266, 28144193, 20104095, 12790875, 9863895, 4109413, -9081094, -21127700, -22324745, -17099376, -15906132, -17216520, -10877123, 2957044, 12415260, 12064485, 8689574, 6549826, 1094872, -7834371, -10950088, -5361883, -2020538, -7512757, -11308521, -3704883, 5296235, 922580, -11425136, -14277158, -6135532, -2598458, -10508008, -18991033, -18662539, -13872035, -11424693, -10497082, -8929141, -8663220, -10470332, -12459618, -16322994, -25375451, -34873412, -35121841, -25757245, -15565926, -7560900, 1806021, 7578075, -1680574]
43837a680574j9853126q566887J1327975J1400108p990297j7412048l259938J4442147
43829b1592640J5247410M693013k057373k366268q81434J616771L976116K065357
43821G00952k473361k775972K19557p48604k716917M873698J7507960J6140030
43813C0727343k463319j6753670j1936605m44481J422256k257847j320391j6013
43805c042727n085457q074893Q94550J2455072R964969n259039j6936618j5749141
43797c0833284m829327R100178J7623546J2772663l46089l956989O490415J1016335
43789A7037448l721929j8285869r104681J0595939Q817975j3329368k1453963
43782b9444448j396356J9637902J5441020l337540j0960515l220655N071981N051873
$$ y = [-1680574, -21533700, -30100587, -18772612, -7372504, -15362801, -32774849, -36034787, -21592640, -6345230, -1652217, -3709590, -6075858, -6957292, -5340521, -1364405, 700952, -1772409, -4548381, -4328824, -5077428, -7794345, -2920647, 14587313, 30727343, 28264024, 11510354, -426251, -870732, 551524, -1706323, -3026714, -3042727, -8128184, -16203077, -15308527, -2853455, 7111514, 1852475, -15084143, -30833284, -35662611, -26562433, -8938887, 3833776, 3487687, -469302, 6021113, 17037448, 13315519, -4970350, -14075031, -3479092, 5338883, -7990485, -29444448, -30840804, -11202902, 4238118, 900578, -10059937, -13280592, -8208611, -3156738]
43774c156738j0996m780995n536428j92409O627312N623840l295158q042708k259086
43765a5023366M179157J519749l593776j27317P956659Q900602M141596N737420
43757A3690724J3755123J2858658l602139j9910857j7964416k071103P908979
43750D664969M084601j705200J185041O301945K398709p861778j2795527j0111218
43742a3838458p539174o925114j978647O474296Q021398O53790l551235J317525
43734a7365619M116608k701765o849465L126896J4286419P553423r433650j1831592
43726a9098745L699510J4616691P995750l770409p885773q645935j1208944r159500
43718c3457355l42088L443828l445650p014963L954937J6158227J0654533o840542
$$ y = [-3156738, -3167734, -7948729, -13485157, -13677566, -7050254, -1426414, -4721572, -12764280, -15023366, -10844209, -9324460, -12918236, -13045553, -5088894, 3811708, 7953304, 13690724, 27445847, 40304505, 36702366, 16791509, -1172907, -3244010, 4664969, 8749570, 7044370, 8229411, 14531356, 16930065, 9068287, -3727240, -13838458, -21377632, -28302746, -30281393, -23807097, -15785699, -15131909, -18683144, -17365619, -13249011, -15950776, -22800241, -19673345, -5386926, 2166497, -7267153, -19098745, -15399235, -782544, 7213206, 3442797, -4442976, -13088911, -24297855, -33457355, -33799443, -30355615, -33801265, -40816228, -36861291, -20703064, -10048531, -16889073]
43710a6889073j3919414l941881P940531R159744L598293K03027J341349N041461
43702g465963Q699357Q293619J450947p687534j2475986j1536234o995494J375796
43694b6341492J2293195J6993265P954581p310348j2136857k093051R101760Q235289
43686F696342j080886n673962o46762O071910N384273j335035m425592O39172
43678E629460N590188L4942j1762008j3702789m17219J2753522R544140n647810
43670B022426j5506507j2676218l988767L215075O924877N731156N09910j054695
43662a4822743O297510J3630496Q663788l189211m606330O025938J0818546R82905
43654B3800899r270128o756675o2244k636223r340274o882646K073416L714856
$$ y = [-16889073, -30808487, -34750368, -26809837, -17650093, -14051800, -13848773, -12507424, -7465963, 1233394, 9527013, 10977960, 3290426, -9185560, -20721794, -27717288, -26341492, -14048297, 2944968, 10899549, 3589201, -8547656, -10640707, -1538947, 6696342, 5615456, -58506, -705268, 5366642, 10750915, 9415880, 4990288, 5629460, 11219648, 11254590, -507418, -14210207, -14627426, -1873904, 7670236, 2022426, -13484081, -26160299, -30149066, -26933991, -20009114, -14277958, -13768048, -14822743, -8525233, 5105263, 13769051, 10579840, 5973510, 11999448, 22817994, 23800899, 14530771, 7774096, 7711852, 5075629, -4264645, -11147291, -9073875, -5359019]
43646e359019l019691n342622J662400Q543166Q212466M659395J749098l418874
43638G686319j0812670j2648960n276636K854883K561847l073334m265861J392418
43630b1581994P274494P581769L060123j974346l897517j494841L382199O594303
43622a055810M677446k385854j0513375j3125572o319659M526513O999451l383141
43614b0580001j3361994o262881J4228183K5644568J5422832k861876q639543
43607C589288m00573O813169L563838m942029r206373n678583K534989Q510697
43599D784423O304543j885853o226799k072537K675053J02385l927709R24092
43591F77598J1104314J3343884N409447j453526j629784k176300p166513r161052
$$ y = [-5359019, -8378710, -13721332, -12058932, -3515766, 4696700, 9356095, 11105193, 7686319, -3126351, -15775311, -21051947, -18197064, -15635217, -18708551, -22974412, -21581994, -14307500, -6725731, -3665608, -5639954, -9537471, -11032312, -7650113, -1055810, 3621636, 1235782, -9277593, -22403165, -28722824, -24196311, -17196860, -20580001, -33941995, -40204876, -25976693, -332125, 15090707, 12228831, 3589288, 3188715, 10001884, 13565722, 8623693, -582680, -6261263, -3726274, 4784423, 11088966, 9203113, 2976314, 903777, 3578830, 3681215, -246494, 677598, 11781912, 25125796, 30535243, 29081717, 27451933, 25275633, 18109120, 8948068]
43583H948068k990467M160542M861229L614476P918990J5482906J9649360K0627513
43575H2272617K1843834K0817414J3409355L236686k130218j761764q55498k494079
43567A34338347o387457j2361700j8712108k0846575j7733202j5189370j6445400
43560B6662535j5277323o450462L186232M102018m80183L6061O208353Q536541
43552B6523772L339808k916217m980161m049095j733199J330051J354497l986520
43544A4882936p767162j737011Q801103J0698341L694219J058900P017079Q978768
43536D5627173j352310j3222889j2781226l092149K404175p92142n425769m634261
43528F730602J025747O087663M898928k984291r646385o273039M358587R986030
$$ y = [8948068, 5957601, 10118143, 14979372, 18593848, 26512838, 41995744, 61645104, 82272617, 104116451, 124933865, 138343220, 141579906, 139449688, 137687924, 136832426, 134338347, 127950890, 115589190, 96877082, 76030507, 58297305, 43107935, 26662535, 11385212, 4934750, 8120982, 12223000, 11742817, 11778878, 17987231, 26523772, 29863580, 26947363, 21967202, 17918107, 16184908, 17514959, 18869456, 14882936, 7115774, 5378763, 14179866, 24878207, 28572426, 29631326, 36648405, 45627173, 44274863, 31051974, 18270748, 15178599, 17582774, 16790632, 11364863, 6730602, 7756349, 13844012, 18742940, 15758649, 6112264, -160775, 4197812, 14183842]
43520A4183842N643605m98421j228370J72560m25105L7895K674540K87198r899982
43511A0947762j6497859q739737N968851J1512328N094305k152166k936984l21907
43503B874593J546319K154650P96124k539425l449789R67367M414785o66081r131011
43494c032468q315730K533837R575405L968691o305095r208359m672713j095559
43486a6551991j429870n35144M808797R424860O017591l813020q529149L50465
43478a0257461J5658285K0393410P625637j0865110j8792057j2661908q96724
43471i795928Q212450J1484689Q685367K685140r74774m97017p55787m898394
43463A4145746p854634m433992J458849L333562K616921L829678M266508j097268
$$ y = [14183842, 19827447, 19329026, 18100656, 18273216, 17848111, 17886006, 20560546, 20847744, 10947762, -5550097, -14289834, -8320983, 3191345, 8285650, 6133484, 3196500, 2874593, 4420912, 6575562, 7371686, 4832261, 1382472, 2349839, 6764624, 6098543, -3032468, -11348198, -8814361, 761044, 4729735, -1575360, -10783719, -15456432, -16551991, -17981861, -18517005, -13708208, -4283348, 1734243, -2078777, -10607926, -10257461, 5400824, 25794234, 33419871, 22554761, 3762704, -8899204, -9795928, -1583478, 9901211, 18586578, 21271718, 20296944, 19799927, 19044140, 14145746, 6291112, 1857120, 3315969, 6649531, 9266452, 13096130, 17362638, 16265370]
43455A6265370q169849q425982k614894J310474J930726M365909P975006O568348
43447A9205108R03710j437092O25241Q99866o55643K527379Q383738N420275p618651
43438B8253931j5599328q364540M078869O864236L40745m924818m675085k543175
43430C430835j484352k274179n134688o223608N93758J1978301J4075462J855835
43422A6817364j0096809p682638Q04051j965356j3361433j3773054J984585J5165862
43414a2107428J0679757j730384m004321L964411P464731N91030o653498n026509
43406f822211J239852K925339j00014m9435O273613J2894352J3274016Q086633
43398C7722145K016390k571668m863920k590332M198282Q592444L253291q499896
$$ y = [16265370, 8095521, -330461, -2945355, -1634881, 295845, 4661754, 12636760, 19205108, 20108818, 18671726, 19296967, 20196833, 19541190, 22068569, 30452307, 35872582, 28253931, 12654603, 4290063, 8368932, 15233168, 15573913, 10649095, 5974010, 3430835, 1946483, -327696, -5462384, -11685992, -11092234, 886067, 14961529, 16817364, 6720555, -962083, -158032, -2123388, -15484821, -29257875, -27273290, -12107428, -1427671, -3158055, -7162376, -3197965, 4266766, 4857796, -1795702, -6822211, -5582359, -2657020, -2757034, -2806469, 3467144, 16361496, 29635512, 37722145, 39738535, 37166867, 32302947, 29712615, 33910897, 42503341, 45756632, 37256736]
43390C7256736j4792974r675140Q03496Q391719J1106267Q986252r6077j3734989
43382B8245290k0626652j2079947M613509J2695493N635647o576266j1359078
43375E47996p125743p54257K789027L899555M189422L560664J830315N75647J596612
43366A1109238L954147M044328k42257n853134o760462q29025O487962P235981
43358A9146778L45925n886193l247668N050967O953195k356433j2260076j0497647
43350b751152o95333L469777n25245j585662M476281O972747o0246n135213J754382
43341E920336J0268072N626545o611720j0143628n026256m433853q576072m838226
43333a7814802O137168Q401782j078821n583124K237773P135357j360311r512791
$$ y = [37256736, 22463762, 12788622, 13592118, 21983837, 33090104, 42076356, 41980279, 28245290, 7618638, -4461309, 152200, 12847693, 18483340, 11907074, 547996, -6577747, -7332004, -4542977, -643422, 3546000, 7106664, 8936979, 9512626, 11109238, 15063385, 19107713, 18865456, 13012322, 6251860, 5422835, 11910797, 19146778, 19492703, 13606510, 10358842, 15409809, 22363004, 20006571, 7746495, -2751152, -3446485, 23292, -501953, -2087615, 2388666, 9361413, 9301167, 4165954, 5920336, 16188408, 21814953, 15203233, 5059605, 33349, -4400504, -12976576, -17814802, -11677634, -3275852, -4354673, -9937797, -7700024, -564667, -1924978, -11437769]
43325a1437769k423328J1471578J5737614J0689050N609940o2715r280222j3057466
43317G246682l681531O878796K254236j1181683j2805890P75590J2470814J0945870
43309A2902884J765496o990360j3104532j3873755o843289K477210O783444R128482
43301g754420J5359645J8546742Q090286q562181j2918414l868087J273486l919284
43293F247773n912627L127962J1163021O811983l273046p663258o363789m345347
43285b07328j837712K94408k208147o694955l296507P680600J1947923L199236
43277H877518n837489m459817j047240o154208j2437544p265045N040353R859100
43269a3424372M290397j835390j420976N528710J6616365K4660993J8398530j726339
$$ y = [-11437769, -13861097, -2389519, 13348095, 24037145, 29647085, 29584370, 20304148, 7246682, 3565151, 10443947, 12698183, 1516500, -11289390, -10513800, 1957014, 12902884, 14668380, 7678020, -5426512, -19300267, -26143556, -23666346, -16882902, -7754420, 7605225, 26151967, 34242253, 25680072, 12761658, 8893571, 10167057, 6247773, 335146, 3463108, 14626129, 21438112, 18165066, 10501808, 4138019, -207328, -2045040, -1750632, -3958779, -10653734, -13950241, -6269641, 5678282, 8877518, 3040029, -1419788, -2467028, -8621236, -21058780, -28323825, -23283472, -13424372, -9133975, -10969365, -12390341, -6861631, 9754734, 34415727, 52814257, 51087918]
43261E1087918j6537552j1160208K555063K615875j0781490j7843473j0359280
43254a0423147r06118m67859m424594l983644K562192J2645778K1283056J9418653
43246C5704317L373940j3932155j5476756m183841J367404l838642n275358L611478
43238A350387Q838421Q78953p219360j736605P633032M200448o586649n527903
43230A830724Q171279J4392584K871246j1843892j2071121j29975Q270975N291798
43222A6783618k608276n680124j783701L718400N770950N089721M490346K080747
43214B7861681n496505j2470673o918760R516157J6143985N909k0876102j9063190
43206a1297498K029806J1726422k104400j5538295p270728Q913340R393590o23726
$$ y = [51087918, 34550366, 23390158, 25945221, 28561096, 17779606, -63867, -10423147, -11329265, -11797124, -16221718, -20205362, -17643170, -4997392, 16285664, 35704317, 39078257, 25146102, 9669346, 5485505, 6852909, 3014267, -2261091, 1350387, 10188808, 11067761, 3848401, 2111796, 9744828, 13945276, 7358627, 1830724, 10002003, 24394587, 27265833, 15421941, 3350820, 3220845, 11491820, 16783618, 14175342, 8495218, 6711517, 10429917, 16200867, 21290588, 25780934, 27861681, 22365176, 9894503, 2975743, 12491900, 28635885, 28641794, 7765692, -11297498, -9267692, 2458730, 354330, -15183965, -22454693, -13541353, -4147763, -4771489]
43198d771489K44927J0066956P410062q114152j1172089O648363J9458901P390110
43190B7161589j1191080r389945N809891P461431o910587j3925754m108959N206513
43182A13099J080112n590464j750170O112010M815939m581322j1273566j0519923
43174b1594285m400081M809101J2315481R967764k297895j1352872p076027L206155
43166a6422659O550483L424583K966505N487640L826980j258891j711313K466112
43158E329440K463880l351677n954592j232063L306279J991676j60329J908448
43150D301062L901898P01995m220406n952313p446047j2698087j6306279r967153
43142d7685330L539049J2640744J2472921R157983P907260N574010j491119r014143
$$ y = [-4771489, -4526562, 5540394, 12950456, 4836304, -6335785, 312578, 19771479, 27161589, 15970509, 6580564, 12390455, 19851886, 12941299, -984455, -5093414, 113099, 1193211, -4397253, -6147423, -35413, 4780526, 199204, -11074362, -21594285, -25994366, -21185265, -8869784, 1097980, -1199915, -12552787, -19628814, -16422659, -9872176, -6447593, -3481088, 2006552, 5833532, 4574641, 2863328, 5329440, 7793320, 4441643, -1512949, -2745012, 561267, 2552943, 2392614, 4301062, 8202960, 8904955, 4684549, -1267764, -8713811, -21411898, -37718177, -47685330, -44146281, -31505537, -19032616, -9874633, -1967373, 3606637, 2115518, -6898625]
43134f898625r936401m684256n54188j147638j417605M069141J0932013Q508804
43126a128755m951157j5916620j0273790P732197J8934036J2768744o70790o129338
43118C64527k630770M19703L55164L020065R070502J0490669L531648m742609
43110A9878899p206603n452581k889378J913168P708394N393641q534213j9856121
43102i044794j2049045Q677963J8915567R833071k254327k321561K264630j836173
43094A2185331r342408m543739J1951655K1519224J2695652n561587j8092801
43087B0811327j9563753j2901512k210749P151774R135372L640946k138525k847548
43079A077332o39007R17628K231000L179895J3078p460337j1268876n078811N102316
$$ y = [-6898625, -16835026, -21519282, -22073470, -23221108, -24638713, -20569572, -9637559, -1128755, -6079912, -21996532, -32270322, -24538125, -5604089, 7164655, 6493865, 364527, -2266243, -1846540, -1491376, 1528689, 10599191, 21089860, 24621508, 19878899, 12672296, 7219715, 4330337, 6243505, 13951899, 19345540, 10811327, -9044794, -21093839, -12415876, 6499691, 16332762, 14078435, 11756874, 14021504, 12185331, 2842923, -1700816, 10250839, 31770063, 44465715, 38904128, 20811327, 1247574, -11653938, -13864687, -6712913, 2422459, 6063405, 3924880, 1077332, 438325, 1355953, 3586953, 6766848, 6779926, -680411, -11949287, -17028098, -11925782]
43070a1925782P716014J649773k056580M329650J3925110J2972613k174552j9240397
43062E195849k2749528j1499817J12710m4957p006648o987808K894288J1628872
43054b8457039J0636128L696951j800053m486848n365387k466088M764958J1464545
43046a2012833J3132119J0623041N746939j547196p571802m915457N527988J0706576
43038A9689375J755587j2823901j8859784j4444642o908661P74113R093750J3549048
43030h175115R775173L047165P49617l8836m743079o894705K150370J3262825
43022I133415Q932884p665417j3922587j953678R382611M452573p105360j0037858
43014h783417p231034q361010r327580j227068R859971J0652546K819018J22107
$$ y = [-11925782, -4209768, -2559995, -4616575, -286925, 13638185, 26610798, 24436246, 5195849, -17553679, -29053496, -28940786, -28985743, -35992391, -42980199, -40085911, -28457039, -17820911, -14123960, -15924013, -20410861, -25776248, -28242336, -23477378, -12012833, 1119286, 11742327, 17489266, 15942070, 8370268, 3454811, 8982799, 19689375, 21444962, 8621061, -10238723, -24683365, -31592026, -30817913, -21724163, -8175115, 1600058, 4647223, 5396840, 5358004, 614925, -6279780, -4129410, 9133415, 18066299, 10400882, -3521705, -5475383, 3907228, 8359801, 1254441, -8783417, -16014451, -24375461, -33703041, -34930109, -25070138, -14417592, -11598574, -11476467]
43006a1476467O222436J1237599R509692N890467L505747q50930o531261o688859
42998A0818424k49279M065388K96088o465380q456386m635643J761024P798937
42990D933173R444101L058012p205358j0426536k640809O575654O910058Q77080
42982A1525375k129799r9934J710677J737246L239766N070565J140878q299366
42974A3895408j3263621o903987M172482Q206710K784065m845116q652482q215625
42966a2822166m151295K975931Q870444Q361211L948098L913604Q826991Q332555
42958B8255373k924124j4549542j4583194p517099o034680r299637n065139O453538
42950b5264504Q597518m696956j3986352k79650K4741708L1803556J3286664q249343
$$ y = [-11476467, -5254031, 5983568, 15493260, 21383727, 24889474, 24038544, 17507283, 10818424, 10569145, 14634533, 14930621, 8465241, 8855, -4626788, -2865764, 4933173, 14377274, 17435286, 10229928, -196608, -2837417, 3738237, 10648295, 11525375, 9395576, 9295642, 11006319, 12743565, 15983331, 21053896, 22194774, 13895408, 631787, -6272200, -2099718, 6106992, 8891057, 4045941, -4606541, -12822166, -16973461, -13997530, -5127086, 3234125, 7182223, 11095827, 19922818, 28255373, 25331249, 10781707, -3801487, -11318586, -17353266, -26652903, -31718042, -25264504, -16666986, -21363942, -35350294, -35629944, -10888236, 20915320, 34201984, 25952641]
42942B5952641j2424709n309569l996249j0324812j2399088n270587L299292O472174
42934a4000907O186831N421738K483238k426564l031858L784558J0281003P546287
42926A6244326p82538l852748q96370j991630r916370j3526802n602758L840307
42918a6484583K702726l317703l45684Q885709P540997o387419j2103176L492846
42910a6016287K2087574J6621623r754333k5473119j1877538J3594139K2469089
42903A1651148J0796008k303847m269690j635818k583757k767949K969050O563572
42895A8418717j577569j2974059r981038O068228J3659231L367238o846353j82646
42887I951749J1716594Q182904n904282q251327L475140Q020231l487685j2822583
$$ y = [25952641, 13527932, 8218363, 4222114, -6102698, -18501786, -23772373, -20473081, -14000907, -7814076, -2392338, 90900, -2335664, -5367522, -1582964, 8698039, 16244326, 15461788, 11609040, 10712670, 8721040, -1195330, -14722132, -20324890, -16484583, -13781857, -17099560, -17445244, -8559535, -1018538, -7405957, -19509133, -16016287, 6071287, 22692910, 12938577, -12534542, -24412080, -10817941, 11651148, 22447156, 20143309, 15873619, 14237801, 11654044, 8886095, 11855145, 18418717, 16841148, 3867089, -6113949, -45721, 13613510, 16980748, 10134395, 9951749, 21668343, 29851247, 23946965, 15695638, 19170778, 27191009, 23703324, 10880741]
42879A0880741n127538P234925N437621p318330j4114300r692307j544074O025734
42871h217528J3023041J4527509N882534n538620p648777j544691L61720o503508
42863D341680j3639050j4018702j0502830p427523l523646L275911J0885827J5614838
42855a4993495J4954529P822372k772288q935507o518905k557378n812384j1870376
42847c0683432q436923M454155J1947508N726076l985276m650772M24986K6599
42839b5177079n675772n655620L793716J2369201J0145499J093143k890315K302641
42831i694586Q611263O661683l097343j1504161j0624939j066288R135984J1808880
42823B30493O489613J587260M683468J1139744Q503894m598201j2756002n348873
$$ y = [10880741, 5753203, 12988128, 18425749, 11107419, -3006881, -12699188, -14243262, -8217528, 4805513, 19333022, 25215556, 19676936, 12028159, 10483468, 10845188, 4341680, -9297370, -23316072, -33818902, -41246425, -44770071, -41494160, -30608333, -14993495, -38966, 7783406, 5011118, -3924389, -10443294, -13000672, -18813056, -30683432, -39120355, -34666200, -22718692, -16992616, -20977892, -25628664, -25203678, -25177079, -30852851, -36508471, -32714755, -20345554, -10200055, -9106912, -11997227, -9694586, -1083323, 5578360, 2481017, -9023144, -19648083, -20714371, -11578387, 230493, 6720106, 8307366, 12990834, 24130578, 32634472, 28036271, 15280269, 9931396]
42815I931396M916221n30951j5757362j6842504J308366J6492831J3454529M241099
42807A7213625K710811P79497j1375430k0273207q782337J1809912J6047242L485075
42799A1615188l460357K236092M114036n423195j1784737m684341N554645P929341
42791F096672O510256N875041R4225j1565365j5397678l564477J0882356J2850255
42783A1781285O053810J795902k87084n706318j0498008q356767l577908k811871
42775a1606959k211863L769658R477886P783576L782389M297097L371350n304275
42767A3358859j1453142l474289P967241M813529n952973j736488J5127645J6523433
42759C5173815n236663k0539436p119898J4364809J1879203r722934j8918363
$$ y = [9931396, 14847617, 14316666, -1440696, -18283200, -16974834, -482003, 12972526, 17213625, 19924436, 20703933, 9328503, -10944704, -19727041, -7917129, 8130113, 11615188, 8154831, 10390923, 14504959, 9081764, -2702973, -7387314, -1832669, 6096672, 12606928, 18481969, 18576194, 7010829, -8386849, -11951326, -1068970, 11781285, 17835095, 19630997, 19343913, 13637595, 3139587, -5217180, -8795088, -11606959, -13818822, -10049164, -571278, 7212298, 10994687, 15291784, 18663134, 13358859, 1905717, -1568572, 6398669, 11212198, 5259225, 3522737, 18650382, 35173815, 29937152, 9397716, 2277818, 16642627, 28521830, 18798896, -119467]
42752a19467n869802P656620N650777j098927J605103Q193951O410277r73346
42744B1455186k980283o95950m390103j3038248j3123038j186083P293035N70582
42736f094902r363546l511471J3610829J7687683J05026j7622553j3399363N305764
42728a3282533J4232568O379169k851557j420268N051500P559945Q014940J1874949
42720C5558713J6126899J3532683M002424n708967j1241917j3940533j6265296
42713B2064006j8050946j6745362r434577L407486J4746431J5327594M413429
42706A5728061p133929q746139k708453K7452m777736r129192l856857R077667
42698a1519126J8140995J4603045J545238r148872q238586K068283J0668613R128906
$$ y = [-119467, -5989269, 1667351, 7318128, 6219201, 7824304, 16018255, 22428532, 21455186, 18474903, 17778953, 13388850, 350602, -12772436, -13958519, -6665484, -6094902, -15458448, -18969919, -5359090, 12328593, 12433619, -5188934, -18588297, -13282533, 950035, 7329204, 4477647, 3057379, 8108879, 15668824, 23683764, 35558713, 51685612, 65218295, 69220719, 63511752, 52269835, 38329302, 22064006, 4013060, -12732302, -22166879, -18759393, -4012962, 11314632, 15728061, 8594132, -152007, -2860460, -2833008, -7610744, -16739936, -20596793, -11519126, 6621869, 21224914, 22770152, 13621280, 5382694, 7450977, 18119590, 27248496]
42690B7248496M9425o708809n062682J421758M204852q39484q496170q681601
42682C135785K315096J4953647J5169752K671809n234656M718395K0707890J8232884
42674G6670602o119940k7196927k3543662l954204Q883244R336863P530837N833561
42666D7440374k298389j2205105r464589M330972Q895735l030550j2156673l825225
42658A7686550P338225K530031q742728n383844P989741Q307114o268108j2612549
42650A0844432q25836J0659539O108221m500394n359219P65850J891367k842077
42642A6741883n581243l360210J349624O181865P290909N95219q913275q889133
42634E415639K476653J0863500N945705l695539m952876P32310L107094o47653
$$ y = [27248496, 27297921, 20589112, 15526430, 16948188, 21153040, 20313556, 11817386, 3135785, 5450881, 20404528, 35574280, 38246089, 33011433, 37729828, 58437718, 76670602, 70550662, 43353735, 19810073, 15855869, 24739113, 34075976, 41606813, 47440374, 45141985, 32936880, 23472291, 27803263, 36698998, 33668448, 21511775, 17686550, 25024775, 27554806, 18812078, 13428234, 21417975, 29725089, 23456981, 10844432, 10018596, 20678135, 26786356, 22285962, 16926743, 17692593, 19583960, 16741883, 11160640, 7800430, 9150054, 15331919, 22622828, 23218047, 14304772, 5415639, 7892292, 18755792, 24701497, 21005958, 16053082, 16785392, 19892486, 19244833]
42626A9244833n829905r241482q929180j887683R101312J3360152N855121l717527
42618A7955641l513366N200759J2326028J1352144J602188j3155980k2521208
42611I246206j6299488J05055Q603156K889196l696549j385995K075484J58903
42603A695968Q07312P583581P589935m869794j2685256m105334M090431m104768
42595c997925j2105911J547107K1760162J8947829o56820n923751O019229R171313
42587C4761233j416957k577877J0016077J1037007p599943j9711649j0456258
42580A4051633j271686r426408j7193544n312501J2545726J4924242P594192P157440
42572B3069094J0167048M374408n884136r194730p517657o750720k304419O678829
$$ y = [19244833, 13414928, 4173446, -4755734, -6643417, 2457895, 15818047, 21673168, 17955641, 14442275, 19643034, 31969062, 43321206, 44923394, 31767414, 9246206, -7053282, -6948227, 1654929, 4544125, 847576, -538419, 1537065, 1695968, 2503280, 10086861, 17676796, 12807002, 121746, -3983588, 106843, -3997925, -16103836, -14556729, 7203433, 26151262, 25494442, 19570691, 25589920, 34761233, 33344276, 30766399, 40782476, 51819483, 44219540, 24507891, 14051633, 12779947, 3353539, -13840005, -19152506, -6606780, 8317462, 15911654, 23069094, 33236142, 37610550, 31726414, 22531684, 15014027, 8263307, 5958888, 12637717]
42564A2637717O332162p973156j5445919j163034J5149182Q645374r450487j0980697
42556b248858K536858O389890k660956l559184Q997936J5268443N097551p308491
42548B2513189r606889p128211n345158P45991J1300452J5276581Q218695P5659
42540C6050309k233255m926112j2706691j7947087j2666659n34392R782352J4383630
42532I202095J2599577M333115o585658j2971270j1125855l014580O900689J2010461
42524A1348574N677415r105099j7813956j1569328J55725M367030L732812P610362
42516e596465J2901223J1001971O663006J0709346J9051927J8608829R718308
42509H3058145K282158n359703k0145625l0784815j8096653J0384081K4345904
$$ y = [12637717, 18969879, 10996723, -4449196, -5612230, 9536952, 18182326, 8731839, -2248858, 288000, 6677890, 4016934, 457750, 9455686, 24724129, 29821680, 22513189, 12906300, 5778089, 432931, 1178922, 12479374, 27755955, 35974650, 36050309, 33817054, 28890942, 16184251, -1762836, -14429495, -14963887, -5181535, 9202095, 21801672, 26134787, 19549129, 6577859, -4547996, -7562576, -661887, 11348574, 17025989, 7920890, -9893066, -21462394, -21306669, -16939639, -13206827, -5596465, 7304758, 18306729, 24969735, 35679081, 54731008, 73339837, 83058145, 85340303, 79980600, 59834975, 29050160, 10953507, 21337588, 45683492]
42502D5683492J3651473m35477l234947o068246j6418685j8583687k427215J3496046
42494B5662754R104558o282431j1568801o151403k823835j924840M654250J2654604
42486B3324856J0377627k73008n978769k428768K357574K588892J11594k336624
42478B7743374l551193k715478k516426p265421j2578781p299454P297679J3609168
42470A2723468L353670p290276k182036R148281Q165551k088964l914605N096703
42462B3011792J0390449N204217k676557p424623j0488041j0071918k277176P078792
42454A2746935P660387J968290K056847Q520196Q877868j068749j0098787r580563
42446B1082424m119438O13807P271587J7647912K5062241K2782315J2511197J71919
$$ y = [45683492, 59334965, 58899488, 55664541, 49596295, 33177610, 14593923, 12166708, 25662754, 34767312, 28484881, 16916080, 10764677, 7940842, 6016002, 10670252, 23324856, 33702483, 33429475, 27450706, 25021938, 27379512, 29968404, 30079998, 27743374, 24192181, 21476703, 18960277, 11694856, -883925, -8183379, -885700, 12723468, 16077138, 8786862, 6604826, 15753107, 23918658, 21829694, 17915089, 23011792, 33402241, 38606458, 35929901, 28505278, 18017237, 7945319, 5668143, 12746935, 20407322, 22375612, 24432459, 32952655, 41830523, 40761774, 30662987, 21082424, 16962986, 17576793, 24848380, 42496292, 67558533, 90340848, 102852045, 103023964]
42438A03023964r649522j2575578o088171M600708J0017699Q667160Q813741J5909919
42430A22719920K5270673K9332155K5941423J8423946J3436928J8046488L1680715
42423B84852248M2491563M0437320L2041765L1329285L7540912L5347913J8545791
42416E22586797o22982r953635j1900357j3935964j6642683j8936024k4366536
42409D26228616l3543178l8961760l5734075k9768210k7282514k4040216j4281175
42402B22617488l609032k396016j0363432j7455995j7682569j3708964r657949
42395A47743531p211076p571536j0119660j0040645l928234L123492K769825m575823
42387A10189874r925015q584485n717389o639160q436746o400572l877965p989164
$$ y = [103023964, 93374442, 80798864, 74710693, 79311401, 89329100, 97996260, 106810001, 122719920, 147990593, 177322748, 203264171, 221688117, 235125045, 253171533, 284852248, 327343811, 367781131, 399822896, 431152181, 468693093, 504041006, 522586797, 521963815, 512010180, 500109823, 486173859, 469531176, 450595152, 426228616, 392685438, 353723678, 317989603, 288221393, 260938879, 236898663, 222617488, 219008456, 216612440, 206249008, 188793013, 171110444, 157401480, 147743531, 140532455, 132960919, 122841259, 112800614, 108872380, 111995872, 114765697, 110189874, 100264859, 91680374, 85962985, 79323825, 70887079, 64486507, 60608542, 52619378]
42379E2619378j6374535j6544275k531920J3863120J6007530M125657n100916
42372D6064039j629572N431982L745032l417962m329220J304445K278779n689246
42364D3758277j3688664j3710171q585104m231446q68780L140211N510909L228742
42356A4553974k911382j0068184j5218595j3788722k886325J1441975J6931749
42349a945510Q992477l678182j0508453r889052n385497J310078Q157972J0114168
42341b831999N594782J092858K985556Q278118R166351L618201l670369p704242
42333A6529256o080916P92580P762648P355857p63331o865744l007645O419313
42325B2142018J1550069R662802M325035k961270j1491037j5291670q392605M598086
$$ y = [52619378, 36244843, 19700568, 17168648, 31031768, 47039298, 51164955, 46064039, 44434467, 49866449, 53611481, 50193519, 45864299, 47168744, 49447523, 43758277, 30069613, 16359442, 7774338, 3542892, 2674112, 5814323, 11325232, 14553974, 11642592, 1574408, -13644187, -27432909, -30319234, -18877259, -1945510, 7046967, 3368785, -7139668, -17028720, -22414217, -21104139, -12946167, -2831999, 2762783, 3855641, 6841197, 15119315, 24285666, 27903867, 24233498, 16529256, 10448340, 11240920, 19003568, 26359425, 25596094, 18730350, 15722705, 22142018, 33692087, 43354889, 47679924, 44718654, 33227617, 17935947, 9543342, 14141428]
42317A4141428J2022744R427173K602095l120494p829254j0576251p312129J529599
42309A0884911Q940112J0466478R075192P659718L563190m718966j1456569j0417978
42301B3996088l634590K330250N451726P434939O757976L77881p843323q524189
42293B6346758L13200Q056936M577233n577462q933167j598761O156978O122757
42285C5464472M491870J0524644J8500027J3054591o512719j9522307q901920
42278D7098658J5501800K9168113K4162994J5775215J7375020K1362845J2169244
42271A82613889j0013981k8456351l0492370k0412840j0997840q892547j1247003
42264F2100957j2273724r042036k657300K959745M067062J064223j410467m36655
$$ y = [14141428, 26164172, 35591345, 38193440, 35072946, 27243692, 16667441, 9355312, 10884911, 19825023, 30291501, 39366693, 47026411, 50589601, 45870635, 34414066, 23996088, 20361498, 22691748, 28143474, 35578413, 42336389, 42714270, 34870947, 26346758, 26659958, 34716894, 39294127, 33716665, 24783498, 23184737, 29341715, 35464472, 39956342, 50480986, 68981013, 82035604, 75522885, 56000578, 47098658, 62600458, 91768571, 115931565, 131706780, 149081800, 170444645, 182613889, 172599908, 144143557, 113651187, 93238347, 82240507, 73347960, 62100957, 49827233, 40785197, 38127897, 41087642, 45154704, 46218927, 44808460, 44371805]
42256D4371805O51563k913473r060249j0478105n245066r8854j14309q64377L537105
42247A9786040R179136P222501j848999p727823m757252J692304N667805Q500487
42239C7714199J1417637R094115j028525r385132n192003N968150P335661m828485
42231E1095617j3683562m534376J3369825J7430254J019412j7761831j8874775
42224B8060564m387319O305945K029341p372420o425624L819132O726153o856129
42216B1899643k4345086k5853711q855676R193620J2762206M979423q77698M33147
42208a0664132L789798N583661P963098J0453255P310893j657294n828124K347453
42200A9298608J3613444J2413219j179286j1195469p995355O07945L726807J817466
$$ y = [44371805, 45023368, 42109895, 33049646, 22571541, 17326475, 17227621, 17113312, 16248935, 19786040, 28965176, 36187677, 34338678, 26610855, 21853603, 23545907, 29213712, 37714199, 49131836, 58225951, 57197426, 47812294, 42620291, 48588441, 55924102, 51095617, 37412055, 32877679, 46247504, 63677758, 64697170, 46935339, 28060564, 23673245, 29979190, 32008531, 24636111, 18210487, 22029619, 28755772, 21899643, -2445443, -28299154, -37154830, -27961210, -15199004, -10219581, -11097279, -10664132, -6874334, -1290673, 6672425, 17125680, 24436573, 22779279, 16951155, 19298608, 32912052, 45325271, 44145985, 32950516, 24955161, 25563106, 29289913, 31107379]
42192C1107379M96143n72136m261408q152020q083115m420016J233400Q862631
42184A6210858J3849545P794026n971835r434816M696674J6580848O108501j4145097
42176C5688704j5964810R77678J0114452J715667m602406K550926O873398l447172
42168C3906437j1863823k149071J1799344Q807520m407922o467090L240081Q406854
42160D1272330N929762O093716Q407599K810309p749976j0080305m721899l951485
42152C8010051p092676k322458O891457L944679q968376r139402Q559024J9682239
42144D9564538Q880791n732591l941965M563362J061766q683583o678378M776224
42136D3810164Q246380J263978k577273R95801K174119l012796p122254o511283
$$ y = [31107379, 31603522, 31031386, 26769978, 18617958, 10534843, 6114827, 7348227, 16210858, 30060403, 37854429, 31882594, 22447778, 27144452, 43725300, 49833801, 35688704, 19723894, 20701572, 30816024, 32531691, 27929285, 30480211, 37353609, 33906437, 22042614, 19893543, 31692887, 40500407, 36092485, 29625395, 32865476, 41272330, 47202092, 53295808, 61703407, 64513716, 56763740, 46683435, 41961536, 38010051, 30917375, 28594917, 35486374, 39431053, 30462677, 21323275, 29882299, 49564538, 58445329, 52712738, 48770773, 53334135, 54395901, 45712318, 39033940, 43810164, 52056544, 53320522, 50743249, 51739050, 53913169, 50900373, 43778119, 37266836]
42128C7266836n499462m388670J049374P049044M538676l515040l356284O896933
42120D0041407J1477453P04639j3392583j4354312l234156O710570Q885701O613363
42112D3452082L359337j63951k132205j175474k1899j199584j661211J679511
42104D2136606L835566k400320j3143422j5151010l568800R948341J2155761N416962
42096C9229684K512454P250494R618951K022634q364000r819666l152368L96198
42088C9694381l185278n071642J248381P994619L716913q839107j4642062o412735
42080A4503470M847857L383593j0997112k1326606j3157995P215106J8220788
42073B689101P777964j1516099j6904140l013936J2813270J3926930M055728k152762
$$ y = [37266836, 31767374, 27378704, 28428078, 35477122, 40015798, 36500758, 33144474, 40041407, 51518860, 52223499, 38830916, 24476604, 21242448, 27953018, 36838719, 43452082, 46811419, 46647468, 44515263, 43339789, 43317890, 42118306, 40457095, 42136606, 45972172, 43571852, 30428430, 15277420, 11708620, 21656961, 33812722, 39229684, 41742138, 48992632, 58611583, 60634217, 52270217, 42450551, 39298183, 39694381, 36509103, 31437461, 32685842, 40680461, 44397374, 35558267, 20916205, 14503470, 19351327, 22734920, 11737808, -9588798, -22746793, -15531687, 2689101, 10467065, -1049034, -17953174, -20967110, -8153840, 5773090, 9828818, 7676056]
42065G676056m07886J582752P8076Q60953P003490J1229759N942145n490393j3204361
42056A5270591j2521574o064551K133240Q615511R052472J963412o092170n978976
42048F377955J386457M443013k990286j1248432p358921N945913J3078041O948106
42040A6581846k578960m590610j700454j953058m127436j212126N584489P310292
42032A3313983J451294m032739k688570K278972M475707K657134l3133k43970
42024A7178678L787237J0076452J2219080O145337k986191p042231o593061p610193
42016B5175108q115427p48142J0105208R034239o398401j7314346r546235N042705
42008G234709O890787k104419m338101M919090J2512569R634787K654966o52081
$$ y = [7676056, 7268170, 8850922, 8928998, 9789951, 16793441, 28023200, 33965345, 28474952, 15270591, 2749017, -3315534, -1182294, 7433217, 16485689, 18449101, 12356931, 6377955, 7764412, 12207425, 9217139, -2031293, -9390214, -3444301, 9633740, 16581846, 14002886, 9412276, 7711822, 5758764, 1631328, 419202, 6003691, 13313983, 14765277, 10732538, 8043968, 10322940, 14798647, 17455781, 17422648, 17178678, 20965915, 31042367, 43261447, 49406784, 46420593, 39378362, 32785301, 25175108, 17059681, 16311539, 26416747, 35450986, 29052585, 11738239, 2192004, 7234709, 14125496, 12021077, 7682976, 12602066, 25114635, 34749422, 37404388, 36752307]
42000C6752307j973287m844836o567860l467582K143464M673664J591492m287441
41992B4019921o430509m00381Q599909Q388505m369601j6433094j4080752j460552
41984b166554P178902Q160331Q462357R127745M054706n103443q307664l612411
41976A7793969k89637k832483n616744o341984r836920j4104723q535895O821947
41968b2942470J5747701R360883J050997N976318J7552422J7896274L174202j4184569
41960C3631758k2178906j7456866l424849R949786J1276465J792677l699734J578915
41952A1469246N320708j959105p875462J472917J4391455R897812o457176r543024
41944A6717371M187471J0322150l424913j7181526j0878082N625771J0221382
$$ y = [36752307, 34779020, 29934184, 23366324, 19898742, 22042206, 26715870, 28307362, 24019921, 17589412, 17189031, 25788940, 34177445, 29807844, 13374750, -706002, -2166554, 5012348, 13172679, 21635036, 30762781, 34817487, 29714044, 21406380, 17793969, 17504332, 14671849, 9055105, 2713121, -7123799, -21228522, -29764417, -22942470, -7194769, 2166114, 3217111, 9193429, 26745851, 44642125, 47816327, 33631758, 11452852, -6004014, -9428863, 520923, 11797388, 13590065, 9890331, 11469246, 16789954, 14830849, 6955387, 8428304, 22819759, 32717571, 26260395, 16717371, 20904842, 31226992, 27802079, 10620553, -257529, 5368242, 15589624]
41937A5589624K07461j0261704j2539347p476751L563210J6069774J8003646L613324
41929B6769237j3251496j4320269j773144O308761K322593m330487o002935n840435
41921a0118175n846364j470911O605096Q967830K783720j503151K857873O514308
41913H790226p54592j1790170j1979123j144051Q186036J0573953J1220676J0948658
41905B4051613L361375r876578j5561152p490375L507044O122284M305104O633567
41897A5052882R895381O127846j013301j437527L660421M022066j373486l559767
41889C1374515j666199n354814j5290035j7695645o207012N929634O247235K137994
41881e24327N880955J2124322P502049m745365q910219k925079j060163q521571
$$ y = [15589624, 15797085, 5535381, -7003966, -14480717, -10917507, 5152267, 23155913, 26769237, 13517741, -802528, -2575672, 3733089, 6055682, 1725195, -4277740, -10118175, -15964539, -17435450, -10830354, -1862524, 921196, -581955, 2275918, 8790226, 8035634, -3754536, -15733659, -16877710, -8691674, 1882279, 13102955, 24051613, 27412988, 17536410, 1975258, -5515117, -2008073, 4114211, 8419315, 15052882, 24948263, 31076109, 30062808, 28625281, 32285702, 36307768, 34934282, 31374515, 29708316, 24353502, 9063467, -8632178, -14839190, -8909556, -2662321, -524327, 5356628, 17480950, 24982999, 20237634, 11327415, 8402336, 7342173, -1179398]
41873a179398j1536529K88873J6162180J8321583M762727j0873895j5619067o703346
41865f376872Q995714J8708691J2735219m062386j4675569r409524K389085N819481
41857A4123839k58046m923726j744435M726273P011211K596483m867248p766871
41849H897480j252543P989918N838603r588186k0024176j0111172Q151038J0016877
41841h2161n482197j3204160j93490J3929406P116148j0853990j2887045N334699
41833a6322790K0392610J5514718J165698m180518P78594L749193j212692p715919
41825A2168894p967305j950640M322909N543367J655743k737214l614942j581496
41817E839316Q24511L536091O537018N604500k383640j0840396r248250J013392
$$ y = [-1179398, -12715927, -12427054, 3735126, 22056709, 26819436, 15945541, 326474, -6376872, 2618842, 21327533, 34062752, 30000366, 15324797, 5915273, 8304358, 14123839, 13865793, 8942067, 7197632, 11923905, 18935116, 21531599, 16664351, 8897480, 7644937, 15634855, 21473458, 11885272, -8138904, -18250076, -10099038, -82161, -5564358, -18768518, -18962008, -5032602, 2083546, -8770444, -21657489, -16322790, 4069820, 19584538, 20750236, 16569718, 17348312, 21097505, 19884813, 12168894, 4201589, 2250949, 6573858, 12117225, 13772968, 11035754, 7420812, 5839316, 6663827, 10199918, 16736936, 22341436, 19957796, 9117400, -130850, 882542]
41809H82542O314377j98809q872908p992392J511553J1836302J8452186J6788739
41801C8721590P94256k3262904l2806950j5019794J1165237J7282965L636192
41794E10592n079246J148198P049600K527259j541914L342876O743498p09436
41786A3991427r228724o812926P24039J912591j040387k66848K015185R52033
41778B246390J223940O361391P157059k598379j0300003l355024P276855M212741
41770A2224970n488550k029386J1201068J1804871l229193j2452724o292658j2664
41762E725734l500894n561529R61012L979540l987167r650393k524270N868204
41754h689763L654924N62291Q651274J7434267R991018p966863j6458528j0220864
$$ y = [882542, 7196919, 6998110, -1874798, -9867190, -8355637, 3480665, 21932851, 38721590, 39515846, 16252942, -16554008, -31573802, -20408565, -3125600, 510592, -4568654, -3420456, 3629144, 6156403, 4614489, 7957365, 14700863, 13991427, 4762703, -2050223, -1326184, 586407, -453980, -720828, 1294357, 2246390, 3470330, 9831721, 16988780, 14390401, 4090398, 735374, 8012229, 12224970, 6736420, 4707034, 15908102, 27712973, 24483780, 12031056, 5738398, 5725734, 2224840, -3336689, -2375677, 1603863, -2383304, -12033697, -14557967, -8689763, -5034839, -4472548, 4178726, 21612993, 31604011, 23637148, 7178620, -3042244]
41746c042244k47043N997671P807574K282944r474226j4033206j917555J4103355
41738A477270J5415306N371362O07348J518399m754034j5719736j4329973L41731
41730a0072327Q981297L709624n74938N387375Q910680m97180j1162235q300091
41722c617795L046443R175544Q708079P772476N490131r88340n992876l871263
41714A9722399m33207k994186o573283l226694K132216l35247p416302p823509
41706f947813j094131L616385M838500R042898J4445701J1051306r93468q809978
41698B5149400o859728m570678p603654o750127M102246J2519143M974859r524071
41690A1437390j1085382r9183K868449r354040j6847218k644611J9502204K3790402
$$ y = [-3042244, -3289287, 2708384, 10515958, 12798902, 3324676, -10708530, -12626085, 1477270, 16892576, 22263938, 22871286, 24389685, 19635651, 3915915, -10414058, -10072327, -1091030, 2618594, 2043656, 7431031, 16341711, 15844531, 4682296, -3617795, -571352, 8604192, 17312271, 25084747, 30574878, 29586538, 23593662, 19722399, 19289192, 16295006, 9721723, 6495029, 8627245, 8291998, 875696, -6947813, -8041944, -4425559, 412941, 9455839, 23901540, 34952846, 33959378, 25149400, 18289672, 13718994, 6115340, -634787, 3467459, 15986602, 20961461, 11437390, 352008, 252825, 3121274, -6232766, -23079984, -25724595, -6222391, 17568011]
41682A7568011R143139k308447l16835J417663p397150j5071310q833966K202086
41674c596809K108760n043933l301153O515209Q007344j639381n707193L947728
41666A290572J3132521Q947744m55764k127275N82981j924005o168845l122727
41658A0155202L196613K159314l594527k426918M630886M662935l927996p141986
41650G713523J082855P867968K222692p336428p182722R7167J704779m736062
41642A433772r796386q567680n967027n642283m564861r99618J597157K446545
41634c0060381O647159J4776429J6980927O284326p214612o908577O194348J2280159
41626A8979778N8278j6018111j5242672M79169J0092618K947165q872438j0181401
$$ y = [17568011, 26711150, 24402703, 24085868, 25503531, 18106381, 3035071, -5798895, -3596809, -1488049, -6531982, -9833135, -3317926, 4689418, 3050037, -2657156, 1290572, 14423093, 23370837, 22915073, 20787798, 21370779, 19446774, 13277929, 10155202, 13351815, 15511129, 11916602, 9489684, 14120570, 18783505, 14855509, 7713523, 8796378, 16664346, 18887038, 11550610, 4367888, 4465055, 6169834, 1433772, -8362614, -16930294, -22897321, -28539604, -33104465, -34104083, -32506926, -30060381, -23413222, -8636793, 8344134, 14628460, 7413848, 505271, 6699619, 18979778, 19038056, 3019945, -12222727, -11743558, -1650940, 1296225, -7576213, -17757614]
41618a7757614k381610L078982K087258M4254J300927M469522O775245P319445
41610D936409O488098N633012O246259O990619L617476n493289j5498808j8894913
41602e975137j1878877K962025J7120242K0247753R659976l803413o215266J996569
41594B4113872O702056k34788j0939936j3985782p184552N207058J6760777J6590003
41586C7028708k700464k7624950l0493543m930112K0894801K0745355L919203
41579A6838998n472739n660661q962106j0902476J017757J5766083J0510200p891137
41571E243919r049652R649952J5677258l874891j8282648l776964J6449352J0500539
41563B2536865j1713390j8483362o769587J108700j637214j780257M053069N061908
$$ y = [-17757614, -20139224, -17060242, -14972984, -14928730, -13627803, -9158281, -2383036, 4936409, 11424507, 17057519, 23303778, 30294397, 33911873, 28418584, 12919776, -5975137, -17854014, -14891989, 2228253, 22476006, 32135982, 28332569, 22117303, 24113872, 30815928, 30581140, 19641204, 5655422, -1529130, 3677928, 20438705, 37028708, 34328244, 6703294, -23790249, -28720361, -7825560, 12919795, 16838998, 11366259, 5705598, -3256508, -14158984, -13141227, 2624856, 13135056, 5243919, -3805733, 5844219, 21521477, 17646586, -636062, -4413026, 12036326, 22536865, 10823475, -7659887, -14429474, -13320774, -14957988, -16738245, -12685176, -7623268]
41555g623268n37022l366369j844629j020473L017331J4483738J9706289M197801
41547B7013398j6604309j3545679J0276298K1548529P856855o422659l641641
41540B6480792J211919o867154j4943893p485663N150485O227903P59112J523826
41532A2057327L926459k052166q853048l717835O984892Q544413L849814O086789
41524B6826645J2992689J1033509K58782o559183o034485n335671n086010j270988
41516B6825288j84212r912403k0131760j3518299M490487J2000546O352089O107739
41508A2029475J4493462J1399932q481664j9915958o451362J1014879O954084
41501B1042848r116376j1013745K260593J0462226P560227N448781O910774J825157
$$ y = [-7623268, -8160290, -11526659, -13371288, -14391761, -11374430, 3109308, 22815597, 27013398, 10409089, -3136590, 7139708, 28688237, 36545092, 30122433, 26480792, 27692711, 20825557, 5881664, -1603999, 3546486, 9774389, 10533501, 12057327, 15983786, 13931620, 5078572, 1360737, 8345629, 16890042, 20739856, 26826645, 39819334, 50852843, 51111625, 44552442, 38517957, 33182286, 28096276, 26825288, 26641076, 16728673, -3403087, -16921386, -12430899, -430353, 5921736, 12029475, 26522937, 37922869, 29441205, 9525247, 3073885, 14088764, 21042848, 11926472, 912727, 3173320, 13635546, 21195773, 26644554, 33555328, 35380485]
41493C5380485q813258r502526L780000J4373721R280958l389313r361437p358864
41485B4389766m942030n433429o852776o562024j667444Q155093J4996786Q891052
41477C0974994o444462j4199483o544342L999808K988011n539391p272888O58205
41469a379548P766149O634718O96632l343844k242019L874469J0612791R396063
41461C2015411l311338j7247402j7769418n128265M866851K220180m804395m188044
41453a3346420J891144L022051j302051j362021N921883J1349176P760672L10249
41445A4244683l154097l934567o873305r028722m174040M275573O007765n0536
41437b687246l107389L060940J1157261J2649999R349120N999582P24039p808949
$$ y = [35380485, 26567227, 17064701, 20844701, 35218422, 44499380, 41110067, 31748630, 24389766, 19447736, 14014307, 7161531, 599507, -1067937, 7087156, 22083942, 30974994, 24530532, 10331049, 3786707, 7786515, 10774526, 5235135, -2037753, -1379548, 6386601, 13021319, 13717951, 10374107, 8132088, 12006557, 22619348, 32015411, 28704073, 11456671, -6312747, -11441012, -6574161, -4353981, -9158376, -13346420, -11455276, -8433225, -9735276, -11097297, -5175414, 6173762, 13934434, 14244683, 11090586, 7156019, 282714, -8746008, -12920048, -8644475, -2636710, -2687246, -5794635, -2733695, 8423566, 21073565, 30422685, 36422267, 37146306, 29337357]
41429B9337357j2009392o179493O07053l458275j2161903r038733M988033J0394759
41421B479406k28276q973235j22334J5370218J7554851P603404K469928O168240
41413D2322202N510385n886862j6694082j5615683o813250p19342J128692M137735
41405G369795R043262R996996L189366p216767j2523535p941657K165597P928783
41397A2011840L617681p422205j7323631j9636799j0705220P493134K2557821
41390i407379J9183844m98024j3063889k299326J6102976J4624884o148133j8384656
41382A10297q610667M652696L296964k483134M692230J7087201J3015573p397023
41374B4364137k0225537j2012960K747017M040763p224789j3509690m224167J2617949
$$ y = [29337357, 17327965, 11148472, 11755525, 8297250, -3864653, -12903386, -7915353, 2479406, 2251130, -6722105, -6844439, 8525779, 26080630, 33684034, 36153962, 42322202, 47832587, 41945725, 25251643, 9635960, 2822710, 2103368, 3232060, 7369795, 16413057, 26410053, 29599419, 22382652, 9859117, 1917460, 4083057, 12011840, 15629521, 8207316, -9116315, -28753114, -39458334, -31965200, -9407379, 9776465, 9278441, -3785448, -6084774, 10018202, 24643086, 18494953, 110297, -8500370, -3847674, -550710, -3033844, 1658386, 18745587, 31761160, 24364137, 4138600, -7874360, -5127343, -1086580, -8311369, -21821059, -26045226, -13427277]
41366a3427277K0876524J4537792L723933J138216M837000J785934j0511242j7275042
41358E685838q116496N924360Q699734K753352J363313L945837j278721j2488717
41350F488500j3300671J4348J0148118N010851n199180p136594m586823o684190
41342a5245641r165135l046486O911304Q489198J803284j904359J333425M489899
41334f334511L432762K249251L670728M546297K905436J385918J754297K504853
41326A6115031K920133L659635K866190k611909j1373615j7252465j5162659m687321
41318b5526980R426691J7420883J0878672n274370j3487519m553135Q520968Q122952
41310E528162l000283q433763m628853k716102n056841p44025J0920991J3175819
$$ y = [-13427277, 7449247, 21987039, 25710972, 26849188, 31686188, 33472122, 22960880, 5685838, -2430658, 3493702, 12193436, 14946788, 16310101, 20255938, 18977217, 6488500, -6812171, -6797823, 3350295, 8361146, 3161966, -3974628, -8561451, -15245641, -24410776, -27457262, -20545958, -12056760, -10253476, -12157835, -10824410, -6334511, -2901749, -652498, 3018230, 7564527, 10469963, 11855881, 13610178, 16115031, 19035164, 22694799, 25560989, 22949080, 11575465, -5677000, -20839659, -25526980, -16100289, 1320594, 12199266, 6924896, -6562623, -11115758, -2594790, 5528162, 2527879, -5905884, -10534737, -13250839, -18307680, -19051705, -8130714, 5045105]
41302E045105j489977j5142638r470785O743885J2032160M143504j039659K794478
41294C616073M857482k154046j0381350j0097326k800449L990970O466066M703151
41286a799429j05847m582995m188329J578021Q182876J1294863R911021N039343
41278B5329524m27870j807492K068594M990549J041379n319418m635506K645003
41270B3884763N947531P08253n142135m704190k503459m751751p393512l184564
41262B860936M338034M629446l112258p042846N55715J1187689J0552915k597447
41254B1372184j4382981j2856654j989591M598681Q06619o379714q406537o030714
41246b3268707m934007n113906j216485P523995J3925587J1359741K072179m932147
$$ y = [5045105, 3555128, -11587510, -21058295, -14314410, -2282250, 1861254, 821595, 3616073, 8473555, 6319509, -4061841, -14159167, -16959616, -12968646, -6502580, -1799429, -1905276, -6488271, -10676600, -9098579, -915703, 10379160, 20290181, 25329524, 24901654, 23094162, 25162756, 30153305, 31194684, 25875266, 21239760, 23884763, 29832294, 30540547, 25398412, 20694222, 18190763, 13439012, 6045500, 2860936, 7198970, 11828416, 8716158, 1673312, 2229027, 13416716, 23969631, 21372184, 6989203, -5867451, -7857042, -3258361, -2451742, -8831456, -17237993, -23268707, -28202714, -33316620, -34533105, -27009110, -13083523, -1723782, 348397, -4583750]
41238d583750k892584O021100J1924216O638032o105206j2442282l926272J1197016
41230E830270J6992774Q136713o086179j4136960j2177030l106399O604009Q846032
41222A0903230L94091j0829694j2739846l897170N261844P156618N314960N672967
41214G237000P608979P415587M143042j373365p386390r270264l921348K488087
41206F941328L43067p909096r361287j060280M697028J493793q3304P263372J1585301
41197A3909922J428364j1520142r006471L672141O109979l344953n764927N496478
41189I80391J3246611M394414j0127351j3472683n934320R64400K070110j97813
41181h076241l710444o262608l735123L690522Q770086O317488k78501n484930
$$ y = [-4583750, -7476334, -1455234, 10468982, 17107014, 11001808, -1440474, -5366746, 5830270, 22823044, 30959757, 24873578, 10736618, -1440412, -4546811, 2057198, 10903230, 11297321, 467627, -12272219, -16169389, -10907545, -3750927, 1564033, 7237000, 14845979, 22261566, 26404608, 25031243, 17644853, 8374589, 4453241, 6941328, 7284395, -624701, -9985988, -11046268, -6349240, -4855447, -4938751, 2324621, 13909922, 15338286, 3818144, -5188327, -1516186, 4593793, 1248840, -4516087, 980391, 14227002, 18621416, 8494065, -4978618, -10912938, -9948538, -7878428, -8076241, -11786685, -18049293, -21784416, -18093894, -9323808, -3006320, -3284821, -8769751]
41173h769751p778083o210636L81720O665164L400624p540352j1403258j372964
41165c2627536R516674P100773l147497o057075O55276P373536J0181653J2412277
41157E408081J1556856M50480j7047814k5431671j7106296k254531N600820N343119
41149c3480956M236445N303081N746927M429733M234153O785103Q878798O202362
41141A2335646m34706m812622k506827L369952O367505N015338K497280o16537
41133B1215029o484993j2544910j2252013n710846r80568j144775L74473O242428
41125a1286175P740818m17129p874816k937463Q822712J3264543Q588948L474185
41117A9375623k60796o943310j2225411o937463M102782N454340l640472n854902
$$ y = [-8769751, -16547834, -22758470, -22376750, -15711586, -12310962, -19851314, -31254572, -32627536, -23110862, -16010089, -19157586, -25214661, -24559385, -17185849, -7004196, 5408081, 16964937, 17415417, 367603, -25064068, -42170364, -44424895, -38824075, -33480956, -29244511, -23941430, -18194503, -13764770, -9530617, -2745514, 6133284, 12335646, 11900940, 7088318, 4581491, 7951443, 14318948, 19334286, 21831566, 21215029, 14730036, 2185126, -10066887, -15777733, -16758301, -17903076, -17528603, -11286175, -3545357, -3962486, -11837302, -14774765, -5952053, 7312490, 15901438, 19375623, 19114827, 12171517, -53894, -6991357, -2888575, 2565765, -1074707, -6929609]
41109f929609N631167J3426513K530040j4528624j4906868J746071J4300800R735696
41101A1005186l455710j1116244r746968m248838R31134L946743M584467M726337
41093c373893O389869P640114M184750l128079o373558J73830J0727411J2424272
41085B8664716K00034j5857414k0847908j1524422P69877L567512l675785j0934679
41077b9638069r014564J661816J1315232R775340j722422r203086k238912J0320254
41069a8744411J0795546j210652p246757J008474P857384m65991j2071638q683767
41061b8761812M224770P855590J830623J366704P179781M428365p492639j0491004
41053a9859622J222377J0519200O673551J767392N943020Q585363m92716j0785965
$$ y = [-6929609, -1298442, 12128071, 14658111, 129487, -14777381, -13031310, 1269490, 11005186, 7549476, -3566768, -13313736, -17562574, -16631440, -12684697, -8100230, -3373893, 3015976, 10656090, 14840840, 11712761, 5339203, 5513033, 16240444, 28664716, 28864750, 13007336, -7840572, -19364994, -18595117, -15027605, -18703390, -29638069, -38652633, -36990817, -25675585, -15900245, -17622667, -26825753, -29064665, -18744411, -7948865, -9159517, -16406274, -15397800, -7540416, -8006407, -20078045, -28761812, -24537042, -16681452, -14850829, -13484125, -6304344, -1875979, -9368618, -19859622, -18637245, -8118045, -1444494, 322898, 6265918, 14851281, 14358565, 3572600]
41045C572600r477698l105714k400558r61015J0329771K0588209J3372841m918473
41037B6999963j3557290q766258m913176p961781r152570m715529j858401k838491
41029b6763533m02950P486322J3097960J2355132R885794Q024659L115025m162467
41021B2635942o024165R92791J0215801J2822108N457782r048927k1713966k1508399
41013f171033q017568M293012M068653o72349L585197J2640689J1630080O93587
41005B2050268n193886q73850L284128J247851j530056l107849q759820j5921788
40997h805002j3666434k386855L778934K03664n94561P997067J4443358R862379
40989A0832550L487152M888690O554005j249716j1321395j0970467k988557k7638
$$ y = [3572600, -5905098, -9010812, -11411370, -12372385, -2042614, 18545595, 31918436, 26999963, 13442673, 4676415, -236761, -8198542, -17351112, -22066641, -23925042, -26763533, -27166483, -19680161, -6582201, 5772931, 15658725, 23683384, 26798409, 22635942, 16611777, 17604568, 27820369, 40642477, 46100259, 37051332, 15337366, -6171033, -14188601, -9895589, -5826936, -6499285, -2914088, 9726601, 21356681, 22050268, 16856382, 15982532, 19266660, 20514511, 18984455, 15876606, 7116786, -8805002, -22471436, -24858291, -21079357, -20875693, -21470254, -13473187, 970171, 10832550, 14319702, 19208392, 25762397, 24512681, 13191286, 2220819, -767738, -795376]
40981g95376m720705q744664o748442k33239P792143J3150295J1090863M215179
40973A5006054K642372Q695605J0498860J40411j1590914j0649220j517763M67068
40965A3692473o930933j1038232m428876N834149R749687N795535m49950l142999
40957I080854j279170K63819k956947o856970l409682N294483P251875j395130
40949E993132r456272p682625j206324K306945M764022Q602765P918906Q6053
40941A1326602n076882l54291N267216J401569n835658n435228r70961k160614
40933a838247n795344k597466M081042M207923l39741q07961O58661l345061p602780
40924a3378974j864790P901159O780111k988465m726648M219877Q394275P18985
$$ y = [-795376, -5516081, -14260745, -21009187, -21242426, -13450283, -299988, 10790875, 15006054, 17648426, 26344031, 36842891, 36983302, 25392388, 14743168, 13225405, 13692473, 6761540, -4276692, -8705568, -2871419, 6878268, 12673803, 12223853, 9080854, 7801684, 8065503, 5108556, -1748414, -5158096, 136387, 7388262, 5993132, -3463140, -11145765, -12352089, -10045144, -5281122, 3321643, 11240549, 11326602, 6249720, 5895429, 11162645, 12564214, 6728556, 1293328, 322367, -1838247, -7633591, -10231057, -6150015, -1942092, -2281833, -3089794, -2431133, -5776194, -13378974, -15243764, -7342605, -562494, -3550959, -8277607, -4057730, 4336545, 5055530]
40916E055530p348456n917940J327739Q633109J4394564J3488189J312956j2024674
40908A8921017j0191585L681707Q834507k136030j3901099j4277575q878682m291717
40900b2239457K341438R639660Q386887l88589l710204j00920k697236j1411884
40892b0180305p793480J0827406J9841154O861636m901794M787399J7274087O376792
40884C3092895j5842927j8511433k733600L043176q223601j3504809p03506J3474106
40876i909699J3262268N349661J547870P50643j972708m280819l642742l583487
40868b479013n991087o700157l232202J251776L872046M236221R95625n458555
40860a3505346q606832l309336M943545P875756P156464Q161509P011092j621442
$$ y = [5055530, -2292926, -8210866, -6883127, 1749982, 16144546, 29632735, 30945691, 18921017, 8729432, 12411139, 21245646, 19109616, 5208517, -9069058, -17947740, -22239457, -19898019, -10258359, -1871472, -2260061, -5970265, -6071185, -8768421, -20180305, -27973785, -17146379, 2694775, 9556411, 4654617, 9442016, 26716103, 33092895, 17249968, -1261465, -3995065, -951889, -9175490, -22680299, -23383805, -9909699, 3352569, 8702230, 10250100, 11000743, 9028035, 4747216, 1104474, -2479013, -8470100, -15170257, -18402459, -17150683, -13278637, -9042416, -8046791, -13505346, -22112178, -25421514, -20477969, -12602213, -5445749, 2715760, 9726852, 8105410]
40852H105410r110495k954250J0592317J2952303J891580n743660j701995L156289
40844A7187499M79253k761866l32009J629454k246096o444939o055126n234631
40836c778461o690369n589781r71569O9885l405735j906964O867628J1126495
40828d278871M908629n98700L040365N895375j812283r948777m463482Q276766
40820A019022J1849799O030628L326164M995253O30830j0272732j5610696j0913401
40812h945133n179827l370287J011078J0389863J4407798N247476q431242j2175523
40804g045797m428398L666430M048318J83088k73541L707505N930800K418449
40796H206854j953258K40244P604666J0907044O066264j261426o423535j1744938
$$ y = [8105410, -1005085, -3959335, 6632982, 19585285, 21476865, 15733205, 14031210, 17187499, 17666752, 14904886, 14572877, 16202331, 13956235, 7511296, 1456170, -3778461, -10468830, -16058611, -17030180, -16960295, -20366030, -22272994, -15405366, -4278871, 629758, 31058, 3071423, 8966798, 7154515, -2794262, -7257744, 1019022, 12868821, 18899449, 22225613, 27220866, 27851696, 17578964, 1968268, -8945133, -14124960, -17495247, -16484169, -6094306, 8313492, 13560968, 5129726, -7045797, -11474195, -7807765, -3759447, -3576359, -3849900, -142395, 5788405, 8206854, 6253596, 6493840, 14098506, 25005550, 31071814, 29810388, 23386853, 11641915]
40788A1641915j6491807j1725509M477795J5791636O192758j5011294k2385756
40781b7510262p642002J1518707J7367370J1760366N122873J60551m810707o815829
40773h48933k523027M419275Q101526P721759M641927k019916j0652910j3965496
40765e125795p900335Q76351L544652R69404k58677O93928j73017k536469k711605
40756a2621563j858368l750093n272974N28505J1053882J4583266P363263j01585
40748I924333O83265L305280j977039j1414628j3039673m668373L903791N354724
40740g928320J977589j532643l308813j261516O119384J3167508R700089n298226
40732A1635052j9446143k1071236j1815791j225396M666759M674502j36191l718788
$$ y = [11641915, -4849892, -16575401, -12097606, 3694030, 9886788, -5124506, -27510262, -35152264, -23633557, -6266187, 5494179, 10617052, 10777603, 5966896, -848933, -3371960, 1047315, 9148841, 16870600, 21512527, 19492611, 8839701, -5125795, -13026130, -12149779, -8605127, -7635723, -7894400, -7200472, -7373489, -9909958, -12621563, -14479931, -18230024, -23502998, -22974493, -11920611, 2662655, 10025918, 9924333, 10607598, 13912878, 11935839, 521211, -12518462, -17186835, -13283044, -7928320, -5950731, -7483374, -10792187, -12053703, -5934319, 7233189, 16933278, 11635052, -7811091, -28882327, -40698118, -41923514, -37256755, -32582253, -32718444, -36437232]
40724c6437232K944518J8375003K5831534J3206225p313956j2945893j345995
40717B314204P362557J121303p781391m135065O491530P724544k215410q787766
40709B094506k828217P355513P804252m064116j7354530j9548297q510266O324551
40701b8726604J3872049J1614708M980024j045339n277828o501293k896791L005715
40693a0975359M723425L944o071742q308808o724396k960405K436317O882824
40685b0994200O972043N770037J0701571J9875306K0060802N488908j0597188
40678C7277279j3272670o987382o483021j1964850r100751N807021J5962144O208552
40670A7446322j4788129k3718916j0783015Q859159J3377382r3939j3131234j0053576
$$ y = [-36437232, -33492714, -15117711, 10713823, 23920048, 16606092, 3660199, 2314204, 9676761, 10798064, 3016673, -1118392, 5373138, 13097682, 10882272, 2094506, -733711, 6621802, 14426054, 10361938, -6992592, -26540889, -35051155, -28726604, -14854555, -3239847, 1740177, 694838, -4582990, -11084283, -13981074, -10975359, -6251934, -6247990, -12319732, -20628540, -27352936, -30313341, -27877024, -20994200, -14022157, -8252120, 2449451, 22324757, 42385559, 47874467, 37277279, 24004609, 17017227, 10534206, -1430644, -10531395, -4724374, 11237770, 17446322, 2658193, -21060723, -31843738, -22984579, -9607197, -9701136, -22832370, -32885946]
40662c2885946K643141Q034774L930606K311177N367041J619767q585243o087640
40654b3652323J4168552K4793488M073691k4646162k2812912M194817J4689149
40647i191700l366914j4610732L896789K4169171J3102202j4177410j9680044
40640a9858638j359207R515896O89193o984512J094825J1009823O495161o016213
40632e413672j0599607m385838L973962P596286M956134j370687m295578J306961
40624h232039Q964722P420720j057593k389131N455086O277148p816248j9431380
40616a0808715r994380J0933824J8336851O957955n263802o743659n231794p669320
40608i483040o159511N562541J5925391J0455518m605377q856432L798664J7001048
$$ y = [-32885946, -30242805, -22208031, -18277425, -15966248, -10599207, -8979440, -17564683, -23652323, -9483771, 15309717, 19383408, -5262754, -28075666, -23880849, -9191700, -12558614, -27169346, -23272557, 896614, 13998816, -178594, -19858638, -21217845, -11701949, -11012756, -17997268, -16902443, -5892620, 602541, -5413672, -16013279, -20399117, -16425155, -8828869, -3872735, -5243422, -9539000, -8232039, 732683, 8153403, 7095810, 4706679, 10161765, 16438913, 8622665, -10808715, -20803095, -9869271, 8467580, 15425535, 10161733, 3418074, -1813720, -9483040, -15642551, -10080010, 5845381, 16300899, 11695522, 2839090, 6637754, 23638802]
40600B3638802J4917459J953163o683201o029753m399225q820984j5764148j6936291
40592a8124178q931115M068782J3549014J2233937N37597j1323319j1481288J265765
40584a8204805J5885806K0941099J4727623K886280q652274j5111291j2867629
40577c95191m121497J939674n22092m936525j434101O651902N794935o408470
40569c431365j4277635n081510J1995343J7616816P225450o609851j3243885j3065893
40561a8872530q222358K029172J2695934J2491512p0442r887310m466488P863020
40553f439490J0452338K914244r24957L235893M658042k135452p393492l372099
40545I95027J838624k048243r985393r584939k89663P332696P796994N096349
$$ y = [23638802, 38556261, 40509424, 33826223, 27796470, 23397245, 14576261, -1187887, -18124178, -27055293, -22986511, -9437497, 2796440, 3334037, -7989282, -19470570, -18204805, -2318999, 18622100, 33349723, 36236003, 27583729, 12472438, -395191, -4516688, -2577014, -3099106, -8035631, -9469732, -2817830, 2977105, -3431365, -17709000, -22790510, -10795167, 6821649, 14047099, 7437248, -5806637, -18872530, -27094888, -25065716, -12369782, 121730, 51288, -9836022, -14302510, -6439490, 4012848, 6927092, 6002135, 9238028, 13896070, 11760618, 4367126, 995027, 2833651, 785408, -9199985, -18784924, -19074587, -11741891, -3944897, 1151452]
40537A151452K982460J355856J462520M735705O536474P85789q350015r065444
40529A594797J556918J2304096J2198109K765749o971200j1056441r279034n256393
40521b143399m191993p361510q407060j601370P035298O267174k563103o025752
40513a8991715O96511O721973M343990J402646O076266J1642762P924379j736161
40505A8080651p067026o406461l602134K643322J2755039J6737837O140522r330206
40497B9951544j3152412o402609l956743q634431q169928R06417O054813O42808
40489b760541m999104k349656J738899K4292j381555L852065Q158227K911569
40481E194196m589396k002203O904558P252624l903377j3488548j1105923n02845
$$ y = [1151452, 4133912, 5489768, 6952288, 11687993, 18224467, 19010256, 10660241, 1594797, 3151715, 15455811, 27653920, 30419669, 23448469, 12392028, 3112994, -2143399, -6335392, -13696902, -22103962, -23705332, -16670034, -10402860, -12965963, -18991715, -18295204, -11573231, -7229241, -5826595, 249671, 11892433, 19816812, 18080651, 11013625, 4607164, 1005030, 3648352, 16403391, 33141228, 39281750, 29951544, 16799132, 10396523, 6439780, -2194651, -10364579, -9458162, -3403349, -2760541, -7759645, -10109301, -8370402, -8346110, -9727665, -5875600, 2282627, 5194196, 604800, -1397403, 5507155, 12759779, 8856402, -4632146, -15738069, -16240914]
40473a6240914Q361236R663225L636249m148798n341130K542365J0735650R136926
40465A8344809O800n823112m713847k932345l802271k524009L225779O659821
40457H441625J352818q559386j3209179q727230N3890O274174O839806K766324
40449d767158l228695q570334j0680828o593719L922390J4100878J4177706L536283
40441A896523n908515m211195L224556M526851l97553j227462M535704P184307
40433I623216J279029n163175l575549K540176M715702J709875k265223m992825
40425C871226n236266p98496N152523K667412j1025167k2281733j6854548p22096
40417d5227145P258697J573795m349515K45572R428737J2499173Q661326L604043
$$ y = [-16240914, -7879678, 1783547, 5419796, 1270998, -4070132, -1527767, 9207883, 18344809, 18351609, 12528497, 7814650, 4882305, 1080034, -1443975, 1781804, 8441625, 9794443, 1235057, -11974122, -20701352, -20647462, -14373288, -7533482, -4767158, -7995853, -16566187, -27247015, -33840734, -29918344, -15817466, -1639760, 1896523, -4011992, -8223187, -4998631, -471780, -869333, -2096795, 2438909, 9623216, 10902245, 5739070, 2163521, 4703697, 9419399, 11129274, 8864051, 3871226, -1365040, -2163536, 2988987, 5656399, -5368768, -27650501, -44505049, -45227145, -37968448, -36394653, -40744168, -40498596, -31069859, -18570686, -9909360, -6305317]
40409f305317L88586K88749M957146J0891276Q937206k946234j2873926r704483
40401f366997J062450N916133L091427J747268L893171R98347r457107j6974138
40393a6089446j2928411k256286N891824J0008362J1521342P111059m282286j3185195
40385a4209037r751511J277025O925970N065134N064967R843714J0885875M502348
40377A9604485k24552L234701P026743K091439o063924o587733j555867j407961
40369A6117331n874928m495571L788581O857952q07518q903170r069359q527338
40361a0914020j4772063j7895668m222004J8040856K4783986Q762111r789660
40354f006462j0933641L38988O552494L952913L109455Q578604J2007384O369302
$$ y = [-6305317, -5916731, -5627982, -670836, 10220440, 19157646, 16211412, 3337486, -6366997, -5304547, 611586, 3703013, 5450281, 9343452, 10341799, 884692, -16089446, -29017857, -31274143, -25382319, -15373957, -3852615, 3258444, -1023842, -14209037, -23960548, -22683523, -15757553, -10692419, -5627452, 4216262, 15102137, 19604485, 19379933, 22614634, 29641377, 31732816, 25668892, 19081159, 17525292, 16117331, 10242403, 5746832, 9535413, 16393365, 15585847, 6682677, -2386682, -10914020, -25686083, -43581751, -47803755, -29762899, -4978913, 3783198, -6006462, -16940103, -16601115, -10048621, -6095708, -2986253, 5592351, 17599735, 23969037]
40346B3969037m004943j1273639j3832603j3619846j0010119k240061N852313
40339b5159861R232514Q022725N871374L550736r34096o441799p980803l018255
40331a6857465N153297J1396377J2867192Q660579k71567q915179j0451211m443740
40323b861717O62353k241636q893826r380704k200029M280673M766851L742343
40315a2125692N901207P027251J160054p561418q981665k347518J085974n786731
40307b1628538j4168124j0493132M009084J3258494P317069l998746m366813O638396
40299b3432310J3587132P993849M20045L144587R717768M687792r829716j3730660
40291g441513J010870J5795112J1646613k625800m452200P768150J3210285J415882
$$ y = [23969037, 19964094, 8690455, -5142148, -18761994, -28772113, -31012174, -25159861, -15927347, -7904622, -2033248, 1517488, 583392, -5858407, -13839210, -16857465, -11704168, -307791, 12559401, 21219980, 20948413, 12033234, 1582023, -2861717, -2199364, -4441000, -13334826, -22715530, -24915559, -20634886, -15868035, -12125692, -6224485, 802766, 1962820, -5598598, -14580263, -16927781, -15841807, -21628538, -35796662, -46289794, -42280710, -29022216, -21705147, -25703893, -30070706, -23432310, -9845178, -1851329, -1431284, 1713303, 11431071, 16118863, 6289147, -7441513, -6430643, 9364469, 21011082, 18385282, 13933082, 21701232, 34911517, 36327399]
40283C6327399j2502657j1505217j8333N984841J250289o938921j1530206j0204309
40275i137114k713503O825336R165060K12550j1059445j2628049m302872M183765
40267a9454272O111133J863184n256554r453314l718320J0210462J8201492J0616836
40259I120647j935850k196426Q282525J1927697J778302j0590378j4877266j3722443
40251a2213192j1117804n009735K721959L782116j669786j627910P938176J3807036
40243c389140O306888m074652l653594K690150J626951n908691q080282k081483
40235a6563853M710020R158921J3128008J3162065M463709o412519p408104N63774
40227A4802021M559622l78746n455289m175204j386752k701654n701417n903220
$$ y = [36327399, 23824742, 12319525, 12301192, 18286033, 19536322, 12597401, 1067195, -9137114, -11850617, -5025281, 4139779, 4352329, -6707116, -19335165, -23638037, -19454272, -13343139, -11479955, -16736509, -26189823, -29908143, -19697681, -1496189, 9120647, 7184797, 4988371, 13270896, 25198593, 26976895, 16386517, 1509251, -12213192, -23330996, -28340731, -25618772, -21836656, -23506442, -25134352, -17196176, -3389140, 2917748, -1156904, -4810498, -2120348, -493397, -6402088, -14482370, -16563853, -11853833, -2694912, 10433096, 23595161, 28058870, 21646351, 14238247, 14802021, 19361643, 18982897, 13527608, 9352404, 7965652, 5263998, -437419, -6340639]
40219f340639l151418R65737N069333O178114K870717k50713J137311K531264
40211I009706k111964p644650m736955K677226K039782n995054p282806J702971
40203a2341744P292564J923106l514863M78492O030795L283026k192270n63749
40195C95357M776496M294759j834828p254760j0834402j2974587q711833L264427
40187b8879371J2280272Q878008n09105m115076k350948j641803P10888R375723
40179f251412J5698888Q113384o183771r273785o98868K378986n591126r935369
40171a1743073j924564O043439J503841p741828p080961K322066P557875L766032
40163g297173k134837m297445m638159o792149r503695p375681K891216J6296619
$$ y = [-6340639, -9492057, -8526320, -3456987, 2721127, 5591844, 5341131, 6478442, 9009706, 6897742, -746908, -5483863, -2806637, -766855, -6761909, -14044715, -12341744, -5049180, -3126074, -6640937, -6162445, -131650, 3151376, 959106, 395357, 5171853, 9466612, 7631784, 377024, -10457378, -23431965, -32143798, -28879371, -16599099, -7721091, -8230196, -12345272, -14696220, -16338023, -15627135, -6251412, 9447476, 17560860, 11377089, 2103304, 1404436, 3783422, -1807704, -11743073, -13667637, -7624198, -6120357, -13862185, -20943146, -18621080, -11063205, -7297173, -9432010, -13729455, -18367614, -25159763, -34663458, -42039139, -39147923, -22851304]
40155b2851304K1546345J3368149K42472o509081p674795j0332158j1015248k63059
40147b3488679J5776439J7218778L66906j2938746p261647L044666r39697j0187152
40139a8409132l898541J2191826J2411600n225340j1990659O212582K3548395
40132A4840731J2068474j5505311k4635103q944824N146866J213273o152458l4342
40124b2002694J1384250J0711509Q207m121249K956193R335521O864714R70795
40116A6107246j614491k194275l260677k938956j224646k678716p383627p556429
40108a2744571K33723O841695K421219q850541j3941304p385259M418108J2478892
40100a6528038J2615850O149419j281183l676526j102499J185490J958179N246338
$$ y = [-22851304, -1304959, 12063190, 12305662, 5796581, -1878214, -12210372, -23225620, -23488679, -7712240, 9506538, 9873444, -3065302, -10326949, -7282283, -8221980, -18409132, -22307673, -10115847, 2295753, -2929587, -14920246, -8707664, 14840731, 26909205, 11403894, -13231209, -22176033, -17029167, -15815894, -21968352, -22002694, -10618444, 93065, 101272, -4019977, -1063784, 8271737, 15136451, 16107246, 14492755, 12298480, 9037803, 6098847, 4874201, 2195485, -5188142, -12744571, -12510848, -5669153, -3247934, -12098475, -26039779, -33425038, -29006930, -16528038, -3912188, 2237231, 956048, -2720478, -3822977, -2637487, -679308, 4567030]
40092D567030R210909M504461q921091j5062701l829306J0595123Q769734m792507
40084E041652r734088j952488L052075k063439o572286k989062J211631m61838
40076a4467843k743254q54581J575331L301983Q828885J4474076Q064784q685104
40068I494277j5176758j380379J4357852J1874210j318198m624386L630648Q308431
40060B5165697L567990k426135m456159m609073k596294K838783N591439k03517
40052B2872731p352180m990954K599771K303612n467507p860429k018901J571062
40044A657205n68831M44651O790816P272692l136551j2624148j0392149k113467
40036a2669782K130442L916573R431837J5207617J2939747L752421k821628k051881
$$ y = [4567030, 13777939, 18282400, 9361309, -5701392, -9530698, 1064425, 9834159, 5041652, -4692436, -6644924, -3592849, -5656288, -12228574, -15217636, -14006005, -14467843, -17211097, -18065678, -16490347, -13188364, -4359479, 10114597, 18179381, 9494277, -5682481, -7062860, 7294992, 19169202, 17851004, 13226618, 16857266, 25165697, 28733687, 26307552, 21851393, 17242320, 14646026, 17484809, 23076248, 22872731, 15520551, 10529597, 13129368, 15432980, 9965473, 2105044, 86143, 1657205, 1088374, 1533025, 8323841, 15596533, 12459982, -164166, -10556315, -12669782, -10539340, -6622767, 2809070, 18016687, 30956434, 34708855, 31887227, 29835346]
$$ [...]
##END NTUPLES=NMR SPECTRUM
##END=
