##TITLE=31Pdec_LR-701-RM1
 CDCl3, 88 sc
 18.11.2019
##JCAMPDX= 6.0         $$ Bruker NMR JCAMP-DX V2.0
##DATA TYPE= NMR SPECTRUM
##DATA CLASS= NTUPLES
##ORIGIN= UXNMR, Bruker Analytische Messtechnik GmbH
##OWNER= root
$$ XWIN-NMR		Version 3.5
$$ Mon Nov 18 15:50:21 2019 Russian Standard Time (UT+4h)  she@DPX200
##.OBSERVE FREQUENCY= 81.013821
##.OBSERVE NUCLEUS= ^31P
##.ACQUISITION MODE= SIMULTANEOUS
##.ACQUISITION SCHEME= undefined
##.AVERAGES= 88
##.DIGITISER RES= 17
##SPECTROMETER/DATA SYSTEM= spect
##.PULSE SEQUENCE= zgpg30
##.SOLVENT NAME= CDCl3
##.SHIFT REFERENCE= (INTERNAL, CDCl3, 0, 182.463)
##AUDIT TRAIL= $$ (NUMBER, WHEN, WHO, WHERE, WHAT)
$$ ##TITLE= Audit trail, XWIN-NMR		Version 3.5
$$ ##JCAMPDX= 5.01
$$ ##ORIGIN= Bruker BioSpin GmbH
$$ ##OWNER= she
$$ F:/spectra/data/she/nmr/P31/1/pdata/1/auditp.txt
$$ ##AUDIT TRAIL=  $$ (NUMBER, WHEN, WHO, WHERE, WHAT)
(   1,<2019-11-18 15:48:15.28 +0400>,<she>,<DPX200>,
      <continue with go, POWCHK disabled, PULCHK disabled
       configuration hash MD5:
       00 E9 B6 7A A2 85 ED C7 34 08 36 98 17 FE 4E 26
       data hash MD5: 32K
       70 7D A5 6C 98 DF DF CE 2E 08 10 5C 60 03 7F EF>)
(   2,<2019-11-18 15:49:31.60 +0400>,<she>,<DPX200>,
      <Start of raw data processing
       efp BC_mod = 2 LB = 1 FT_mod = 6 PKNL = 1 PHC0 = -1422.221 PHC1 = 474.001 SI = 64K 
       data hash MD5: 64K
       EB 89 1C 71 BD 31 A8 EE 2A 1A 97 29 04 D1 BE 61>)
(   3,<2019-11-18 15:49:50.39 +0400>,<she>,<DPX200>,
      <pk PHC0 = 3.046606 PHC1 = 0 
       data hash MD5: 64K
       6E BA 93 42 96 ED 4D D2 DA E5 D4 38 43 56 F9 8E>)
$$ ##END=
$$ 
$$ hash MD5
$$ 5B 29 D2 63 09 54 9D 71 39 D1 60 04 5D BA 48 A5
##$RELAX= 
##$RELAX= 
##$RELAX= 
##$RELAX= 
##$RELAX= 
##$RELAX= 
##$RELAX= 
##$RELAX= 
$$ Bruker specific parameters
$$ --------------------------
##$DU= <F:/spectra>
##$EXPNO= 1
##$NAME= <P31>
##$PROCNO= 1
##$TYPE= <nmr>
##$USER= <she>
##$AMP= (0..31)
100 100 100 100 100 100 100 100 100 100 100 100 100 100 100 100 100 100 
100 100 100 100 100 100 100 100 100 100 100 100 100 100 
##$AQSEQ= 0
##$AQ_mod= 1
##$AUNM= <au_zg>
##$AUTOPOS= <>
##$BF1= 81.014009
##$BF2= 200.13
##$BF3= 200.13
##$BF4= 200.13
##$BF5= 200.13
##$BF6= 200.13
##$BF7= 200.13
##$BF8= 200.13
##$BYTORDA= 1
##$CFDGTYP= 0
##$CFRGTYP= 5
##$CHEMSTR= <none>
##$CNST= (0..31)
1 1 145 1 1 1 1 1 1 1 1 1 1 1 1 1 1 1 1 1 1 1 1 1 1 1 1 1 1 1 1 1 
##$CPDPRG= <waltz16>
##$CPDPRG1= <>
##$CPDPRG2= <waltz16>
##$CPDPRG3= <>
##$CPDPRG4= <mlev>
##$CPDPRG5= <mlev>
##$CPDPRG6= <mlev>
##$CPDPRG7= <mlev>
##$CPDPRG8= <mlev>
##$CPDPRGB= <>
##$CPDPRGT= <>
##$D= (0..31)
0 1 0 0 0 0 0 0 0 0 0 0.03 2e-05 3e-06 0 0 0 0 0 0 0 0 0 0 0 0 0 0 0 0 
0 0 
##$DATE= 1574077570
##$DBL= (0..7)
120 120 120 11 120 120 24 19 
##$DBP= (0..7)
150 150 150 150 150 150 150 150 
##$DBP07= 0
##$DBPNAM0= <>
##$DBPNAM1= <>
##$DBPNAM2= <>
##$DBPNAM3= <>
##$DBPNAM4= <>
##$DBPNAM5= <>
##$DBPNAM6= <>
##$DBPNAM7= <>
##$DBPOAL= (0..7)
0.5 0.5 0.5 0.5 0.5 0.5 0.5 0.5 
##$DBPOFFS= (0..7)
$$ [...]
##$SUBNAM2= <"">
##$SUBNAM3= <"">
##$SUBNAM4= <"">
##$SUBNAM5= <"">
##$SUBNAM6= <"">
##$SUBNAM7= <"">
##$SUBNAM8= <"">
##$SUBNAM9= <"">
##$SW= 369.568048894756
##$SWIBOX= (0..15)
0 1 3 0 0 0 0 0 0 0 0 0 0 0 0 0 
##$SW_h= 29940.119760479
##$TD= 32768
##$TD0= 1
##$TE= 0
##$TE2= 300
##$TE3= 300
##$TEG= 300
##$TL= (0..7)
0 120 53 12 22 120 120 120 
##$TP= (0..7)
150 150 150 150 150 150 150 150 
##$TP07= 0
##$TPNAME0= <>
##$TPNAME1= <>
##$TPNAME2= <>
##$TPNAME3= <>
##$TPNAME4= <>
##$TPNAME5= <>
##$TPNAME6= <>
##$TPNAME7= <>
##$TPOAL= (0..7)
0.5 0.5 0.5 0.5 0.5 0.5 0.5 0.5 
##$TPOFFS= (0..7)
0 0 0 0 0 0 0 0 
##$TUNHIN= 0
##$TUNHOUT= 0
##$TUNXOUT= 0
##$USERA1= <user>
##$USERA2= <user>
##$USERA3= <user>
##$USERA4= <user>
##$USERA5= <user>
##$V9= 5
##$VALIST= <valist>
##$VCLIST= <CCCCCCCCCCCCCCC>
##$VD= 0
##$VDLIST= <DDDDDDDDDDDDDDD>
##$VPLIST= <PPPPPPPPPPPPPPP>
##$VTLIST= <TTTTTTTTTTTTTTT>
##$WBST= 1024
##$WBSW= 4
##$XGAIN= (0..3)
0 0 0 0 
##$XL= 0
##$YL= 0
##$YMAX_a= 25943
##$YMIN_a= -10800
##$ZGOPTNS= <>
##$ZL1= 120
##$ZL2= 120
##$ZL3= 120
##$ZL4= 120
##$ABSF1= 0
##$ABSF2= 0
##$ABSG= 0
##$ABSL= 0
##$ALPHA= 0
##$AQORDER= 0
##$ASSFAC= 0
##$ASSFACI= 0
##$ASSFACX= 0
##$ASSWID= 0
##$AUNMP= <proc_1d>
##$AZFE= 0.1
##$AZFW= 0.5
##$BCFW= 0
##$BC_mod= 2
##$BYTORDP= 0
##$COROFFS= 0
##$CY= -3
##$DATMOD= 1
##$DC= 0
##$DFILT= <>
##$DTYPP= 0
##$F1P= 0
##$F2P= 0
##$FCOR= 1
##$FTSIZE= 65536
##$FT_mod= 6
##$GAMMA= 0
##$GB= 0
##$INTBC= 1
##$INTSCL= 5.30512e-09
##$ISEN= 30
##$LB= 1
##$LEV0= 0
##$LPBIN= 0
##$MAXI= 10000
##$MC2= 0
##$MEAN= 0
##$ME_mod= 0
##$MI= 50
##$NCOEF= 0
##$NC_proc= -9
##$NLEV= 6
##$NOISF1= 182.463
##$NOISF2= 159.3651
##$NSP= 0
##$NTH_PI= 0
##$NZP= 0
##$OFFSET= 182.463
##$PC= 4
##$PHC0= -1419.174
##$PHC1= 474.001
##$PH_mod= 1
##$PKNL= yes
##$PPARMOD= 0
##$PSCAL= 0
##$PSIGN= 0
##$REVERSE= no
##$SF= 81.0140089999434
##$SI= 65536
##$SIGF1= 159.3651
##$SIGF2= -187.1042
##$SINO= 113.3802
##$SIOLD= 16384
##$SREGLST= <1H.CDCl3>
##$SSB= 0
##$STSI= 65536
##$STSR= 0
##$SW_p= 29940.119760479
##$SYMM= 0
##$S_DEV= 0
##$TDeff= 32768
##$TDoff= 0
##$TI= <>
##$TILT= no
##$TM1= 0
##$TM2= 0
##$TOPLEV= 0
##$USERP1= <user>
##$USERP2= <user>
##$USERP3= <user>
##$USERP4= <user>
##$USERP5= <user>
##$WDW= 1
##$XDIM= 65536
##$YMAX_p= 509746621
##$YMIN_p= -241453764
$$ End of Bruker specific parameters
$$ ---------------------------------
##NTUPLES= NMR SPECTRUM
##VAR_NAME=  FREQUENCY,     SPECTRUM/REAL,   SPECTRUM/IMAG
##SYMBOL=    X,             R,               I
##VAR_TYPE=  INDEPENDENT,   DEPENDENT,       DEPENDENT
##VAR_FORM=  AFFN,          ASDF,            ASDF
##VAR_DIM=   65536,         65536,           65536
##UNITS=     HZ,            ARBITRARY UNITS, ARBITRARY UNITS
##FACTOR=    0.456856943014862, 1,           1
##FIRST=     14782.0589164792, 0,            0
##LAST=      -15158.0608439998, 0,           0
##MIN=       -15158.0608439998, -241453764,  0
##MAX=       14782.0589164792, 509746621,    0
$$ Real data points
##PAGE= N=1
##DATA TABLE= (X++(R..R)), XYDATA
$$ [...]
47848a5422973R899779J1926230R730256p265762l0443219l2494061n137869K5288976
47840c3918643L3502412K4859958J3609636l293964k6566543l2990208p349896
47833c2147248K1615942J6786862p427500o150186J9596267K0568084j8000360
47826A4841861m6920473l0471194j469523j178563r531463J2901498M6218801
47819a5609056L7114196j0470180l4523069q396723K3467817J9701481K70392
47812A1554858K632432K0739203K4018905J0159409J204659J767013l504397j5692367
47804E2879715j5907415K482998J9264494J3723724q478859k3545788j7821020
47797B2597849j194608O362325j757247j1943078q936358L656400R590885L685289
$$ plain form
47848 -15422973 -5523194 6403036 16133292 8867530 -21575689 -54069750 -59207619 -33918643
47840 -33918643 -416231 24443727 38053363 34759399 8192856 -24797352 -32147248
47833 -32147248 -10531306 6255556 -1171944 -7322130 12274137 32842221 14841861
47826 14841861 -32078612 -62549806 -64019329 -65197892 -74729355 -61827857 -15609056
47819 -15609056 21505140 11034960 -23488109 -31884832 -8417015 11284466 11554858
47812 11554858 14187290 34926493 58945398 69104807 70309466 72076479 68572082 52879715
47804 52879715 36972300 39455298 58719792 72443516 63964657 40418869 22597849
47797 22597849 21403241 27765566 26008319 14065241 5128883 8785283 18376168 22061457
47789B2061457l151853l146293j556820k948702j785528N678050J2391610J1849831
47781C9391752P494854K882678n824502j8678682k5274266j9179965p230371M965588
47773b1452914K1614181L8104827L2080991n121775m1623282l7206429K068083
47766a1536318K8300664J3051879j9593080k8517675n157038K2939833K6477308
47759B5965573L388152k1097463k0383438L745280K1574136J2983304m909582
47752B1265962k934302J6255103K2906158N959157j3108461j6808363j4395338
47745A9139916j6551552j3534220K177500J2596453r80503k2505848j8162805
47738c7821059J4036658L6930417K2062633j4365282l4053659k3011825k052120
$$ plain form
47789 22061457 18909604 15763311 14206491 11257789 9472261 15150311 27541921 39391752
47781 39391752 46886606 49769284 43944782 25266100 -8166 -19188131 -26418502 -21452914
47773 -21452914 161267 38266094 70347085 65225310 23602028 -13604401 -11536318
47766 -11536318 16764346 29816225 10223145 -18294530 -23451568 -511735 25965573
47759 25965573 29353725 8256262 -12127176 -8381896 13192240 26175544 21265962
47752 21265962 18331660 34586763 57492921 63452078 50343617 33535254 19139916
47745 19139916 2588364 -10945856 -8768356 3828097 2847594 -19658254 -37821059
47738 -37821059 -23784401 13146016 35208649 20843367 -13210292 -36222117 -38274237
47731c8274237M909967r76560k547391N742083J2545076J0923525Q724171J0458932
47723A1505566N312081j1550651k0529785l878747J9606002J6425317p986053
47716H903730j2683626J5054808L6336410J8650490j6239751k8489053j6359401
47709E173607m344786K641452J5521929K5151471J0854732j7963393k6585373
47702A0449639o213356J2361155N393603j2136944j4591645k408717N065388j381398
47694c462275j2672301j4430956j266429J5883467J7586036P87190j0095220O049676
47686a620812L1125133K7390278p597122l4164422k5627229k113557M538555m800511
47678a2869687o883996N599688J6121736P463650j9504067m4721759m3034820
$$ plain form
47731 -38274237 -33364270 -34340830 -36888221 -31146138 -18601062 -7677537 1046634 11505566
47723 11505566 16817647 5266996 -15262789 -19141536 464466 16889783 8903730
47716 8903730 -3779896 11274912 47611322 66261812 50022061 21533008 5173607
47709 5173607 828821 3470273 18992202 44143673 54998405 37035012 10449639
47702 10449639 4236283 16597438 21991041 9854097 -4737548 -7146265 -2080877 -3462275
47694 -3462275 -16134576 -30565532 -31831961 -15948494 1637542 2424732 -7670488 -1620812
47686 -1620812 29504321 56894599 49297477 15133055 -10494174 -12607731 -8069176 -12869687
47678 -12869687 -19753683 -14153995 1967741 9431391 -10072676 -54794435 -97829255
47671i7829255j0596806K2128961K1390752m491051j4121056Q630425L4241159
47664d0646871L5185253K1439438J1024807j554480k1282982k7242509m710603
47657b7787947K0878005J8023393j575770n068019O608144O725023o037697q340802
47649C424330J162428K41901j1703308j0794458M255138O207173r544718j1440065
47641b8191579J4020915L5182067K4799942R36144p714614o208726j3756166k4830055
47633e762072k0641476k045026J5867991K7473029L2094494K1794047l215778
47626F5565209k2332184k0369609j0127191p693663m771248Q424854J4098166
47619B2794334n204133k7045961j7586788J1406774J7814947k796875j1720769
$$ plain form
47671 -97829255 -108426061 -86297100 -64906348 -69397399 -83518455 -74888030 -40646871
47664 -40646871 -5461618 15977820 27002627 25448147 4165165 -23077344 -27787947
47657 -27787947 -6909942 11113451 9537681 4469662 11077806 17802829 11765132 3424330
47649 3424330 4586758 4828659 -6874649 -17669107 -13413969 -7206796 -16751514 -28191579
47641 -28191579 -14170664 21011403 45811345 46747489 39032875 32824149 19067983 -5762072
47633 -5762072 -26403548 -28448574 -12580583 14892446 46986940 68780987 65565209
47626 65565209 43233025 22863416 12736225 5042562 271314 8696168 22794334
47619 22794334 17590201 -9455760 -27042548 -15635774 2179173 -617702 -12338471
47612a2338471N098286J2784860j0771885l3464887j9595303J1967824J7677880
47605b8641696l951721j5001351J401091K0879945K0329369Q490572L003743J287391
47597G797343q429759k1440049k1231997n621377Q350065Q365436L115073P304035
47589b1791230J8767035K1389776P950095j1178129k2980236k4808437j9498730
47582e2149856q337741N463853J5601347K0617995K3655668K0538094K920372
47575B8309732j9597668k0407873N982589K7100068J6312476o106656o938314
47568B4654354K212564j5081315m8764132m4213454J2231133O0765927M9326465
47561D1131542M976006j3593951j109837L279253j1782488j8699159o017782M235957
$$ plain form
47612 -12338471 -7240185 5544675 -5227210 -38692097 -58287400 -46319576 -28641696
47605 -28641696 -32593417 -47594768 -46193677 -25313732 -4984363 3506209 6509952 7797343
47597 7797343 -632416 -22072465 -43304462 -48925839 -40575774 -32210338 -29095265 -21791230
47589 -21791230 -3024195 18365581 26315676 15137547 -7842689 -32651126 -52149856
47582 -52149856 -60487597 -55023744 -39422397 -18804402 4851266 25389360 28309732
47575 28309732 8712064 -11695809 -5713220 21386848 37699324 31592668 24654354
47568 24654354 26866918 11785603 -36978529 -81191983 -68960850 -8194923 41131542
47561 41131542 46107548 32513597 31403760 34683013 22900525 4201366 -1816416 2419541
47553B419541J06260j261062R951024J6513357O591078m392049k049454K946611
47545C0825306j876637o845996l68263P189797K486850n107664p32725P657074
47537C3227742L866988n456486k269726Q157394L717721j5949158k6943967j9008633
47529b0658125p251059j049013R390478K5341242K7201071O342876j4996373j5198980
47521I122117l988154p19793j515708O529103J4238000L328587j8231809k3694805
47513a4932462p468896R581623J4020638J2787628J1231017M361294o283158j1483854
47505A1813830j3578407k1980616k7170513r121232K2378847L0180563N578937
47498a898591j3693411j468781J5961258N643332j7141857j6933598L134412J2152210
$$ plain form
47553 2419541 2525801 1264739 11215763 27729120 34320198 29928149 27878695 30825306
47545 30825306 28948669 22102673 21734410 28924207 31411057 26303393 25570668 33227742
47537 33227742 37094730 31638244 29368518 37525912 41243633 25294475 -1649492 -20658125
47529 -20658125 -27909184 -28958197 -19567719 5773523 32974594 39317470 24321097 9122117
47521 9122117 5133963 4414170 2898462 9427565 23665565 26994152 8762343 -14932462
47513 -14932462 -22401358 -12819735 1200903 13988531 25219548 29580842 23297684 11813830
47505 11813830 -1764577 -23745193 -50915706 -60036938 -37658091 -7477528 -1898591
47498 -1898591 -15592002 -17060783 -1099525 4543807 -12598050 -29531648 -26397236 -14245026
47490a4245026M943002K255593P259131M289008l703916J544020J3780269P632673
47482B3754754j3843235j9702723m801596J818253p542428l529679K1333336K7072426
47474B4559108q819247m3747097k8481545J8877391M1876804K5569529K099808
47467C1934751p557526j0959851j0932476o4702J1414970L228929j5326978j1981628
47459a0244511J4422560K4673924j063991k9366106k2515704O167723J5178098
47452b748007l391493j6026460J344586L0924906L9268125J9840060l424173j0012645
47444E5774899o718985j1350571k1775211j7556442N792447K3014647J2509800
47437C9690584j0786705j5433002J492558J2045177l88540j8903150k0195342
$$ plain form
47490 -14245026 -9302024 -7046431 212700 4501708 797792 2341812 16122081 23754754
47482 23754754 9911519 -9791204 -14592800 -12774547 -20316975 -23846654 -2513318 24559108
47474 24559108 15739861 -28007236 -56488781 -37611390 4265414 29834943 31934751
47467 31934751 24377225 13417374 2484898 2420196 13835166 17064095 1737117 -10244511
47459 -10244511 4178049 28851973 27787982 -1578124 -24093828 -17926105 -2748007
47452 -2748007 -6139500 -22165960 -20821374 10103532 49371657 69211717 65787544 55774899
47444 55774899 49055914 37705343 15930132 -1626310 4166137 27180784 39690584
47437 39690584 28903879 13470877 14963435 27008612 26620072 7716922 -12478420
47430a2478420o236249L230400l12403n862237j919498O337344N231375m360701
47422a6370389l433337J6225317K9997203R542665k8434027l3766313O369688
47415a9869193M1916724K8409405j0570880k3884127r034867k533810j1544510
47408g111258q480090J0253543J4541572l116542j3007416m396350o390584l0330014
47400d8037139l9078213o082191L5101584L8549628J2322730k379073N452073
47393d150601J3943157J2075291Q061825M588796j501295l452308L783796P273906
47385D0622567k621962r897093k54398P256868r586989l1525312k4329967K489825
47377b7846461R043236r067722j6388231k2371J2493006O003615R06558Q764109
$$ plain form
47430 -12478420 -18714669 -15484269 -15796672 -21658909 -23578407 -17241063 -12009688 -16370389
47422 -16370389 -19803726 -3578409 26418794 35961459 7527432 -26238881 -19869193
47415 -19869193 22047531 50456936 39886056 16001929 6967062 4433252 -7111258
47408 -7111258 -15591348 -5337805 9203767 6087225 -6920191 -11316541 -17707125 -48037139
47400 -48037139 -87115352 -93197543 -58095959 -19546331 -7223601 -9602674 -4150601
47393 -4150601 9792556 21867847 29929672 34518468 33017173 29564865 33348661 40622567
47385 40622567 38000605 28103512 27849114 35105982 25518993 -6006319 -30336286 -27846461
47377 -27846461 -18803225 -27870947 -44259178 -44281549 -31788543 -25784928 -24878370 -16114261
47369a6114261R841965m668328j0323167N150139J3642760m742115k0709587j872088
47361b9794682K8968948K5884037q650899l0433904k2388625j0157596q626984
47354e5199705O21813K5182316L5826060J0094232k6092253l0907316n132485
47347d5607338J3005935N990812k148235R603481K2912821R995636j7762523k1261058
47339b5270469Q560752L4676656K5834282j743530j3527982o192526j188634l390036
47331A7758513Q19718R065027J753993j9758282k7056353r249261O243829l646392
47323b4069208j9572093r128083K3322615M3093814L2432947P109439j0387420
47316D2802011j3226382o039137M174879R874527P087443M9227m643308o907771
$$ plain form
47369 -16114261 -6272296 -10940624 -21263791 -16113652 -2470892 -7213007 -27922594 -29794682
47361 -29794682 -825734 25058303 16407404 -14026500 -36415125 -46572721 -55199705
47354 -55199705 -54577892 -29395576 6430484 16524716 -9567537 -40474853 -45607338
47347 -45607338 -32601403 -26610591 -28758826 -19155345 3757476 13753112 -4009411 -25270469
47339 -25270469 -16709717 17966939 43801221 42057691 28529709 22337183 21148549 17758513
47331 17758513 18578231 27643258 29397251 9638969 -17417384 -26666645 -20422816 -24069208
47323 -24069208 -43641301 -52769384 -29446769 13647045 46079992 53189431 42802011
47316 42802011 29575629 23536492 27711371 37585898 44673341 44722568 40079260 33171489
47308C3171489j0420885j4433675j4125826o100689Q923414K3022800K1158237
47301D1194865l028340k9857745k9980251m757981J0238760n451977k5629294
47294d7271963j4859715J9992906M0038047K5363895p643427l2641410l5597195
47287e2618862j7116187P343385J5533382M359824j566380J4511023L2003787
47280B449972K3581524n23409j0946025q450036j5477533k7208571j7257549Q167747
47272d5663880J1907940r396383j3854946J3468854K8616065N0009l5112215k8398675
47264g8383231M536977J5461732K696049L464187K2665677K6520851N845657p452482
47256d644583L508446J3733742J859364j5150298j2961421L502763J4424364J3621554
$$ plain form
47308 33171489 22750604 8316929 -5808897 -11909586 -2986172 20036628 41194865
47301 41194865 38166525 8308780 -21671471 -26429452 -16190692 -21642669 -47271963
47294 -47271963 -62131678 -42138772 -2100725 23263170 15619743 -17021667 -52618862
47287 -52618862 -69735049 -62391664 -46858282 -42498458 -44064838 -29553815 2449972
47280 2449972 26031496 25508087 14562062 6112026 -9365507 -36574078 -53831627 -45663880
47272 -45663880 -33755940 -43152323 -57007269 -43538415 -14922350 -14872341 -49984556 -78383231
47264 -78383231 -73846254 -58384522 -55688473 -52224286 -29558609 -3037758 2807899 -4644583
47256 -4644583 -1136137 12597605 14456969 -693329 -13654750 -10151987 4272377 17893931
47248A7893931N430876p108915j5358326n395873J8911525L0738849J4260799
47241E9372866j2376861k3671408j9745546j5281684j1824712k311903R235820
47234a6603428J4480481J7699592K4657012K3994893L997082j8916348j6226520
47227C3082764Q916056K1899186N668429j6776137j9031924o714104j018047n747753
47219B0278470r205872o528001k144412K155457N864442K803659r648687j9769840
47211a6194784j4729689k45753P926986Q011891J0687810J5886990J1073264m485009
47203A7931706j3482980o374561L676137J941698o768784j0517299j0344032j2993059
47195c6931174j4468441p956370j08200r15311l134784P316983K2842254J9688344
$$ plain form
47248 17893931 23324807 16215892 857566 -4538307 14373218 45112067 59372866
47241 59372866 46996005 23324597 3579051 -11702633 -23527345 -25839248 -16603428
47234 -16603428 -2122947 15576645 40233657 64228550 68225632 49309284 33082764
47227 33082764 41998820 63898006 69566435 52790298 33758374 27044270 26026223 20278470
47219 20278470 11072598 4544597 2400185 4555642 10420084 13223743 3575056 -16194784
47211 -16194784 -30924473 -31170226 -23243240 -15231349 -4543539 11343451 22416715 17931706
47203 17931706 4448726 -1925835 1750302 3692000 -3076784 -13594083 -23938115 -36931174
47195 -36931174 -51399615 -59355985 -59464185 -60379496 -63514280 -56197297 -33355043 -13666699
47187a3666699m171174k0237818q836919J3543162K1149714J5214255J3474776
47180A6469297J7054615J2535689J141633n16217Q715787P438155j4745098l6356441
47172A1737420l1604354n492330J4880974J5785460P117107J692761J313041L806970
47164A9237049Q529496J1016950M968405n705691q881440l704853m520181j6604553
47156D335182k2799416r299314Q277418O302546p486930l716668J9327283K7234410
47148B2174511J605663k8514433k8321643o459994N284099L177014P834771J9400168
47140c819844J5934690k319937o680275J0793121J8621794l818409k9443504k3926450
47132b4658814K174011J3280154K963380n402529j423325K640396O98173j57510
$$ plain form
47187 -13666699 -17837873 -38075691 -46912610 -33369448 -12219734 2994521 16469297
47180 16469297 33523912 46059601 47201234 46685017 55400804 62838959 48093861 11737420
47172 11737420 -19866934 -25359264 -10478290 5307170 12424277 14117038 15430079 19237049
47164 19237049 27766545 38783495 43751900 38046209 29164769 25459916 20939735 4335182
47156 4335182 -18464234 -27763548 -19486130 -13183584 -20670514 -24387182 -5059899 22174511
47148 22174511 23780174 -4734259 -33055902 -39515896 -34231797 -31054783 -23220012 -3819844
47140 -3819844 12114846 9794909 3114634 13907755 32529549 28711140 -732364 -24658814
47132 -24658814 -22484803 -9204649 -6241269 -11643798 -13067123 -10426727 -9728554 -9886064
47124i886064p95900q695271j4698614j273492K2424403K4866990m53926k2293271
47116a0805145j8059847l531922p26302m463353q80576O348449J0801597K0317198
47108i99901L4155969K7243817j1452173m5775452l5592748J099423J1539178
47101a9781887j2884375k6789484l983074K4918146K4332841M526511m022181
47094a3683503J807097L933698j831269l971431R24815M074029J8486p143166
47086a5871244q590504L794291K6182213L4537199P834322l3451628l8838845
47079b4404196N850463N0551809M3474162k952516l8874454m6962243m5929500
47072e9246475l9807748j2271060K8368862M4745649K3318177m962976j1175535
$$ plain form
47124 -9886064 -10681964 -19377235 -34075849 -35349341 -12924938 11942052 11488126 -10805145
47116 -10805145 -28864992 -32396914 -33123216 -37586569 -38467145 -32118696 -21317099 -999901
47108 -999901 33156068 60399885 48947712 3172260 -32420488 -31321065 -19781887
47101 -19781887 -32666262 -59455746 -63438820 -38520674 -14187833 -9661322 -13683503
47094 -13683503 -11876406 -7942708 -9773977 -13745408 -12820593 -8746564 -8728078 -15871244
47086 -15871244 -24461748 -20667457 5514756 40051955 47886277 14434649 -24404196
47079 -24404196 -18553733 31998076 75472238 72519722 33645268 -13316975 -59246475
47072 -59246475 -99054223 -111325283 -82956421 -38210772 -14892595 -19855571 -31031106
47065c1031106l316626Q77111M710863J5445208K2482612J5427121L743341k258991
47057B6079533j0803996k8002855l6720737k0202789Q041283K2138952J9617755
47050a9852854J6028869J5199976R681664K366850K346041M116084n261989k0834654
47042C789987k3399356p644528J1760811K0595566J5943022J384997j3011367
47035I419132j3351552q37315L104291j0729998j8131972Q39341K1163629P360042
47027a164402k4570408k6147768O926143K8591790J8423477R110344K0478761
47020C1647937K0601689j5141319n2312483m5994284p220501K0838418K5967428
47013b1613115K4506378J9105059K985074j0393932n227269J955384j2347617
$$ plain form
47065 -31031106 -34347732 -33470621 -28759758 -13314550 9168062 24595183 28338524 26079533
47057 26079533 15275537 -12727318 -49448055 -69650844 -61609561 -39470609 -19852854
47050 -19852854 -3823985 11375991 21057655 23424505 25770546 29886630 24624641 3789987
47042 3789987 -19609369 -27253897 -15493086 5102480 21045502 22430499 9419132
47035 9419132 -3932420 -4769735 -1665444 -12395442 -30527414 -29688073 -8524444 -1164402
47027 -1164402 -25734810 -51882578 -44956435 -16364645 2058832 11169176 31647937
47020 31647937 52249626 37108307 -15204176 -61198460 -68418961 -47580543 -21613115
47013 -21613115 2893263 21998322 24983396 14589464 9362195 11317579 -1030038
47006a030038l0843934j8655718J4361348K4296369M536711n468159J0337039
46999b466382J8515760l035571k5769294j8834223J922710M882589o646114p611150
46991c9041675N088879J3546657J1334630Q033247Q023618O139177P20092m304274
46983I540351p233757r130215j1143506j5113306j8554536j0155954J4363982
46976d7426941L4548906K6954829M099898L84455J5191782J0027746k3447625
46969B0333050l8035457l384574L8058666L0671420j0551025k6405426k978415
46962G708239J9142650J5549722M379981J336615k417496r808743q347890o22534
46954B6920544n128023j7691304j1971358J0925277J5996915o175124j7085506
$$ plain form
47006 -1030038 -31873972 -50529690 -36168342 -11871973 -7335262 -12803421 -2466382
46999 -2466382 16049378 13013807 -12755487 -31589710 -29667000 -24784411 -31430525 -39041675
46991 -39041675 -33952796 -20406139 -9071509 -1038262 6985356 13124533 13844625 9540351
46983 9540351 2306594 -6823621 -17967127 -33080433 -51634969 -61790923 -47426941
46976 -47426941 -12878035 14076794 18176692 18561147 33752929 43780675 20333050
46969 20333050 -17702407 -21086981 16971685 47643105 37092080 10686654 7708239
46962 7708239 26850889 42400611 46780592 48117207 45699711 35890968 27543078 26920544
46954 26920544 21792521 4101217 -7870141 3055136 19052051 12876927 -4208579
46947d208579P823404L5368879K5437108p881939k3463585j5670862r675436j2230933
46939d501943q329014J720933M07851j2735007j7308194n018248R742778J4890603
46931b1130241J3614780J0215494L498353l332569m111525k373369o599667j3868921
46923b4087665j4552507j0383304r501783p049221P459999K4703213K1923273
46916a1487995j792502k0019124j5553708j239401M081091O57952j175594K245701
46908d4283580J0286415K1317316K4759100P223278k2655837l3726235j1137453
46901d8216996K0490095K9195204J6219803N100042L012803k686034j4990677
46894H124240j9599906r776267J427671J356102m117800j608909R521045J6660274
$$ plain form
46947 -4208579 3614825 38983704 64420812 56538873 33075288 17404426 7728990 -4501943
46939 -4501943 -12830957 -11110024 -10702173 -23437180 -40745374 -45763622 -36020844 -21130241
46931 -21130241 -7515461 2700033 6198386 2865817 -1245708 -3619077 -10218744 -24087665
46923 -24087665 -38640172 -49023476 -58525259 -65574480 -58114481 -33411268 -11487995
46916 -11487995 -13280497 -33299621 -48853329 -50092730 -46011639 -45353687 -46529281 -44283580
46908 -44283580 -33997165 -12679849 12079251 19302529 -3353308 -37079543 -48216996
46901 -48216996 -27726901 1468303 17688106 22788148 25800951 23114917 8124240
46894 8124240 -11475666 -21251933 -19824262 -18468160 -22585960 -24194869 -14673824 1986450
46886A986450J0214239n324350j6134250j3054270o52276Q652631R197262O757549
46878A642985P688688J0011181R275398O314666K628787n521820j9354190k8463309
46870a5777614k0664331m43462J2745099P664364m427265l319009J5731041L5709076
46862B7217899L6691273J8265826j423727r945502j5592929k9798331m2646932
46855a7232423l3382863m238104J7480064J7581177J3702190K2929934L1713351
46848D8553326J8805748p743865k1845072j8118725j3588376j5961631j6170729
46841b6069324j0678768n798608J96710J3422570K1968336O393737k1927142k4500279
46833d6992768R352438M0709060L2921970k15243k0367173j6531095n137903L938739
$$ plain form
46886 1986450 12200689 6876339 -9257911 -22312181 -22964457 -14311826 -5114564 1642985
46878 1642985 9331673 19342854 28618252 34932918 37561705 32039885 12685695 -15777614
46870 -15777614 -36441945 -36885407 -24140308 -16475944 -20903209 -24222218 -8491177 27217899
46862 27217899 63909172 82174998 80751271 70805769 55212840 25414509 -17232423
46855 -17232423 -50615286 -54853390 -37373326 -19792149 -6089959 16839975 48553326
46848 48553326 67359074 59615209 37770137 19651412 6063036 -9898595 -26069324
46841 -26069324 -36748092 -42546700 -42349990 -28927420 -6959084 -565347 -22492489 -46992768
46833 -46992768 -37640330 3068730 35990700 35775457 15408284 -1122811 -6260714 -2321975
46825b321975J2241240J4348441L227327j1011419j2609389o643957j0316381
46818a3086113k0943213j7809007L361057K2071411K3542847J6133636J2264963
46811B5535581J0751641N335226m387470j5923578k4178691j7507347Q878892
46804a1495746L3848025K7180770p477195k9815178j5446542J0997014J3227942
46797B1019090o064590j6217280o788939L840899M095142M932551J4088751J8310014
46789C7215638M921601j4190655j7077403l757510K876151j0253109k6740901
46782b7006188k2612010J79197J5717142R139738n045953o438661L179284Q952560
46774b3934891R738001J5677861K2905741J4538330q229679j8993838k616624
$$ plain form
46825 -2321975 9919265 24267706 27495033 16483614 3874225 -2769732 -13086113
46818 -13086113 -34029326 -51838333 -48477276 -26405865 -2863018 13270618 25535581
46811 25535581 36287222 41622448 37234978 21311400 -2867291 -20374638 -11495746
46804 -11495746 22352279 49533049 42055854 12240676 -3205866 7791148 21019090
46797 21019090 14954500 -1262780 -8051719 -4210820 -115678 4816873 18905624 37215638
46789 37215638 42137239 27946584 10869181 7111671 9987822 -265287 -27006188
46782 -27006188 -49618198 -49439001 -33721859 -24582121 -29628074 -36066735 -32887451 -23934891
46774 -23934891 -14196890 1480971 24386712 38925042 30695363 11701525 9084901
46767I084901J9575465J7943492n263999k2492442j9051734n331497M955312R559710
46759H979208J0083570O190121J317985J609289N175074K885663o542985j2251629
46751A7446296o863929K014049K042435p515750j5400289j1818444J225713J2096755
46743f773164J1263587J942728k699009M497802J4723119J4018259J012253j2757219
46735B5228356j7972641j4835482o162264O857716J9193268K1166534R447180
46728D2922667n792542j0809254l893720L342914N70202q160329q462566N965572
46720A5682944K1168900J5266255j4239449m1842899m0353056j2887837J0715446
46713d6489696R943446l911793o521264O418170J5750241P529133o675726n948068
$$ plain form
46767 9084901 28660366 46603858 41339859 18847417 -204317 -5535814 -580502 8979208
46759 8979208 19062778 25252899 26570884 28180173 33355247 36240910 29697925 17446296
46751 17446296 10582367 12596416 14638851 7123101 -8277188 -20095632 -18869919 -6773164
46743 -6773164 4490423 6433151 3734142 8231944 22955063 36973322 37985575 25228356
46735 25228356 7255715 -7579767 -13742031 -6884315 12308953 33475487 42922667
46728 42922667 37130125 26320871 22427151 25770065 26340267 18179938 9717372 15682944
46720 15682944 36851844 52118099 37878650 -3964249 -44317305 -57205142 -46489696
46713 -46489696 -36546250 -40458043 -46979307 -40561137 -24810896 -17281763 -23957489 -29905557
46705b9905557J0201283K1343306J5958276O376598N194065K017773j7389917
46698A3795827l8217872k9764971O896813L2323331K1099423m085414q575388
46691f528251O095651J4754060J2230502J3501911J8232567Q204726j7420733
46684D9070433l3166816k2453277M24064J3404291J3404460R622279N797586Q99700
46676C7002720l070100l301717Q53122J0563702K3588289K7022464Q633956k1280835
46668H0011601l5476011k3209640k970174M372438j147845r555874j7134642k0335415
46660b5445562j0373362J1419887K6148913K0006990L281376o693023r590108
46653H755111j4010235j6912228r452791L739334Q816213K941969l664137k721403
$$ plain form
46705 -29905557 -19704274 1639032 17597308 23973906 29167971 31185744 13795827
46698 13795827 -24422045 -54187016 -47290203 -14966872 6132551 2047137 -6528251
46691 -6528251 -432600 14321460 26551962 40053873 58286440 66491166 49070433
46684 49070433 15903617 -6549660 -6125596 7278695 20683155 30305434 36103020 37002720
46676 37002720 33932620 30630903 31484025 42047727 65636016 92658480 101292436 80011601
46668 80011601 44535590 21325950 18355776 22728214 21580369 12024495 -5110147 -25445562
46660 -25445562 -35818924 -24399037 1749876 21756866 25038242 18345219 8755111
46653 8755111 -5255124 -22167352 -31620143 -27880809 -19064596 -16122627 -19786764 -22508167
46645b2508167O125857J9019398K7074046J9200612k533331j8237315j3443063
46638A4698037J145476N959472j026873q640480j2241826j1599928l18981K1112667
46630I087564L1449368J3163960j5776158k2413138p532703k853424j8183198
46623a3057729k5753248p786128J2880104R040088r814867j6626075q602512l832128
46615f3552495o449625j177721J8313702L5827284L2391798Q979261j3968084
46608A0364120j5448542O090658K8478102K6468898L66673k3041059k2785824
46601A0493026p606601K51825m421052p676882N30010J4252448K1919275J8341043
46593D6083092N000281j3347337k9077139l3816084k4632831p984738M474253
$$ plain form
46645 -22508167 -16382310 2637088 29711134 48911746 46378415 28141100 14698037
46638 14698037 15843513 21802985 20776112 12135632 -106194 -11706122 -12025103 9087564
46630 9087564 40536932 53700892 37924734 15511596 7978893 5125469 -13057729
46623 -13057729 -38810977 -46597105 -33717001 -24676913 -34491780 -51117855 -59720367 -63552495
46615 -63552495 -70002120 -71179841 -52866139 -17038855 15352943 24332204 10364120
46608 10364120 -5084422 1006236 29484338 55953236 56319909 33278850 10493026
46601 10493026 2886425 3138250 -1282802 -8959684 -8429674 5822774 27742049 46083092
46593 46083092 51083373 37736036 8658897 -25157187 -49790018 -57774756 -53300503
46586e3300503O203774K233219J966460M600376p17694j4877770j9742625k679199
46578g6313962J8567024J6457256m070767j0069858Q132393J9482640J436639
46571b6378635k0874705j1459697J9706509L0368708Q905658j1327614m089190
46564a5148966J5035656J8819909P979679J099556J484740l287809j4969712j8639478
46556g626425n553410J2638214J8703984J0135048j998930r167107j2545707j5103922
46548a0518255j4252876o502504M599232J1083784J0634295Q705401R372115R326331
46540B2447523M454436j625625j265078N431803P753592l199594k0710487k6156644
46532a2870074j0479097J1201620J4826776j530920j2881371r39418J8469849
$$ plain form
46586 -53300503 -47096729 -44863510 -42897050 -38296674 -39014368 -53892138 -73634763 -76313962
46578 -76313962 -57746938 -41289682 -45360449 -55430307 -47297914 -27815274 -26378635
46571 -26378635 -47253340 -58713037 -39006528 -8637820 267838 -11059776 -15148966
46564 -15148966 -113310 18706599 26686278 27785834 29270574 25982765 11013053 -7626425
46556 -7626425 -13179835 -541621 18162363 28297411 26298481 17131374 4585667 -10518255
46548 -10518255 -24771131 -31273635 -26674403 -15590619 -4956324 3749077 13121192 22447523
46540 22447523 26901959 25276334 24011256 29443059 37196651 33997057 13286570 -12870074
46532 -12870074 -23349171 -12147551 2679225 1148305 -11733066 -12672484 5797365
46525E797365J6176791q445453k5322866j4603996Q490910J6919979N776113o929888
46517b141045m875996R420279J7752511M484536k2474622l2742180q722451K4561993
46509a4736975K6660292j078525j4380781Q488739L2341516J8018306j8333455
46502C6979117l0899630j0667635R431643P119258n886137j1606296p018421L715432
46494h832669J3051811P029503j6630176l1113830j0593474K5304505L2053286
46487A0268956O176663r555720N168737J8507953M209360j4575423r467567L248793
46479A3981752l763677j5480642q10989K7681733K9922528M728718r806956j937941
46471D4514526k521560k5869827m1356707k4478237L282757J1960813Q024446
$$ plain form
46525 5797365 21974156 13528703 -11794163 -26398159 -17907249 -987270 4788843 -2141045
46517 -2141045 -7017041 2403238 20155749 24640285 2165663 -30576517 -39298968 -14736975
46509 -14736975 11923317 10844792 -3535989 4952750 37294266 55312572 36979117
46502 36979117 6079487 -4588148 4843495 11962753 6076616 -5529680 -12548101 -8832669
46494 -8832669 4219142 11248645 -5381531 -36495361 -47088835 -21784330 10268956
46487 10268956 16445619 6889899 12058636 30566589 34775949 20200526 10732959 13981752
46479 13981752 10218075 -5262567 -6073556 21608177 51530705 56259423 46452467 44514526
46471 44514526 41992966 16123139 -25233568 -49711805 -46429048 -34468235 -26443789
46464b6443789J1768785J6610088N716641r511239m745884J3647346J6641952
46457B3683900N45129q246855J670520J1181503P605128L928841P608028J727239
46449D9703433k1816732l7436496k1345611Q175463J6109887K257427m542209
46442h894838M883240J1254231N127014P327K267221l85637j0991887j3161846
46434i895175j171462P269379K697102Q39992J0566419J3437589j717247j1544452
46426A0482145M682884K4699852J5681093j1326722j8776714k103442R557205
46419C2896301N111586P68802p59393j4945312l3787408k5152324J2303066L5600191
46411A2035509J8181068j3472919k5414327k1753468j8883667r813015J2664287
$$ plain form
46464 -26443789 -14675004 1935084 7651725 -1859514 -6605398 7041948 23683900
46457 23683900 24229029 15982174 17652694 28834197 36439325 40368166 47976194 49703433
46449 49703433 27886701 -9549795 -30895406 -22719943 -6610056 -4352629 -8894838
46442 -8894838 -4011598 7242633 12369647 12376974 14644195 14258558 3266671 -9895175
46434 -9895175 -11066637 -3797258 -1100156 -260164 10306255 23743844 22026597 10482145
46426 10482145 15165029 39864881 55545974 44219252 25442538 23339096 32896301
46419 32896301 38007887 38776689 38017296 23071984 -10715424 -35867748 -23564682 12035509
46411 12035509 30216577 16743658 -8670669 -30424137 -49307804 -59120819 -46456532
46404d6456532K6705196J2716041p961530l186516J7920274K0707035P14726j3977322
46396G181372r489136L50530M787529Q054937J0380278N745870p76748R92211
46388B7226843M171502o105112k3473142k6384131j2080758J416127N774157Q404930
46380b1049584J0111527M813656Q2614Q203483J7767258O390610j7982811k3843421
46372a5506668p249460J700367r545178j7695415q536017K95909k209130N06355
46364e8239237J4354032J5799968l090243j0914889J0161857K6703391P862292
46357B637171j8831423j1668639J5111848J7685015k785151q317191N979632Q294716
46349H105978p045870j0511724L872541N894883j2266359j7230175N941842K3477862
$$ plain form
46404 -46456532 -19751336 -7035295 -14996825 -18183341 -263067 20443968 21158694 7181372
46396 7181372 -2307764 -1957234 2830295 10885232 21265510 27011380 26234632 27226843
46388 27226843 31398345 25293233 1820091 -24564040 -36644798 -35228671 -29454514 -21049584
46380 -21049584 -10938057 -6124401 -6041787 2161696 19928954 26319564 8336753 -15506668
46372 -15506668 -22756128 -21055761 -30600939 -48296354 -56832371 -56536462 -58745592 -58239237
46364 -58239237 -43885205 -28085237 -31175480 -42090369 -31928512 -5225121 2637171
46357 2637171 -16194252 -27862891 -12751043 4933972 2148821 -6168370 -188738 8105978
46349 8105978 1060108 -9451616 -5579075 315808 -11950551 -29180726 -23238884 238978
46341B38978R178059j1217059m698832J4531311J2314661q628438j7004347l326225
46333h611892J2132247J4265055P962383J754003j837190k527378l661129j0795428
46325H680671j7886700q294146J6864850K9079001J0697725j4531305j3872812
46318A0737284O117750J2432839l611394j9450671j9925309j1785184o79290J5621161
46310a0542814K8209896K0922265m15683j0097330j759861J808816j1421577k0926396
46302d222684q114111J1851923J3499582k127956j5189614j7204983j2933602
46295c4441445l941886Q925174J5291556P256157m557058m688363L556469N544355
46287g055041j30363l394379l687369q642388j4401210q311125Q211373J9194133
$$ plain form
46341 238978 9417037 -1800022 -6498854 8032457 20347118 11718680 -5285667 -8611892
46333 -8611892 3520355 17785410 25747793 27501796 25664606 23137228 19476099 8680671
46325 8680671 -9206029 -17500175 -635325 28443676 39141401 24610096 10737284
46318 10737284 16855034 29287873 25676479 6225808 -13699501 -25484685 -26163975 -10542814
46310 -10542814 17667082 38589347 38173664 28076334 26316473 28125289 16703712 -4222684
46302 -4222684 -12336795 -484872 13014710 10886754 -4302860 -21507843 -34441445
46295 -34441445 -38383331 -29458157 -14166601 -6910444 -11467502 -16155865 -12599396 -7055041
46287 -7055041 -7185404 -10579783 -14267152 -22909540 -37310750 -45621875 -37410502 -18216369
46279a8216369J8059423J2962790O666170p500022k4794687k6433498p324458
46272d6580651J3027848J8282151J5628808J6360449J5141488M959812m207323
46265C2612582j444546L714541k962454j4063709j2554789j778695J197702l037213
46257A683419J460094J2852591R500548j2219954k4976852q831183J8725042K7532955
46249B5726660J4066359q39887k776877L585925O328180j421531j6478818k5771300
46241B418711j8851934m824099m142476j7479351k0556259j276661J8662494J7848427
46233b8201148J0086293J7906141K8217206J1060169k4711729l5629951q124416
46226b9397435K0313338J7805107J09894m405250K85367m032729j1711219o132157
$$ plain form
46279 -18216369 -156946 12805844 19472014 11971992 -12822695 -39256193 -46580651
46272 -46580651 -33552803 -15270652 358156 16718605 31860093 36819905 32612582
46265 32612582 31168036 34882577 31920123 17856414 5301625 3522930 4720632 1683419
46257 1683419 3143513 15996104 25496652 13276698 -11700154 -20531337 -1806295 25726660
46249 25726660 39793019 38953132 36176255 39762180 46090360 44668829 28190011 2418711
46241 2418711 -16433223 -21257322 -25399798 -42879149 -63435408 -64712069 -46049575 -28201148
46233 -28201148 -18114855 -208714 28008492 39068661 14356932 -21273019 -29397435
46226 -29397435 -9084097 8721010 8830904 4425654 4711021 678292 -11032927 -17165084
46218a7165084N342730K789011q937408o860350R477843J5188627j11531j7391631
46210a7667793j8325870o425798P041981J5410638J0076921j3640558l6600210
46203f0130689k7924099J0712153L7882954K5597791m104928j5451767q051404
46196d1469989k912503K21828J5885858L3278962K2924121j3784985l6496550
46189b2353258j9654274J2992599K4021827J1298517J663503R667755K3527025
46182D1163694K6845715J6883158R92411j2811954j8930730j5042461l584552
46175C5515281Q875025J4491102Q391369o213799j8487588k0685329j6831172
46168E054889j4432759j1099181j36907J2830933J3730819K352863n042677l96422
$$ plain form
46218 -17165084 -11822354 -9033343 -17970751 -24831101 -15353258 -164631 -276162 -17667793
46210 -17667793 -35993663 -42419461 -35377480 -19966842 -9889921 -23530479 -60130689
46203 -60130689 -88054788 -77342635 -39459681 -13861890 -17966818 -33418585 -41469989
46196 -41469989 -44382492 -44160664 -28274806 5004156 27928277 14143292 -22353258
46189 -22353258 -42007532 -29014933 -4993106 6305411 7968914 17636669 41163694
46182 41163694 68009409 84892567 85884978 73073024 54142294 39099833 35515281
46175 35515281 44390306 58881408 67272777 61058978 42571390 21886061 5054889
46168 5054889 -9377870 -20477051 -20613958 -7783025 5947794 8300657 3257980 2861558
46160B861558N074139J934327k545964j675784l915563j3992706j5626397M972029
46152b2914361K9631137K7455453j376852k5742139k6417093j4244668l249541
46145c6858064Q584033K2749740K7359448J5353045n68991n469818k060670l7739
46137B9050984K053718Q829749J1820415n16017k0544036k6634247j1943205N813854
46129b068785P653081l548722r186182J312209J8780882K5221898J2740173r381748
46121D1522806k4633738k3878003j0847721K289058L832361o302286j1453359
46114b9470882N676635L4700878L9141158K520346l9156674l6222279Q314691
46107a4496127M1192436L0262469O09476j1965347r705471j2475773j7023634
$$ plain form
46160 2861558 7935697 9870024 7324060 5648276 1732713 -12259993 -27886390 -22914361
46152 -22914361 6716776 34172229 32795377 7053238 -19363855 -33608523 -36858064
46145 -36858064 -28274031 -5524291 21835157 37188202 36619211 31149393 29088723 29050984
46137 29050984 31104702 39934451 51754866 51238849 30694813 4060566 -7882639 -2068785
46129 -2068785 5584296 2035574 -7150608 -5838399 12942483 38164381 50904554 41522806
46121 41522806 16889068 -6988935 -17836656 -15547598 -11715237 -18017523 -29470882
46114 -29470882 -23794247 10906631 50047789 52568135 13411461 -22810818 -14496127
46107 -14496127 26696309 56958778 57568254 45602907 35897436 23421663 6398029
46100F398029p837833R198976J5245393R361869L199839l981856j6531262k0254472
46092e201317j682653J9573858J4078946p446734p801007J3812802J7714676r532063
46084C3516508l1060235k0236188p01092N64665r68666J6043507L1163133J4419280
46076D2740912j7895018k5468530p542321P47714j1817746k0415863j1288643
46069e0939495N24905N361049J2598878K1878813J6553621k451088r628499M152940
46061a948876J5327524Q436281J366649Q862116J2071862o917966k6474551j6341205
46053e618166J0829708J6779764k783882j4325672j639596J1951974M977365j0299855
46045I871640j2631910m383469j094286m844581o149493k233626K206581N534116
$$ plain form
46100 6398029 -1439804 7759172 23004565 32366434 35566273 31584417 15053155 -5201317
46092 -5201317 -6883970 12689888 26768834 19322100 11521093 25333895 43048571 33516508
46084 33516508 2456273 -17779915 -18481007 -17916342 -18885008 -2841501 28321632 42740912
46076 42740912 24845894 -622636 -8164957 -7417243 -19234989 -39650852 -50939495
46069 -50939495 -50414590 -45053541 -32454663 -10575850 5977771 3526683 -6101816 -1948876
46061 -1948876 13378648 21814929 23181578 32043694 44115556 37197590 10723039 -5618166
46053 -5618166 5211542 21991306 19207424 4881752 3242156 15194130 20171495 9871640
46045 9871640 -2760270 -7143739 -8238025 -13082606 -19232099 -21465725 -19259144 -13725028
46037a3725028P317002K033324j2597343k5612005k3780861r779043K512478Q507931
46029f5123545J5524196K5116757K7391502J7165101K863500p338219j6136986
46022e37694k4524655k0817577K101578K6010774K3793154k892263k1765988j1939922
46014c0572593J0114204J7557438R433483K442676r34329j2042839k7450998k6485671
46006e7938629l680032J7687713J6206623R2231r517368r168317r209192q709823
45998f4236794L798288K4994403L2762560J5386891r132047j3904339L934551
45991f396487K1658522J9725063K589912j1223253j2725358r440835j0049304
45984e861740j0349530j325722J2408735J3334455n674950k7736544l0360408
$$ plain form
46037 -13725028 -6408026 -4374702 -16972045 -42584050 -66364911 -76143954 -73631476 -65123545
46029 -65123545 -49599349 -24482592 2908910 20074011 22937511 15599292 -537694
46022 -537694 -25062349 -45879926 -43778348 -17767574 6025580 3133317 -18632671 -30572593
46014 -30572593 -20458389 -2900951 6532532 8975208 8040879 -4001960 -31452958 -57938629
46006 -57938629 -61618661 -43930948 -27724325 -27632094 -37149462 -46317779 -55526971 -64236794
45998 -64236794 -60438506 -35444103 -2681543 12705348 3573301 -10331038 -6396487
45991 -6396487 15262035 34987098 37577010 26353757 13628399 4187564 -5861740
45984 -5861740 -16211270 -17536992 -5128257 8206198 2531248 -25205296 -55565704
45977e5565704j2714881N300370R334234N058082M391756P874674P882052L023758
45969b5415659l9675J903037L684147J226959k70450O295974J7017231J8970325
45961B3371889O690132r825327j7387227j4519439r119276o417836n882508n440749
45953c8530341j157352J1897047K8613830L0334747P287079k0324321k3273939
45946e153250m172965N879479n459653j5281701o344050N095735J892235j339972
45938b4884142J3394050K9223700K0015832j387359n44450K0565353K5195025
45931H1578009K150632j8070097j6090885j1444260k0853318k6235399q972184
45924a7937502J3449451J3172609o065613j8449673j2541956L281235J8205520
$$ plain form
45977 -55565704 -68280585 -62980215 -53645981 -48587899 -44196143 -36321469 -28439417 -25415659
45969 -25415659 -25455334 -23552297 -19868150 -18641191 -18911641 -12615667 4401564 23371889
45961 23371889 30062021 20236694 2849467 -11669972 -20789248 -27207084 -33089592 -38530341
45953 -38530341 -39687693 -27790646 823184 31157931 38445010 18120689 -5153250
45946 -5153250 -9326215 -3446736 -8906389 -24188090 -30532140 -25436405 -23544170 -24884142
45938 -24884142 -11490092 17733608 37749440 36362081 35817631 56382984 81578009
45931 81578009 83728641 65658544 49567659 38123399 17270081 -8965318 -17937502
45924 -17937502 -4488051 8684558 2618945 -15830728 -28372684 -25091449 -6885929
45917f885929K3508059J3809030n87476Q14111J6897888K0529506J871040j2114503
45909E7841726m372037j470519k5751360m4364729j4514811M0099160N3591812
45902F1059242J2783226k7126255k6201173o261714K00096j460467N017889J0414440
45894B8425284O3100j6064359j9412704j0650632k065950J803137K126406M47562
45886a5328156L851457J6794248K4532087J0427420q696978j73658K6127373K2527585
45878H0061378j7876991l9201671r647471K1409836N4115m2368575l7085836J3043641
45870c1611574L9796658J3962696k1660566k6318612r766883M961430J6202822
45863a4434029K3419368J4579474o835522j6593736p877611k663928j0696968
$$ plain form
45917 -6885929 16622130 30431160 29843684 30657795 47555683 68085189 69956229 57841726
45909 57841726 53469689 51999170 26247810 -18116919 -32631730 7467430 61059242
45902 61059242 73842468 46716213 20515040 14253326 14453422 12992955 18010844 28425284
45894 28425284 28488384 12424025 -6988679 -17639311 -19705261 -17902124 -15775718 -15328156
45886 -15328156 -11476699 5317549 29849636 40277056 31580078 31406420 57533793 80061378
45878 80061378 62184387 22982716 13335245 34745081 34799196 -7569379 -44655215 -31611574
45870 -31611574 8185084 22147780 487214 -25831398 -35598281 -30636851 -14434029
45863 -14434029 8985339 23564813 16729291 135555 -7742056 -10405984 -21102952
45856b1102952j0986355Q184659K4059183J6659761K396707N441640J9086565
45849D3739208K1171810R521761k243602r505712j4989877j4231198k827092J0569993
45841D1205291J4144207P472067m249625j8403963k8406602k4825589j2647173
45834b5711387r003926j3981215o923531J5220221K4004762M574996j3970151
45827b5790231k166721K1347345K0816941K591340J302472J8705728K1732499
45820E8539373K64931j6852456j0837492Q10995o04088p800130j0493246j4491395
45812a463508j9820748q773902K1154447L7184055J2561067k8935020m0198498
45805b8292107j3732071J2480841J0379958n636457q161641N835434K0951271
$$ plain form
45856 -21102952 -32089307 -23904648 154535 16814296 19211003 24652643 43739208
45849 43739208 64911018 74432779 72189177 62683465 47693588 33462390 30635298 41205291
45841 41205291 55349498 62821565 58571940 40167977 11761375 -13064214 -25711387
45834 -25711387 -34715313 -48696528 -55620059 -40399838 -16395076 -11820080 -25790231
45827 -25790231 -27956952 -6609607 14207334 16798674 18101146 36806874 58539373
45820 58539373 58804304 41951848 31114356 31925351 31321263 23521133 13027887 -1463508
45812 -1463508 -21284256 -30058158 -8903711 28280344 40841411 11906391 -28292107
45805 -28292107 -42024178 -29543337 -19163379 -24799836 -32961477 -27126043 -6174772
45798f174772K9101776L1144961K2872923K52710k2934191k3474888j373641J3801541
45790D3216419J773785j8610962j7269183J320760O859642o393422j0346518Q450694
45782I001215K3829374J2529043o509130l563889J1833511O701391k0435920l6666970
45774c281375k5586318p138121r71843o59045M472602Q444251N120690M493320
45766a5105839J4481586K1502044P829343j9936517l5663172k3813597N537585
45759d5168567K9372661L2630601J8739051L359572l349354o101317j1585421
45752A7897226j3111290j195807J4778689J4069125m374083j7089722q668271
45745B305867P624669J0467668k506765j7550406k2546493j3618226M524705J7392757
$$ plain form
45798 -6174772 22927004 54071965 76944888 77197598 54263407 30788519 29414878 43216419
45790 43216419 44990204 26379242 9110059 10430819 17290461 10897039 550521 9001215
45782 9001215 32830589 45359632 38850502 35286613 47120124 53821515 33385595 -3281375
45774 -3281375 -28867693 -36005814 -36977657 -37636702 -33164100 -24719849 -19599159 -15105839
45766 -15105839 -624253 20877791 28707134 8770617 -26892555 -50706152 -45168567
45759 -45168567 -15795906 16834695 35573746 38933318 35583964 29482647 17897226
45752 17897226 4785936 3590129 18368818 32437943 28063860 10974138 2305867
45745 2305867 9930536 20398204 17891439 341033 -22205460 -35823686 -31298981 -13906224
45737a3906224J1585004o152540j3063064k33579J5500757J6929208Q327738K269110
45729B1256410K26251j403708m8013M936966N319474k264440q070773o520420
45721A3431747o974952j3805535j2664281N455814K2833732J9802255O812586
45714C4891366O113299J2553747K657059k1783640l0689178j0441570J5321625
45707H622708J8892314J854401j4935134j8715316j1386630N65389J2796806K3457804
45699B1152342L0199332K6321941O581356j7755334k2134037o01193J8164728
45692F1929135O971834j8570076k1369892J452101J6655940Q933897R67864R580731
45684F6551534J7040901N942989p089746M39526J6905588J5288005j711403o991185
$$ plain form
45737 -13906224 -2321220 -8473760 -21536824 -21770403 -6269646 10659562 18987300 21256410
45729 21256410 21482661 20078953 20030940 24967906 30287380 28022940 19952167 13431747
45721 13431747 6456795 -7348740 -20013021 -14557207 8276525 28078780 34891366
45714 34891366 41004665 53558412 56215471 34431831 3742653 -6698917 8622708
45707 8622708 27515022 29369423 14434289 -4281027 -15667657 -15102268 -2305462 21152342
45699 21152342 51351674 77673615 84254971 66499637 44365600 43764407 61929135
45692 61929135 68900969 50330893 28961001 30413102 47069042 56002939 56970803 66551534
45684 66551534 83592435 89535424 82445678 82885204 99790792 115078797 113367394 106376209
45676A06376209N908953J4006633M376085m456517Q275186L3589475M4306252
45669B12382276K9169442L166966j2697484j2959829q698352j1729665k0093544
45662A78539810k0439037n959761J1103454J1040414q541766k6979886k5233341
45655A13529887j0454213n159152j3208978j2465321R957260L0650412J8439004
45648A31288899j7497446l4900039j6755430O110581K923123j4732051k0026051
45641C6411586j4680266j4417452j0226914J5956947M6086019M0621673J244306
45634A00995899k3475989p212053J8163734J4979148o702516j4584723n828931
45627G6334569j848985q328982j0601059j118074J1854552J8291794J3297300
$$ plain form
45676 106376209 112285162 126291795 130667880 126211363 134486549 168076024 212382276
45669 212382276 241551718 244718684 232021200 219061371 210363019 198633354 178539810
45662 178539810 158100773 152141012 163244466 174284880 165743114 138763228 113529887
45655 113529887 103075674 97916522 84707544 72242223 82199483 112849895 131288899
45648 131288899 113791453 78891414 62135984 68246565 71169688 56437637 36411586
45641 36411586 21731320 7313868 -2913046 13043901 59129920 99751593 100995899
45634 100995899 77519910 70307857 88471591 103450739 96748223 82163500 76334569
45627 76334569 74485584 66156602 55555543 54437469 66292021 84583815 97881115
45620I7881115k396378j6525203j2422717N315609R371364j0179883k4953267
45613D6090640j0126909J3296927Q896659j7470220k6376717n009906J7449436
45606B6749910J6468983K000023n260780q63393Q778270J7516324J7640133M390483
45598H7419953j2726344j8475244j2639875o080035P41813J4138937K5172208
45591G7551413J7426472k146884p521060P172502K0088393J8729764J5210447
45584A46511047J6190942R143275p551989j1926411M853388J7583793O325714
45577A81129759q667985J336286K7471073L8711590K8851139J8692035K0912550
45570C08436447K9665631L8191674M2422729L3789976J2013437k074289Q492289
$$ plain form
45620 97881115 95484737 78959534 66536817 71852426 81223790 71043907 46090640
45613 46090640 35963731 49260658 58157317 40687097 14310380 9300474 26749910
45606 26749910 43218893 45218916 39958136 39094743 47873013 65389337 83029470 87419953
45598 87419953 74693609 56218365 43578490 37498455 38240268 52379205 77551413
45591 77551413 94977885 92831001 85309941 92482443 112570836 131300600 146511047
45584 146511047 162701989 171845264 164293275 152366864 157220252 174804045 181129759
45577 181129759 172461774 173798060 201269133 239980723 268831862 287523897 308436447
45570 308436447 338102078 376293752 418716481 452506457 464519894 462445605 470937894
45563D70937894K5005880J3802847k2914617m4981085k7423692Q079949K2516678
45556D45023854K546309l2411108n2645549m3804351k0238775j1520050k6225308
45549B60725022l8068011k3412614P37734J797947j6202778k0136013m330067
45542A61111220L31760j9031436l4050019k3415091p443867r710398j6120474
45535E1671695l158494J8043726K0131472M404579o829568r706312j6221176k1774455
45527C6561467j1398022N916519N413885j0377045j2599834N251837J5579676
45520C4348483L498170r775302n732843K570773Q94504J446268J3758748J6780743
45512E7789544o328594k8737628j5284544J7805603K2947673m605049j9585320
$$ plain form
45563 470937894 495943774 509746621 486832004 441850919 414427227 422507176 445023854
45556 445023854 447570163 415159055 362513506 318709155 298470380 286950330 260725022
45549 260725022 222657011 199244397 199982131 201780078 185577300 165441287 161111220
45542 161111220 161442980 142411544 108361525 84946434 77502567 67792169 51671695
45535 51671695 48513201 66556927 86688399 91092978 84263410 74557098 58335922 36561467
45527 36561467 25163445 31079964 36493849 26116804 13516970 18768807 34348483
45520 34348483 37846653 28071351 22338508 24909281 25803785 27250053 41008801 57789544
45512 57789544 51460950 22723322 7438778 25244381 48192054 43587005 24001685
45505B4001685L75954K0909637Q326550j9165921k5151235q741631P241194J7783711
45497B5579944K9812700L1763450Q210482k2636825k5352655j900631P876041
45490E3352506j2216378k9495087j4978175J1388968J3179277q152674k0232557
45483g154120p894955J3147660K4865168K5051026J8062691P230082k056839o086064
45475F5164649r244878j4930523j4881524k605765Q261345q54902k1760275k5547336
45467a6399209l968609J7295789J5035179j825135j0838578o853756R11028Q552378
45459A909087J6261470J6399169J717618j7460552k0779661l649825J6817092
45452A1214398K3379101J6087599N894522m81456m991808j1850796j9883318k1309918
$$ plain form
45505 24001685 24377639 45287276 53613826 34447905 9296670 555039 7796233 25579944
45497 25579944 55392644 87156094 95366576 72729751 47377096 45476465 53352506
45490 53352506 41136128 11641041 -3337134 8051834 21231111 13078437 -7154120
45483 -7154120 -15049075 -1901415 22963753 48014779 66077470 73307552 71250713 65164649
45475 65164649 55919771 40989248 26107724 23501959 31763304 30908402 9148127 -16399209
45467 -16399209 -20367818 -3072029 11963150 10138015 -700563 -7554319 -6643291 1909087
45459 1909087 18170557 34569726 36287344 18826792 -1952869 -5602694 11214398
45452 11214398 34593499 50681098 56575620 56094164 51102356 39251560 19368242 -1941676
45444a941676j0290671O549302J4002480O888462j606051K830771J5658931J9868676
45436E1960224Q544512q907924k0850677k3430261j7634710p308565o93444l062438
45428b1383283o282891K492903J8496258J9409937l809669k8261009k4935240
45421d4272994L392600K5450661K1261478L223812o229806l232724J377777L725010
45413D695814R146437J5910709J3031063j555380j4078026j4064556r313385j1227359
45405g454683j4978309q906468K948106N666172j437048m066641R86823K54847
45397b6987201r348895j0056535P167299K2912208J7681644L197789L110052J5277655
45389B2954016J8282633P041946m152138q842933j1946921r743927M466044J5849784
$$ plain form
45444 -1941676 -12232347 -5683045 8319435 15207897 13601846 16432617 32091548 51960224
45436 51960224 60504736 51596812 30746135 7315874 -10318836 -17627401 -18320845 -21383283
45428 -21383283 -27666174 -25173271 -6677013 12732924 8923255 -19337754 -44272994
45421 -44272994 -40880394 -15429733 5831745 9055557 2825751 -406973 970804 4695814
45413 4695814 13842251 29752960 42784023 41228643 27150617 13086061 3772676 -7454683
45405 -7454683 -22432992 -31339460 -28391354 -22725182 -24162230 -28228871 -27242048 -26987201
45397 -26987201 -36336096 -46392631 -39225332 -16313124 1368520 4566309 7676361 22954016
45389 22954016 41236649 48278595 44126457 35283524 23336603 13592676 18058720 33908504
45381C3908504K167465k4053130k4162032N171926J8732118p900246l4639963
45374c0775358j6599434K3889118K9572758n415021k9917402j2796679J9631189
45367b2410829L0645789J9151541M366178m979389q534700l722988N999098Q293547
45359B8808247k4306o585610m544047l930506j2149849j9858554j7569069j0620572
45351d6474266o175415q16199P481115J1430982J0540813J6755356K9690076K7240654
45343D9673116J094629j9358458o359888J9694756J7087280j3459670l0123629
45336A8248136j5059345J198351q179110k4732073j6599967J2975699L4225725
45329B077416L3035946K0309535O652711r822409k9824558m3210366l8412678
$$ plain form
45381 33908504 36075969 12022839 -12139193 -6967267 11764851 3864605 -30775358
45374 -30775358 -47374792 -23485674 6087084 672063 -29245339 -42042018 -22410829
45367 -22410829 8234960 27386501 31752679 26773290 18238590 14515602 20514700 28808247
45359 28808247 28783941 22198331 17654284 13723778 1573929 -18284625 -35853694 -46474266
45351 -46474266 -52649681 -53465880 -45984765 -34553783 -24012970 -7257614 22432462 49673116
45343 49673116 50767745 31409287 25049399 44744155 61831435 48371765 18248136
45336 18248136 3188791 4387142 -3791968 -28524041 -45124008 -32148309 2077416
45329 2077416 35113362 55422897 62075608 52253199 22428641 -20781725 -59194403
45322e9194403j5415859J2517281K8542963K6426076J5817657Q607479K422656
45315A9723850j0988129k2584206j1217864K0652709L8215813J8671311j3069219
45308C9404265j6932292N604021J6222274k159558k3400372k1504923p409916
45301a0176501n619066j5047418j5243153k12600J5882139K2517099K2868592
45294A4969092J9909518R650160p143929j9410189j8352406p371608M587672J1626279
45286H464589R779739k447534j6529226j7081940j584920J1939750Q411804j301096
45278c48834L298725J8252855J8417958l132992k1567743j6462717j112814J358988
45270a296574n590987k711216Q744089R508773j721395m277844P319426J0741987
$$ plain form
45322 -59194403 -74610262 -62092981 -33550018 -7123942 8693715 17301194 19723850
45315 19723850 8735721 -13848485 -25066349 -4413640 33802173 52473484 39404265
45308 39404265 22471973 28075994 44298268 42138710 18738338 -2766585 -10176501
45301 -10176501 -15795567 -30842985 -46086138 -46298738 -30416599 -7899500 14969092
45294 14969092 34878610 44528770 37384841 17974652 -377754 -7749362 -3161690 8464589
45286 8464589 18244328 15796794 -732432 -17814372 -19399292 -7459542 952262 -348834
45278 -348834 2949891 21202746 39620704 36487712 14919969 -1542748 -2655562 -1296574
45270 -1296574 -6887561 -9598777 -854688 8654085 6932690 2654846 9974272 20716259
45262B0716259o798658k3767215j5853736P480914K0176281J8039327J5266254
45255C5259426J3160926o9660k1495862l1456991k1792462m860934Q155063J7676157
45247e424337K1465452J1396352q501064j9320014j0791520P419075K2497773
45240A8741717K9506190K2674364j744764k7237777k7350218n843601J139477
45233I885388j9611087l1028551j640094L8239992L5514330o599399l2695655
45226g935076j4775657J5262079J9382817J553286j2025414j0646169p40667P635700
45218b289101L384613j5716335k7350372m549095L8695686N2217417J7024516
45211F1417329k3386361k3581985J366319O745890j2477848k3340721j2066297
$$ plain form
45262 20716259 13917601 -9849614 -25703350 -18222436 1953845 19993172 35259426
45255 35259426 48420352 48350692 26854830 -4602161 -26394623 -31255557 -23100494 -5424337
45247 -5424337 16041115 27437467 18936403 -383611 -11175131 -3756056 18741717
45240 18741717 48247907 70922271 69177507 41939730 14589512 8745911 9885388
45233 9885388 -9725699 -40754250 -42394344 -4154352 31359978 24760579 -7935076
45226 -7935076 -22710733 -7448654 11934163 13487449 1462035 -9184134 -9924801 -2289101
45218 -2289101 1095512 -14620823 -41971195 -46520290 -7824604 44392813 61417329
45211 61417329 38030968 14448983 15815302 22561192 10083344 -13257377 -25323674
45204b5323674K289320P326720J1251051J5056624O629748j0730497j6146719
45197i647427o056184r56545p688836o508422J0038777J6997195k813933k5812046
45189c2447421k1710350L61422R548476K442764K418099J6150718K2599279Q725627
45181H088614r667898j2056757o15704O740930N20474j1376693j4299146k840030
45173c5506210J1964544J3588972J223548o419984M523930K2474479K5342222
45166C7191501J0251751n443095j0029922r500180j2655991j7402962j6180463
45159b3769361o410575P433464J6245900J1475147m676169j6080075r067941R076662
45151a5772948J7920427R668985l067979n329587M612590J7939516K3262733J2128563
$$ plain form
45204 -25323674 -23034354 -15707634 -4456583 10600041 17229789 6499292 -9647427
45197 -9647427 -15703611 -16660156 -24348992 -30857414 -20818637 -3821442 -6635375 -32447421
45189 -32447421 -54157771 -53796349 -44247873 -41805109 -39387010 -23236292 -637013 8088614
45181 8088614 -1579284 -13636041 -14251745 -7510815 -6990341 -18367034 -32666180 -35506210
45173 -35506210 -23541666 -9952694 -8729146 -15149130 -10625200 11849279 37191501
45166 37191501 47443252 42000157 31970235 22470055 9814064 -7588898 -23769361
45159 -23769361 -30179936 -22746472 -6500572 4974575 298406 -15781669 -24849610 -15772948
45151 -15772948 2147479 11816464 8748485 3418898 8031488 25971004 49233737 61362300
45143F1362300j1866211k8980123k1233179L168069J6019375L488189j7981109
45136C977311k4817111j3207994L458457J2915166J1900392M166057j990968n237
45128c603927O775136Q987659M473410r31075n524854j2116449j5501405n945987
45120b3387492J0448784J2913974l901922j8524625j2872190K784303R191037
45113b3348131O722599P667721J3512596J8485722K3899251K9348733K1306678
45106I7595169o457401l0630047k3455945M356960J4021227p231651l0187687
45099A8010625k7442234o934880Q614249J2536255J0162055K572626q835010j3818201
45091e134515m707653J0787542J8542049J2755145m585070k7702058m2428693
$$ plain form
45143 61362300 49496089 20515966 -717213 2450856 18470231 21958420 3977311
45136 3977311 -20839800 -34047794 -30589337 -17674171 -5773779 -1607722 -3598690 -3603927
45128 -3603927 3171209 12158868 16632278 15701203 10176349 -1940100 -17441505 -23387492
45120 -23387492 -12938708 -24734 -3926656 -22451281 -35323471 -32539168 -23348131
45113 -23348131 -16625532 -8957811 4554785 23040507 46939758 76288491 97595169
45106 97595169 91137768 60507721 37051776 41408736 55429963 48198312 18010625
45099 18010625 -9431609 -16366489 -7752240 4784015 14946070 17518696 8683686 -5134515
45091 -5134515 -9842168 945374 19487423 32242568 27657498 -44560 -42473253
45084d2473253l1033487N279689L8321991M0980547J7009822q256842j9136183
45077F92284j8615081j3169561m583646M542061J0397139J3744168J6507832J3995692
45069B3510888J098507j4446927j6676514j937097J4432914J5798472K114892
45062B3895135j2969866j7275324q886431N833659J8382711K2936259J8065501
45055D9981644O337567o113527j1634337p646274j582470l373163j1296154j2468830
45047B204456j402588R568116N640104r960967j9291042j1320792O690450J8498448
45039F26185J4465149j140516j4846617j7262099j2638081j1054067j1513509
45032e3363555k575994J6765980K9191167K1184431K908788n738726r71887N602640
$$ plain form
45084 -42473253 -73506740 -68227051 -29905060 11075487 28085309 19828467 692284
45077 692284 -17922797 -31092358 -35676004 -31133943 -20736804 -6992636 9515196 23510888
45069 23510888 24609395 10162468 -6514046 -8451143 5981771 21780243 23895135
45062 23895135 10925269 -6350055 -15236486 -9402827 8979884 31916143 49981644
45055 49981644 56319211 50205684 38571347 30925073 29342603 25969440 14673286 2204456
45047 2204456 801868 10369984 16010088 6049121 -13241921 -24562713 -17872263 626185
45039 626185 15091334 13950818 -895799 -18157898 -30795979 -41850046 -53363555
45032 -53363555 -55939549 -39173569 -9982402 11202029 14110817 8372091 7400204 13002844
45024A3002844O641284L949070j142627p735852r491634l159930R17904p649326
45016d668267j9124593j4966403K816782J3403277Q361209J52718k691632n948564
45008b2665473r444593n71269K0590258L1536684J7787646n012171j4727670j1426668
45000F066744o219081J222253J4071933K2031706J5595841N116032L851778L228054
44992F4965260j0908870k7419284k3200006j605139J1846187J0153812J0399321
44985C4231281J6408468Q757387j7733420l6597424k6415899j337085J2757432
44978i929260J2785234J0824597R294698M121592J45399L909959R810306R488595
44970E0451120O189030N400715J933236q199466j4618625q856007k106157o619185
$$ plain form
45024 13002844 19644128 23593198 22450571 14714719 5223085 2063155 2981059 -4668267
45016 -4668267 -23792860 -38759263 -35942481 -22539204 -14177995 -14025277 -16716909 -22665473
45008 -22665473 -32110066 -32681335 -12091077 19445607 37233253 32221082 17493412 6066744
45000 6066744 -152337 1069916 15141849 37173555 52769396 57885428 61737206 64965260
44992 64965260 54056390 26637106 3437100 1831961 13678148 23831960 34231281
44985 34231281 50639749 59397136 41663716 5066292 -21349607 -22686692 -9929260
44978 -9929260 2855974 13680571 22975269 27096861 27242260 31152219 40962525 50451120
44970 50451120 56640150 62040865 63974101 55774635 41156010 32300003 30193846 23574661
44962B3574661j0931438J835900K0000837J6737353n797017j6682428l883293
44955B4854575Q508770q4869j7427106k2747431j6586492r609728j777070Q615419
44947b6253932J2027233L910522l16676J1874293K3992311J1666586j7014168
44940A9886169k8361190r857602J4518431K0559191J3110525R009429R086899
44933D7951852K648857j0267382j7116897j1411278j492822J552607j900266k117458
44925G847213N461266J2456939Q176524l890280p927240K971047J5842122J5019619
44917E5957210K594970p997825j1757685j2384376q472860L422998J3853330Q134539
44909D3350301q547597j4067139l498112J755774r661742j7105238k193296J6180147
$$ plain form
44962 23574661 12643223 14479123 34479960 51217313 45420296 28737868 24854575
44955 24854575 33363345 33278476 15851370 -6896061 -23482553 -33092281 -34869351 -26253932
44947 -26253932 -14226699 -10316177 -10632853 1241440 25233751 36900337 19886169
44940 19886169 -8475021 -18332623 -3814192 16744999 29855524 38864953 47951852
44933 47951852 50600709 40333327 23216430 11805152 10312330 11864937 9964671 7847213
44925 7847213 13308479 25765418 33941942 30051662 22124422 25095469 40937591 55957210
44917 55957210 58552180 50554355 38796670 26412294 17939434 21362432 35215762 43350301
44909 43350301 34802704 20735565 17237453 18993227 9331485 -7773753 -9967049 6213098
44901F213098J0035814q846739m367650K3388633L2411143K506434l1797677l1675887
44893b132831p061094P219637M457166K648329L983827n085334j8473109j2185405
44885b6628814J3911795K8872879J6011249k700116k066532J0560171J2260994
44878E0221626k024637k0495076l2678861l0856264j0381266J4846001J6335743
44871a5032734r116729k3453720K160764L8950813L6368647n377963l6389560
44864a1890482k6881537J810355J8130735J5426902m92642k3135273l3859546
44857f0891488j2930791K4021810L3723312N609115j9146057q500906J5716505
44850b2398500J9942151J0951015J1187924J2145210n354499k5559240j7894932
$$ plain form
44901 6213098 16248912 7402173 3034523 26423156 58834299 61340733 29543056 -2132831
44893 -2132831 -9193925 -1974288 2482878 5131207 9115034 4029700 -14443409 -26628814
44885 -26628814 -12717019 16155860 32167109 29466993 27400461 37960632 50221626
44878 50221626 48196989 27701913 -4976948 -35833212 -46214478 -31368477 -15032734
44871 -15032734 -24149463 -47603183 -45442419 -6491606 29877041 24499078 -11890482
44864 -11890482 -38772019 -36961664 -18830929 -3404027 -3896669 -27031942 -60891488
44857 -60891488 -73822279 -49800469 -16077157 -10468042 -29614099 -38115005 -22398500
44850 -22398500 -2456349 8494666 19682590 31827800 26473301 914061 -16980871
44843a6980871R189805J8421480K052149j1721729q745230m179375n074330K442525
44835a4595576K0245927K8094407J7671846O039256M301208J695851p919597j1601780
44827D3931542k477504N082908j582991j5898877k6706711l0154030k1574176
44820d9379839J106770K1704676K0102828N708260N856072J7847654J1326587
44813C4273008j3646940j7248656J2721602L2120726R288557k2364223k0269418
44806A4874656j125989m526097k0246816q930675K3720103L2714759Q229608j0764686
44798C3944863j481098J2700069P615800p897755j7602571k2701584k5760712
44791b1182988j7850439K960376K1265614K4110447J5039379L408757l851120
$$ plain form
44843 -16980871 -7791066 10630414 12682563 960834 -7784396 -11963771 -17038101 -14595576
44835 -14595576 5650351 33744758 51416604 57455860 61757068 63452919 55533322 43931542
44827 43931542 41454038 46536946 44953955 29055078 2348367 -27805663 -49379839
44820 -49379839 -48273069 -26568393 -6465565 -757305 5098767 22946421 34273008
44813 34273008 20626068 3377412 16099014 48219740 57508297 35144074 14874656
44806 14874656 13748667 9222570 -11024246 -19954921 3765182 36479941 44709549 33944863
44798 33944863 32463765 45163834 52779634 44881879 27279308 4577724 -21182988
44791 -21182988 -39033427 -36073051 -14807437 9303010 24342389 27751146 23900026
44784B3900026L85728J4747940J9670259j040523l0704786l6756476j5819723
44777b5617555N086672J0859534J1297450J1562017M084536n224408J586989J7874694
44769C1509929J3411994j4832923k9456081q644678J9379305K1249244N778538
44762C8395328j157332n59147p014087j3838137n868787P885864P304272k881603
44754B2266371p66484J4849819K2299151J0768059p555159j8547378j9808913
44747B3505466j4206903o378910l866220q085610q899699q66609M001742m611185
44739a9407928j3984175o442940R957118J2618977J136099l196160N640154Q806381
44731d872474l729347j4672189p062775Q869073J2748884M835648J366813N230280
$$ plain form
44784 23900026 24285754 39033694 58703953 57663430 26958644 -9797832 -25617555
44777 -25617555 -20530883 -9671349 1626101 13188118 17272654 12048246 13635235 31509929
44769 31509929 44921923 30089000 632919 -8011759 11367546 32616790 38395328
44762 38395328 37237996 36678849 29664762 15826625 9957838 17843702 25147974 22266371
44754 22266371 21499887 36349706 58648857 69416916 61861757 43314379 23505466
44747 23505466 9298563 2919653 -946567 -9032177 -17931876 -18798485 -14796743 -19407928
44739 -19407928 -33392103 -39835043 -29877925 -17258948 -16122849 -19319009 -13678855 -4872474
44731 -4872474 -8601821 -23274010 -30336785 -21467712 -8718828 -3883180 -2516367 2713913
44723B713913O94480j9007056l4240813k1288261J3780736L7749420K9374876
44716I777295L695119j0134082m353488O242034J0097694R208594P211126M029396
44708C5773688J728810P07188p376451k5902537l7112735k2237387N026364J2665213
44700c6727847j709524r087141N06147L516104q899184r076419J7259058L7616071
44692f602735K1897727p306074j1651951K174496J012824j5179644j7543561p06886
44684c3905804J2678264J3744598J3015259Q583305j0486502l0477982k3694347
44677e0543209M980543K1308707J4732101Q576386J2777832R518875l701763j349451
44669A6300021K0988759K6649956n732601m0895679l4827658J396659J9944773
$$ plain form
44723 2713913 3408393 -15598663 -49839476 -71127737 -57347001 -19597581 9777295
44716 9777295 13472414 3338332 -1015156 5226878 15324572 24533166 31744292 35773688
44708 35773688 37502498 38209686 30833235 4930698 -32182037 -54419424 -49393060 -36727847
44700 -36727847 -38437371 -47524512 -47018365 -43502261 -52401445 -61477864 -44218806 -6602735
44692 -6602735 15294992 7988918 -3663033 -1488537 -475713 -15655357 -33198918 -33905804
44684 -33905804 -21227540 -7482942 5532317 14115622 3629120 -26848862 -50543209
44677 -50543209 -45562666 -24253959 -9521858 -945472 11832360 21351235 17649472 16300021
44669 16300021 37288780 63938736 58206135 17310456 -17517202 -16120543 3824230
44662C824230K759137k2323598k5180902o717760J1381020J3153683K875461m26521
44654b0655250J3672922K9059906K0873333p850449k6216180j7522539K45889
44647h392368N926354M687319J0178565J6836778J0662978m993342j4152161j1466433
44639I287690n240874k574747l200602l426396J054155R996216J3284255K067198
44631B1246895j2582110q830310J2803648K4695506R712876j5142754k4063842
44624G839909j3765406K348735J3652651J3589132k42400j4248982o419636K0135367
44616B2889370L2362258J2545535j4502305k0027061j2777854j4867965j9309326
44609a3687348o912937J1069683Q103225p288610M79084L2450243M3516363P817668
$$ plain form
44662 3824230 6583367 -15740231 -40921133 -47638893 -36257873 -23104190 -20228729 -20655250
44654 -20655250 -6982328 22077578 42950911 35100462 8884282 -8638257 -8392368
44647 -8392368 -2466014 2221305 12399870 29236648 39899626 34906284 20754123 9287690
44639 9287690 4046816 1472069 -1728533 -5154929 -4100774 5895442 19179697 21246895
44631 21246895 8664785 -165525 12638123 37333629 47046505 31903751 7839909
44624 7839909 -5925497 -3576762 10075889 23665021 23422621 9173639 2754003 22889370
44616 22889370 55251628 67797163 53294858 33267797 20489943 5621978 -13687348
44609 -13687348 -20600285 -9530602 -1427377 -8715987 -8236903 24213340 67729703 75547371
44601G5547371l8866828m6692116j8375384J144506q573261j7854888N368512
44594d8302088M4993728N4543556K0058657j7979935j6382239J4574837K8084597
44587G9591113M829744k7403037l8212398k9060587j4706188Q67706J4000032
44580a0093615J2311393l510171j0276670L855397J6300308M470650j6311718
44573c254426j7138564r72995P655127N997521J1858346K4893453K3522542K531261
44565E5092265j5355058j1687481N382435J5969344R887848p629026j8983756
44558C2676571q064523J5943265K0102611q759913l6691051k4435551J5829924
44551F601333L6702136K0828451l576234j0163682l786266J016856J213140j212665
$$ plain form
44601 75547371 36680543 -10011573 -28386957 -27242451 -35815712 -53670600 -48302088
44594 -48302088 -3308360 51235196 71293853 53313918 36931679 51506516 79591113
44587 79591113 84420857 57017820 18805422 -10255165 -24961353 -24093647 -10093615
44580 -10093615 2217778 -1292393 -11569063 -7713666 8586642 13057292 -3254426
44573 -3254426 -20392990 -21365985 -13710858 -7713337 4145009 29038462 52561004 55092265
44565 55092265 39737207 28049726 33432161 49401505 59289353 51660327 32676571
44558 32676571 24612048 40555313 60657924 51898011 15206960 -9228591 6601333
44551 6601333 43303469 64131920 60555686 50392004 46605738 47622594 48835734 47623069
44543D7623069l815953P39840J3413680J7327207J226031j4138704l554344J7405939
44535G6226765J2496226j4656248k3596601k609093J4338257N261140r610501
44528E7849945r428735k734452R26096R504055K0751118J5797675q91848K885509
44520I4659363L0038777L8246661R272777j2842110R230900M3115297L9920599
44513B51642264J2840930Q061886K5653092K8974822J5599349J7798078L7508830
44506C98079251L8691034J0104527j4529104j0815716L515607L962025o983574
44499D22024050j5594092j8893683j8816522j6244823j7673424k7620634l3362271
44492B73818601k0467648j839400l050777j9739078k2832982q733504o343993
$$ plain form
44543 47623069 43807116 44546956 57960636 75287843 76513874 62375170 58820826 76226765
44535 76226765 88722991 74066743 50470142 47861049 62199306 67460446 57849945
44528 57849945 48421210 45686758 46612854 56116909 76868027 92665702 91773854 94659363
44520 94659363 124698140 162944801 172217578 159375468 168606368 211721665 251642264
44513 251642264 264483194 272545080 298198172 327172994 342772343 360570421 398079251
44506 398079251 436770285 446874812 432345708 421529992 425045599 429007624 422024050
44499 422024050 406429958 387536275 368719753 352474930 334801506 307180872 273818601
44492 273818601 253350953 251511553 248460776 228721698 205888716 197155212 190811219
44485A90811219k4282609l1001414p735063J4874786K575590k7654710l3588333
44478H3999466j1478474L473511m916518j1494878O160082K9234527K2846778
44471A17824494j2645338l7083461k0418454J8072178L3600039J2571378j3311384
44464I8609452j3359736K583479N999264o084046j2506529m458598O171418J2691571
44456H9646275K0900340K7329688J6578351j0874276l1183421k8750148j5437071
44449F8209738o843100K26483J1730924J6867972M193807j5959038k4823646k1544592
44441C2058548j7727475j4023055k542054J1876928J4027133K990313m225332
44434B2435006J728420R050421M059073q653255j4634242r559654j267872K609540
$$ plain form
44485 190811219 166528610 135527196 127792133 142666919 145242509 117587799 83999466
44478 83999466 72520992 75994503 71077985 59583107 65743189 94977716 117824494
44471 117824494 105179156 68095695 47677241 65749419 99349458 111920836 98609452
44464 98609452 85249716 87833195 93832459 87748413 75241884 70783286 76954704 89646275
44456 89646275 110546615 137876303 154454654 143580378 112396957 83646809 68209738
44449 68209738 61366638 61593121 73324045 90192017 94385824 78426786 53603140 32058548
44441 32058548 14331073 308018 -2234036 9642892 23670025 26660338 22435006
44434 22435006 24163426 33213847 37272920 28619665 13985423 4425769 3157897 5767437
44426E767437j9687q484375j7497241j5446026L045553K2636658K0364154j456171
44418H910302j2297592L982097K0565731M393095l0386558l7636512o637711K1663214
44410b7443934J5855639m422528q682642l510827q891440j4183499J702156K3434411
44402b6142664J7177683j1474246k1786422j214526J8186113J3917985K787244
44395h548833L604405Q224696P400707J0772532K0133384J4736002j2390199l1919892
44387A2012802j8768962R391618K1274476J6449314J1539755M264734j4325298
44380D1838439k8618340j6852093Q648467J5475911P11371p438700L794708J6443104
44372C4002867J5970773J0378520Q254265L546129q769760k1545245k6823565
$$ plain form
44426 5767437 5747750 -2736625 -20233866 -35679892 -32634339 -9997681 10366473 8910302
44418 8910302 -3387290 594807 21160538 25553633 -4832925 -42469437 -49107148 -27443934
44410 -27443934 -11588295 -16010823 -24693465 -28204292 -37095732 -51279231 -49577075 -26142664
44402 -26142664 -8964981 -20439227 -42225649 -43440175 -25254062 -11336077 -8548833
44395 -8548833 -4944428 3280268 10680975 21453507 41586891 56322893 43932694 12012802
44387 12012802 -6756160 2635458 23909934 40359248 51899003 56163737 41838439
44380 41838439 13220099 -3631994 5016473 20492384 21203755 13765055 17559763 34002867
44372 34002867 49973640 60352160 68606425 72152554 63382794 41837549 15013984
44365A5013984k2751551p686221J5512292L0397740K2225374J699167p553726
44358D6857059l539277m067760j2311982j3148063n796376q053603k0507271j8949552
44350c9516825M911342K5839979K3679505J0260726Q08580j0531287k5019446
44343i567426k1079895Q936384L1627493J6809052j3677705j8753179o18027P042140
44335G18837p11489J971056J8587975K2207570M817302q478269m270903n63571
44327C4278508r039722j4351148o458227N41187j330076J969234J4065229J3967473
44319C3642458m250750j2637796L283562J3940171l782792j9865710J457981L5788008
44311D7575132L1958290o295816k7695256j5315456m342714j4311661j8994561
$$ plain form
44365 15013984 -7737567 -15423788 88504 30486244 52711618 54410785 46857059
44358 46857059 43317782 39250022 26938040 13789977 7993601 -60002 -20567273 -39516825
44350 -39516825 -34605483 -8765504 14914001 25174727 25983307 15452020 -9567426
44343 -9567426 -30647321 -21710937 9916556 26725608 13047903 -5705276 -6323303 718837
44335 718837 7348 1978404 20566379 42773949 47591251 39112982 34842079 34278508
44327 34278508 25238786 10887638 4429411 4970598 3640522 5609756 19674985 33642458
44319 33642458 29391708 16753912 20037474 33977645 30194853 10329143 11787124 47575132
44311 47575132 79533422 73237606 45542350 30226894 25884180 11572519 -7422042
44304g422042Q42116K2985473K3838723J2963641N264791m912549j8352023j4748175
44296B0459955J0690039K6180318R118521j5635614j5609145k006765m008031
44289B9189278j4979959p659804J1999921J2605441o057445r485796J4300780
44282B9912416L5176349K9553437J2409570M316038k318130k1296319l9533095
44275D8220266l2824279m711085J4392313O892180j0677806j2607428J50031K059947
44267A0894139j7773129l3144795j3681565K6762500M0662120J1130541k2767330
44260B082481k1219589L543930J6046765J4448872K0908058L0319104J3973353
44253H0102974k5741572m7072232k6721431P937528J9237276M819256j1981399
$$ plain form
44304 -7422042 -6579926 16405547 40244270 53207911 58472702 53560153 35208130 20459955
44296 20459955 31149994 57330312 66448833 50813219 35204074 33197309 29189278
44289 29189278 14209319 6549515 18549436 31154877 25097432 15611636 29912416
44282 29912416 65088765 94642202 107051772 111367810 109049680 87753361 48220266
44275 48220266 15395987 10684902 25077215 31969395 21291589 8684161 8834192 10894139
44267 10894139 -6878990 -40023785 -53705350 -26942850 13719270 24849811 2082481
44260 2082481 -19137108 -15593178 453587 14902459 35810517 66129621 80102974
44253 80102974 54361402 7289170 -19432261 -11494733 7742543 12561799 580400
44246E80400j4708016k215192J6820332K5399520J0770038j4745770k2246485
44239c45173l894457J5782534J4482496j034564j2515073j5624043j5442675j2479869
44231c1070824n804699J333713P507190J4362378J8497212J4860761Q471925O917121
44223C5074777L935448q708820j7540640l786374J8752025J6657311r586122k3039569
44215A1758036q708625O304525L396272k64567O460737M704770j0923466r871675
44207B856007K0107343L8964173J4561927k2171685k7347085j3217333j5950987
44200b197640k6398795j2042480J5098130J5524634n818788p362520J4498066
44193h699393K0322539m09379j1738561M142877J9014044J0975839k995810m528934
$$ plain form
44246 580400 -14127616 -16342808 477524 25877044 36647082 21901312 -345173
44239 -345173 -4239630 11542904 26025400 24990836 12475763 -3148280 -18590955 -31070824
44231 -31070824 -36875523 -35541810 -28034620 -13672242 4824970 19685731 28157656 35074777
44223 35074777 39010225 30301405 12760765 8974391 27726416 44383727 34797605 11758036
44215 11758036 3049411 9353936 12750208 12485641 18946378 23651148 12727682 2856007
44207 2856007 22963350 61927523 76489450 54317765 26970680 13753347 -2197640
44200 -2197640 -28596435 -40638915 -25540785 -10016151 -15834939 -23197459 -8699393
44193 -8699393 11623146 11213767 -524794 3618083 22632127 33607966 30612156 26083222
44185B6083222k200365m995914m671511n20367p314507k4522407l0200251j6700417
44177f5042517j25863J2345159K7505651L4028849J1059057k1788409j5505050
44170a7523123K8368793M3908509k378168n3303273m2231922J1274806L8035030
44163F150652J9695795j953273J616615J4639374J4635807n5847k0268227l3598523
44155H62373k5345441L119736K4149061J6055052m215387n850515Q975096J1290053
44147B9040028q305601k7303837k3982201q49770K3330691K9679051J2927558
44140C4535919q973205j0222129P000120J0921342j1535526l0801256k1175840
44133c0250575k503241l255800r022889J0079108M0241441L9884114N003029k7483183
$$ plain form
44185 26083222 23882857 18886943 14215432 13695065 6380558 -18141849 -48342100 -65042517
44177 -65042517 -65168380 -52823221 -25317570 8711279 19770336 -2018073 -17523123
44170 -17523123 10845670 54754179 52376011 -927262 -43159184 -31884378 6150652
44163 6150652 25846447 23893174 25509789 40149163 54784970 54729123 34460896 862373
44155 862373 -24483068 -21363332 2785729 18840781 14625394 8774879 17749975 29040028
44147 29040028 20734427 -6569410 -30551611 -31401381 -8070690 21608361 34535919
44140 34535919 25562714 15340585 22340705 33262047 21726521 -9074735 -30250575
44133 -30250575 -32753816 -36009616 -45032505 -34953397 5288044 45172158 50175187 22692004
44125B2692004l6533765l2096374j7391109J4614680M4312104L5879794l873103
44118B7604231k4161894l658438J9487595J1028951r796624j1043308P73831L174148
44110A3408492j78706N161114J1104028K958283j0361500j3371561j3604230k3000218
44102b7884298k6857248n824525K4056104K9526101J0490020l751373m078477
44095d323696r300802k2807679k1010756L236193K0614190Q280635j4039998j4043225
44087e3395138O188059J7735111P907262p777475j1876473k942703J2146678K6482118
44079e532561L1503954K1463722L914843n440298l288019m221173j9178834l6718533
44071a7496899l5441542j1535525J5544676K5386791J7094092M586641k476792
$$ plain form
44125 22692004 -13841761 -45938135 -63329244 -48714564 -4402460 31477334 27604231
44118 27604231 3442337 -216101 19271494 30300445 20503821 9460513 10234344 13408492
44110 13408492 13229786 18390900 29494928 32453211 22091711 8720150 -4884080 -27884298
44102 -27884298 -54741546 -60566071 -36509967 -6983866 3506154 -245219 -4323696
44095 -4323696 -13624498 -36432177 -57442933 -54206740 -33592550 -25311915 -39351913 -53395138
44087 -53395138 -47207079 -29471968 -21564706 -29342181 -41218654 -44161357 -32014679 -5532561
44079 -5532561 25971393 47435115 51349958 45909660 42621641 38400468 19221634 -17496899
44071 -17496899 -52938441 -64473966 -48929290 -23542499 -6448407 -1861766 -4338558
44064d338558o325240j0572017j0024890K108229J9041481K2744974P216509q990711
44056A0859777n241703J0808334J2166850o697583j8667989m434197J6102161
44049A4895650J3948921k453644r11651J9050077J9538951j6810236n2519586
44042e261518m2436235M319679L5937369K3280339j0518874k5903951j2693096
44035c3276287O815720R472313l022958r952513k8953J2432631P306983j0193223
44027b0446287j3995007N175961K4941681K2537294L663415j2228673j9101501
44020i453117k0418308j2409123P957956K6775520K5637316O969314r303677j1011046
44012D744835k266045P172200P223029r840419l6125014m5837527k4240400Q799865
$$ plain form
44064 -4338558 -10663798 -21235815 -31260705 -29152476 -10110995 12633979 19850488 10859777
44056 10859777 5618074 16426408 28593258 21895675 3227686 -1206511 14895650
44049 14895650 28844571 26390927 25479276 44529353 64068304 47258068 -5261518
44042 -5261518 -47697753 -43378074 -7440705 15839634 5320760 -20583191 -33276287
44035 -33276287 -26460567 -16988254 -20011212 -29963725 -29992678 -17560047 -10253064 -20446287
44027 -20446287 -34441294 -29265333 -4323652 18213642 21877057 9648384 -9453117
44020 -9453117 -29871425 -42280548 -34322592 -7547072 18090244 25059558 15755881 4744835
44012 4744835 2478790 9650990 16874019 7033600 -29091414 -74928941 -99169341 -90369476
44004i0369476K3306409J8873252J7407822K3488262J9453341m02656j7388811
43997e631857j5642497j270227J0591535J1259183k24959j4905689j4941484M768426
43989b5997569K0248480O236661k3924588l3126100j3157686Q214656J4350514
43982d7155632J9430708L2506812L6155371J7521295p141990j7093399j4229487
43975A9993678j0323185p909443p344246j2301023j6501209o605920J1902546
43968b9088802J6754061N983060K577387J0545700L423226k4227787l4764458
43961d8797613p330273J9167053M226123k5482061j5688606K8737906N1260543
43954F093072K9060510k277860j1399820r548114j4925458j9897262j2061142
$$ plain form
44004 -90369476 -67063067 -48189815 -30781993 -7293731 12159610 11756954 -5631857
43997 -5631857 -21274354 -22544581 -11953046 -693863 -918822 -15824511 -30765995 -25997569
43989 -25997569 -5749089 487572 -23437016 -56563116 -69720802 -61506146 -47155632
43982 -47155632 -27724924 4781888 40937259 58458554 51316564 34223165 19993678
43975 19993678 9670493 1761050 -5583196 -17884219 -34385428 -40991348 -29088802
43968 -29088802 -12334741 -6351681 -3774294 6771406 10194632 -14033155 -48797613
43961 -48797613 -56127886 -36960833 -32734710 -58216771 -73905377 -45167471 6093072
43954 6093072 35153582 32875722 21475902 11927788 -2997670 -22894932 -34956074
43947c4956074J213411O936106N369937K467953p28726l142197j704281J356091
43939b3187780J019237j084191j251278k350405m691006J447704J6933529K1440460
43931H276270L240289j4145943n108197J3359047P873021j2459133r253034J7673567
43923I455887K7088441N648666j1772934n086152r43964j8535749l1123690j3434593
43915c8704088J2464037J4110129q67146o411371k261415j619688M59751J1498985
43907a1330806J6780504M142858q036253j390330O977166m152194j7752441r169976
43899b3931472M857530l595009j5756958M082524L5418599K4202603k3445064
43892A832753m0361637l487550K9591493J5582199q868592K304834K5334107J2668174
$$ plain form
43947 -34956074 -33742663 -26806557 -21436620 -18968667 -19697393 -22839590 -24543871 -23187780
43939 -23187780 -22168543 -23252734 -24504012 -26854417 -31545423 -30097719 -13164190 8276270
43931 8276270 11516559 -2629384 -7737581 5621466 13494487 1035354 -8217680 9455887
43923 9455887 36544328 42192994 30420060 25333908 24389944 5854195 -25269495 -38704088
43915 -38704088 -26240051 -12129922 -12997068 -19408439 -21669854 -23289542 -22829791 -11330806
43907 -11330806 5449698 9592556 1556303 165973 7143139 2990945 -14761496 -23931472
43899 -23931472 -19073942 -22668951 -38425909 -34343385 1075214 25277817 1832753
43892 1832753 -38528884 -42016434 -12424941 3157258 -5711334 -3406500 21927607 34595781
43884C4595781k2875038l0950019o476167J0021661L308054j801853M710855J392451
43876h074275j7344429k3524849k868369J7369407J0012780j0498140j2399140
43869d7327015O474280J9984430J2178312n336148j1665078L10393J8458783K3226183
43861A6304140P331330j4700354k1797410j0599315L568612Q244345M489920l322367
43853a0481099j3143644j7963548q945365Q189545J4657271L574654j0460213
43846c4572399j3507058q572025j727338J0201450K5592353K9067293J3464093
43839A9946369l529738l107442O852950P294146j108674n529632q459619j9702141
43831g343781k7505107r713429K5042036L9171859J7479421j1575615j7623733
$$ plain form
43884 34595781 11720743 -19229276 -25705443 -15683782 -12375728 -14177581 -9466726 -8074275
43876 -8074275 -25418704 -48943553 -51811922 -34442515 -24429735 -34927875 -47327015
43869 -47327015 -40852735 -20868305 -8689993 -14026141 -25691219 -25380826 -6922043 16304140
43861 16304140 23635470 8935116 -12862294 -23461609 -19892997 -11648652 -7158732 -10481099
43853 -10481099 -23624743 -41588291 -50533656 -42344111 -27686840 -24112186 -34572399
43846 -34572399 -48079457 -56651482 -58378820 -48177370 -22585017 6482276 19946369
43839 19946369 16416631 13309189 20162139 27456285 26347611 20817979 12358360 -7343781
43831 -7343781 -34848888 -44562317 -19520281 19651578 37130999 25555384 7931651
43824G931651n187339N935380J1670564J4997983Q256025j0919180k2047412p505836
43816C131836J4472421J0954339j5831794k8787598r451119J5255011J0922835
43809F65931j8873718l9574257k7460918Q131389L8811809M3413614K2964014
43802B8077864k747720j2781489k598586J4409896K1094908J0292935j2306852
43795D3440956l2934070l7879087k3385479L65592J8635636K5856213K6370753
43788B0470514K3017143J2585529m712806j8362413j7347412n085194K347386
43781A2912747m748701j7329706j9179190p726901M569274R278607J1141356J3395142
43773B312628P457137j0162798k2279810j2033594P362783Q446195o338498n624512
$$ plain form
43824 7931651 2744312 8679692 20350256 35348239 43604264 32685084 10637672 3131836
43816 3131836 17604257 28558596 12726802 -16060796 -25511915 -10256904 665931
43809 665931 -18207787 -57782044 -85242962 -77111573 -38299764 5113850 28077864
43802 28077864 25330144 12548655 9950069 24359965 45454873 55747808 43440956
43795 43440956 10506886 -27372201 -50757680 -50392088 -31756452 -5900239 20470514
43788 20470514 43487657 56073186 51360380 32997967 15650555 10565361 12912747
43781 12912747 8164046 -9165660 -28344850 -36071751 -31502477 -22223870 -11082514 2312628
43773 2312628 9769765 -393033 -22672843 -34706437 -27343654 -18897459 -25235957 -30860469
43765c0860469J8960782L3667496J3053945j9130827k5782385j0335742k660558
43758b3087758p484872m169147R374352J1331751l214866j1706072k632273O899684
43750b4689201L663233p45838L706211N269149m364680q398519Q080278K7547522
43742A0068155K2156149m891893k4627395k2486033j0623157l303876j232425
43735c4940475j091082k360150j319218P071583J7410833J6364309J706478j1037326
43727h195048o554696J2019319K7211495K5594535R677224n528781o896323L417511
43719E0745236R654095K12015j8349589k9068793k4281125j2244278m639953l054765
43711c1027157k25116P867596J4308619Q011329j0692737k4627082j6133029J1064020
$$ plain form
43765 -30860469 -11899687 21767809 34821754 15690927 -10091458 -20427200 -23087758
43758 -23087758 -30572630 -34741777 -25367425 -14035674 -17250540 -28956612 -31588885 -24689201
43750 -24689201 -21025968 -21771806 -18065595 -12796446 -17161126 -25559645 -17479367 10068155
43742 10068155 32224304 27332411 2705016 -19781017 -30404174 -33708050 -34940475
43735 -34940475 -36031557 -38391707 -39710925 -32639342 -15228509 1135800 2842278 -8195048
43727 -8195048 -14749744 -2730425 24481070 50075605 59752829 54224048 47327725 50745236
43719 50745236 60399331 60611346 42261757 13192964 -11088161 -23332439 -27972392 -31027157
43711 -31027157 -31252273 -23384677 -9076058 -1064729 -11757466 -36384548 -52517577 -41453557
43703d1453557L3484670L3897715J8562757M350000l216235j0247685j7838277
43696A7539388j7380009m962373Q783595J0329796J037784m822662p66846K000808
43688A1759481p413338j8645581j1606464J1254075K2589475Q605960q491333
43681H052275l580460J1584945P663133j1912153j2749020J5286848L7954852
43674E2300420K6118810k882197j5280102j0506300j3011671k7407338l2326540
43667b2994918j7402103L86499L457382l178575m719014J486454P602621J0450511
43659b4911143J3674092J7076194J3585638Q16665r755398l836405J3817297J8389950
43651C8856890m812435l5862931m0291039j2098008J9001817K5253694R315716
$$ plain form
43703 -41453557 -7968887 25928828 44491585 48841585 45625350 35377665 17539388
43696 17539388 159379 -4802994 3980601 14310397 15348181 10525519 9758673 11759481
43688 11759481 4346143 -14299438 -25905902 -14651827 7937648 16543608 8052275
43681 8052275 4471815 16056760 23719893 11807740 -941280 14345568 52300420
43674 52300420 78419230 75537033 60256931 49750631 36738960 9331622 -22994918
43667 -22994918 -40397021 -40010522 -36553140 -39731715 -44450729 -42964275 -35361654 -24911143
43659 -24911143 -11237051 5839143 19424781 20241446 10486048 6649643 20466940 38856890
43651 38856890 34044455 -1818476 -42109515 -54207523 -35205706 -9952012 -636296
43644f36296r628925k0316947k0472884r858713M309967P239356m920408j6415314
43636g0700164j3153499j641393M926745O973478J1003686J3979730J1114150
43629c7497267Q330838J0554197Q623165m362616j5030683q242224P238195J4098893
43621a6287502J6645842K8289714L7089014J7040177k5812253n1382081l7400803
43614c1817892n191684J5864846K2556769K3487852J6346196q94001j4469558
43607B5882528j1295244O8035K097793o086014j0307674k363102J2501686K4078242
43599C4576250K4001324R700419j0580455k2386745k0775082j4718710j1377684
43592a1560683o194032M367578J1290325N033153q443812j4438481p723895M283850
$$ plain form
43644 -636296 -10265221 -30582168 -51055052 -60913765 -56603798 -49364442 -54284850 -70700164
43636 -70700164 -83853663 -85495056 -80568311 -73594833 -62591147 -48611417 -37497267
43629 -37497267 -29166429 -18612232 -9989067 -14351683 -29382366 -37624590 -30386395 -16287502
43621 -16287502 358340 28648054 65737068 82777245 56964992 5582911 -31817892
43614 -31817892 -37009576 -21144730 1412039 24899891 41246087 40352086 25882528
43607 25882528 14587284 14655319 16753112 10667098 359424 -2003678 10498008 34576250
43599 34576250 58577574 68277993 57697538 35310793 14535711 -182999 -11560683
43592 -11560683 -17754715 -13387137 -2096812 2936341 -5507471 -19945952 -27669847 -23385997
43584b3385997J2169515J1425217L521853l546227o59051J0674006J7032851R073885
43576C6306052o158847j3783918p107171Q258707K0080216J6668759l122789k3203925
43568B7937084k3146248l178390J3328946Q387528r917454k2304358k2131347
43561c1024239j4151895p79444J6026727K6388104K1531667Q706617L978070J0723655
43553D1399262J6257870J0003981m300571j5139021j4526087k805365J1423897
43546D2313966J6678766R537086p73036l320687J545349N120681K765816k421498
43538G1446443n080274j510634P191893J0701844l632197k9996617l9551029j3049766
43530c480337K6772086L6078664N530755k6204122k3753098M04542J0147382j270356
$$ plain form
43584 -23385997 -11216482 208735 3730588 184361 -474690 10199316 27232167 36306052
43576 36306052 30147205 16363287 9256116 17514823 37595039 54263798 51141009 27937084
43568 27937084 4790836 1612446 14941392 23328920 13411466 -8892892 -31024239
43561 -31024239 -45176134 -45955578 -29928851 -3540747 17990920 26697537 30675607 41399262
43553 41399262 57657132 67661113 63360542 48221521 33695434 30890069 42313966
43546 42313966 58992732 68529818 67756782 64436095 65981444 71102125 73867941 71446443
43538 71446443 66366169 64855535 72047428 82749272 79117075 49120458 9569429 -3480337
43530 -3480337 23291749 59370413 64901168 38697046 14943948 15348490 25495872 24225516
43522B4225516q385841J651837J1016739N354028r27401Q151393J7882030M248515
43514F3216816k3257264l0877708j1748850L928348j937257p827777O780903K1623023
43506A9900234O654494k5424245l3647867r453975J2708664Q438394n778427n533317
43498c2136045N584571R759211M480337J29269Q91575L633673P001387R649716
43490H993694P008099j094418p435748q766032j0424406j3490561r505752M006660
43482c0708464J5281731J5077953R726004P463373M442790l318986n993597O472980
43474A8443784K4237578K6201688O290669j9158804k8567346j4648576Q827595
43467B1626588J8114722N318304q454251l79619J6632529R300072k0158528k8568553
$$ plain form
43522 24225516 15839675 17491512 28508251 33862279 32934878 41086271 58968301 63216816
43514 63216816 39959552 9081844 -2667006 1261342 -675915 -8503692 -1722789 19900234
43506 19900234 26554728 1130483 -32517384 -41971359 -29262695 -20824301 -26602728 -32136045
43498 -32136045 -26551474 -16792263 -12311926 -12182657 -11291082 -7657409 -656022 8993694
43490 8993694 16001793 14907375 7471627 -1294405 -11718811 -25209372 -34715124 -30708464
43482 -30708464 -15426733 -348780 9377224 16840597 21283387 17964401 11970804 18443784
43474 18443784 42681362 68883050 75173719 56014915 27447569 12798993 21626588
43467 21626588 39741310 45059614 36605363 36225744 52858273 62158345 41999817 13431264
43459A3431264J161692K4710550L70136m2370920m3060829n36394K8279817J5142211
43451b872473o433152l975537P382098L553402m098198M904564J8048125J0168403
43443B6677232j0700084j3753288M638026J5199109K826022j0871813m293514
43436I721690Q716170J005000k3108362l0248732n648991K4357363K8645212J2859095
43428B6298445N647058J3503078J4740226j214534j5372415j0780866N22864k18843
43420C3125013p262401l402115Q205116R882531J114175j80088J1782839K0484412
43412G3749482J2169925n415454j5273384j1255744k198330k605954j7813038
43405C1357503l2864430k4257652P609181K9749524J6563939j3469793k3375548
$$ plain form
43459 13431264 14592956 39303506 39673642 -2697278 -45758107 -46294501 -18014684 -2872473
43451 -2872473 -9305625 -13281162 -5899064 -2345662 -6443860 -1539296 16508829 26677232
43443 26677232 15977148 2223860 6861886 22060995 24887017 14015204 9721690
43436 9721690 18437860 19442860 -3665502 -33914234 -39563225 -15205862 13439350 26298445
43428 26298445 31945503 45448581 60188807 58974273 43601858 32820992 33343856 33125013
43420 33125013 25862612 22460497 30665613 40548144 41662319 41482231 53265070 73749482
43412 73749482 85919407 80503953 65230569 53974825 51776495 49170541 31357503
43405 31357503 -1506927 -25764579 -18155398 11594126 28158065 14688272 -8687276
43398h687276r997941j993400r873001j1828416M707832J9591492J2904000l906332
43390i083042q240689O82066P910024Q939196J1321402J6654312J6255186M080431
43382D8518886j3814778k2874925j3138406P308505J6141984K951103j4464319
43375A0628050j3720263o68072J725775p826566q297146M436996Q267706n915391
43367a1368911j5029587j88733K2519949K7740248J7546440J0838892J1046978
43360F3105276O309755p283681k0815483k4808917j4665250O871249K3567959
43353C2280908J6404899q524509k0334662o006792P184444p611265l2942401l1911645
43345e1461023l830434J6838445J2140634m00343k365344J685365L375384P693017
$$ plain form
43398 -8687276 -18685217 -20678617 -30551618 -42380034 -37672202 -18080710 -5176710 -9083042
43390 -9083042 -17323731 -16641665 -8731641 207555 11528957 28183269 44438455 48518886
43382 48518886 34704108 11829183 -1309223 5999282 22141266 25092369 10628050
43375 10628050 -3092213 -3760285 -2034510 -9861076 -18158222 -13721226 -5453520 -11368911
43367 -11368911 -26398498 -26587231 -4067282 23672966 41219406 52058298 63105276
43360 63105276 69415031 62131350 41315867 16506950 1841700 8712949 32280908
43353 32280908 48685807 40161298 19826636 13819844 21004288 13393023 -19549378 -51461023
43345 -51461023 -55291457 -38453012 -26312378 -26712721 -29078065 -27392700 -24017316 -16324299
43337a6324299J6468484J4335840r542702l6611047l6490639q164938J5006262
43330f1323039Q655886r292290n069951J9478566K7804861O154160r989797J0641585
43322a2940019M0913544L2252099q623515k7423757o557613J0350657o381481
43315B1589915k3939536m853567K9379960L4346426J1401951m951540o446010
43308E6527599j0933457j6863607n443861J6737581K1397149N531129m699117
43301F2253416N91063L051021o100775j2154963p703742m671538q430532j0131608
43293A6702342r767249j5619511j7861662Q68255K3823366J2020173k9973825
43286a9808111m6430336j1847481K4743968J1756844k6208342k6579098J8195752
$$ plain form
43337 -16324299 144185 14480025 4937323 -31673724 -68164363 -76329301 -61323039
43330 -61323039 -52667153 -61959443 -67029394 -47550828 -19745967 -13591807 -23581604 -12940019
43322 -12940019 27973525 60225624 51602109 24178352 17620739 27971396 21589915
43315 21589915 -2349621 -7203188 22176772 56523198 67925149 62973609 56527599
43308 56527599 45594142 28730535 23286674 40024255 61421404 66952533 62253416
43301 62253416 62844479 65895500 59794725 47639762 39936020 35264482 26833950 16702342
43293 16702342 6935093 -8684418 -26546080 -25677825 -1854459 10165714 -19808111
43286 -19808111 -66238447 -78085928 -53341960 -41585116 -67793458 -94372556 -76176804
43279g6176804N3978563M2850895N583582j5820780o580824J5119167K0325043
$$ plain form
43279 -76176804 -22198241 20652654 26236236 10415456 3834632 18953799 39278842
$$ [...]
##END NTUPLES=NMR SPECTRUM
##END=
