##TITLE=31Pdec_LR-701-C1
 CDCl3, 96 sc
 20.11.2019
##JCAMPDX= 6.0         $$ Bruker NMR JCAMP-DX V2.0
##DATA TYPE= NMR SPECTRUM
##DATA CLASS= NTUPLES
##ORIGIN= UXNMR, Bruker Analytische Messtechnik GmbH
##OWNER= root
$$ XWIN-NMR		Version 3.5
$$ Wed Nov 20 14:42:23 2019 Russian Standard Time (UT+4h)  she@DPX200
##.OBSERVE FREQUENCY= 81.013821
##.OBSERVE NUCLEUS= ^31P
##.ACQUISITION MODE= SIMULTANEOUS
##.ACQUISITION SCHEME= undefined
##.AVERAGES= 96
##.DIGITISER RES= 17
##SPECTROMETER/DATA SYSTEM= spect
##.PULSE SEQUENCE= zgpg30
##.SOLVENT NAME= THF
##.SHIFT REFERENCE= (INTERNAL, THF, 0, 182.463)
##AUDIT TRAIL= $$ (NUMBER, WHEN, WHO, WHERE, WHAT)
$$ ##TITLE= Audit trail, XWIN-NMR		Version 3.5
$$ ##JCAMPDX= 5.01
$$ ##ORIGIN= Bruker BioSpin GmbH
$$ ##OWNER= she
$$ F:/spectra/data/she/nmr/P31/1/pdata/1/auditp.txt
$$ ##AUDIT TRAIL=  $$ (NUMBER, WHEN, WHO, WHERE, WHAT)
(   1,<2019-11-20 14:41:09.53 +0400>,<she>,<DPX200>,
      <continue with go, POWCHK disabled, PULCHK disabled
       configuration hash MD5:
       00 E9 B6 7A A2 85 ED C7 34 08 36 98 17 FE 4E 26
       data hash MD5: 32K
       FE 38 33 44 4E 48 6C 72 E1 43 D3 38 31 3C D0 0A>)
(   2,<2019-11-20 14:41:12.62 +0400>,<she>,<DPX200>,
      <Start of raw data processing
       efp BC_mod = 2 LB = 1 FT_mod = 6 PKNL = 1 PHC0 = -1302.88 PHC1 = 39.00098 SI = 64K 
       data hash MD5: 64K
       D3 BB BF 7B A5 C5 F3 83 28 2A 87 E1 3A 76 FA CC>)
(   3,<2019-11-20 14:41:18.28 +0400>,<she>,<DPX200>,
      <abs ABSG = 5 
       data hash MD5: 64K
       BA 46 E9 B2 E3 12 76 A8 36 D1 FE DC 96 7C 96 E9>)
(   4,<2019-11-20 14:41:51.89 +0400>,<she>,<DPX200>,
      <pk PHC0 = -35.48605 PHC1 = 140.8 
       data hash MD5: 64K
       EA AD BD 74 A1 AC 47 2F F9 01 34 E3 8B 75 C4 E4>)
(   5,<2019-11-20 14:41:55.00 +0400>,<she>,<DPX200>,
      <abs ABSG = 5 
       data hash MD5: 64K
       DC B9 E7 9A 2E 38 5B DE DC AC 52 49 8F E6 28 F2>)
$$ ##END=
$$ 
$$ hash MD5
$$ E9 94 04 4B E4 80 52 89 DF 6A D2 5D 9B AB B0 CE
##$RELAX= 
##$RELAX= 
##$RELAX= 
##$RELAX= 
##$RELAX= 
##$RELAX= 
##$RELAX= 
##$RELAX= 
$$ Bruker specific parameters
$$ --------------------------
##$DU= <F:/spectra>
##$EXPNO= 1
##$NAME= <P31>
##$PROCNO= 1
##$TYPE= <nmr>
##$USER= <she>
##$AMP= (0..31)
100 100 100 100 100 100 100 100 100 100 100 100 100 100 100 100 100 100 
100 100 100 100 100 100 100 100 100 100 100 100 100 100 
##$AQSEQ= 0
##$AQ_mod= 1
##$AUNM= <au_zg>
##$AUTOPOS= <>
##$BF1= 81.014009
##$BF2= 200.13
##$BF3= 200.13
##$BF4= 200.13
##$BF5= 200.13
##$BF6= 200.13
##$BF7= 200.13
##$BF8= 200.13
##$BYTORDA= 1
##$CFDGTYP= 0
##$CFRGTYP= 5
##$CHEMSTR= <none>
##$CNST= (0..31)
1 1 145 1 1 1 1 1 1 1 1 1 1 1 1 1 1 1 1 1 1 1 1 1 1 1 1 1 1 1 1 1 
##$CPDPRG= <waltz16>
##$CPDPRG1= <>
##$CPDPRG2= <waltz16>
##$CPDPRG3= <>
##$CPDPRG4= <mlev>
##$CPDPRG5= <mlev>
##$CPDPRG6= <mlev>
##$CPDPRG7= <mlev>
##$CPDPRG8= <mlev>
##$CPDPRGB= <>
##$CPDPRGT= <>
##$D= (0..31)
0 1 0 0 0 0 0 0 0 0 0 0.03 2e-05 3e-06 0 0 0 0 0 0 0 0 0 0 0 0 0 0 0 0 
0 0 
$$ [...]
##$SUBNAM3= <"">
##$SUBNAM4= <"">
##$SUBNAM5= <"">
##$SUBNAM6= <"">
##$SUBNAM7= <"">
##$SUBNAM8= <"">
##$SUBNAM9= <"">
##$SW= 369.568048894756
##$SWIBOX= (0..15)
0 1 3 0 0 0 0 0 0 0 0 0 0 0 0 0 
##$SW_h= 29940.119760479
##$TD= 32768
##$TD0= 1
##$TE= 0
##$TE2= 300
##$TE3= 300
##$TEG= 300
##$TL= (0..7)
0 120 53 12 22 120 120 120 
##$TP= (0..7)
150 150 150 150 150 150 150 150 
##$TP07= 0
##$TPNAME0= <>
##$TPNAME1= <>
##$TPNAME2= <>
##$TPNAME3= <>
##$TPNAME4= <>
##$TPNAME5= <>
##$TPNAME6= <>
##$TPNAME7= <>
##$TPOAL= (0..7)
0.5 0.5 0.5 0.5 0.5 0.5 0.5 0.5 
##$TPOFFS= (0..7)
0 0 0 0 0 0 0 0 
##$TUNHIN= 0
##$TUNHOUT= 0
##$TUNXOUT= 0
##$USERA1= <user>
##$USERA2= <user>
##$USERA3= <user>
##$USERA4= <user>
##$USERA5= <user>
##$V9= 5
##$VALIST= <valist>
##$VCLIST= <CCCCCCCCCCCCCCC>
##$VD= 0
##$VDLIST= <DDDDDDDDDDDDDDD>
##$VPLIST= <PPPPPPPPPPPPPPP>
##$VTLIST= <TTTTTTTTTTTTTTT>
##$WBST= 1024
##$WBSW= 4
##$XGAIN= (0..3)
0 0 0 0 
##$XL= 0
##$YL= 0
##$YMAX_a= 17333
##$YMIN_a= -12438
##$ZGOPTNS= <>
##$ZL1= 120
##$ZL2= 120
##$ZL3= 120
##$ZL4= 120
##$ABSF1= 182.463
##$ABSF2= -187.1042
##$ABSG= 5
##$ABSL= 3
##$ALPHA= 0
##$AQORDER= 0
##$ASSFAC= 0
##$ASSFACI= 0
##$ASSFACX= 0
##$ASSWID= 0
##$AUNMP= <proc_1d>
##$AZFE= 0.1
##$AZFW= 0.5
##$BCFW= 0
##$BC_mod= 2
##$BYTORDP= 0
##$COROFFS= 0
##$CY= -3
##$DATMOD= 1
##$DC= 0
##$DFILT= <>
##$DTYPP= 0
##$F1P= 0
##$F2P= 0
##$FCOR= 1
##$FTSIZE= 65536
##$FT_mod= 6
##$GAMMA= 0
##$GB= 0
##$INTBC= 1
##$INTSCL= 5.30512e-09
##$ISEN= 30
##$LB= 1
##$LEV0= 0
##$LPBIN= 0
##$MAXI= 10000
##$MC2= 0
##$MEAN= 0
##$ME_mod= 0
##$MI= 50
##$NCOEF= 0
##$NC_proc= -7
##$NLEV= 6
##$NOISF1= 182.463
##$NOISF2= 159.3651
##$NSP= 0
##$NTH_PI= 0
##$NZP= 0
##$OFFSET= 182.463
##$PC= 4
##$PHC0= -1338.366
##$PHC1= 179.801
##$PH_mod= 1
##$PKNL= yes
##$PPARMOD= 0
##$PSCAL= 0
##$PSIGN= 0
##$REVERSE= no
##$SF= 81.0140089999434
##$SI= 65536
##$SIGF1= 159.3651
##$SIGF2= -187.1042
##$SINO= 113.3802
##$SIOLD= 16384
##$SREGLST= <1H.CDCl3>
##$SSB= 0
##$STSI= 65536
##$STSR= 0
##$SW_p= 29940.119760479
##$SYMM= 0
##$S_DEV= 0
##$TDeff= 32768
##$TDoff= 0
##$TI= <>
##$TILT= no
##$TM1= 0
##$TM2= 0
##$TOPLEV= 0
##$USERP1= <user>
##$USERP2= <user>
##$USERP3= <user>
##$USERP4= <user>
##$USERP5= <user>
##$WDW= 1
##$XDIM= 65536
##$YMAX_p= 321384505
##$YMIN_p= -34515721
$$ End of Bruker specific parameters
$$ ---------------------------------
##NTUPLES= NMR SPECTRUM
##VAR_NAME=  FREQUENCY,     SPECTRUM/REAL,   SPECTRUM/IMAG
##SYMBOL=    X,             R,               I
##VAR_TYPE=  INDEPENDENT,   DEPENDENT,       DEPENDENT
##VAR_FORM=  AFFN,          ASDF,            ASDF
##VAR_DIM=   65536,         65536,           65536
##UNITS=     HZ,            ARBITRARY UNITS, ARBITRARY UNITS
##FACTOR=    0.456856943014862, 1,           1
##FIRST=     14782.0589164792, 0,            0
##LAST=      -15158.0608439998, 0,           0
##MIN=       -15158.0608439998, -34515721,   0
##MAX=       14782.0589164792, 321384505,    0
$$ Real data points
##PAGE= N=1
##DATA TABLE= (X++(R..R)), XYDATA
$$ [...]
42470B3339993k527605j275524n799635j1335481q395574L256400J2277567R675957
42462A9216098j03161n676132k850950K238740K742388p12765k461814M57337
42454A2849741N095070O349512K435728l662670p464413o997103l633962M1426
42446E013329K331524K885733K287516J464933R40193N70600J93359j33352r79675
42437A4574160l289124n945001n195740P70194P444767P762434R13118n941963
42429A1092845o327346j813869J579929J584201O90281M36817r04148m039753
42421B298957n512245j528984O166752J0869279Q162263J126287l299917k548541
42413A5733851o28275j560397l733931l456976j589686k108876m846996m864803
$$ y = [23339993, 20812388, 19536864, 13737229, 2401748, -5993826, -2737426, 9540141, 19216098, 19112937, 13436805, 10585855, 12824595, 15566983, 14854218, 12392404, 12849741, 17944811, 24294323, 26730051, 23067381, 15602968, 8605865, 4971903, 5013329, 7344853, 10230586, 12518102, 13983035, 14923228, 15493828, 15687187, 15553835, 14574160, 11285036, 5340035, 144295, 914489, 8359256, 16121690, 17034808, 11092845, 4765499, 2951630, 4531559, 6115760, 6806041, 7242858, 6338710, 2298957, -3213288, -4742272, 1424480, 12293759, 20456022, 21582309, 18282392, 15733851, 15105576, 13545179, 9811248, 6354272, 4764586, 2655710, -2191286, -7056089]
42405g056089j34466M972828O072541M336570K815676J310340j214989k632122
42397H470289q97183J143192o08618m515581n184442j816596Q93537O31081P62747
42388a121574L935991P135167O306475K783748J425856L522856M729215P66155
42380B9483889o282150r035518l237943N786872Q085183J445714m906095k047423
42372A9292529O649771J0246587M774861l088656o327537m998047k186271J116530
42364B5479767M243391M993760L052706J635250K673037L635477J998617l98076
42356D7313929o07299P33975J267532J038864J571510K867184M195354N909784
42348F4290833P939739Q750434Q443338J0341303J6339014K2910696K4999248
$$ y = [-7056089, -7190555, -2217727, 3854814, 8191384, 11007060, 12317400, 11102411, 8470289, 7573106, 8716298, 8107680, 3592099, -1592343, -3408939, -2515402, -1884321, -1121574, 2814417, 9949584, 16256059, 19039807, 20465663, 23988519, 28717734, 29483889, 23201739, 14166221, 10928278, 16715150, 24800333, 26246047, 21339952, 19292529, 25942300, 36188887, 40963748, 37875092, 31547555, 26549508, 24363237, 25479767, 29723158, 34716918, 37769624, 39404874, 42077911, 45713388, 47712005, 47313929, 46706630, 47440605, 48708137, 49747001, 51318511, 54185695, 58381049, 64290833, 72230572, 80981006, 89424344, 99765647, 116104661, 139015357, 164014605]
42341A64014605K1950833J6656494J1158564O429316L984222L635106J579874
42334B29409014n086565j3492631j8542327j9510045j8795835j6302593j0793777
42327A26885241n721908p018649j4052156j8619790j5203537p698887l364324
42320E5205990l770423m877512l738365j769374j637402l037113k917375k19837
42312C3238589J196378k550816p809875o126668K943754Q030018Q62909j0371431
42304A9412858j1364073k015630M464492K267287M00714N730336J0421094M427738
42296C3744816p805822j3205856q268156j616204N4124o37786L60504J079123
42288C704743j977361o341549n595043J774213R157787R238714L014913j597907
$$ y = [164014605, 185965438, 202621932, 213780496, 220209812, 224194034, 227829140, 229409014, 224322449, 210829818, 192287491, 172777446, 153981611, 137679018, 126885241, 121163333, 114144684, 100092528, 81472738, 66269201, 58570314, 55205990, 51435567, 46558055, 42819690, 41050316, 39412914, 36375801, 33458426, 33238589, 34434967, 31884151, 24074276, 17947608, 20891362, 28921380, 29784289, 19412858, 8048785, 6033155, 10497647, 12764934, 13165648, 18895984, 29317078, 33744816, 25938994, 12733138, 4464982, 2848778, 2902902, 2265116, 2625620, 3704743, 1727382, -4614167, -10209210, -8434997, 722790, 9961504, 12976417, 11378510]
42280A1378510m23523J823268k18320l606032k296041J762504J089327m323560
42272E186133n980416r56844K728452m94706m188610q97780N080155M990355N462
42263E472201j779897P46053J268858j739480k527304J223548M098723K012334
42255H775036j346701l07998N454954J2024922J5953812J5883329J2241615O685147
42247G5364116M45886o081353j0827096j0328204n672016m009586q990902j3820832
42239A6080013j0554291k334727J975762J790154L144297N576811K989755k665166
42231A6002608k074282M695893N933491k284492p967560k263070N867153M389091
42223B2298832k857249m284948J40694J067025l483396o438863m495523j059419
$$ y = [11378510, 10954987, 12778255, 12559935, 8953903, 6657862, 8420366, 9509693, 5186133, -794283, -1751127, 977325, 482619, -3705991, -4603771, 476384, 5466739, 5472201, 3692304, 4438357, 5707215, 3967735, 1440431, 2663979, 6762702, 8775036, 7428335, 7120337, 12575291, 24600213, 40554025, 56437354, 68678969, 75364116, 75810002, 69728649, 58901553, 48573349, 42901333, 38891747, 29900845, 16080013, 5525722, 3190995, 5166757, 6956911, 10101208, 15678019, 18667774, 16002608, 13928326, 18624219, 24557710, 22273218, 14305658, 12042588, 17909741, 22298832, 19441583, 15156635, 15297329, 16364354, 12880958, 6442095, 1946572, 887153]
42215H87153K317677O648928Q370521K280308p680406j0649468l766856L848671
42207B256528M196725n04191m166712m713127k585905J967101O654282P387616
42199A0492317L671863m15595k173109k773618l119679k487444k008205l648523
42191b461993m934488j224834N653360Q364220N453488L644606N664922M548376
42183B4707657m442517j3961837j3967853n568646J757120K935441P30245m88958
42175h299348J522538O658433J0855960P993759j535857q164344m957490K150016
42167F223667K987132k048811m477263k111893q77751k881886k894212J494817
42159d586200N207568M191429J052197r71376k674279m127372k159509L059213
$$ y = [887153, 3204830, 9853758, 18224279, 20504587, 12824181, 2174713, -1592143, 2256528, 6453253, 5949062, 1782350, -2930777, -5516682, -3549581, 3104701, 10492317, 14164180, 13748585, 11575476, 8801858, 5682179, 3194735, 1186530, -2461993, -7396481, -8621315, -2967955, 5396265, 10849753, 14494359, 20159281, 24707657, 20265140, 6303303, -7664550, -13233196, -11476076, -8540635, -7810390, -8299348, -6776810, -118377, 10737583, 18731342, 17195485, 9031141, 4073651, 6223667, 9210799, 7161988, 2684725, 572832, -304919, -3186805, -6081017, -4586200, 621368, 4812797, 5864994, 4893618, 2219339, -1908033, -4067542, -1008329]
42151a008329N157922M34445n610198n986147j960697O09782P93671K026579M596756
42142i46216N190225K991202P33171j4153j21280K3043O13571L76319j519903
42133G325979k551158l12678K209653J53764m910948o096758j181069M472139
42125h91076O312157N842421N254928L184238m87897j597268J364790K479608
42117B1461901k929457q945452o254106L544835R449595O728710K235601K034399
42109B7326026K508328j249978n431471l290341L283969N927428K053409k385760
42101B8741610k627555q01253q1094P29215L146385M201891O29273m644706n365678
42092B3928088q02219K881717J078947l197691l850903K58509M644587N394130
$$ y = [-1008329, 4149593, 4584038, -1026160, -7012307, -8973004, -8363222, -7569551, -5542972, -946216, 4244009, 7235211, 7968382, 7954229, 7832949, 7855992, 8469563, 8845882, 7325979, 4774821, 4462143, 6671796, 6825560, 1914612, -4182146, -5363215, -891076, 5421081, 11263502, 16518430, 19702668, 19214771, 17617503, 18982293, 21461901, 18532444, 9586992, 3332886, 6877721, 16327316, 23056026, 25291627, 27326026, 29834354, 28584376, 23152905, 19862564, 23146533, 29073961, 31127370, 28741610, 26114055, 25312802, 25231708, 25960923, 29107308, 33309199, 33938472, 29293766, 23928088, 23125869, 26007586, 27086533, 23888842, 20037939, 20296448, 24941035, 30335165]
42084C0335165L043168J29654k369523m678053o051319n154027k279141M67467
42076A3443391J343341K58361j870825l644597l292541k98858K694317J907255
42068A0539844k500758n625954l942774q9339J198540J01347N94198K802999J559334
42059D637437n227894j0899992p184814M432017J3045749J0878121J903147m161585
42051G422186l676099j234548j176049j888736m36032J412501K24921k142957
42043a494813k86227N684143Q343720K732412o432880j0800360q278460l061356
42035a3593821J209874L576091L214228J69204k229343q36600J779988M90580
42027f219799l750217m232351J428395P348601P734196L902566J98190j994792
$$ y = [30335165, 33378333, 33507987, 31138464, 26460411, 20409092, 15255065, 12975924, 13443391, 14786732, 15045093, 13174268, 9529671, 6237130, 5938272, 8632589, 10539844, 8039086, 2413132, -1529642, -1618981, -420441, -319094, 275104, 3078103, 4637437, -590457, -11490449, -18675263, -14243246, -1197497, 9680624, 11583771, 7422186, 3746087, 2511539, 1335490, -553246, -989278, 423223, 648144, -1494813, -1781040, 3903103, 12246823, 14979235, 8546355, -2254005, -10532465, -13593821, -12383947, -8807856, -5593628, -5424424, -7653767, -8490367, -6710379, -6219799, -9970016, -14202367, -12773972, -5425371, 2308825, 6211391, 6409581, 4414789]
42019D414789k603174p4131N030932P376982L105079l585479n154184n50171M327722
42010A2288365M971605K459996l95341k699607m409296m799127l342023p57865
42002C316707J200447O76013k374415m788820l208781O29940J273064j987103
41994e262948k881208J930450N970149K125989n366044o108630J258869P505434
41986h27939O325078J179708k530308m128605m084317j326040K312204J764534
41978a315685k881574m013543K299189Q485891N343325m591802j0644588q235669
41970a5554456k359353J666210L541900L822127J427692k355101k772432K070852
41962a0512561P114226N977506r76925o958434o473743p84273M277596M649128
$$ y = [4414789, 1811615, 1737484, 6768416, 14145398, 17250477, 13664998, 8510814, 7960643, 12288365, 17259970, 19719966, 19324625, 16625018, 12215722, 7416595, 4074572, 3316707, 4517154, 5193167, 2818752, -1970068, -5178849, -4548909, -3275845, -5262948, -8144156, -6213706, -243557, 1882432, -3483612, -9592242, -8333373, -827939, 5497139, 6676847, 4146539, 17934, -4066383, -5392423, -3080219, -1315685, -4197259, -8210802, -5911613, 2574278, 7917603, 3325801, -7318787, -15554456, -17913809, -16247599, -12705699, -8883572, -7455880, -9810981, -12583413, -10512561, -3398335, 2579171, 1602246, -5356188, -11829931, -12614204, -8336608, -3687480]
41954c687480J725885j2428J420518L212406J634822k676591m972650k146570
41946e502088L224290N765554L718450R31537J656641M526246L936559k162025
41938A6095164q396430q110748j863832L272345K677371o91774j156764K128066
41930C953398M401258J384088n056611p925192k661045O385502R624172L905594
41922A4011164k870814k341981K754309L739018J88997J53180N640515P704484
41914B8978872L21841r339876j1303624o879157m215831m501769k115678L501523
41906e553699N916377K547204r95488j33809J895323K77203l499107m545788k247768
41897f339552n17987j503069k687670p74380L627205O465702N131431J723232
$$ y = [-3687480, -1961595, -1974023, -553505, 2658901, 4293723, 1617132, -3355518, -5502088, -2277798, 3487756, 7206206, 8137743, 9794384, 14320630, 18257189, 16095164, 7698734, -412014, -2275846, 996499, 3673870, 2982096, 1825332, 3953398, 8354656, 9738744, 4682133, -3243059, -5904104, 481398, 10105570, 14011164, 11140350, 8798369, 11552678, 15291696, 15480693, 15633873, 21274388, 28978872, 29300713, 19960837, 8657213, 1778056, -2437775, -6939544, -9055222, -5553699, 362678, 2909882, 1914394, 1780585, 3675908, 3953111, 454004, -4091784, -6339552, -6857539, -8360608, -11048278, -11822658, -8195453, -1729751, 3401680, 5124912]
41889E124912K44942J175769J292221q06629k447395j801296j180750k337848
41881g36074k384616R45587L436565R7959n476468m973416J756379N536397J171350
41872f26337n453962o611816k523123K025138M952911N917210L249575k233252
41864a303656m356645Q69778P518233O588797p66320m412545j70218M065384L71147
41855H403955p236855q366974n60708P797770Q461752K462504l029587l606253
41847D325604r25831J266460J557087Q29699k89345k135155m171142m129865o53222
41838d325710L461583K896302l701289j0299288r340797r88141O580320P253316
41830h463704M065323L527188N889024N715987J018857l604746m041672k243808
$$ y = [5124912, 5369854, 6545623, 7837844, 7031215, 4583820, 2782524, 1601774, -736074, -3120690, -2175103, 1261462, 1359421, -4117047, -9090463, -7334084, -1797687, -626337, -6080299, -12692115, -15215238, -13190100, -8237189, -2319979, 929596, -1303656, -5660301, -4790523, 2727710, 9316507, 8550187, 4137642, 3967424, 8032808, 8403955, 1167100, -7199874, -7760582, 37188, 8498940, 10961444, 7931857, 4325604, 3399773, 4666233, 6223320, 7053019, 6763674, 4628519, 457377, -3672488, -4325710, -864127, 2032175, -1669114, -11968402, -21309199, -22297340, -15717020, -8463704, -4398381, -871193, 5017831, 10733818, 11752675, 8147929, 4106257, 1862449]
41822A862449k289940m152833m259080m63090N620747J0090207R774941N493800
41814B1677201K237782L300594M744307L32424p932417j0757185n198775j6273
41806H387658k645774p599028m945348M519327J0712419Q197943J088552m436373
41798A3279376n730337l069706L74059n27496o145713q852875l004629N262780
41790h414541O464806K519523K556502O324799M587731l416935o435982J083171
41782E269074R832281R716868K757274l803163p602557q370048m484884J139089
41774D453934Q66005n283341o725301Q07784O330212J388672m257604J830917
41766e88722J2618382J1439552j159702p932040j356395P030863O231922J60425
$$ y = [1862449, -427491, -4580324, -8839404, -9302494, -3681747, 6408460, 16183401, 21677201, 23914983, 27215577, 31959884, 32292308, 24359891, 13602706, 8403931, 8387658, 5741884, -1857144, -6802492, -2283165, 8429254, 16627197, 17715749, 13279376, 7549039, 4479333, 4853392, 4325896, -1819817, -10672692, -13677321, -8414541, -1949735, 569788, 3126290, 9451089, 14038820, 10621885, 4185903, 5269074, 15101355, 24818223, 27575497, 23772334, 16169777, 7799729, 3314845, 4453934, 5319939, 36598, -6688703, -5880919, 449293, 1837965, -2419639, -588722, 12029660, 23469212, 22309510, 14377470, 13021075, 20051938, 26283860, 26444285]
41758B6444285k518070j198456P851k31756j630909m258708n584028j884746M526817
41749A3672280O090504O75193n269815o707745n813899m915890j760729L750349
41741b79752N824824J570591k931404j515945K712056L330208P73258n76243j123541
41732G784052l802823n958789k210258N377055Q446463M672541J025643K114216
41724A7448100K821554k229829p834142m782232N025238Q964154J084582q800867
41716A1696558q795323j683755M27462m613317n787005L135798J2756060J1369969
41708A8506447J397689n787693o175123m828714m323422j812533K378388K918861
41700B273900j376585m414632k056936J958590K782115J524447J684874L089277
$$ y = [26444285, 23926215, 22727759, 22735610, 22503854, 20872945, 16614237, 11030209, 9145463, 13672280, 19762784, 20437977, 15168162, 8460417, 2646518, -2269372, -4030101, -279752, 5545072, 7115663, 4184259, 2668314, 5380370, 8710578, 9483836, 8907593, 7784052, 3981229, -1977560, -4187818, 1189237, 9635700, 14308241, 15333884, 17448100, 20269654, 18039825, 10205683, 5423451, 10448689, 19412843, 20497425, 11696558, 2901235, 1217480, 1644942, -2968375, -8755380, -5619582, 7136478, 18506447, 19904136, 14116443, 7941320, 3112606, -1210816, -3023349, -644961, 2273900, 897315, -3517317, -5574253, -3615663, -833548, 690899, 2375773, 5465050]
41692E465050L497917K926372K614369K092710M53879j210931j228716o1172J59663
41683A4709141j821398m915757o267806l997644j87809Q94800r12966o09192L770143
41674F61512O419861K446730l276775l283288L69179L29105k625313j422564L307350
41665B925797L544262q65979n22787O511776R334075J944075o009360m473883
41657A2387976J830568L079362p6649j228918r83687l747257p181807n759031
41649a679443r91075J621196K186472L600110K989379l816837j2025854j2462157
41641b0578209n098446J460971L096967L642398N611137O371521M430775K140622
41633A077736J117097O47702N70891Q44927k89140k979830l581124r25351o6563
$$ y = [5465050, 8962967, 11889339, 14503708, 16596418, 17050297, 15839366, 14610650, 14549478, 14709141, 12887743, 7971986, 1704180, -2293464, -2481273, -1586473, -2499439, -3108631, 661512, 7081373, 9528103, 6251328, 2968040, 3337219, 3666324, 1041011, -381553, 2925797, 6470059, 5604080, 5081293, 11593069, 20927144, 22871219, 16861859, 12387976, 14218544, 17297906, 17221257, 15992339, 15008652, 11261395, 4079588, -1679443, -2670518, -1049322, 1137150, 4737260, 7726639, 3909802, -8116052, -20578209, -25676655, -24215684, -21118717, -17476319, -11865182, -5493661, -1062886, 1077736, 2194833, 2842535, 3413426, 4258353, 3969213, 989383, -2591741, -3517092, -3583655]
41624c583655l259727l474280L929814R717683L461852p559381p395231L290874
41616d872051P893471L28616o759338m173681N81606n20847k085146K476122P503483
41607C72235N255910k88764j064467J495710J343648l79784Q09010K600522L00833
41598A0444853l006591j268771K901353J876292l850932o419474l537594q01475
41590c662339q00820O12254N158550P526808L605046k610818m397558j028262
41582D402861K280361J311808k664655m971779l181510j34657k22134l173586
41574f353291m522523k637485r27525j163777L00691N721019R909917O604361
41566F931387j869962p049443n111974j31748K691769K448415J243496J161332
$$ y = [-3583655, -6843382, -10317662, -6387848, 3329835, 6791687, -767694, -8162925, -4872051, 3021420, 3350036, -3409302, -7582983, -7001377, -7522224, -9607370, -7131248, 372235, 5628145, 5339381, 4274914, 5770624, 7114272, 6734488, 7543498, 10144020, 10444853, 7438262, 6169491, 9070844, 10947136, 7096204, 676730, -2860864, -3662339, -4463159, -3850905, 1307645, 8834453, 12439499, 9828681, 5431123, 4402861, 6683222, 7995030, 5330375, 358596, -2822914, -2957571, -3179705, -6353291, -10875814, -13513299, -14440824, -15604601, -15303910, -9582891, 327026, 6931387, 5061425, -1988018, -7099992, -7231740, -4539971, -2091556, -848060, 313272]
41558C13272K643318L674042J536854k796913m278692l08252M936177N726909
41550A1446715J775396l043408n904534n593297j434842M177967N834230K351041
41542I609268J8897L213654O343295K387258m713938n484729k17814J685298k586848
41533A0254341n131282j109564L603460K891901k21274l36443J134805j73482
41525A0912462l599652n308111m454944k485561K83079K790015J650821l469673
41517c681564o342284j775972N903270Q084269L799824N997P09777K575584K149231
41508A1428132Q91634M92408j191836n469693q112494m310819L541157P787361
41500E055850N016071l45106k549119j117757O15946O58146l54430j253140j253159
$$ y = [313272, 2956590, 6630632, 8167486, 5370573, 1091881, 783629, 5719806, 11446715, 13222111, 10178703, 4274169, -1319128, -2753970, 1423997, 7258227, 9609268, 9628165, 12841819, 19185114, 21572372, 16858434, 11373705, 11155891, 12841189, 10254341, 5123059, 4013495, 7616955, 10508856, 10287582, 9951139, 11085944, 10912462, 7312810, 2004699, -2450245, -4935806, -4652727, -1862712, -211891, -3681564, -10023848, -11799820, -5896550, 2187719, 5987543, 5993540, 6703317, 9278901, 11428132, 12319766, 12812174, 11620338, 6150645, -1961849, -6272668, -2731511, 5055850, 10071921, 9726815, 7177696, 6059939, 6675885, 7334031, 6979601, 5726461, 4473302]
41491D473302J86304K142915J867555j671937m602590j950495N025269Q903085
41483A4373408N065931k402568o050521l995517p90258o73018k815190l425389
41475g13122q88964J964127R72708l688156o357572k632854L954947N934478K293648
41466H39240l86485J535421L350140P88929j842023J339793O835134N723717k757116
41457A5426750r243435o793491P84799N076772K780494k811462o328894m299801
41449e408268K476760Q686815Q742080K620966l971111n653492k102904K768726
41441H159572M235126O1386o876143r744111m502116M619460R149274N714651
41433A0817099j205928n241480l892043R82369N066853M276096j276239o241528
$$ y = [4473302, 4659606, 6802521, 8670076, 6998139, 2395549, 445054, 5470323, 14373408, 19439339, 17036771, 10986250, 6990733, 6200475, 5527457, 2712267, -713122, -1602086, 362041, 1334749, -2353407, -8710979, -11343833, -7388886, -1454408, 839240, 452755, 1988176, 5338316, 6127245, 4285222, 5625015, 12460149, 18183866, 15426750, 6183315, -610176, 174623, 5251395, 8031889, 5220427, -1108467, -5408268, -2931508, 5755307, 14497387, 17118353, 13147242, 7493750, 5390846, 8159572, 12394698, 12456084, 5579941, -4164170, -8666286, -4046826, 5102448, 10817099, 9611171, 4369691, 477648, 1460017, 6526870, 10802966, 9526727, 3285199]
41425C285199n759562j294166K251983L473767M331050M799623L030589J31175
41417A4249658p44291O0036n48013k310255k090851m34560j197753m019510l988917
41408a024456j44022K655192K181614J959861L496780K969301r34193l525040
41400G635037k763660l547673p778017q106691O12227J0291486R550355L95222
41392F288286m928299j581868L092616K347430j364654k556461n58529J725892
41384B464413K384798J367587l85017j397057j143584q84287j151422j4181L361419
41375D602669N630644L693156J44024n09285O29799j080218m960427m825429J228466
41366D553399O955642O472820J766809j532820k033799k333049l282775k742712
$$ y = [3285199, -2474363, -3768529, -1516546, 1957221, 6288271, 11087894, 14118483, 14249658, 13505367, 13565403, 13017390, 10707135, 8616284, 8181724, 6983971, 2964461, -1024456, -1168478, 1486714, 3668328, 5628189, 9124969, 12094270, 11160077, 7635037, 4871377, 1323704, -6454313, -14561004, -13948777, -3657291, 5893064, 6288286, 1359987, -221881, 2870735, 5218165, 3853511, 1297050, 738521, 2464413, 4849211, 6216798, 5831781, 4434724, 3291140, 2406853, 1255431, 1241250, 4602669, 10233313, 13926469, 14070493, 13561208, 14191007, 13110789, 8150362, 3324933, 4553399, 11509041, 17981861, 19748670, 18215850, 16182051, 13849002, 10566227, 7823515]
41358G823515K16837L079921K963341L25210j834296j969874j465897j567535
41350G571222r77556J273365K412130o78098n351376n550327r36394K060518L90377
41341B13861p67147K646442N624121J876945n245633p375061l646068l23628N05444
41332f490724K909769P195027O853586j218124j0153902j1320135m990605J254915
41324a5960193K374623O72151J433912N581409P377355R39893j0311889j4505714
41316b2398453n426753P660607J0445978J807542n829869l948432K612784N474069
41308i602527L759532J216873r24315k771257k302226J312548M265293L110919
41300a935160N41192J136923L457800J834108m537042r343767p065991L11465
$$ y = [7823515, 8040352, 11120273, 14083614, 14408824, 12574528, 10604654, 9138757, 7571222, 6593666, 7867031, 10279161, 9601063, 4249687, -1300640, -2237034, -176516, 213861, -553286, 2093156, 7717277, 9594222, 4348589, -3026472, -6672540, -6996168, -6490724, -3580955, 3614072, 10467658, 9249534, -904368, -12224503, -17215108, -15960193, -13585570, -12913419, -11479507, -5898098, 1479257, 2419150, -7892739, -22398453, -27825206, -20164599, -9718621, -7911079, -13740948, -17689380, -15076596, -9602527, -5842995, -4626122, -5550437, -8321694, -10623920, -9311372, -5046079, -1935160, -1393968, -257045, 3200755, 5034863, 497821, -8845946, -15911937, -15600472]
41292a5600472O030843O020861K174767r23720j132171n9264J36720m21502n43759
41283d317697k23759J89247J375890L019352K225850k300547o026869l530892
41275i589425K799186M721239l88374n890576n647018j543558J889236M642594
41267i006696Q192897R846444O208802q3389k931951j193157N55782m70603j781335
41258I336794p12238R44647k69521m206411p075376o194489k888657m8866J724353
41249i389764L572726M506365J533839m630332p536079k580421N683094Q622283
41241b18289M571547m88275k397791k582929k091723Q06729M734893L942102k928077
41232C348187q536135o227421P84672M634218L416267J343821J273214K386098
$$ y = [-15600472, -9569629, -3548768, -1374001, -2297721, -3429892, -3489156, -3352436, -3773938, -4317697, -4541456, -4352209, -2976319, 43033, 2268883, -31664, -6058533, -9589425, -6790239, -2069000, -2457374, -8347950, -13994968, -15538526, -13649290, -9006696, -813799, 9032645, 15241447, 15158058, 12226107, 11032950, 11588732, 11118129, 9336794, 8624556, 9569203, 9299682, 5093271, -1982105, -8176594, -11065251, -11114117, -9389764, -5817038, -1310673, 223166, -4407166, -11943245, -14523666, -8840572, -218289, 4353258, 3864983, 1467192, -1115737, -3207460, -2400731, 2334162, 6276264, 3348187, -5187948, -11415369, -10630697, -5996479, -2580212, -1236391, 36823, 2422921]
41224B422921L324495K873105p37672o639700r053216l159560P238505J2313426
41216H582304O982007l747669j0369520p936936J8863N190439K877056k820327
41208a223783m038997O83577N033486M391940J497496L17712j44521j872989k705907
41199A938014m10015K074337R96566j766311k104608o82298r35867k422205j835063
41190e147450R51912K904951K524756N29213j995770k718407R45150O038718M554420
41181H587493m711144j0844463n135690N058549O556204m33935m898368l210644
41173i031998j400632p86799L930117J0713929R115519k208105j0147703n856844
41165e672516K649553M050425l29396k503193j043665O72812K453546M731520
$$ y = [2422921, 5747416, 8620521, 7882849, 1243149, -7810067, -10969627, -3731122, 8582304, 15564311, 11816642, 1447122, -6489814, -6470951, -1280512, 1596544, -1223783, -5262780, -4579203, 454283, 4846223, 6343719, 6661431, 6516910, 4643921, 1938014, 1527999, 3602336, 4598902, 2832591, 727983, 45685, -890182, -3312387, -5147450, -4195538, -1290587, 1234169, 1763382, -232388, -2950795, -2005645, 4033073, 8587493, 3876349, -6968114, -12103804, -7045255, -489051, -922986, -5821354, -9031998, -10432630, -11219429, -7289312, 3424617, 12540136, 10332031, 184328, -5672516, -3022963, 1027462, 698066, -1805127, -2848792, -2175980, 277566, 5009086]
41157E009086L844125j766589n846514k911550K416234K782383r8185J52522K717398
41148F298910J906031j563340j580015K352573M445509K578767K96629j127299
41140A3607765m087334p410184o127573k97672L548140K178621RQ85527K200979
41131D498278N50427k163702k606920j582765j612897k289800j885941j012595
41123h105915j150311j493093l94789J526100K460919K415662K704382L283087
41115A246042K802798J027598m80170k80263J065404J215054j507762n357798
41107b69097n830527q17149N574643O947045K474369k061978k001803N02893O16074
41098E134470j950059l232750j591715k69931k369758o005205o717182l468999
$$ y = [5009086, 8853211, 7086622, 1240108, -1671442, 744792, 3527175, 3428990, 3581512, 6298910, 8204941, 6641601, 5061586, 7414159, 11859668, 14438435, 14735064, 13607765, 9520431, 2110247, -4017326, -4314998, -766858, 1411763, 1411772, 2297299, 4498278, 5048705, 2885003, 278083, -1304682, -2917579, -5207379, -7093320, -8105915, -9256226, -10749319, -11144108, -9618008, -7157089, -4741427, -2037045, 1246042, 4048840, 5076438, 4596268, 4316005, 5381409, 6596463, 5088701, -269097, -6099624, -6916773, -1342130, 5604915, 8079284, 6017306, 4015503, 4518396, 5134470, 3184411, -48339, -1640054, -1909985, -4279743, -10284948, -17002130, -20471129]
41090b0471129L71643K014508K479598L569054M143488K214739p12774j043924
41082g434797J312405K540318R45524m57687P42386K084978K09162l757377o159188
41073i974276n918308m116558n77562M742755Q265043N807900o55720m035410
41065f462136j234498K940099K973827k4577j205882O28592K379700K121518J274618
41056C391261J084003M27723j353527k160433k24317K109609R06172l359880n689461
41047d868850l201373J417920M580884O256215P109506N103908n09502m880419
41039A1008289l155516J402748J474199l014225n054379k286304k69724k070103
41031a965015l172401n45535J584553K87898J89028M302832O140790k30336q302496
$$ y = [-20471129, -20099486, -18084978, -15605380, -12036326, -7892838, -5678099, -6390873, -7434797, -6122392, -3582074, -2636550, -3094237, -2351851, -266873, -57711, -3815088, -9974276, -15892584, -20009142, -20586704, -15843949, -7578906, -1771006, -2426726, -6462136, -7696634, -4756535, -1782708, -1807285, -3013167, -2384575, -4875, 2116643, 3391261, 4475264, 4902987, 3549460, 1389027, 1164710, 3274319, 4180491, 820611, -4868850, -8070223, -6652303, -2071419, 4184796, 11294302, 16398210, 15888708, 11008289, 7852773, 9255521, 10729720, 7715495, 2661116, 374812, 105088, -1965015, -5137416, -5682951, -4098398, -3810500, -3621472, 681360, 6822150, 6591814, -1710682]
41022a710682p466540P82325N450273K433542k165327l933771m777177n277387
41014a6664744k566933K388016M366271K832552K960012N748843N753532J303800
41006F121349j765490k81311P56382k506739n609967l404041J635625M281337
40998g72855M187924L509175K183038N19168J088923L051561M65448p884657j2917265
40989f569540o891314M112856P566856J335654m961283l849664K312678P242429
40981B98672P847381M949274J766007J860814M951038N697249K32970p847220
40973A9756185j1934414j0609183p007440k700765K173595M808567K240983k781420
40965f053892m396657j713600J201566K629603M194245M786205O51247o827045
$$ y = [-1710682, -9177222, -8394897, -2944624, -511082, -2676409, -6610180, -11387357, -16664744, -19231677, -16843661, -12477390, -9644838, -6684826, -935983, 4817549, 6121349, 4355859, 4074548, 4830930, 2324191, -3285776, -6689817, -5054192, -772855, 3415069, 6924244, 9107282, 9626450, 10715373, 13766934, 14232382, 6347725, -6569540, -13460854, -9347998, -1781142, -445488, -5406771, -9256435, -6943757, 298672, 8146053, 13095327, 14861334, 16722148, 21673186, 27370435, 27603405, 19756185, 7821771, -2787412, -9794852, -12495617, -10322022, -5513455, -3272472, -6053892, -10450549, -12164149, -10962583, -8332980, -4138735, 647470, 1298717, -5528328]
40957e528328r924208m252539N015028R582060P187175J861421j905329k717253
40949f81973j920263j533274j715625m55581K732336M302063J076485m069255
40941b265087n192846j530616J851497J889933J196148K737242N215553N612806
40933I514630L083205j162491n177062o715626m971075k021269L8227K351163
40925e060298O041259P524276K842504m182008n187216O51493N138357L471861
40917A1240228M37998R26538K011814l04394l157332k171021L74155k88376k845469
40908F224141k596078q2205O7326k472383l236026o26990J900741J816904O35641
40899A631071K21805J66525j20538P4449J288440L050654M455045L910353j91905
$$ y = [-5528328, -15452536, -19705075, -14690047, -5107987, 2079188, 3940609, 2035280, -681973, -2602236, -4135510, -5851135, -6306716, -3574380, 727683, 1804168, -2265087, -7457933, -8988549, -7137052, -5247119, -4050971, -1313729, 3901824, 9514630, 12597835, 11435344, 6258282, -457344, -5428419, -7449688, -7411461, -5060298, 980961, 8505237, 11347741, 7165733, 1978517, 2630010, 7768367, 11240228, 11678226, 12604764, 14616578, 14312184, 11154852, 8983831, 9357986, 9069610, 6224141, 3628063, 3545858, 3613184, 1140801, -2095225, -2722215, -821474, 995430, 1631071, 1852876, 2019401, 1898863, 1973312, 3261752, 6312406, 10767451, 14677804, 14485899]
40890A4485899o208167q864600n560254p96772r3182j800605m92738L232839L354384
40881b743196j095081l610610n34628K991301J463470k018856p52286M782740
40873a517146P083598K086312n269261p230470k267529L893465N342413K274028
40865D395410p18931j461348k334430m674250m948682m31627M187989K010082
40857c975787m906405o640230M12333P267643M686185l491448n555804K080698
40849a0122815J0377842R233631r79942j0601337j0932754k532545N712307O022364
40841c823249K44938l089694k07638L780977L910333K676645L732132M002166
40833A1226610l09975m063103L88106Q599724P421182n056749j4394626r791581
$$ y = [14485899, 8277732, -586868, -6147122, -6943894, -7037076, -8837681, -9330419, -6097580, -2743196, -3838277, -7448887, -7983515, -4992214, -3528744, -5547600, -6299886, -1517146, 5566452, 7652764, 2383503, -4846967, -7114496, -3221031, 2121382, 4395410, 3676479, 2215131, -119299, -4793549, -9742231, -10173858, -5985869, -3975787, -8882192, -15522422, -15110089, -7842446, -3156261, -6647709, -12203513, -10122815, 255027, 9488658, 8508716, -2092621, -13025375, -15557920, -9845613, -3823249, -3578311, -6668005, -6875643, -3094666, 815667, 3492312, 7224444, 11226610, 10916635, 6853532, 7241638, 15841362, 23262544, 18205795, 3811169, -5980412]
40825e980412J202162N635601L702660L910404O460812M241060k441293n068076
40817A1662918j307951J618374K51922K77820M344639N268496j701227q727841
40809A1687150o310040J853285M296260j675600p913479p962092l363522J873882
40801g514156N530414N633813J409503l222272k691344K633770O511029M896826
40793A3187583l62099n546553p990061n689171M99790M851073K928749j020033
40785H59278J81992M374951K658787n071616p964911j170675N803395L946944
40777C618145j842350k615782j72121j482187m526559j641571O071753R366280
40769F775608N296355N82783k22256l47056k552628l768913j229866K543358M037271
$$ y = [-5980412, -4778250, 857351, 4560011, 8470415, 14931227, 19172287, 16730994, 11662918, 10354967, 11973341, 12225263, 12503083, 16847722, 22116218, 20414991, 11687150, 5377110, 7230395, 11526655, 9851055, 1937576, -6024516, -9388038, -7514156, -1983742, 3650071, 5059574, 1837302, -854042, 1779728, 8290757, 13187583, 12825484, 7278931, -711130, -6400301, -5900511, -1049438, 1879311, 859278, 1041270, 5416221, 8075008, 3003392, -4961519, -6132194, -328799, 3618145, 1775795, -839987, -1012108, -2494295, -7020854, -8662425, -2590672, 6775608, 12071963, 12654746, 12432490, 12085434, 9532806, 5763893, 4534027, 7077385, 11114656]
40760A1114656L089488Q77766j840951l177674j500314P64758l66222l744891
40752E216616m464835k139613j235735k474936j476656K231579K906476j533166
40744b970270n135755l565941o00348j27298P21628M321657N784565J131436m011736
40735d452062k603475K016795K024626j226531j00580M925322N181453j350154
40727D415394n933121k700596K828352L108051r89671l957911m035810k697732
40719i963044r6068L978257P330881P603578N322306J951788k575091p547400
40711F005207r305287m911335L302957R521015R845980M425367l818307j0394713
40703D670884j1022950n118971K768149O670239M362810j291365m989385l125958
$$ y = [11114656, 14204144, 15081910, 13240959, 10063285, 8562971, 9327729, 8961507, 5216616, 751781, -1387832, -2623567, -5098503, -6575159, -4343580, -1437104, -2970270, -8106025, -11671966, -12272314, -12399612, -11677984, -7356327, -1571762, -440326, -4452062, -7055537, -5038742, -3014116, -4240647, -4341227, 584095, 5765548, 4415394, -1517727, -4218323, -1389971, 1718080, 728409, -3229502, -7265312, -9963044, -10059112, -6080855, 1250026, 8853604, 14175910, 16127698, 13552607, 6005207, -3300080, -8211415, -4908458, 4612557, 14458537, 18883904, 15065597, 4670884, -6352066, -11471037, -8702888, -2032649, 2330161, 1038796, -3950589, -7076547]
40695g076547K643735N995657K739205l113198l865365R89617L692704l4857m173345
40686b202394j731767M336269N937287K083383j036925n90480K1838j059342j138680
40677D619189M54383j27437l935997n764218k369955J438357M99599j698730J153469
40668e731340O547964N953593j172924n069179o5030O361356M109327n326813
40660E606954j1551516r200830k606122K408615M864861N815499M955326K743653
40652C036440J814546L096545L458894M81211k826864j943517J903190K736406
40644A1756851j697887o452133n985153j219107K544532K902151K359325L339780
40636G548359M354799K671158j231120m227664m711281l605779j464389K165929
$$ y = [-7076547, -4432812, 1562845, 4302050, 1188852, -2676513, -1686896, 2005808, 1970951, -2202394, -3934161, 402108, 6339395, 8422778, 7385853, 6795373, 6817211, 5757869, 4619189, 5073572, 4946135, 1010138, -4754080, -7124035, -5685678, -5186079, -6884809, -5731340, 816624, 6770217, 5597293, 528114, 463084, 6824440, 10933767, 5606954, -5944562, -15145392, -17751514, -15342899, -10478038, -4662539, 292787, 3036440, 4850986, 7947531, 11406425, 11887636, 9060772, 7117255, 9020445, 11756851, 10058964, 3606831, -2378322, -3597429, -1052897, 1849254, 4208579, 7548359, 11903158, 14574316, 13343196, 9115532, 4404251, 798472, -665917, 1500012]
40628A500012N552674M738790o04700m669758k959365N73848o35976m859349m409394
40619e773218J279646L677934j071846n252386j942089L536270K423138l215363
40611f337914m509709l02819K501439J416729J023902L099101L939810K918395
40603C748934M256821P851369P405854J028603m943728o405012o858110p924803
40595a840072m339603M826307R464316K311211q042365q618632p40456M074034
40587b905260K573304J713559M155474M535297R05160j679584j256770k344130
40579E697050o265136p642247m262289j534541k649658k605676K592618Q193361
40571h476518Q245796M671598K543317J731960j56015j124782J800756N638359
$$ y = [1500012, 7052686, 11791476, 11186776, 6517018, 3557653, 4131501, 3495525, -1363824, -5773218, -4493572, -815638, -1887484, -7139870, -9081959, -5545689, -3122551, -6337914, -10847623, -11150442, -8649003, -7232274, -6208372, -3109271, 830539, 3748934, 8005755, 15857124, 23262978, 24291581, 19347853, 12942841, 6084731, -1840072, -6179675, -1353368, 8110948, 10422159, 2379794, -6238838, -6979294, -2905260, -331956, 1381603, 5537077, 10072374, 10977534, 9297950, 8041180, 5697050, -568086, -8210333, -12472622, -14007163, -16656821, -19262497, -16669879, -8476518, -230722, 4440876, 6984193, 8716153, 8560138, 7435356, 9236112, 14874471]
40563A4874471M814734k44274l808002l113177j036871j175821l969571o822894
40555d81405n696711J058412Q274217P567273j176823p086692k364008O232970
40547F327233P334617J767548l31262L209114L539792l790987j1001004r858995
40539b803944l001438J924569L167875L974566N044605L912651K6254m020174
40531H224964n565826l707989O02191M467503M805956J754827j447268k739601
40523F394757k906923k623782j510788q89583k896550n417233l344324K583706
40515a0610720M438592j017080n484973j017288O588930N638052l009159o272109
40507a0745755J379675R150115N722923m489819q288087j984775N436781O111391
$$ y = [14874471, 19689205, 19444931, 15636929, 12523752, 11486881, 10311060, 6341489, -481405, -6178116, -5119704, 3154513, 10721786, 9544963, 2458271, 94263, 6327233, 13661850, 15429398, 15098136, 18307250, 21847042, 18056055, 7055051, -2803944, -5805382, -3880813, -712938, 3261628, 8306233, 12218884, 12245138, 8224964, 2659138, -1048851, -446660, 4020843, 8826799, 10581626, 9134358, 6394757, 3487834, 864052, -646736, -1536319, -4432869, -9850102, -13194426, -10610720, -6172128, -7189208, -12674181, -13691469, -7102539, -1464487, -4473646, -10745755, -9366080, -215965, 5506958, 1017139, -7270948, -9255723, -3818942, 2292449]
40499B292449K698641K144552N324687O723716K485702m646713q792562p364057
40491H66415k831326J055011K997344L687725L385428J696927q95764l020264
40483F941496l776399k832740J31353M156721N952255L105785j557976k341871
40475I778624J432283L591781l43169o160338o438004q07640M106685M276297
40467I436519K525632K167657J464028k430999p462626q705770m997338n1925
40459h054822K510832K297739N56009j564035k671687j579861R55033K682706
40451d868086K689584K145495J847335J038101o08596j882581j937101j410997
40443b986846o86099Q63244K750718K970602J270087J05549K78289j137278n252745
$$ y = [2292449, 4991090, 7135642, 12460329, 19184045, 21669747, 17023034, 8230472, 866415, -1964911, -909900, 2087444, 5775169, 9160597, 10857524, 9961760, 6941496, 3165097, 332357, 463710, 4620431, 10572686, 13678471, 12120495, 9778624, 11210907, 14802688, 14459519, 8299181, 1861177, 1053537, 5160222, 9436519, 11962151, 14129808, 15593836, 13162837, 5700211, -3005559, -8002897, -8054822, -5543990, -3246251, -2690242, -4254277, -6925964, -8505825, -7550792, -4868086, -2178502, -33007, 1814328, 2852429, 2243833, 361252, -1575849, -2986846, -3672945, -2809701, -58983, 2911619, 4181706, 4287255, 4565544, 3428266, -1824479]
40434a824479p073016j790154O660247R294294L939100k424642l680424j130426
40426A970500J191227J767408P471m541353q315541n293055L231387O717798o15370
40417c879528r490995p318304L933879J1112729Q830478M340805L270463J831122
40409A2630649l089852o281068l106561J648269J354298j666087q92403K856972
40401C454217L132128r38376l521047k031494o25343k441084m773276m101938
40393a1846213q50053K876916N810741O038820J653798m889355p481592m026673
40385a2713611O98993K415814K904282M682860N121763J367323k648267r71064
40377H58093M401230N374722m37926o443068o928635m075825k530576k281486
$$ y = [-1824479, -8897495, -10687649, -4027402, 5266892, 9205992, 6781350, 3100926, 1970500, 3161727, 4929135, 4936606, 395253, -7920288, -13213343, -9981956, -3264158, -3879528, -13370523, -20688827, -16754948, -5642219, 3188259, 7529064, 10799527, 12630649, 9540797, 3259729, 153168, 1801437, 3155735, 1489648, 597245, 3454217, 6586345, 5647969, 2126922, 95428, -529915, -2970999, -7744275, -11846213, -12696266, -9819350, -4008609, 2030211, 3684009, -1205346, -8686938, -12713611, -12014618, -9598804, -6694522, -2011662, 3110101, 4477424, 1829157, 858093, 5259323, 10634045, 10196119, 3753051, -3175584, -7251409, -9781985, -12063471]
40369a2063471p48724J824110L217299L164068K807194J889066k08966j836478
40361a955902o86090K439854M069627K202125j703488m565068m334498j534618
40353f068058J045724J345425R51509K643959M779583K420069m037467o669806
40345c589062q99386O181282M885638k920268o609836k328301K796225K621317
40337A37609k29917j116159m16705L6604J391829M280278N762394L750496K76312
40328A3872741k669109n624439p204013l567109L582640N565281q68447o674469
40320c586924l486163L218299L192668k136328l525175j28000Q04761j425323
40312g072185n8443M847414M827023j371317l730309K299164P201302K664094
$$ y = [-12063471, -12812195, -10988085, -7770786, -4606718, -1799524, 89542, -119424, -1955902, -2641992, -202138, 3867489, 6069614, 4366126, -198942, -4533440, -6068058, -5022334, -3676909, -2725400, -81441, 4698142, 7118211, 3080744, -3589062, -4488448, 1692834, 6578472, 3658204, -2951632, -5279933, -2483708, 137609, -92308, -1208467, -1625172, -1588568, -196739, 4083539, 9845933, 13596429, 13872741, 11203632, 5579193, -1624820, -5191929, -1609289, 3955992, 3087545, -3586924, -7073087, -3854788, -662120, -2798448, -6323623, -6451623, -5646862, -7072185, -7130628, -2283214, 2543809, 1172492, -2557817, -258653, 6942649, 9606743]
40304I606743n266703o737021k604601P81224L241545P017326Q000545J745155
40296A5784213o440214q157126m974801m179129m927836o19756O720380P340377
40288E46108p6116n383794k884891J036035L63779j009110J895254N815015N834911
40279F137191M077292M290249L552976k557484j0469569j2208945o387328J073804
40271a2491814N507850O599240M466898p14136n442577n400745j947248q28224
40263a0250756l510146m986683j862409K383905L077542J237383R90443K770656
40255a0150065L393889J858272Q21393J765926K374558O07065j368057k75873
40247i72892K771319L503653R57914j278638j248316j639373m000755m362146
$$ y = [9606743, 4340040, -2396981, -5001582, -4220358, -978813, 6038513, 14039058, 15784213, 9343999, 1186873, -3787928, -7967057, -12894893, -13514649, -6794269, 546108, 469992, -4913802, -7798693, -6762658, -6398879, -7407989, -5512735, 302280, 6137191, 10214483, 14504732, 18057708, 15500224, 5030655, -7178290, -13565618, -12491814, -6983964, -384724, 4082174, 3368038, -2074539, -7475284, -9422532, -10250756, -13760902, -18747585, -20609994, -18226089, -15148547, -13911164, -12920721, -10150065, -6756176, -4897904, -4076511, -2310585, 63973, 671038, -697019, -972892, 1798427, 5302080, 6259994, 4981356, 3733040, 2093667, -1907088, -6269234]
40239f269234O31848O592889O733373K402885P45926K230768m57290q668159j2456697
40230h513691n053197N259070O419162J81990k008582K172346L247294k865036
40222a160644o846958p67067Q264165P697143k299261r322362n897913J971156
40214h361741M658473Q71358l348334l406563j95261K669229K455281j049196
40206e706754n045062n246833q8636O635489R337797O884970L011750K87888k941504
40197G129105p697822j0016261n803703J701250M798217K032147M02588M527861
40189b926618Q996659O292037j437108n018298j527699J886343r59427o266877
40181i60988o174030m8539N055499M161896N6478j714461n7348J821739J884770
$$ y = [-6269234, -5637386, 955503, 7688876, 10091761, 10837687, 13068455, 12611165, 3943006, -8513691, -13566888, -8307818, -1888656, -1706666, -3715248, -1542902, 1704392, -1160644, -8007602, -8774669, -510504, 7186639, 4887378, -4434984, -10332897, -8361741, -3703268, -2831910, -6180244, -9586807, -9782068, -7112839, -4657558, -5706754, -10751816, -15998649, -16087285, -9451796, -113999, 6770971, 9782721, 10070609, 7129105, -568717, -10584978, -16388681, -14687431, -9889214, -7857067, -7454479, -2926618, 6070041, 12362078, 10924970, 5906672, 4378973, 6265316, 5305889, -960988, -7135018, -7183557, -2128058, 2033838, 2090316, 375855, 318507, 2140246, 4025016]
40172D025016J464665K000303K393093J120552q58508j421193m95482K27185R3193
40163H548824l83637j513598l504823l965007l67179M484908M240829j814549
40155E725768o241878l427187K489150M206573J688085J24449O51561J80806j158245
40146D239082j16123K137649L96780n026972o711285j483737L294221j41026q270110
40137a1681521j0431278k342922R154252J4013112Q817581n10875m590018n78498
40129A849833M014915Q89456o634151p282376J219375P600567L763765k882694
40121B538690j648007M373070M280761k182636m666026K71985M065229P94519
40113G827585m127762m398563k603428l533776n089376k796616J691814L422789
$$ y = [4025016, 5489681, 7489984, 9883077, 11003629, 10145121, 8723928, 8228446, 8455631, 8548824, 8165187, 6651589, 3146766, -818241, -1185420, 3299488, 7540317, 5725768, -516110, -3943297, -1454147, 2752426, 4440511, 4564960, 5216521, 5397327, 4239082, 4122959, 6260608, 6657388, 1630416, -5080869, -6564606, -3270385, -3411411, -11681521, -22112799, -24455721, -15301469, -1288357, 7529224, 7018349, 2428331, 1849833, 5864748, 6754204, 120053, -7162323, -5942948, 1657619, 5421384, 2538690, 890683, 5263753, 9544514, 7361878, 2695852, 2967837, 7033066, 7827585, 3699823, -698740, -3302168, -6835944, -11925320, -14721936, -13030122, -9607333]
40105i607333K120831J265152J585912J030900l57211m76868Q52544J999399K681087
40096A094413L473044L291494R18882j896335k252213k53402J662548K555034
40088H593465K957070K015820j706457o700158q920929o162909j25342N481975
40080d567465P266032L976185j607279l945194n59120M634429O290157M102337
40072A5590082J268689j173130m041822n717854l559706O43150J874274p81941
40064D101742k744653r88583J782710J489347k288482o744058q305431m555619
40056a8253027K695398O773481L413072j848228m275P339069Q501747q22054r495745
40047a700562o397109L414163O403440k85274o692910n198012R71263M806839
$$ y = [-9607333, -7486502, -6221350, -4635438, -3604538, -3961749, -4438617, -3586073, -1586674, 1094413, 4567457, 7858951, 8777833, 6881498, 4629285, 4375883, 6038431, 8593465, 11550535, 13566355, 11859898, 5159740, -3761189, -9924098, -10049440, -4567465, 2698567, 6674752, 5067473, 1122279, 563159, 5197588, 11487745, 15590082, 16858771, 15685641, 11643819, 5925965, 2366259, 3009409, 4883683, 4101742, 1357089, 368506, 2151216, 3640563, 1352081, -5391977, -13697408, -18253027, -15557629, -8784148, -5371076, -7219304, -7223579, 115490, 8617237, 7795183, -1700562, -8097671, -4683508, 1719932, 1434658, -5258252, -10456264, -9485001, -4678162]
40039d678162L890653J29643l441337l996913j122469J570496P35006j076852
40031g989935J194451O140486O295008o97340p113422n096211K608296O580720
40023A922053L245768j478925j285449J884177J089539n114341r254260m239224
40015a3230662O227453J1011629N527727k597130m044232P98773M868566M741584
40007A3303708K566901L32798k074620m211091n127680m965130k962743L180810
39999D2953J1483456J3580509N336124m482411m872487J517208L797221J447682
39991B7850255M067999J2463452J5229545Q323913L256511Q513729J6435695J8290873
39983A14431972J9986245L0237865M2865098M4906971L5612393K3484788R859173
$$ y = [-4678162, -787509, -657866, -4099203, -8096116, -9218585, -7648089, -6913083, -7989935, -6795484, -654998, 5640010, 4942670, -2170752, -7266963, -4658667, 1922053, 5167821, 3688896, 2403447, 4287624, 5377163, 262822, -8991438, -13230662, -7003209, 4008420, 9536147, 6939017, 2894785, 3693558, 8562124, 13303708, 15870609, 16203407, 14128787, 9917696, 4790016, -175114, -3137857, 42953, 11526409, 25106918, 30443042, 25960631, 21088144, 22605352, 26402573, 27850255, 31918254, 44381706, 59611251, 67935164, 71191675, 79705404, 96141099, 114431972, 134418217, 164656082, 207521180, 252428151, 288040544, 311525332, 321384505]
39976C21384505r611309l0010710l9067988l4677320k7629998k5418652k4809570
39969A30158958k2085435j9304106j7526713j3894135q638887o190768o678893
39962C5840021m925020k13770J746040r86399l457899l421145m508228o687005
39954A3386595l693285N532377J2644237J2364120R586062Q280587L526743p553402
39946E4074034j6310773j3814008m608351L64594j115654l668332n074082o196420
39938C651008m648848J508602P038931N851242J049967l68736N71260j846818
39930A2806608o000105n564333k259743l567993p810009m713742O440893J2165377
39922A496953M116405p650623q589217J180639J0018789J1300074P991742M012133
$$ y = [321384505, 311773196, 281762486, 242694498, 208017178, 180387180, 154968528, 130158958, 108073523, 88769417, 71242704, 57348569, 48709682, 42518914, 35840021, 30915001, 30701231, 32447271, 31460872, 28002973, 24581828, 20073600, 13386595, 9693310, 15225687, 27869924, 40234044, 49820106, 58100693, 61627436, 54074034, 37763261, 23949253, 19340902, 19705496, 18589842, 14921510, 9847428, 3651008, -997840, 510762, 7549693, 13400935, 14450902, 14082166, 14653426, 12806608, 6806503, 1242170, -1017573, -4585566, -12395575, -17109317, -10668424, 1496953, 5613358, -2037265, -10626482, -9445843, 572946, 11873020, 19864762, 23876895]
39914B3876895j65058l486196l148094L70297J643463l269403j0580876j1834390
39906f593362l688174P118787J0521636M394672l609541n920126l062182Q8289
39898g50001J701743K529561J602819k015900n179855l950594K79362L092484
39890b690381L830201M423914L537126r37165m951020k438875L628835L701705
39882H104340l187842o583626p48738N923438L873215l261189n160421j4271N245468
39873D190374O466093N814613N062026K494879k746593p989562r727725o732744
39865c168639q97217L606040L750468J511831J549255L889355L220605k352263
39857A1109435p081602n892735j896006o26509j318626R4600K925610L285782
$$ y = [23876895, 23711837, 20225641, 17077547, 17447844, 19091307, 15821904, 5241028, -6593362, -10281536, -3162749, 7358887, 11753559, 8144018, 2223892, -838290, -750001, 951742, 3481303, 5084122, 3068222, -2111633, -6062227, -5782865, -2690381, 1139820, 5563734, 9100860, 8163695, 3212675, 773800, 4402635, 8104340, 4916498, -1667128, -2415866, 3507572, 7380787, 4119598, -1040823, -1055094, 4190374, 10656467, 16471080, 21533106, 24027985, 21281392, 13291830, 3564105, -3168639, -4065856, -459816, 3290652, 4802483, 6351738, 10241093, 13461698, 11109435, 4027833, -1864902, -3760908, -4387417, -5706043, -5611443, -2685833, 599949]
39849E99949J237987n0852n51100k593474n262416n569932m024905l166198j911310
39840b1292251K279884O756479O235312J717008l19434J965227L687297K252678
39832C282200Q79487J080523o37966m940487n669911J010549Q926591R359652
39824A3290638K694502l122803l557033j400181l50728O02515N194867J4539196
39816B7890973K4868713L0483388K9108584K3384491J5658149L604488j4540708
39809A40458078l1696564l6023773k5562623j2406482q175071j0665173j0019385
39802E909007l345582L547333N971796M596577R71301m176250p801680o023295
39794c50793k41343L332055J772360j589700l535988m869685n696937k680797
$$ y = [599949, 1837936, 1787084, 1235984, -1357490, -6619906, -12189838, -16214743, -19380941, -21292251, -19012367, -12255888, -6020576, -4303568, -4623002, -2657775, 1029522, 3282200, 4161687, 5242210, 4604244, -336243, -6006154, -4995605, 3930986, 13290638, 15985140, 12862337, 9305304, 7905123, 7554395, 8156910, 13351777, 27890973, 52759686, 83243074, 112351658, 135736149, 151394298, 154998786, 140458078, 108761514, 72737741, 47175118, 34768636, 26593565, 15928392, 5909007, 2563425, 6110758, 12082554, 16679131, 17650432, 13474182, 5672502, -350793, -592136, 2739919, 4512279, 2922579, -613409, -5483094, -11180031, -13860828]
39786a3860828M657994R722218O712679m41886l369611j455123j430692n044238
39778d509487n518004P70763O785026M885351j206756k179298K385864M163890
39770E577349J42493k911172o06118J305677k998586q437634n985819L316487
39762a0597323R624287Q028216L089630l61142l055264n941983o124024j997851
39754g335454K623012L671834K542822K929913M874351N486802L351816o90036
39746A7455060m896932o399483k737462L433698M778950j445260p932839o459727
39738d203995K63442K560444j650571m109226N18936O085216M006180m207683
39730g37257r039631n395194K016238N510139L014203r93203j084905L523256
$$ y = [-13860828, -9202834, 519384, 7232063, 6790177, 3420566, 1965443, 534751, -4509487, -10027491, -9256728, -2471702, 2413649, 1206893, -972405, 1413459, 5577349, 5719842, 2808670, 2202552, 3508229, 509643, -7927991, -13913810, -10597323, -973036, 7055180, 10144810, 9783668, 6728404, 786421, -5337603, -7335454, -4712442, -1040608, 1502214, 4432127, 9306478, 14793280, 18145096, 17455060, 12558128, 6158645, 3421183, 6854881, 11633831, 10188571, 2255732, -4203995, -3940553, -1380109, -3030680, -7139906, -6620970, -535754, 3470426, -737257, -9776888, -15172082, -13155844, -7645705, -4631502, -5624705, -6709610, -3186354]
39722c186354Q322695Q173387K621884l898674o934518n807972k619809M72670
39714b856691K112173J790964M76182j14201J04843m79498j919309j843500K86728
39705b442309R14843k267324n100596j973923M884778O955159J376893m378387
39697b030866k868724L150499N570236K447595j047406j449652o21413n37743
39689B612526l45255q0270j948383n300462n135781O35636O302525N335799m13930
39680A662405l530751j417847J548214J878339J377297K328153L096741J261601
39672H204152k060117l789757k788663r7245K825617M170354K126887k391150
39664F200078m943062k230500L238266N713654L080352j235211l259771k950491
$$ y = [-3186354, 5136341, 13309728, 15931612, 12032938, 5098420, -709552, -3329361, -2856691, -744518, 1046446, 1522628, 1408427, 1513270, 1033772, -885537, -2729037, -2442309, -1527466, -3794790, -8895386, -10869309, -5984531, 970628, 2347521, -2030866, -4899590, -1749091, 3821145, 6268740, 5221334, 3771682, 3150269, 2612526, 2267271, 2187001, 238618, -5061844, -10197625, -9561989, -3259464, 2076335, 1662405, -1868346, -3286193, -1737979, 140360, 1517657, 3845810, 6942551, 8204152, 6144035, 2354278, -434385, -531630, 2293987, 6464341, 8591228, 6200078, 1257016, -973484, 2264782, 7978436, 11058788, 9823577, 6563806, 3613315]
39656C613315k780204l631799l716942j277315K648109M640180K248946l060441
39648a316151o660794m868270J587782Q096386J0072560O744871J586468j236461
39640A4006391j162636j229639l202157m388714j474409L664955N351403J498717
39632A3063911l749479n793822m754805l270810k304483j477533q69826J2233
39624i144614K386422M748548K752044l614940o513742j5052R180763Q797902
39616H577331j344223p618430j572459P795542O996492k993804r307728n771579
39608e238858L28142O91794k992771m030412q94836K474837L433090K930684K194728
39599a103602J003457o12856j610716j330812j31480J268572J814970K42485k962049
$$ y = [3613315, 833111, -2798688, -6515630, -7792945, -5144836, -504656, 1744290, -1316151, -7976945, -12845215, -11257433, -3161047, 6911513, 13656384, 15242852, 14006391, 12843755, 11614116, 8411959, 4023245, 2548836, 6213791, 11565194, 13063911, 9314432, 3520610, -1234195, -4505005, -6809488, -8287021, -9156847, -9144614, -6758192, -2009644, 742400, -2872540, -9386282, -9401334, -220571, 8577331, 7233108, -385322, -1957781, 5837761, 12834253, 9840449, 532721, -5238858, -4910716, -4218922, -7211693, -11242105, -12136941, -9662104, -6229014, -3298330, -1103602, -100145, -713001, -2323717, -3654529, -3786009, -2517437, -702467, -459982, -3422031]
39590c422031m464738j565649L294296M501196N77150l510769l130452j41620
39582g862617Q14426m8778J647789O319486Q000734K442498n979301r187656n395889
39573i249308j36967K042329K313529K886854K331298q30903l155297k97904M954806
39564H58437M729831k360952p569211l920317L048919K847440m254552p067867
39556a3688272K00721R288529R415056J458723n069208n255820k345410J34899
39548e860782K733709N630991N753098J266294m538226o783393m609092j175866
39540g583267N68324L62522l13335k15113O27760J447944K130408L161728L627267
39531C814238J035236m793064r071124o493442J734574Q228606P415999J100524
$$ y = [-3422031, -7886769, -9452418, -6158122, -1656926, -1079776, -4590545, -7720997, -7862617, -7048191, -7096969, -5449180, 870306, 8871040, 11313538, 5334237, -3853419, -9249308, -9386275, -7343946, -5030417, -2143563, 187735, -643168, -3798465, -4096369, 858437, 5588268, 3227316, -4341895, -8262212, -5213293, -2365853, -6620405, -13688272, -13487551, -4199022, 5216034, 6674757, 1605549, -3650271, -5995681, -5860782, -3127073, 2503918, 8257016, 9523310, 4985084, -1798309, -6407401, -7583267, -7014943, -6652421, -6965756, -7180869, -6553109, -5105165, -2974757, 186971, 3814238, 4849474, 56410, -9014714, -15508156, -13773582, -5544976, 1871023, 2971547]
39523B971547m246463l849545J584956O383799M695697k798454p800123l309796
39515f368382O960674J2141450P291385j413953n411253l250187K96468O98491
39507A0944693k861647p460067q342960l674185K044135K914754J21149K97824
39499f016304M623530O117849O31740n940378o011541o74210L362404L103447
39491h03463N66516j849603k701834j097762J444269J992346J492939L908208
39483B951616P502842M677791m746355r109181j572360P605027N929021k179697
39475A1058704m171938o66033j980444p209257m869481N329200R668067L165961
39467A0324779k296792Q81114L393687k930742r433867n353559L747839N953795
$$ y = [2971547, -1274916, -5124461, -3539505, 2844294, 7539991, 4741537, -3058586, -6368382, 592292, 12733742, 20025127, 18611174, 13199921, 9949734, 10246202, 10944693, 8083046, 622979, -7719981, -11394166, -9350031, -6435277, -6314128, -6016304, -1392774, 4725075, 5356815, -583563, -6595104, -7269314, -3906910, -803463, -236947, -2086550, -4788384, -5886146, -4441877, -2449531, -956592, 2951616, 10454458, 15132249, 10385894, 1276713, -295647, 7309380, 13238401, 11058704, 6886766, 6220733, 4240289, -2968968, -7838449, -2509249, 7158818, 10324779, 8027987, 8909101, 12302788, 9372046, -61821, -5415380, -1667541, 4286254]
39459D286254K162437J199113K859276M16755m591193m534706k61021J32968l715315
39450b045432l591643K532265O960471N381079K551127K239607J589850j133661
39442A4483663k397897q54950n60360k711131k282220K380311M423797j034094
39434A1447119p808391o884740Q77869O896719O452283K081563k228682m596597
39426F237143m270201j709595R32369K245500K967166K911074k77710o150536
39418B885210q894643m238633L936815Q544459Q055270N235725L14285p622908
39410H215580j4206569j2824052m566787K196693L391451L027699L638432J443091
39402i684462m617427p217128j158077O622852O225455m7520j305038M833952
$$ y = [4286254, 6448691, 7647804, 10507080, 10923835, 6332642, 1797936, 1536915, 1669883, -2045432, -5637075, -3104810, 3855661, 9236740, 11787867, 14027474, 15617324, 14483663, 12085766, 11230816, 10670456, 7959325, 5677105, 8057416, 12481213, 11447119, 3638728, -3246012, -2368143, 4528576, 10980859, 13062422, 10833740, 6237143, 1966942, 257347, 1189716, 3435216, 6402382, 9313456, 9035746, 2885210, -6009433, -10248066, -6311251, 2233208, 10288478, 15524203, 15838488, 8215580, -5990989, -18815041, -23381828, -21185135, -17793684, -14765985, -11127553, -9684462, -14301889, -21519017, -22677094, -16054242, -9828787, -9876307, -11181345, -6347393]
39394f347393Q860975M269475l463063o278520m296061k314808j411887L08665
39386a0672617K282987K114886k96823l002596m602989m064464n72940L948777
39378a4865779N361989K941787P76288Q83490j62593l951666n375168q99292L681861
39369a1609083J417799m085632l941598J857072N047718K500757o38941j072350
39361a0524258j067338j238425J072021M587528M146660j99667k744853k177556
39353h145888k669396l671093J51408O389359N261913k860900m386229N446654
39345d484172J1861380L230952q813818p019882M227101P032862j280629o622169
39337a868375k776435J328153M02449J206193P246708J0104678L357867o316277
$$ y = [-6347393, 2513582, 6783057, 3319994, -2958526, -7254587, -9569395, -10981282, -10672617, -8389630, -6274744, -6571567, -9574163, -14177152, -18241616, -18814556, -14865779, -9503790, -6562003, -5785715, -4902225, -5064818, -9016484, -14391652, -15290944, -11609083, -10191284, -14276916, -18218514, -16361442, -11313724, -8812967, -9451908, -10524258, -11591596, -12830021, -11758000, -7170472, -3023812, -3223479, -5968332, -8145888, -10815284, -14486377, -14334969, -7945610, -2683697, -5544597, -9930826, -4484172, 7377208, 10608160, 1794342, -5225540, -998439, 6034423, 4753794, -1868375, -4644810, -3316657, -2914208, -1708015, 5538693, 15643371, 19001238, 12684961]
39329A2684961r490377o520510k871266K94008L733969M541911K37455n316479
39321b706328o008372j260086M134042N824901L146929j084093k624193k33418
39313h10618J888596l71032m060495l021170K137200M793239L038913J720343
39305E314976K675821J740737j773769j721455L978855P410098K122656o161084
39297A3586835p634585k255908K000664J410916m38696m69027l55854k280115
39289C564230m769203m321064J44577M891955M225874k488618q096725n765883
39281a2614857J378367M233047P82096j886294N55893L820175L652662K336694
39273B257783K349000R02220l846761p461398n788923j501239J192332K958254
$$ y = [12684961, 3194584, -3325926, -6197192, -5903184, -2169215, 2372696, 2610151, -2706328, -8714700, -9974786, -5840744, -15843, 3131086, 2046993, -577200, -810618, 1077978, 706946, -3353549, -6374719, -4237519, 555720, 3594633, 5314976, 7990797, 9731534, 7957765, 6236310, 10215165, 17625263, 19747919, 13586835, 5952250, 3696342, 5697006, 7107922, 6669226, 6200199, 5844345, 3564230, -1204973, -5526037, -5381460, -489505, 3736369, 1247751, -6848974, -12614857, -11236490, -7003443, -6221347, -8107641, -7551748, -3731573, -78911, 2257783, 4606783, 5509003, 1662242, -5799156, -11588079, -13089318, -11896986, -8938732]
39265h938732N075288M417549r89369o249592n865375j610820J629969L318442
39257i212640M585956L200547j717727m522900l51825O056388O620208J807886
39249F465893j552437j437934j321519j796396J5901L471068M371323J679537
39241I895436j972907n458359q781322r224876m437546K097892N047234M835530
39233g998918M868962L926398q42446n725798m293651J686294M251032J728936
39225b399191Q2847J711998K457840Q35827O54719K294786P06047m683334o809600
39216e148061j975243L608572L100750j439696l650668j933318O07934J449383
39208e380347K24053k039777l028811j276469J152555J558733J519751L954687
$$ y = [-8938732, -3863444, 554105, -435264, -6684856, -12550231, -14161051, -12531082, -9212640, -4626684, -1426137, -3143864, -7666764, -8018589, -1962201, 4658007, 6465893, 4913456, 3475522, 2154003, 357607, 373508, 3844576, 8215899, 9895436, 7922529, 2464170, -6317152, -15542028, -19979574, -17881682, -12834448, -7998918, -3129956, 796442, -46004, -5771802, -10065453, -8379159, -4128127, -2399191, -2316344, -604346, 1853494, 2689321, 3344040, 5638826, 6344873, 1661539, -5148061, -7123304, -3514732, -413982, -1853678, -5504346, -7437664, -6829730, -5380347, -5156294, -7196071, -10224882, -11501351, -10348796, -8790063, -7270312, -3315625]
39200c315625O505940M714825J018420J969814O065431M398943m055733q442399
39192H859616k300674O048326O398000J341005n62399N66336j789733p564561
39184A0995916r561340n019201O48804K461512J749451J818399K470462J236973
39176F800976k171276m593184k718851K472841N731213L664726n05251j427011
39168G254183N76637R35750p93330l05535L023790L965624P870m276335m520440
39159E868214k347572n34954J636390M127294L043657k996855q028264n831067
39151e063157J294738N705883L951606q67888m160695l920985j342634N79449
39143c823683M84758O49501K800128L599915l34369m700458k624061L436832M678715
$$ y = [-3315625, 3190315, 7905140, 8923560, 10893374, 16958805, 21357748, 17302015, 8859616, 6558942, 12607268, 19005268, 20346273, 19783874, 20350210, 18560477, 10995916, 1434576, -3584625, -2935821, -474309, 1275142, 3093541, 5564003, 6800976, 4629700, 36516, -2682335, -209494, 5521719, 9186445, 8681194, 7254183, 7830820, 8766570, 7973240, 7667705, 10691495, 14657119, 14664989, 10388654, 5868214, 3520642, 2985688, 4622078, 8749372, 11793029, 8796174, 767910, -5063157, -3768419, 1937464, 5889070, 5021182, 860487, -3060498, -4403132, -3823683, -3338925, -2689424, 110704, 3710619, 3376250, -1324208, -3948269, -511437, 4167278]
39134D167278R50332Q53752M919979K743960p805706j3293638n604174L808129
39126i260088K525491k606484J184439R415767Q175317j499241n723430j502825
39118G08946j30012o110504r495648l165310O043543Q779049N202625P54150j672745
39109I14094j381237J288816K929236l1968m886951n038461O66861O928701R765701
39100A1154792Q968295M342197l081870p770933n675064j648155k467458n215192
39092a393388k668248K647099K038423l350031l729323K028346M449137N57479
39084E79494j463602J918430L282214j274236m637020j577874K977754M400932
39076D206092N230767O040631J970932n519878o738419o57577N04020p587763
$$ y = [4167278, 5117610, 5971362, 10891341, 13635301, 5829595, -7464043, -13068217, -9260088, -6734597, -9341081, -8156642, 1259125, 9434442, 7935201, 2211771, 708946, 578934, -5531570, -15027218, -18192528, -12148985, -3369936, 1832689, 2586839, 914094, -467143, 821673, 3750909, 3718941, -1168010, -6206471, -5539610, 1389091, 11154792, 20123087, 24465284, 21383414, 13612481, 7937417, 6289262, 3821804, -1393388, -4061636, -1414537, 623886, -2726145, -6455468, -4427122, 22015, 579494, -884108, 1034322, 4316536, 3042300, -1594720, -3172594, -194840, 4206092, 9436859, 15477490, 17448422, 11928544, 5190125, 4532548, 5036568, -2551195]
39068b551195j0868261L75107J2625571Q654288n587921j1165849n074938n88138
39060a4181336l299789m909063k47386N075795N686644L212386P49433k06352
39052h119668K092658O186186M878314m482233j1362491n331481N863155N602739
39044d672821n980863j1272649j563048J1121718J3296656P689359M489592N360523
39036A8468467M526166o36218p117005j0761129r156830l302664J651171J159269
39028e168773k453416k895718J132406N204132O621943O261757L856889j208577
39020A1350643m993195k882040J981433K604480j29190N66443L914894J692748
39012A4106216o565355j0726767o038623n5992J154105J786837N129190N644116
$$ y = [-2551195, -13419456, -13044349, -418778, 8235510, 2647589, -8518260, -13593198, -14181336, -17481125, -22390188, -22637574, -17561779, -11875135, -8662749, -7913316, -8119668, -6027010, 159176, 5037490, 555257, -10807234, -16138715, -10275560, -4672821, -10653684, -21926333, -23489381, -12367663, 928993, 8618352, 13107944, 18468467, 22994633, 22358415, 15241410, 4480281, -4676549, -7979213, -6328042, -5168773, -7622189, -10517907, -9385501, -4181369, 2440574, 8702331, 12559220, 11350643, 6357448, 3475408, 5456841, 8061321, 7932131, 8498574, 12413468, 14106216, 7540861, -3185906, -9224529, -9280521, -8126416, -6339579, -1210389, 4433727]
39004D433727M70972k275727L245525Q679193M141724n084377o823221j089036
38996E698780J865962j067191l010705l13322K761373K875472J645353J41186
38988A0596908k538117m683874l257835l425M66690j524189j602753M17725M28104
38979a700766j909886k487294p51055q85400l576139l847059M86969M672647M412471
38970e585512K077672K135905M331510M655376Q44299m951610p683391l898917
38962h074668L439056O673915L120254l73452K203169N136773q43728j1829955
38954e48636j3497701k062818Q877808P202828j859064n609302j799963J828155
38946g468693R98004q11650J77079K976446M104291J170931m792937q463047m554858
$$ y = [4433727, 4904699, 2628972, 5874497, 14553690, 18695414, 13611037, 6787816, 5698780, 7564742, 6497551, 3486846, 3173524, 5934897, 8810369, 10455722, 10596908, 8058791, 3374917, 117082, 113657, 580347, -943842, -2546595, -2128870, -1700766, -3610652, -6097946, -6849001, -7734401, -11310540, -15157599, -14670630, -9997983, -5585512, -3507840, -1371935, 2959575, 7614951, 8459250, 3507640, -4175751, -8074668, -4635612, 2038303, 5158557, 4785105, 6988274, 12125047, 11281319, -548636, -14046337, -16109155, -7231347, -28519, -1887583, -7496885, -9296848, -7468693, -6470689, -7282339, -7105260, -4128814, -24523, 1146408, -3646529, -12109576, -16664434]
38937a6664434M650793J0115490P299311J848906L04038O93945k038513o332632
38929a23096o850575l498914m05223J473712L675922M625738K156346l63508J718419
38920B408821N471176M087693j531233l921486j634818q44413l143941k220317
38912a328518L886206P314860K729577l528296l421518O90403J287787k548916
38904E081585o104918p482911p795760o153888j371086L679335N461741N286332
38896i399570O110210O736292M674886J459474p11090l680605q042895p965922
38888a0819220j16347O768736K614891o578324n710334N193538R159109j283182
38880g71133j1337621o520104N241749O875889j773087o230391j196452L475857
$$ y = [-16664434, -12013641, -1898151, 5401160, 7250066, 7554104, 8248049, 6209536, -123096, -6973671, -10472585, -10877808, -9404096, -5728174, -1102436, 1053910, 690402, 2408821, 7879997, 11967690, 10436457, 6514971, 4880153, 4035740, 891799, -1328518, 2557688, 9872548, 12602125, 9073829, 5652311, 6342714, 7630501, 5081585, -1023333, -8506244, -16302004, -22455892, -23826978, -20147643, -14685902, -9399570, -3289360, 3446932, 8121818, 9581292, 8870202, 5189597, -2853298, -10819220, -10935567, -4166831, -1551940, -8130264, -13840598, -8647060, 512049, -771133, -12108754, -18628858, -13387109, -6511220, -8284307, -14514698, -15711150, -12235293]
38872a2235293J009881k080779J380485P040208O512988N49110k667157N83811
38864I3254N586153O473689K825283j730199m277103m329200k517068J89127J944406
38855D258342Q04978k541278m270013j918942J518784J057337k958888m770542
38847h820222j276125L726931N129955K680293o30236k738471k511913P12442
38839c727346M533681M212014m59710l048146L44256M029324P92362o474871q424401
38830h222837k679920L778121N096966K422945p70254k431646n87013M838801
38822A445163P947407J910451r975870j5503103q820761K187886P327642O234565
38814g246620M445104L548445J561768j058564k099135j809483j396107K12452
$$ y = [-12235293, -11225412, -13306191, -11925706, -4885498, 1627490, 2176600, -490557, 93254, 5679407, 12153096, 14978379, 13248180, 8971077, 4641877, 2124809, 2313936, 4258342, 5063320, 2522042, -1747971, -3666913, -2148129, -1090792, -4049680, -8820222, -10096347, -6369416, -1239461, 1440832, 810596, -1927875, -4439788, -3727346, 806335, 5018349, 4558639, 1510493, 1854749, 5884073, 6676435, 201564, -8222837, -10902757, -7124636, -2027670, 395275, -374979, -2806625, -3393638, 1445163, 9392570, 11303021, 1327151, -14175952, -22996713, -20808827, -13481185, -7246620, -2801516, 746929, 2308697, 1250133, -849002, -2658485, -4054592, -3842140]
38806c842140L424472M647815J144947l244382k975411M90359J104864j657163
38798i06639k013267K118430N126224K494859j905102j689986K212405K713997
38790H150921l057202q975165p440366O43624O565101M623582r45589k370904
38782b805998O80064J288740l577848p777599m760181K872685P226555N842473
38774a011109L354588L459056M422770L314017N14300j813412l178643m794577
38766D266990p159743q572112o049535J422694R903779J2606524P005211j632483
38758A1791325o152413n402726l393952k481599j786423j592025l860702p123801
38750b0002316n936996J592181R501047J0979844P214764M987408O614685P027166
$$ y = [-3842140, -417668, 4230147, 5375094, 2130712, -844699, -354340, 750524, -906639, -2919906, -801476, 4324748, 6819607, 4914505, 3224519, 5436924, 8150921, 5093719, -3881446, -11321812, -10678188, -4113087, 510495, -435094, -2805998, -2125934, -837194, -4415042, -12192641, -16952822, -14080137, -6853582, -1011109, 2343479, 5802535, 10225305, 13539322, 14053622, 12240210, 9061567, 4266990, -2892753, -11464865, -17514400, -16091706, -6187927, 6418597, 13423808, 11791325, 5638912, 236186, -3157766, -5639365, -7425788, -9017813, -12878515, -20002316, -25939312, -24347131, -14846084, -3866240, 3348524, 8335932, 14950617, 21977783]
38742B1977783J876048n463176q012659m416060m31621j015853m158826m542232
38734d186596j146129J915778J556676o18035j644082j339468j212151j113591
38726g787598O00832M041300O700500N815898J411740l127128m045607j344706
38718B265231J160875J044235M91526J787003K278649j199470m949431k775043
38710A03575K641172J998571m814574n971995L321651J0127123K490186j0179708
38702b83999r845723K322926P697054p93245q929562m947059L347893M105763
38694g325952M52804J734380N595492K981716m452294o159413k37080L760180
38686c650167M46177m225046l978268o80216J883687M248904O714878N822119
$$ y = [21977783, 23853831, 18390655, 10377996, 5961936, 5530315, 4514462, 355636, -4186596, -5332725, -3416947, -1860271, -2478306, -4122388, -5461856, -6674007, -7787598, -7186766, -3145466, 3555034, 9370932, 10782672, 7655544, 3609937, 2265231, 3426106, 4470341, 4961867, 6748870, 9027519, 7828049, 2878618, 103575, 2744747, 4743318, -71256, -6043251, -2721600, 7405523, 9895709, -283999, -10129722, -7806796, -109742, -902987, -9832549, -14779608, -11431715, -7325952, -6873148, -5138768, 456724, 3438440, -1013854, -7173267, -7410347, -3650167, -3203990, -7429036, -11407304, -12087520, -10203833, -5954929, 759949, 6582068]
38678F582068P60921k770415j007539Q56064l089748q530294o550596K018862
38670a1730677P047362M281517Q62361K565590M284414k98939o230279l776476
38662b995127N505281R317326K148800o993340q050491l160452m78433j015127
38654e721563K25449L387435L073810j631516m496730j475646L645789N597157
38646B604185M351001K528576P34998j024490j118545P92135J696380l04393k279486
38637G980361r47823J767637J922934J87919M75712L012329L776837J089562j775318
38628A7490150j886947r77124k411172o093101q491906o830729j888522L066276
38620h023075N430592N242072M015868K172012j023076m850148o602821m895299
$$ y = [6582068, 7342989, 4572574, 3565035, 4421099, 1331351, -7198943, -13749539, -11730677, -4683315, -401798, 460563, 3026153, 7310567, 7011628, 781349, -2995127, 2510154, 11827480, 13976280, 6982940, -1067551, -4228003, -4706436, -5721563, -5496114, -2108679, 965131, -666385, -5163115, -6638761, -2992972, 2604185, 6955186, 9483762, 10218760, 9194270, 8075725, 8867860, 10564240, 10259847, 7980361, 7032538, 8800175, 10723109, 10911028, 11386740, 14399069, 18175906, 19265468, 17490150, 15603203, 14626079, 12214907, 6121806, -2370100, -9200829, -11089351, -8023075, -2592483, 2649589, 6665457, 8837469, 7814393, 2964245, -3638576, -8533875]
38612h533875j653564P62718K502502M254852M401329J197787l394870n329587
38604e792708l522876m30967K012350L951066N152338M320596J675610n59419
38596F805990j327643k063389l714393m599263k752274J100326M346362N327376
38588C123092M335279K572230J066958K56220N4085K57873O26523N01142o92445
38579A2100957k107463k082724r06991q73180k022077o88106M565322Q313703
38571A6299441M512396m155266r050858p367407m433400l225205M64883Q362513
38563A407097J2712190O235998n573013j0454413n605880L01004Q94761n77739
38555f59995M74193K326572J730892K75246O96969J147015j236564l973900k401154
$$ y = [-8533875, -10187439, -9424721, -6922219, -2667367, 1733962, 2931749, -463121, -5792708, -9315584, -9746551, -7734201, -3783135, 1369203, 5689799, 7365409, 6805990, 5478347, 3414958, -299435, -4898698, -7650972, -6550646, -2204284, 3123092, 7458371, 10030601, 11097559, 11353779, 11407864, 11665737, 12292260, 12793402, 12100957, 9993494, 7910770, 7003779, 6130599, 4108522, 3420416, 7985738, 16299441, 20811837, 16656571, 7605713, 238306, -4195094, -7420299, -6955416, 1407097, 14119287, 20355285, 14782272, 4327859, -1278021, -977017, -82256, -659995, -185802, 2140770, 3871662, 4146908, 4843877, 5990892, 4754328, 780428, -1620726]
38546a620726K265154L828916L9908m519792n263337k802236l4097J849937K551882
38537c704391J425348n90195o27410K105497M370097L361257R55124Q42659L120686
38528A1258672M447597K495508j961186o335025p841626n323270j170587N01647
38520c928270p15821p30523K205619L853637J184722j094996K344017P001142
38512A0119527L779113o025918j0385051l439928N890434O626048q5448n188007
38504A290770m584394j314023J448464L102219L158552J379998o43677j825699
38496B012210l717501o858948p651528l221879K960003N148966L233905J774762
38488f320010K622775L437851K597699Q44151j350866l752951m416814j898588
$$ y = [-1620726, 644428, 4473344, 4513252, -6540, -5269877, -8072113, -8106210, -6256273, -3704391, -2279043, -2869238, -3496648, -1391151, 2978946, 6340203, 7295327, 8137986, 11258672, 15706269, 18201777, 16240591, 9905566, 2063940, -3259330, -4429917, -3928270, -4644091, -5374614, -3168995, 684642, 1869364, 774368, 3118385, 10119527, 13898640, 7872722, -2512329, -5952257, -61823, 6564225, 6478777, 1290770, -3293624, -4607647, -3159183, -56964, 3101588, 4481586, 3837909, 2012210, -1705291, -8564239, -16215767, -19437646, -16477643, -11328677, -8094772, -6320010, -3697235, -259384, 2338315, 3182466, 1831600, -1921351, -6338165, -8236753]
38480h236753J446890K354490J556773J657258J885719q7590k714627k396258
38472d534098M48956K483419L128930L548508K114870k349839n089825j331028
38464a580107M262204L644296n79017J100289P263723N514079o327484j3662745
38456c64762o965080L386906M130062j138743j719651R47181j239000n572551
38448h535638k948577M024784L750661m273746p800706j853315M319654L790796
38440i526087J757308L590762N468097L512585J498918K362513J933357j370489
38432I226964n96176O816947R726506j160849j5644290j5795325j572612R536609
38424E37774P744604J755065J791679M897058L292108k510193o606477p178740
$$ y = [-8236753, -6789863, -4435373, -2878600, -1221342, 664377, 576787, -2137840, -4534098, -4085142, -1601723, 1527207, 5075715, 7190585, 4840746, -249079, -1580107, 2682097, 6326393, 5747376, 6847665, 14111388, 19625467, 13297983, -364762, -7329842, -3942936, 187126, -951617, -2671268, -1724087, -2963087, -8535638, -11484215, -7459431, -3708770, -7982516, -15783222, -17636537, -13316883, -9526087, -7768779, -4178017, 1290080, 4802665, 6301583, 8664096, 10597453, 9226964, 8630788, 15447735, 25174241, 24013392, 8369102, -7426223, -8998835, 537774, 8282378, 10037443, 11829122, 16726180, 20018288, 17508095, 10901618, 3722878]
38416C722878o006893l388655m4962P7867m503248p831712m126992K566269M014265
38407a5521183R37618J509784P008733R031061L638308j595058j61652K552779
38399G400390p74520n524424j982508P480992R894656O10681j0077021j1899031
38391d870785o669944j338466K196524M529766L541994j094960l904526j363919
38383h974316J241625j702125n653643l015274L173899L561400j275253j072711
38375a3716398O419796J0318807L818118m356673l072640M916783Q513549M483787
38367A7325129r11805l167741l550083l083730p19290J792112O8394n805782r442170
38358g494966n926771J929796P223893O456334J755776k504789l671260k271565
$$ y = [3722878, -2284015, -5672670, -5717632, -5639765, -10143013, -17974725, -22101717, -19535448, -15521183, -14583565, -13073781, -6065048, 2966013, 6604321, 5009263, 4847611, 7400390, 6625870, 1101446, -881062, 6599930, 16494586, 17105267, 7028246, -4870785, -11540729, -12879195, -10682671, -6152905, -2610911, -3705871, -7610397, -8974316, -7732691, -9434816, -15088459, -18103733, -14929834, -11368434, -12643687, -13716398, -7296602, 3022205, 6840323, 2483650, -588990, 4327793, 12841342, 17325129, 16413324, 13245583, 9695500, 6611770, 5892480, 7684592, 7752986, 1947204, -7494966, -13421737, -11491941, -4268048, 2188286, 3944062, 1439273, -2231987, -4503552]
38350d503552n95703J16240P15290K173291L802770M352249L572456J611786j533098
38341I711729m583222m953611k173433M97716K31863j293342o24034K228973M159689
38332C202328L246073j26027m764454q130695o340299J002521P497030O534458
38324B120935M25118k566629q1998J894116m04269k646123n49867K502382J493660
38315B187325j297779j45556L930602M067549j504042o153234m486964O1406Q13611
38306b527082k534135m323758j577311K324210L395569K650442L276278M662499
38298E346712L387239k38028j380662J614400L149729j790085q709074q334273
38290f954042L53955P780365N884585k369822p939586o225964r8731M381873K925905
$$ y = [-4503552, -5099255, -4983015, -4267725, -2094434, 1708336, 6060585, 9633041, 11244827, 9711729, 5128507, 174896, -1998537, -1500821, -1268958, -2562300, -3186334, -957361, 3202328, 6448401, 6322374, 1557920, -6572775, -12913074, -11910553, -4413523, 2120935, 2546053, -20576, -102574, 1791542, 1387273, -1258850, -1808717, 693665, 2187325, 889546, 743990, 4674592, 8742141, 7238099, 1084865, -3402099, -3340693, -2527082, -5061217, -9384975, -10962286, -8638076, -5242507, -2592065, 684213, 5346712, 8733951, 8495923, 7115261, 8729661, 11879390, 10089305, 1380231, -6954042, -6600087, 1180278, 7064863, 4695041, -3244545, -9470509, -9569240, -5187367, -2261462]
38281b261462l349758p447898l271453N385748P647296L48889o080093k058603
38273a1087334O625994P161496j149704o522788l016793J600959n87930n690701
38265a2666801n439657K07985M846888N846216N924924O482045N483708J869947
38257A2555255k366366m916647n149060l514707j179954L11226Q07857J829164
38249a623232L403315K766617j131042m087767j546641M198026O094987J741019
38241I815282l347364l024561K079873O187800N380617J198360j919600j548455
38233A4821952M90720P23183j576342l810625l976870l004440k188974q09012
38225F69592J768556L930388M118930L091217J547818j568687n336310n117952
$$ y = [-2261462, -5611220, -13059118, -16330571, -10944823, -3297527, -2948638, -9028731, -11087334, -4461340, 2700156, 1550452, -4972336, -7989129, -6388170, -6976100, -12666801, -18106458, -17898473, -13051585, -7205369, -1280445, 5201600, 10685308, 12555255, 10188889, 5272242, 123182, -3391525, -4571479, -4260253, -3452396, -1623232, 1780083, 4546700, 3415658, -672109, -2218750, 1979276, 8074263, 9815282, 6467918, 3443357, 5523230, 11711030, 17091647, 18290007, 16370407, 14821952, 15312672, 16035855, 14459513, 10648888, 6672018, 3667578, 1478604, 669592, 2438148, 6368536, 10487466, 13578683, 15126501, 13557814, 8221504, 3103552]
38217C103552O21321N182049J771856n698639p629685l093152k12389k115013
38209h070100k743029P80889K236152j891789m531835L06878O415736N522007
38201a975091J679021M081822J0093167Q378176k281164j0113855p970180k284959
38193c93063r66538k676157l181064l379735m763401m199620J29744L577181K331103
38184a3521550L94963K458827N027994K498381k308795k549081P72348Q83960
38176f342953k346525k131242K866402N905097L838017J649279J915038m74939
38168D878174p395579j0361087k664653Q077984R289774J276247m359061k256689
38160c514890R65507q50388m679220m957911j540217K601467N845740O745320
$$ y = [3103552, 3724873, 8906922, 10678778, 4980139, -2649546, -5742698, -5955087, -8070100, -10813129, -10032240, -7796088, -9687877, -14219712, -13912834, -7497098, -1975091, -296070, 3785752, 13878919, 22257095, 19975931, 9862076, 1891896, -393063, -1359601, -4035758, -7216822, -10596557, -15359958, -19559578, -19429834, -15852653, -13521550, -13126587, -10667760, -5639766, -3141385, -5450180, -7999261, -7226913, -6342953, -8689478, -10820720, -7954318, -2049221, 1788796, 3438075, 5353113, 4878174, -2517405, -12878492, -15543145, -7465161, 1824613, 3100860, -1258201, -3514890, -2549383, -3399771, -8078991, -13036902, -14577119, -11975652, -6129912, 615408]
38152F15408L578593j568749l102363L33486L122932J080008k505518l152642
38144a598845k006059j384387P48439N329595O664189O64751n824684l815941
38136a222942K845831K725094m266428o148438J260833P235840L857768j906351
38128D381207j634212N05982k424625n784158j570903N693491N329382j067786
38120C428378k203495K976104L071025n644332j1438599n550290L911490N124352
38112f325367J52321q33129L356701M638335k6313m104229k132164K613716L641421
38103I81292n09l100240p34430N832292R599476N192326m043776q905787n312095
38094d91451J054440L087024J085372l88550n42931j748712l175173j269752L466977
$$ y = [615408, 4194001, 2625252, -477111, -143625, 2979307, 4059315, 1553797, -1598845, -3604904, -4989291, -4240852, 1088743, 7752932, 8417683, 2592999, -1222942, 1622889, 4347983, 81555, -6066883, -4806050, 2429790, 6287558, 4381207, 2746995, 3252977, 828352, -4955806, -6526709, -833218, 4496164, 3428378, 1224883, 4200987, 7272012, 1627680, -9810919, -15361209, -11449719, -6325367, -6173046, -7006175, -3649474, 988861, 962548, -3141681, -5273845, -2660129, 981292, 980783, -2119457, -2853887, 2978405, 12577881, 17770207, 13726431, 4820644, -491451, 562989, 3650013, 4735385, 4346835, 3803904, 2055192, -1119981, -2389733, 1077244]
38085A077244N576753J829884m456839p622069n499557k62189M192015N036558
38077a28200K605877N3758l44752J83334m22594j395333q73639K23646l89725
38068d87628k082151k317912j282364j278728j944305q64808J000722K3556l025887
38059a2259505k750711J676689L512405j044981n199867q72182Q411909J1722496
38051C196253O110043k76447r75319O99152p75901m108974m587945k072357j60296
38042b951791J18989N56131J039402l64497k950964l771583k786759k904662m039849
38033a8055583k299618K879685O136927M313226K113972M333330O790799K534479
38025H747217n312272o090811K213952Q531182M310690m384331o642431k453733
$$ y = [1077244, 6653997, 8483881, 4027042, -3595027, -9094584, -9356773, -5164758, -128200, 2477677, 2531435, 2186683, 2370017, 1947423, 552090, -321549, -97903, -487628, -2569779, -4887691, -6170055, -7448783, -9393088, -10257896, -9257174, -9233618, -12259505, -15010216, -13333527, -9821122, -10866103, -16065970, -16938152, -8526243, 3196253, 9306296, 9029849, 8054530, 8753682, 7977781, 3868807, -719138, -2791495, -2951791, -2832802, -2276671, -1237269, -1601766, -4552730, -8324313, -11111072, -14015734, -18055583, -20355201, -17475516, -11338589, -7025363, -4911391, -578061, 6212738, 8747217, 3434945, -2655866, -441914, 8089268, 12399958, 8015627, 1373196, -1080537]
38017a080537n20170l738924n990664l260770N01279J128628R85405L686689O876604
38008a412460N600979M94459k663766j222352J045397M5403k870029l636986j586874
37999f206229M44500J099769J815511K765555J635455j455750j894559K584408
37991G88660O382194L085101m171655o616545l398100k415698n982565n745565
37983a8074173K740986R881304N501977m550586o506415O20853M700377k4618
37975e710295n517709m315094k1292J338196J037857K436002L472575J466638
37967e813122j33658K818373O825530N251516r45479m074680r94505K610729N97376
37958F142080n299461p785357k891270N183849Q425980M078932k096651l455270
$$ y = [-1080537, -1600707, -5339631, -11330295, -14591065, -14089786, -12961158, -11975753, -8289064, -1412460, 4188519, 4682978, 2019212, 796860, 1842257, 1887660, -982369, -4619355, -6206229, -5761729, -4661960, -2846449, -80894, 1554561, 98811, -1795748, 788660, 7170854, 10255955, 6084300, -532245, -3930345, -6346043, -12328608, -18074173, -15333187, -5451883, 50094, -4500492, -11006907, -10386054, -5685677, -5710295, -11228004, -15543098, -15564390, -14226194, -13188337, -10752335, -7279760, -5813122, -5946780, -3128407, 3697123, 8948639, 8003160, 3928480, 2933975, 5544704, 6142080, 842619, -6942738, -9834008, -4650159, 3775821, 7854753, 5758102, 2302832]
37950B302832j360183k020814n527774m962223J826606P000163L888311k828906
37942a681988m271232O2678L840302M476207M461650M111950R47024l867044n657606
37933B421941l686787k247196l227419l402980o47363K573543L791319L722315
37925g02627K978608M54690k725137k466902J986039N164645K450244l156307
37917C983253n111085j910188J960403K224157j046333m603779n112979j843154
37909a1459705K300890L598562K151479J539742K969813L204986N16119j264539
37901C557347J146214L438732j108340j0209236j3068347m449462P177472R654057
37893c861563J968310n741693n592144k61387K810617R83414k560783m496760
$$ y = [2302832, 942649, -1078165, -6605939, -11568162, -9741556, -2741393, 1146918, -1681988, -5953220, -5890542, -2050240, 2425967, 6887617, 10999567, 11946591, 8079547, 2421941, -1264846, -3512042, -6739461, -10142441, -10789804, -8216261, -4424942, -702627, 2275981, 2730671, 5534, -2461368, -475329, 4689316, 7139560, 3983253, -1127832, -3038020, -1077617, 1146540, 100207, -4503572, -9616551, -11459705, -9158815, -5560253, -3408774, -1869032, 1100781, 4305767, 4821886, 3557347, 4703561, 8142293, 7033953, -3175283, -16243630, -20693092, -13515620, -3861563, -1893253, -7634946, -13227090, -13488477, -10677860, -9694446, -12255229, -16751989]
37885a6751989m373811k834787k54033K289251L180988K494185K386018M245763
37877i618415O605216O752617L724184o19495k930921j360404J734558J492897
37869E780237k821543m924908M75205Q262744Q033607q68566p280329m254262
37861B402185J133741P1454l621557p80706O743356Q484970K264000k924334j770757
37852A2002352N80012n26386j771434l6882Q79279k283936n467585m377082j962091
37843b963753k128077j920656K418325O671352M511410j398275l060733K21018
37835B350611J740923r44135l028400j683813p2488m33672l94829J538783L136342
37826B209322L353890M108018M896395J923168m461387p751125m630816m50867
$$ y = [-16751989, -21125800, -23960587, -24214620, -21925369, -18744381, -16250196, -13864178, -9618415, -3013199, 3739418, 7463602, 6844107, 3913186, 2552782, 4287340, 5780237, 2958694, -1966214, -1491009, 6771735, 14805342, 13936776, 6656447, 2402185, 3535926, 3607380, -14177, -794883, 5948473, 14433443, 16697443, 13773109, 12002352, 12582364, 12055978, 10284544, 10247662, 11126941, 8843005, 3375420, -1001662, -2963753, -5091830, -7012486, -4594161, 2077191, 6588601, 5190326, 2129593, 2350611, 4091534, 3147399, 118999, -1564814, -1637302, -2070974, -2465803, -927020, 2209322, 5563212, 9671230, 14567625, 16490793, 12029406, 4278281, -352535, -803402]
37818h03402p04915k671628j352716J296810L16761k631413j723523K561429L732104
37809a980493L01978j443484K215636O317090M962303l10624m018743m427240
37801A616423l523711k512790j532244j440652k005703n43821L756698O521506
37793C35706L760397j283369k238756P15312J417601k137040m828794k969702
37785g228645O11221K607233M088846N539394L197694l976626q695931l906869
37777g763683O000239J0021751N215812q28446j997384n67249n39513j022702
37769H518825L19581K217022J936037o47687l782507o020769n985348k971507
37761f416353P87987J756873K03798j37520J401803J175561j567559k002148K139706
$$ y = [-803402, -1508317, -4179945, -5532661, -4235851, -3919090, -6550503, -8274026, -5712597, -1980493, -1678515, -3121999, -906363, 5410727, 10373030, 10062406, 6043663, 1616423, -1907288, -4420078, -5952322, -7392974, -9398677, -9942498, -6185800, 335706, 4096103, 2812734, 573978, 1289290, 2706891, 569851, -4258943, -7228645, -6617424, -4010191, 78655, 5618049, 8815743, 4839117, -3856814, -7763683, -1763444, 8258307, 13474119, 12645673, 10648289, 10081040, 9541527, 8518825, 8838406, 11055428, 12991465, 12343778, 8561271, 2540502, -3444846, -6416353, -5628366, -3871493, -3667695, -3805215, -2403412, -1227851, -2795410, -4797558, -2657852]
37752b657852N333256K366273k891574l096487J382223L671374J166679j590023
37744C683869p60322J819811K463095R8772l967797p405606p515438l411142K277135
37735a2717623O029503P011205O071263L237239r10054l806953m400302n320203
37727d805925p528838o523260L61027O711535N029720q72861j109380M052783
37719d685199M573643j735247m497952J833290P918552M628366k085426j744640
37711D205387L026517J719513n565186p794681p22533O738352O284795R42708
37703H834872j921772j069169n5818l41895n68173r5692M90968J123218K071965
37694H468504K819308K434891N25049k383850m588312m087647j283483L42846
$$ y = [-2657852, 2675404, 5041677, 2150103, -946384, 435839, 4107213, 5273892, 3683869, 2923547, 4743358, 7206453, 7305225, 3337428, -4068178, -11583616, -14994758, -12717623, -6688120, 323085, 6394348, 9631587, 8721533, 4914580, 514278, -4805925, -12334763, -18858023, -18496996, -11785461, -6755741, -7628602, -8737982, -4685199, -111556, -1846803, -6344755, -4511465, 3407087, 8035453, 5950027, 4205387, 7231904, 8951417, 3386231, -4408450, -5130983, 1607369, 7892164, 8834872, 6913100, 5843931, 5788113, 5446218, 4878045, 4782353, 5273321, 6396539, 8468504, 11287812, 13722703, 14247752, 11863902, 7275590, 3187943, 1904460, 2247306]
37686B247306j498148m262283m118359j732554o63650j046768L17767L678330
37678g078359N320971L702540J461675p3012k818845o008755m380700L284544
37670f589941R040315N377561l437322o551600j436240L696490K723379m72686
37662B349956K01359L401674L601371N21493o26283K215558M339630J162386m794658
37653A2372486o924358l036783K458877M925724M764571M630827M209714J282128
37645B4683186l126365m921203l007676j261668k567291m558815m239519l329115
37637b328466m482367m782927P97303R886559J3314977P150861j699999n274256
37629A2581685m743929n864619q245991n998264J949504Q700327P994562J435614
$$ y = [2247306, 749158, -3513125, -7631484, -9364038, -10027688, -11074456, -10756689, -7078359, -1757388, 1945152, 3406827, 3333815, 514970, -5493785, -9874485, -6589941, 2450374, 7827935, 4390613, -2160987, -3597227, 99263, 2822642, 2349956, 2551315, 5952989, 9554360, 10075853, 9449570, 11665128, 16004758, 17167144, 12372486, 5448128, 2411345, 4870222, 9795946, 14560517, 19191344, 23401058, 24683186, 21556821, 16635618, 13627942, 12366274, 9798983, 5240168, 1000649, -2328466, -6810833, -11593760, -10796457, -909898, 12405079, 19555940, 17855941, 12581685, 7837756, 1973137, -6272854, -12271118, -10321614, -1621287, 6373275, 7808889]
37621G808889m642758o108243l238890R01632K478620j54259l788873l027863
37613i771745K746450P623883O450539J352145j763004j171642l19437j680997
37605C466192l235785j948738J480622L032732M08301l259886k311216L735248
37597A367470P438226J998109q355415j1961469m920761L373668L304687k300506
37589a0055991m171414l11624L720074N014427N383131M678104Q29811l283823
37581A802695j815281L723955M872964m05297l759683j46380L511091p0461o189628
37572A523975o006723p31584J824329R35263K576859O838920O487190n51326o774085
37563F122818o380186l031649k060692j702705K067873O645017N568600j410818
$$ y = [7808889, 3166131, -2942112, -6181002, -5279370, -2800750, -2955009, -6743882, -9771745, -7025295, 598588, 7049127, 8401272, 6638268, 5466626, 5147189, 3466192, 230407, -1718331, -237709, 2795023, 3203324, -56562, -2367778, 1367470, 8805696, 10803805, 2448390, -9513079, -14433840, -11060172, -7755485, -10055991, -14227405, -14539029, -10818955, -5804528, -421397, 4256707, 5086518, 1802695, -12586, 3711369, 8584333, 8179036, 4419353, 4272973, 7784064, 7713603, 1523975, -4482748, -5214332, -3390003, -2454740, 122119, 6961039, 13448229, 12896903, 6122818, -257368, -3289017, -5349709, -7052414, -4984541, 1660476, 7229076, 5818258]
37555E818258p010374n814636o97290K026675J086080Q79236M168209P443364
37547G899522N745147K40499k802461q15695J385318j236721o563655q316344
37539d464390m133232K511411O672737N426775q46245p553973q495850k728315
37531a3611082L504657M993607M304875N814487P093786L118104l737997o057874
37523E422563k675897N20097Q29133J313677K530880O62491m055633n723189k561139
37514c737017m2352r71737j060334J516747J310991l918218o796613j800489M695985
37505a0803037M200611q38223k651443q00195K73282J005946L908471N564889
37497a39699K057603j583999J353048O070742K859070n599928p426393j275448
$$ y = [5818258, -1192116, -7006752, -7704042, -5677367, -4591287, -3712051, 456158, 7899522, 13644669, 13885168, 11082707, 10267012, 11652330, 10415609, 3851954, -4464390, -8597622, -6086211, 586526, 6013301, 5167056, -2386917, -10882767, -13611082, -10106425, -5112818, -807943, 5006544, 12100330, 15218434, 11480437, 5422563, 2746666, 3266763, 4095896, 5409573, 7940453, 8602944, 4547311, -1175878, -3737017, -3779369, -4751106, -5811440, -4294693, -2983702, -6901920, -13698533, -15499022, -10803037, -6602426, -7440649, -10092092, -10892287, -10619005, -9613059, -5704588, -139699, 1917904, 333905, 1686953, 7757695, 10616765, 5016837, -2409556, -3685004]
37489c685004K061720q94150j105479M603832O081169j562736o834128k90145
$$ y = [-3685004, -1623284, -2517434, -3622913, 980919, 7062088, 5499352, -1334776, -1624921]
$$ [...]
##END NTUPLES=NMR SPECTRUM
##END=
