##TITLE=31Pdec_LR-698-R3-MK1-TFA
  CDCl3
  24 sc
 29.9.2023
##JCAMPDX= 6.0         $$ Bruker NMR JCAMP-DX V2.0
##DATA TYPE= NMR SPECTRUM
##DATA CLASS= NTUPLES
##ORIGIN= UXNMR, Bruker Analytische Messtechnik GmbH
##OWNER= root
$$ XWIN-NMR		Version 3.5
$$ Fri Sep 29 14:31:21 2023 Russian Standard Time (UT+4h)  she@DPX200
##.OBSERVE FREQUENCY= 81.013821
##.OBSERVE NUCLEUS= ^31P
##.ACQUISITION MODE= SIMULTANEOUS
##.ACQUISITION SCHEME= undefined
##.AVERAGES= 24
##.DIGITISER RES= 16
##SPECTROMETER/DATA SYSTEM= spect
##.PULSE SEQUENCE= zgpg30
##.SOLVENT NAME= CDCl3
##.SHIFT REFERENCE= (INTERNAL, CDCl3, 0, 248.564)
##AUDIT TRAIL= $$ (NUMBER, WHEN, WHO, WHERE, WHAT)
$$ ##TITLE= Audit trail, XWIN-NMR		Version 3.5
$$ ##JCAMPDX= 5.01
$$ ##ORIGIN= Bruker BioSpin GmbH
$$ ##OWNER= she
$$ F:/spectra/data/she/nmr/P31/1/pdata/1/auditp.txt
$$ ##AUDIT TRAIL=  $$ (NUMBER, WHEN, WHO, WHERE, WHAT)
(   1,<2023-09-29 14:30:25.35 +0400>,<she>,<DPX200>,
      <created by zg, POWCHK disabled, PULCHK disabled
       configuration hash MD5:
       00 E9 B6 7A A2 85 ED C7 34 08 36 98 17 FE 4E 26
       data hash MD5: 32K
       3D 09 11 50 2B 20 FA FC 4B 24 44 B7 55 BC F3 8C>)
(   2,<2023-09-29 14:30:28.07 +0400>,<she>,<DPX200>,
      <Start of raw data processing
       efp BC_mod = 2 LB = 5 FT_mod = 6 PKNL = 1 PHC0 = -10600.45 PHC1 = -92.71359 SI = 64K 
       data hash MD5: 64K
       CD FA 3C 19 04 BF 16 C4 3A CA B5 27 21 04 67 22>)
(   3,<2023-09-29 14:30:40.95 +0400>,<she>,<DPX200>,
      <pk PHC0 = 12.43913 PHC1 = 0 
       data hash MD5: 64K
       7C 5B 61 F3 68 AF 9B B1 AE D7 23 6A 89 B5 AD D4>)
$$ ##END=
$$ 
$$ hash MD5
$$ 64 3E 04 72 87 87 3A 5F 09 74 DD 04 35 2E 9C B7
##$RELAX= 
##$RELAX= 
##$RELAX= 
##$RELAX= 
##$RELAX= 
##$RELAX= 
##$RELAX= 
##$RELAX= 
##$RELAX= 
$$ Bruker specific parameters
$$ --------------------------
##$DU= <F:/spectra>
##$EXPNO= 1
##$NAME= <P31>
##$PROCNO= 1
##$TYPE= <nmr>
##$USER= <she>
##$AMP= (0..31)
100 100 100 100 100 100 100 100 100 100 100 100 100 100 100 100 100 100 
100 100 100 100 100 100 100 100 100 100 100 100 100 100 
##$AQSEQ= 0
##$AQ_mod= 1
##$AUNM= <au_zg>
##$AUTOPOS= <>
##$BF1= 81.014009
##$BF2= 200.13
##$BF3= 200.13
##$BF4= 200.13
##$BF5= 200.13
##$BF6= 200.13
##$BF7= 200.13
##$BF8= 200.13
##$BYTORDA= 1
##$CFDGTYP= 0
##$CFRGTYP= 5
##$CHEMSTR= <none>
##$CNST= (0..31)
1 1 145 1 1 1 1 1 1 1 1 1 1 1 1 1 1 1 1 1 1 1 1 1 1 1 1 1 1 1 1 1 
##$CPDPRG= <waltz16>
##$CPDPRG1= <>
##$CPDPRG2= <waltz16>
##$CPDPRG3= <>
##$CPDPRG4= <mlev>
##$CPDPRG5= <mlev>
##$CPDPRG6= <mlev>
##$CPDPRG7= <mlev>
##$CPDPRG8= <mlev>
##$CPDPRGB= <>
##$CPDPRGT= <>
##$D= (0..31)
0 1 0 0 0 0 0 0 0 0 0 0.03 2e-05 3e-06 0 0 0 0 0 0 0 0 0 0 0 0 0 0 0 0 
0 0 
##$DATE= 1695983424
##$DBL= (0..7)
120 120 120 11 120 120 24 19 
##$DBP= (0..7)
150 150 150 150 150 150 150 150 
##$DBP07= 0
##$DBPNAM0= <>
##$DBPNAM1= <>
##$DBPNAM2= <>
##$DBPNAM3= <>
##$DBPNAM4= <>
##$DBPNAM5= <>
##$DBPNAM6= <>
##$DBPNAM7= <>
##$DBPOAL= (0..7)
0.5 0.5 0.5 0.5 0.5 0.5 0.5 0.5 
$$ [...]
##$SUBNAM2= <"">
##$SUBNAM3= <"">
##$SUBNAM4= <"">
##$SUBNAM5= <"">
##$SUBNAM6= <"">
##$SUBNAM7= <"">
##$SUBNAM8= <"">
##$SUBNAM9= <"">
##$SW= 501.771253377433
##$SWIBOX= (0..15)
0 1 3 0 0 0 0 0 0 0 0 0 0 0 0 0 
##$SW_h= 40650.406504065
##$TD= 32768
##$TD0= 1
##$TE= 0
##$TE2= 300
##$TE3= 300
##$TEG= 300
##$TL= (0..7)
0 120 53 12 22 120 120 120 
##$TP= (0..7)
150 150 150 150 150 150 150 150 
##$TP07= 0
##$TPNAME0= <>
##$TPNAME1= <>
##$TPNAME2= <>
##$TPNAME3= <>
##$TPNAME4= <>
##$TPNAME5= <>
##$TPNAME6= <>
##$TPNAME7= <>
##$TPOAL= (0..7)
0.5 0.5 0.5 0.5 0.5 0.5 0.5 0.5 
##$TPOFFS= (0..7)
0 0 0 0 0 0 0 0 
##$TUNHIN= 0
##$TUNHOUT= 0
##$TUNXOUT= 0
##$USERA1= <user>
##$USERA2= <user>
##$USERA3= <user>
##$USERA4= <user>
##$USERA5= <user>
##$V9= 5
##$VALIST= <valist>
##$VCLIST= <CCCCCCCCCCCCCCC>
##$VD= 0
##$VDLIST= <DDDDDDDDDDDDDDD>
##$VPLIST= <PPPPPPPPPPPPPPP>
##$VTLIST= <TTTTTTTTTTTTTTT>
##$WBST= 1024
##$WBSW= 4
##$XGAIN= (0..3)
0 0 0 0 
##$XL= 0
##$YL= 0
##$YMAX_a= 4270
##$YMIN_a= -2119
##$ZGOPTNS= <>
##$ZL1= 120
##$ZL2= 120
##$ZL3= 120
##$ZL4= 120
##$ABSF1= 0
##$ABSF2= 0
##$ABSG= 0
##$ABSL= 0
##$ALPHA= 0
##$AQORDER= 0
##$ASSFAC= 0
##$ASSFACI= 0
##$ASSFACX= 0
##$ASSWID= 0
##$AUNMP= <proc_1d>
##$AZFE= 0.1
##$AZFW= 0.5
##$BCFW= 0
##$BC_mod= 2
##$BYTORDP= 0
##$COROFFS= 0
##$CY= -3
##$DATMOD= 1
##$DC= 0
##$DFILT= <>
##$DTYPP= 0
##$F1P= 0
##$F2P= 0
##$FCOR= 1
##$FTSIZE= 65536
##$FT_mod= 6
##$GAMMA= 0
##$GB= 0
##$INTBC= 1
##$INTSCL= 6.047779e-11
##$ISEN= 30
##$LB= 5
##$LEV0= 0
##$LPBIN= 0
##$MAXI= 10000
##$MC2= 0
##$MEAN= 0
##$ME_mod= 0
##$MI= 50
##$NCOEF= 0
##$NC_proc= -9
##$NLEV= 6
##$NOISF1= 182.463
##$NOISF2= 159.3651
##$NSP= 0
##$NTH_PI= 0
##$NZP= 0
##$OFFSET= 248.5645
##$PC= 4
##$PHC0= -10588.01
##$PHC1= -92.71359
##$PH_mod= 1
##$PKNL= yes
##$PPARMOD= 0
##$PSCAL= 0
##$PSIGN= 0
##$REVERSE= no
##$SF= 81.0140089999694
##$SI= 65536
##$SIGF1= 159.3651
##$SIGF2= -187.1042
##$SINO= 113.3802
##$SIOLD= 16384
##$SREGLST= <1H.CDCl3>
##$SSB= 0
##$STSI= 65536
##$STSR= 0
##$SW_p= 40650.406504065
##$SYMM= 0
##$S_DEV= 0
##$TDeff= 32768
##$TDoff= 0
##$TI= <>
##$TILT= no
##$TM1= 0
##$TM2= 0
##$TOPLEV= 0
##$USERP1= <user>
##$USERP2= <user>
##$USERP3= <user>
##$USERP4= <user>
##$USERP5= <user>
##$WDW= 1
##$XDIM= 65536
##$YMAX_p= 505493520
##$YMIN_p= -135367987
$$ End of Bruker specific parameters
$$ ---------------------------------
##NTUPLES= NMR SPECTRUM
##VAR_NAME=  FREQUENCY,     SPECTRUM/REAL,   SPECTRUM/IMAG
##SYMBOL=    X,             R,               I
##VAR_TYPE=  INDEPENDENT,   DEPENDENT,       DEPENDENT
##VAR_FORM=  AFFN,          ASDF,            ASDF
##VAR_DIM=   65536,         65536,           65536
##UNITS=     HZ,            ARBITRARY UNITS, ARBITRARY UNITS
##FACTOR=    0.620285442955139, 1,           1
##FIRST=     20137.2065510682, 0,            0
##LAST=      -20513.1999529968, 0,           0
##MIN=       -20513.1999529968, -135367987,  0
##MAX=       20137.2065510682, 505493520,    0
$$ Real data points
##PAGE= N=1
##DATA TABLE= (X++(R..R)), XYDATA
$$ [...]
42991a736695Q78926M06710l26159j015588j476883j631670j449649r77760l73573
42982g702341J55626M61837N22055M30733L22150K58511J91949P2190k5546M6468
42972e266368L12300O05543P40546O82425M88302J55917l48121r17729j283460
42963d830645j216589p16647Q644O75441J025135R23718M78852J5328j78450r0498
42953c905711Q1344J98017K82416L78121M53990N00581N88366P24077P42162M78887
42943E22250J9731l59081m94071m58772l76691k55422p6124P7335J07379O5031
42933a228435R5132K26935L30093L00598J95838J38113J55068J77815J51825Q1062
42923F24044j9389j51964l15603m99440o94869q69252r33314q01912n13928k31779
$$ y = [-1736695, -857769, -451059, -777218, -1792806, -3269689, -4901359, -6351008, -7328768, -7702341, -7546715, -7084878, -6562823, -6132090, -5809940, -5551429, -5359480, -5287290, -5312836, -5266368, -4954068, -4348525, -3607979, -2925554, -2437252, -2281335, -2629456, -3547185, -4830645, -6047234, -6763881, -6755237, -6079796, -5054661, -4130943, -3652091, -3636763, -3815213, -3905711, -3824367, -3626350, -3343934, -2965813, -2511823, -2011242, -1422876, -698799, 43363, 522250, 541981, 182900, -311171, -769943, -1146634, -1402056, -1478180, -1400845, -1293466, -1228435, -1133303, -906368, -576275, -275677, -79839, 58274, 213342, 391157, 542982, 624044, 604655, 452691, 137088, -362352, -1057221, -1926473, -2859787, -3661699, -4175627, -4407406]
42913d407406o9159M3225K57944N92913Q76835R18076O76266K58404j92195n64244
42903a609341p83188q17535o96269m95192k85920q7044J40576M35406P53154R65703
42893b479650R85835Q77591P77203P06041N53949K83443M8298J8779J56754K77792
42883B206035L00640L03640L25059K40948q6112o08274j107821j372235j317648
42874a115768r98993n70057k13122l7499j2747J190J54336M98803R18813J171873
42864b03171J081490P32934M27859M03624O32590R12252J075330J061374Q69362
42855F993644N48165K04363p4192k92664m75973n52155m11666q1112K65784M91122
42845F615316N94454O09673N09927K78087j4400k78665m94640o43106o13204l06088
$$ y = [-4407406, -4476565, -4433340, -4175396, -3582483, -2705648, -1787572, -1111306, -852902, -1045097, -1609341, -2392529, -3210064, -3906333, -4401525, -4687445, -4774489, -4633913, -4198507, -3445353, -2479650, -1493815, -616224, 160979, 867020, 1420969, 1704412, 1752710, 1771489, 1928243, 2206035, 2506675, 2810315, 3135374, 3376322, 3290210, 2681936, 1574115, 201880, -1115768, -2114761, -2684818, -2897940, -2935439, -2948186, -2946996, -2792660, -2293857, -1375044, -203171, 878319, 1611253, 2039112, 2442736, 3075326, 3987578, 5062908, 6124282, 6993644, 7541809, 7746172, 7671980, 7379316, 6903343, 6351188, 5939522, 5858410, 6124194, 6615316, 7209770, 7819443, 8329370, 8607457, 8593057, 8314392, 7819752, 7176646, 6563442, 6257354]
42835F257354J58461M41727K58711l60405j086691j545518j563969j229659p64606
42826E65405l64531j44810j66827m07911o81389p02045l45608J92222N95219P63208
42816f97067Q46755R70856J079235J094015J067375J050968R22053N08425j31285
42807F711330o90408r05819p87543n56221m38421n23747p16482p97406o36804
42798F58479m00023m42273r07623j492625j702682j315282n24669L08587R29338
42789d888773J237929J241130J048460Q43864P61711P84529P87254O62161L90764
42780B869029M7118k28530l08579j99799p0318r2580k60435m15208m48238m06034
42770D86426l75732l48300k63832j47197j10780k19719m19769o09109p16244o83890
$$ y = [6257354, 6415815, 6857542, 7116253, 6755848, 5669157, 4123639, 2559670, 1330011, 565405, 200874, 56064, -110763, -518674, -1200063, -1902108, -2247716, -2055494, -1460275, -697067, 149688, 1120544, 2199779, 3293794, 4361169, 5412137, 6334190, 6842615, 6711330, 6020922, 5115103, 4327560, 3771339, 3332918, 2809171, 2092689, 1295283, 658479, 258456, -183817, -1091440, -2584065, -4286747, -5602029, -6126698, -5818111, -4888773, -3650844, -2409714, -1361254, -517390, 244321, 1028850, 1816104, 2478265, 2869029, 2916147, 2687617, 2379038, 2179239, 2108921, 2016341, 1755906, 1340698, 892460, 486426, 110694, -237606, -501438, -648635, -759415, -979134, -1398903, -2008012, -2724256, -3408146]
42760c408146m54654m7979L82227O46535O82588N72767M15173K49893J18481J02045
42750g41070K32235M04930M48207K76081m6518l66960n49275n52704m46761l24811
42740a666646j81907O3239L76752N23866L00654j70370n15862n16657l16038j62218
42730b265187o4379J70571O23823J137363J508041J681656J698111J537975J126868
42721G154842M78876k41600q27976j171457j283777j223826j043895p92537n16205
42712E32445k37216L8844K76919M13526M38193M34969M85773N54594N34371L99628
42702C872046K34460R7726n4577k69751m89039n98169n48211l76396j42118J02175
42692A828146K91667L42839J74136k38937p55193j018948o71099K64919J274627
$$ y = [-3408146, -3862800, -3910779, -3528552, -2882017, -2199429, -1626662, -1211489, -961596, -843115, -741070, -508835, -103905, 344302, 620383, 573865, 206905, -342370, -895074, -1341835, -1666646, -1848553, -1785314, -1408562, -884696, -584042, -754412, -1270274, -1786931, -2102969, -2265187, -2329566, -2158995, -1535172, -397809, 1110232, 2791888, 4489999, 6027974, 7154842, 7633718, 7392118, 6564142, 5392685, 4108908, 2885082, 1841187, 1048650, 532445, 295229, 334073, 610992, 1024518, 1462711, 1897680, 2383453, 2938047, 3472418, 3872046, 4106506, 4204232, 4149655, 3879904, 3390865, 2792696, 2244485, 1868089, 1725971, 1828146, 2119813, 2462652, 2636788, 2397851, 1642658, 623710, -47389, 217530, 1492157]
42683A492157J766793J597659J112156P17927N38020M42710K49476j49739p20625
42674G046534j273478j606095j702887j701582j642582j393628q90746l03120
42666c467584J66981N30562R05947J257081J426723J404053J371531J443107J487302
42657F525703J269553P00152p3700p50366j063443r99119q33720q52420j030257
42648B892383j110819r90415q43563q16677p93921n97674k68101K3735K27140
42639b277912L80860M00829J28501l81760q03977q42771m91312M5644N68491R68021
42629b305386J202610J282946J239500J056987O81691J29842m46866q30802q61496
42620A149026n25611M125M49471O62067P89806J094011J577174J918206J823427
$$ y = [1492157, 3258950, 4856609, 5968765, 6686692, 7224712, 7667422, 7916898, 7767159, 7046534, 5773056, 4166961, 2464074, 762492, -880090, -2273718, -3164464, -3467584, -3300603, -2770041, -1864094, -607013, 819710, 2223763, 3595294, 5038401, 6525703, 7795256, 8495408, 8421708, 7671342, 6607899, 5608780, 4775060, 3922640, 2892383, 1781564, 791149, -52414, -869091, -1663012, -2260686, -2528787, -2505052, -2277912, -1897052, -1496223, -1367722, -1749482, -2553459, -3396230, -3887542, -3841898, -3273407, -2305386, -1102776, 180170, 1419670, 2476657, 3158348, 3288190, 2841324, 2010522, 1149026, 623415, 627540, 1077011, 1739078, 2528884, 3622895, 5200069, 7118275, 8941702]
42611H941702J317236O36210o238m56959o05589n14105m54374o21637q78951r77113
42601F380182r62080j122899j533379j884760j836029j333670n27005M01585J188950
42592a229105J485371J131062L80959k95008n90331m57150L6036P39986J369917
42583B571737J629751J446996R86103M34803j09575n58670p94461p69764n67642
42574D269278l41361k57756m48628q59764j145463r12794j74395N79912Q84453
42565A593482P69800O13886O26246O64567N39117L06325J79120K46627L72227
42556E911397L40227N7814l64670o96142p58494n55984k59672p7171j23138l64793
42546C109374o50021q06831p65416n97982m25794k94225j51346P6647M19257Q37959
$$ y = [8941702, 10258938, 10895148, 10888910, 10431951, 9826362, 9312257, 8857883, 8236246, 7357295, 6380182, 5418102, 4295203, 2761824, 877064, -958965, -2292635, -2819640, -2418055, -1229105, 256266, 1387328, 1768287, 1473279, 882948, 425798, 461834, 1201820, 2571737, 4201488, 5648484, 6634587, 7069390, 6959815, 6401145, 5606684, 4836920, 4269278, 3927917, 3670161, 3221533, 2361769, 1216306, 303512, 129117, 709029, 1593482, 2363282, 2977168, 3603414, 4267981, 4807098, 5113423, 5292543, 5539170, 5911397, 6251624, 6309438, 5944768, 5248626, 4490132, 3934148, 3674476, 3597305, 3474167, 3109374, 2459353, 1652522, 887106, 289124, -136670, -430895, -582241, -505594, -86337, 751622]
42536G51622J207398J328893J044821L98441l31888p96334q07382m60940o9094
42527B265537M8492k16072o94375j100441j266967j223464j070122q41191n23416
42518d622019j63751J03263J52406j2083k23389k42938P1565O46011J238453J623567
42508a428915J724523J573780J212628O98816J85477j18758j37303l1580m3083
42499C635585k25006l88376l31206n8853K67050N31813P16607P65888N55584P9807
42489E548893m22411o52394n39559k43098J05187N16360R71736J278927J211737
42480G775378P41184N6552n91019j006809j098284r26257o95147n93762o32911
42471C028925o87483o64234n55473l76276j70663p0983k19063n89876r84776j221163
$$ y = [751622, 1959020, 3287913, 4332734, 4731175, 4399287, 3602953, 2795571, 2334631, 2265537, 2314029, 2097957, 1403582, 303141, -963826, -2187290, -3257412, -4098603, -4622019, -4785770, -4682507, -4530101, -4542184, -4765573, -5008511, -4936946, -4290935, -3052482, -1428915, 295608, 1869388, 3082016, 3780832, 3966309, 3847551, 3710248, 3678668, 3635585, 3410579, 3022203, 2690997, 2632144, 2899194, 3431007, 4147614, 4913502, 5469086, 5548893, 5126482, 4474088, 3934529, 3691431, 3796618, 4312978, 5284714, 6563641, 7775378, 8516562, 8573114, 7982095, 6975286, 5877002, 4950745, 4255598, 3661836, 3028925, 2341442, 1677208, 1121735, 745459, 574796, 503813, 284750, -305126, -1289902, -2511065]
42461b511065j234996r97173m89888J59769O72267Q79958R19131J037820J284846
42452b79331J521372J671472J779454J820394J633393J118131L95280k88718p41448
42443H629999q76820o95385l02225J04678L43109L41979J18617k79522p65377
42434F619053j195190j430467j417620j191370q34821m61383j86228n8533l3717
42425a90276l7207k5943L0979J67616L55777M73677M24020K61512J17098N986
42415A583239j83317m77954o99120o34914k94044Q6682K74542K22254K8298k08172
42405c02506m54386p02584r13216j018056r78526q34152o73813n42848l98412
42396f818499j90504K9681J42554J11366L3423M132P68k7604j6704J49238M42321
$$ y = [-2511065, -3746061, -4743234, -5233122, -5073353, -4401086, -3521128, -2601997, -1564177, -279331, 1242041, 2913513, 4692967, 6513361, 8146754, 9264885, 9660165, 9371447, 8629999, 7753179, 7057794, 6755569, 6860247, 7203356, 7545335, 7663952, 7384430, 6619053, 5423863, 3993396, 2575776, 1384406, 549585, 88202, -98026, -156559, -190276, -227483, -253426, -222447, -54831, 300946, 774623, 1198643, 1460155, 1577253, 1583239, 1399922, 921968, 222848, -412066, -706110, -619428, -344886, -122632, -94334, -302506, -756892, -1459476, -2372692, -3390748, -4369274, -5203426, -5877239, -6420087, -6818499, -7009003, -6979322, -6836768, -6725402, -6691979, -6687847, -6687079, -6714683, -6731387, -6582149, -6139828]
42385f139828O81005P42660O77314N64529L71060L9738l59716o64970p50764n46737
42375e385709j4000P58600J480114J836048J756662J402482R04662K70507m39898
42366B569468j017752j275382j205911r13042n04144j33188j0542k12985n36952
42357c240430o72014n04672j69084J52793L72607M72395M62429L68779J81455
42348b575742j65537o61427j079771j105459o53935J3798N37799P63405P80150
42339d146719P47238P53559Q07177Q77503R19741Q76928O83780L04675j98180
42330A625702o46101q39676o97740l04423J57941N04549O26771N54723M47613
42321A429359M55129N51265N36667K43843k53089o39763n98519j00833N06625
$$ y = [-6139828, -5458823, -4716163, -4038849, -3474320, -3103260, -3063522, -3423238, -4088208, -4838972, -5385709, -5399709, -4641109, -3160995, -1324947, 431715, 1834197, 2738859, 3009366, 2569468, 1551716, 276334, -929577, -1842619, -2346763, -2479951, -2490493, -2703478, -3240430, -3912444, -4417116, -4586200, -4433407, -4060800, -3588405, -3125976, -2757197, -2575742, -2741279, -3402706, -4482477, -5587936, -6241871, -6228073, -5690274, -4926869, -4146719, -3399481, -2645922, -1838745, -961242, -41501, 835427, 1519207, 1823882, 1625702, 979601, 139925, -557815, -862238, -704297, -199748, 427023, 981746, 1429359, 1884488, 2435753, 2972420, 3216263, 2963174, 2323411, 1724892, 1624059, 2130684]
42312B130684P54375M47903j91318p93691j188794j434652j586269j575535j325302
42303d762599q63530k80496L43306R16572J311379J427525J273864R67470O68782
42294A002273N05133N02334N75585O25012O39479O60199O54518N04304J44442
42285E813279l38273p56705r30831p66361l22253J78560M86533N07484L03685
42276D175118n1196m91869q40354q56854n19960j23459L8226j4279p3228q2833
42266A159312j61924l35730m61576m59908m31370m44031l43793O6543O94480J139493
42256D21496J064262N53228O6224K0394M09884Q39486R27755O50161K82177O6340
42246E301407m829j10661l87561p96334j147165j252827j105502q98881q23036
$$ y = [2130684, 2885059, 3332962, 3141644, 2347953, 1159159, -275493, -1861762, -3437297, -4762599, -5626129, -5906625, -5563319, -4646747, -3335368, -1907843, -633979, 333491, 1002273, 1507406, 2009740, 2585325, 3210337, 3849816, 4510015, 5164533, 5668837, 5813279, 5475006, 4718301, 3787470, 3021109, 2698856, 2877416, 3363949, 3871433, 4175118, 4123922, 3632053, 2791699, 1934845, 1414885, 1291426, 1329652, 1315373, 1242145, 1159312, 997388, 661658, 200082, -259826, -691196, -1135227, -1479020, -1412477, -717997, 421496, 1485758, 2038986, 2105210, 2125604, 2535488, 3374974, 4302729, 4952890, 5235067, 5301407, 5296578, 5185917, 4798356, 4002022, 2854857, 1602030, 496528, -402353, -1225389]
42237a225389q46842p74332n17087k18729p0413q0911r0116M7627L61140P86580
42227b628472J185831J344648J071920L89731l98299q97990r18399n78371j39249
42218a568650K30307N14721P34390Q50997Q15827O59156M72708L11583J59937
42209C180976l125j50884k47440l06698l70938m30694m01683k12341Q6069L23700
42199A466942L49610J59081j31041m12970o51045q23625q77140p86833o24682
42190b331703n09625m94148n23403m81922k58207J82429P22870J126581J231390
42181a335738J108369R54638Q40152O66886M00291K10912K83113N51185P46729
42172D426537O99149M84426K50855o555m12125r73630j466727j607858j326124
$$ y = [-1225389, -2072231, -2846563, -3363650, -3582379, -3652792, -3733703, -3823819, -3776192, -3415052, -2628472, -1442641, -97993, 973927, 1363658, 965359, 67369, -851030, -1429401, -1568650, -1338343, -823622, -89232, 761765, 1577592, 2236748, 2709456, 3021039, 3180976, 3177851, 3026967, 2779527, 2472829, 2101891, 1671197, 1269514, 1057173, 1143242, 1466942, 1816552, 1975633, 1844592, 1431622, 780577, -43048, -920188, -1707021, -2331703, -2841328, -3335476, -3858879, -4340801, -4599008, -4416579, -3693709, -2567128, -1335738, -227369, 727269, 1567421, 2234307, 2634598, 2845510, 3128623, 3679808, 4426537, 5125686, 5610112, 5860967, 5854412, 5442287, 4468657, 3001930, 1394072, 67948]
42163F7948q16858l19403R8004M80881P73518P94288M79038N4139j48144l6341
42153A427070J66253K06433P5971m6471o4214p8944k26856m70088o15076n27263
42143a53185k66390J4614K43267M27819N22445M26471J76876K6345J85484N12752
42133B116498O08782K63371l02168p01139p87430p00032n92886m80610l48671
42124i24285k65844l16967m99440p34038r12975r06114o19780j33521K94607M68436
42114d549921M68392N31685P48714R89123J111878J107812J001416P52177L48367
42105B509643q3758l57760l69109j10267L59316Q56172J081854Q71845M37300
42096E195236K00774L46324O57994Q49703R02907R60526J006028Q39116L69888
$$ y = [67948, -748910, -1068313, -970309, -489428, 284090, 1078378, 1557416, 1611555, 1463411, 1427070, 1593323, 1799756, 1875727, 1829256, 1765042, 1686098, 1459242, 989154, 374078, -153185, -419575, -404961, -161694, 266125, 788570, 1215041, 1391917, 1418262, 1603746, 2116498, 2725280, 2988651, 2686483, 1985344, 1197914, 497882, -95004, -575614, -924285, -1190129, -1507096, -2006536, -2740574, -3653549, -4559663, -5179443, -5312964, -5018357, -4549921, -4081529, -3549844, -2801130, -1812007, -700129, 407683, 1409099, 2161276, 2509643, 2425885, 2068125, 1699016, 1588749, 1948065, 2804237, 3886091, 4757936, 5195236, 5396010, 5742334, 6400328, 7250031, 8152938, 9113464, 10119492, 10958608, 11328496]
42087A1328496k09064n96503o51963m64091k29645j09797j44343k46725l02714
42078H373651k95453k95205l14153k51924m8104J78513K42260J08161j16648l99604
42068G181494q40866j440429j922367j933713j410720o59091o4978K14413K88929
42059e87328L58938N36561P81273R56737R56631P89179N39358K80034O1617n1239
42049D621761l6601k4522k29828o80799j077944j048628n61059o547J65779j44607
42039I77005o59670j028577j097660r11448n61560j19750L06716N62846N65385
42030a966713M06271K61486J81742K7946l50087q96693j344079j421668j071525
42021f173320m79823Q6609M76403O92702P65361O61698L81772P9661l2030R1141
$$ y = [11328496, 11119432, 10522929, 9870966, 9406875, 9177230, 9067433, 8923090, 8676365, 8373651, 8078198, 7782993, 7468840, 7216916, 7168812, 7347325, 7589585, 7697746, 7581098, 7181494, 6340628, 4900199, 2977832, 1044119, -366601, -1025692, -1090670, -876257, -587328, -228390, 308171, 1089444, 2046181, 3002812, 3791991, 4331349, 4611383, 4673000, 4621761, 4585160, 4560638, 4330810, 3650011, 2572067, 1523439, 962380, 955833, 1121612, 977005, 317335, -711242, -1808902, -2720350, -3281910, -3401660, -3094944, -2532098, -1966713, -1560442, -1298956, -1117214, -1089268, -1439355, -2336048, -3680127, -5101795, -6173320, -6653143, -6566534, -6090131, -5397429, -4632068, -3970370, -3588598, -3508937, -3540967, -3449826]
42011c449826K93474M28224M81502M51644K60520q8520l70467l28549K0847M15394
42001a885757O69155Q21882R49185R82924Q12066M67990J08458j45923k92527
41992B487453l94681n07936o43718p62349q03184p36653n75989l46462q7562J14235
41982b256846J67589R0608K6682R3880K57802L98362M48184L92239J82466k18333
41972d17367o83195r25135p48432k70106J69588L11035J62034p6808j99493j16702
41962b794581J18403L58859M85257N16244N54094N91274M54488L1709n04930q35475
41952a024658q42203o92755n69455m82924m15768m61038o46191p31930m05105
41943f272027L26107J083741J482273J423544J051313N84381K33973J12513J08691
$$ y = [-3449826, -3156352, -2728128, -2246626, -1794982, -1534462, -1622982, -1993449, -2321998, -2301151, -1885757, -1216602, -394720, 554465, 1537389, 2349455, 2817445, 2925903, 2779980, 2487453, 2092772, 1584836, 941118, 178769, -624415, -1361068, -1937057, -2283519, -2371081, -2256846, -2089257, -1998649, -1971967, -1878087, -1620285, -1221923, -773739, -381500, -199034, -417367, -1100562, -2025697, -2774129, -3044235, -2874647, -2563612, -2401578, -2478386, -2677879, -2794581, -2676178, -2317319, -1832062, -1315818, -761724, -170450, 284038, 315747, -189183, -1024658, -1866861, -2559616, -3129071, -3611995, -4027763, -4488801, -5134992, -5866922, -6272027, -5945920, -4862179, -3379906, -1956362, -905049, -320668, -86695, 25818, 134509]
41934A34509m4412m57935q97783j006390o83270j57252L05902O77502J108531
41925a020598J635695K012849J908079J291785N45921Q8598o2610k17986n31624
41916E650109p91581p69304n86031n52420p42414r20316q66093o01095k75288
41907d54433J3213K25035L25890L23632L09892L86407N54593P13786P64494O96573
41897C859082N80820M80220L68825J51383k22241o73544j038750j181463j061818
41888A262514p41812l58467n7230R6394J30930Q3503m6976k19619k90314j27460
41878b68537K20589N49349O88775O07055L39380q7643o18763j119971j429442
41869a119208j468580j308079j132476j098767j172176j117960p22066k5691P04114
$$ y = [134509, 90097, -367838, -1265621, -2272011, -2955281, -3112533, -2806631, -2129129, -1020598, 615097, 2627946, 4536025, 5827810, 6373731, 6462329, 6399719, 6181733, 5650109, 4858528, 4089224, 3503193, 2950773, 2208359, 1288043, 421950, -179145, -454433, -441220, -216185, 109705, 433337, 743229, 1129636, 1684229, 2398015, 3162509, 3859082, 4439902, 4920122, 5288947, 5440330, 5218089, 4544545, 3505795, 2324332, 1262514, 520702, 162235, 105005, 201399, 332329, 415832, 368856, 149237, -141077, -268537, -47948, 501401, 1190176, 1797231, 2136611, 2048968, 1430205, 310234, -1119208, -2587788, -3895867, -5028343, -6127110, -7299286, -8417246, -9139312, -9165003, -8460889]
41860h460889J224039J482643J576152J636750J758366J914864J923487J611152
41852D666564J080520O94400O86647Q65024Q23676M06699j70049o40678r77451
41843G435352j301124j623135j794094j683415j322972q58388m15586n4085J73746
41834a443701J82451p3056m79175p65979o84672k10315M25547Q98937J006025
41825a143938P68140L79772N4525j10779j41686p5485J13519M50220Q55574J163555
41815B313417J236009J021668N36621j10936o57119p70896l34197L82256R12967
41806D529790R81966O57186J72291k85815o03649p07641o26014n27334n73309
41797C017471p28596q11018p56600p49345j016048j521204j939449j960484j590346
$$ y = [-8460889, -7236850, -5754207, -4178055, -2541305, -782939, 1131925, 3055412, 4666564, 5747084, 6441484, 7128131, 7993155, 8816831, 9223530, 9053481, 8412803, 7435352, 6134228, 4511093, 2716999, 1033584, -289388, -1147776, -1563362, -1617447, -1443701, -1261250, -1334306, -1813481, -2579460, -3264132, -3474447, -3048900, -2149963, -1143938, -375798, 3974, 58499, -52280, -193966, -269451, -155932, 294288, 1149862, 2313417, 3549426, 4571094, 5107715, 4996779, 4339660, 3568764, 3234567, 3616823, 4529790, 5511756, 6168942, 6341233, 6055418, 5451769, 4744128, 4118114, 3590780, 3017471, 2288875, 1477857, 721257, -28088, -1044136, -2565340, -4504789, -6465273, -8055619]
41788h055619j102657o89147k35930M64299J312691J878657J862360J463765J136507
41779a965074J035184R04220N35094J23925L8778L46117P22214Q03582N19090
41770C063130R7013j59977j08645J44757L64734M20219L79962L63745L75974L53000
41760E293912K97564K51617J80838K5782j31792r2140K23534O51511R49707J008118
41750H658651Q62990N96393K92956L1740j65214l63849o51676j047597j487078
41741F727316j856150k022055j889486j483810r63550n17396k47949j40490r8513
41732b492083j1537J48561K85230K96963K50723L42681O41071R58423J048725
41723A468757Q52948M69987k3039n79442j046719j187302r08115m07474l8841
$$ y = [-8055619, -9158276, -9847423, -10083353, -9619054, -8306363, -6427706, -4565346, -3101581, -1965074, -929890, -25670, 509424, 633349, 672127, 1018244, 1740458, 2544040, 3063130, 3160143, 3000166, 2891521, 3036278, 3401012, 3821231, 4201193, 4564938, 4940912, 5293912, 5591476, 5843093, 6023931, 6049713, 5917921, 5825781, 6049315, 6700826, 7650533, 8658651, 9521641, 10118034, 10410990, 10442730, 10277516, 9913667, 9261991, 8214394, 6727316, 4871166, 2849111, 959625, -524185, -1487735, -2005131, -2253080, -2393570, -2492083, -2503620, -2355059, -2069829, -1772866, -1522143, -1179462, -538391, 420032, 1468757, 2321705, 2791692, 2768653, 2189211, 1142492, -44810, -952925, -1360399, -1399240]
41714a399240k7574l00324n58830n48041l00462r8960j68041m52101p38947r01860
41704e494380r06438o78028j74193M11634P35858O80219M86766M32716N27583
41695c978263O46290P91718J023512J222344J155486P75962K83522j11496l16927
41686A492148k59686J11401O31312R21795P52809L02238p4785k36352k66093j97848
41676C176939L6395L65459M99442K17173l55953q50158r83868p48529l47293m6355
41666I63252l8893l26817o91108q39376o50334k93878r8392k64812o71847r65550
41656c877755q84837n11502j63081m2314o7094p0045n4870j44090l30196m26766
41646f572550k91836P424K96020M72788N44431N60066N77548O27019O33348M45001
$$ y = [-1399240, -1426814, -1727138, -2285968, -2834009, -3134471, -3233431, -3401472, -3853573, -4592520, -5494380, -6400818, -7078846, -7253039, -6841405, -6105547, -5425328, -4938562, -4505846, -3978263, -3331973, -2540255, -1516743, -294399, 861087, 1637049, 1920571, 1809075, 1492148, 1232462, 1343863, 1975175, 2896970, 3649779, 3952017, 3877232, 3640880, 3374787, 3176939, 3213334, 3578793, 4078235, 4295408, 3939455, 3089297, 2105429, 1356900, 1009607, 963252, 924359, 597542, -93566, -932942, -1583276, -1877154, -1975546, -2240358, -2912205, -3877755, -4762592, -5274094, -5437175, -5479489, -5546583, -5616628, -5671498, -5815588, -6145784, -6572550, -6864386, -6856962, -6560942, -6088154, -5543723, -4983657, -4406109, -3779090, -3145742, -2700741]
41636b700741N2991k61999j55633L65594Q69864R11681M48854k02676p28017j007925
41626b408007j021989p55553k87399J40057K68622M2078l82391q16926j156312
41617f377820j315489j183885p55266k66384o7243k74703o05622o32947k01548
41608a1680907M59717J011155J294142J346177J254901J095124R41545Q24792
41600c453354O92698N14455M01125M92883P14989P92975N76196K21624k9088j28565
41590G95938j55245q9147J42935M41393N67304M38622K22178P6995k7585j50182
41580B263206j94890m2678K25363L91186L51216J84073K726j31115j61129n2085
41570B835873J06823J27101p6680l65037n08842m13719j77897L4173J38981J87587
$$ y = [-2700741, -2647750, -2909749, -3065382, -2699788, -1829924, -918243, -469389, -672065, -1400082, -2408007, -3429996, -4185549, -4472948, -4332891, -4064269, -4022191, -4404582, -5221508, -6377820, -7693309, -8877194, -9632460, -9898844, -9966087, -10240790, -10846412, -11479359, -11680907, -11221190, -10210035, -8915893, -7569716, -6314815, -5219691, -4278146, -3453354, -2760656, -2246201, -1845076, -1352193, -637204, 155771, 731967, 953591, 924503, 795938, 640693, 551546, 694481, 1135874, 1703178, 2141800, 2363978, 2440973, 2413388, 2263206, 2068316, 2025638, 2251001, 2642187, 2993403, 3177476, 3180202, 3049087, 2887958, 2835873, 2942696, 3069797, 2993117, 2628080, 2119238, 1705519, 1527622, 1561795, 1700776, 1888363]
41560A888363L13457O04095R77574J193247J042615N70279Q7184q8555O8722K75551
41550F932532K48548m58k26494k76084k54933l54708o12039r04092j110006j186931
41540B255335j125622r30759o58264m18981l33136m83593q52481j251748j387665
41531e186914j104175n47436l732L98308P18137R64564R93405P12812K75263m1121
41521b820889j02687q292N3274k4686k05876l58676l62918k01105M5804K81264
41511c704787M50935N42213N83516O38397P34213P93821P14412N25989L81501
41502A660210L58634L66743K98772J70671L1358j56315m10142n75112m52973r8493
41492A193353J68351J22098q7350r8780K50534P32328R19318N38820l11781j220460
$$ y = [1888363, 2201820, 2805915, 3783489, 4976736, 6019351, 6589630, 6676814, 6588259, 6656981, 6932532, 7181080, 7180622, 6954128, 6678044, 6423111, 6068403, 5456364, 4552272, 3442266, 2255335, 1129713, 198954, -459310, -878291, -1211427, -1695020, -2547501, -3799249, -5186914, -6291089, -6838525, -6842257, -6443949, -5725812, -4761248, -3767843, -3055031, -2779768, -2820889, -2923576, -2931868, -2878594, -2903280, -3109156, -3467832, -3830750, -4031855, -3986051, -3704787, -3253852, -2711639, -2128123, -1489726, -755513, 38308, 752720, 1278709, 1660210, 2018844, 2385587, 2684359, 2855030, 2886388, 2730073, 2319931, 1744819, 1291846, 1193353, 1361704, 1483802, 1396452, 1297672, 1548206, 2280534, 3199852, 3738672, 3426891, 2206431]
41482B206431j727713j616328j014841k50062L96387Q02454R37542P75162L37410
41473H46442k10276o19563p75935q01712q73922r80018r48152p04604l80605j23097
41463e571442R6682M07941Q41714J289831J611612J691582J432349Q18373K1838
41454B640480o38242r08068p66513l88199J4062L01048M22762L87876K37273M0739
41444A343218j02569j07134J9214J64682K37885K98183M92985Q29711J066449
41435D242624R17034L91921j16350j62090L05856Q52466R57192N09696j20612
41426G777737m93305n09464m01404m01788n19444o22929o39053o08673n82108
41417B999569n24046l55966r4728Q0634l7679m39830q14748p94598l27649K22200
$$ y = [2206431, 478718, -1137610, -2152451, -2402513, -2006126, -1203672, -266130, 509032, 846442, 636166, 16603, -759332, -1561044, -2434966, -3414984, -4363136, -5067740, -5448345, -5571442, -5474760, -5066819, -4225105, -2935274, -1323662, 367920, 1800269, 2618642, 2640480, 2002238, 1094170, 327657, -60542, -46480, 254568, 677330, 1065206, 1302479, 1343218, 1240649, 1133515, 1152729, 1317411, 1555296, 1853479, 2346464, 3176175, 4242624, 5159658, 5551579, 5435229, 5273139, 5578995, 6431461, 7388653, 7898349, 7777737, 7284432, 6774968, 6373564, 5971776, 5452332, 4829403, 4190350, 3581677, 2999569, 2475523, 2119557, 2024829, 2105463, 2067784, 1627954, 813206, 18608, -309041, -86841]
41407h6841L97902Q3792l98614o31706n10266k82959k13497k80431k61895n9662
41397b244177J68561K17574Q4285n6623q0554m0937p2119k21140l97310m61079
41387c103519l38618n9148K81324N54698O19503M01298K5597j94266k7285M14256
41377a426160P92053R31493R67645J065752J155904J064047P83751M46798Q0986
41368E862269m16742j043809j567959j698787j326596n96000J78810O93572Q69660
41359I54418R10354J041399J187839J037877M65637k49281p07925p84584o34027
41350C221707m16634j71311Q5029L01485M70723O44602Q16370Q68251P03318L79982
41340F903522M4066k50988n78573r74709j304662j359080j072107n86461r8733
$$ y = [-86841, 311061, 394853, -3761, -635467, -1145733, -1428692, -1642189, -1922620, -2184515, -2244177, -2075616, -1858042, -1773757, -1830380, -1910934, -1951871, -2023990, -2245130, -2642440, -3103519, -3442137, -3501285, -3219961, -2665263, -2045760, -1644462, -1618865, -1813131, -1840416, -1426160, -634107, 297386, 1265031, 2330783, 3486687, 4550734, 5334485, 5781283, 5862269, 5445527, 4401718, 2833759, 1134972, -191624, -787624, -608814, 84758, 954418, 1864772, 2906171, 4094010, 5131887, 5597524, 5348243, 4640318, 3855734, 3221707, 2805073, 2633762, 2718791, 3020276, 3490999, 4135601, 4951971, 5820222, 6523540, 6903522, 6947588, 6696600, 6118027, 5143318, 3838656, 2479576, 1407469, 821008, 722275]
41331G22275K83922M91501L88309j33964r35054j606454j766064j369323p08299
41322d633151j35070J91325L36184M42483N70308O62150O56265O12848O78931
41313f17727R05900J143493J162699Q78221M26671M1517j23472p2247P2183J59281
41303C976519R0335j46970m80868p75329q81340p33129m19726j27170J9450L9129
41293E60901J1602m2922j60474l46053n52610p37569q74379q96971p05981k86463
41283d030919K16233O01312P86565Q24990P58064N43539J81866j57617k43531
41274e19498j6383L62752P03383R36546J049753R86406P11790L21248l3136l12867
41264D189994n89363q63913r97971q77750n84108l34173k72131l51192m08317
$$ y = [722275, 1006197, 1497698, 1886007, 1752043, 816989, -789465, -2555529, -3924852, -4633151, -4768221, -4576896, -4240712, -3798229, -3227921, -2565771, -1909506, -1296658, -617727, 288173, 1431666, 2594365, 3472586, 3899257, 3940774, 3817302, 3745055, 3817238, 3976519, 4066854, 3919884, 3439016, 2663687, 1782347, 1049218, 629492, 502322, 521772, 560901, 572503, 529581, 369107, 23054, -529556, -1267125, -2141504, -3038475, -3744456, -4030919, -3814686, -3213374, -2426809, -1601819, -843755, -300216, -118350, -275967, -519498, -535881, -173129, 530254, 1466800, 2516553, 3502959, 4214749, 4535997, 4502861, 4189994, 3600631, 2736718, 1738747, 860997, 276889, -57284, -329415, -680607, -1088924]
41255a088924l34877j81417r5900j47972k37549k17657q7810Q39o2114k14257
41245b667638l00405k26706j1728K55160M66813N56813N48085N14459M72840L60287
41235c2020J44145j06951l12367m84039o70549q32530q58231p03421m51022k23451
41225d530436r1157q0376k07854m52778p10772q30781p31340m72941j90007M9150
41215h249292K77799N09782O40400N43733K56315j6578r7786J8041K25533M28059
41205e463994N55173N45571L99473K18442J25049J47785K12672K15600P4903k27167
41195c196493n88337q09998p53764m68998j23858J57205L37256M05565L75772
41186d665650L33718L81424M99885N35080L57057m598l96745o68616p45573o23608
$$ y = [-1088924, -1423801, -1605218, -1701118, -1849090, -2086639, -2304296, -2392106, -2391267, -2453381, -2667638, -2968043, -3194749, -3206477, -2951317, -2484504, -1927691, -1379606, -865147, -392307, -32020, 112125, 5174, -307193, -791232, -1461781, -2294311, -3152542, -3855963, -4306985, -4530436, -4621593, -4701969, -4909823, -5362601, -6073373, -6904154, -7635494, -8108435, -8298442, -8249292, -7971493, -7461711, -6821311, -6277578, -6021263, -6037841, -6135627, -6117586, -5892053, -5463994, -4908821, -4363250, -3963777, -3745335, -3620286, -3472501, -3259829, -3044229, -2969326, -3196493, -3784830, -4594828, -5348592, -5817590, -5941448, -5784243, -5446987, -5041422, -4665650, -4331932, -3950508, -3450623, -2915543, -2558486, -2563084, -2959829, -3628445, -4374018, -4997626]
41176d997626l31706R0466N62543R12486R26748N34981o8871n65898p80023p57464
41166d474364o09784l85862j20922R7598J93388J83151J32370N4845r6902l54220
41156e380702o69507r13859r36622o79062k53949J34303L77003N21537O21665
41147g179193O09135L95774N6922j91111k03567k1734K35381N07332P64588R02158
41137d124315P58612K73026m14503j051078j445463j538962j352458r57090n17707
41128a0369938k54143k40549k73341o4708M07348Q44554R63324P82355N14183
41119g690915K84182Q5355n3028j9549K29313N85780Q99137J087368J109949R24363
41109b558045N47954J18233j84762k79263k18731j01758L5369K49825O18013J097648
$$ y = [-4997626, -5329332, -5238866, -4676323, -3763837, -2837089, -2302108, -2370979, -2936877, -3716900, -4474364, -5084148, -5470010, -5590932, -5493334, -5299946, -5116795, -4984425, -4929580, -5026482, -5380702, -6050209, -6964068, -7900690, -8579752, -8833701, -8699398, -8322395, -7800858, -7179193, -6570058, -6174284, -6117362, -6308473, -6512040, -6533774, -6298393, -5791061, -5026473, -4124315, -3365703, -3092677, -3507180, -4558258, -6003721, -7542683, -8895141, -9852231, -10369938, -10624081, -10864630, -11137971, -11202679, -10795331, -9950777, -8987453, -8205098, -7690915, -7406733, -7321378, -7374406, -7393955, -7164642, -6578862, -5679725, -4592357, -3482408, -2558045, -2010091, -1891858, -2076620, -2355883, -2574614, -2676372, -2641003, -2391178, -1773165, -675517]
41099f75517J466234J462960J030866L78268k25687o59315r19421r81698q16108
41090F0582n26819l49895m44726p27391r46584r04429n96578j76991J86094M34781
41080c991956O22249P99410R30865R43824Q13356N41321R9246m95247j046667
41071g83599j262640j041975n98043k14841N3345L47710P26294J044815J124422
41062f04512R46271O51260M09807L20341L85204N38493O93547P65432O63896L33774
41052E103513j37417m99872n32655k68799M1085J99081K16250J81579P7824j87395
41042D193194o08621j021703j221346j110843p62932l86714k22126l86323p60626
41033b288040j038166r42847m54565J74172O47006Q69087R41709R39620P90864
$$ y = [-675517, 790717, 2253677, 3284543, 3662811, 3437124, 2777809, 1858388, 876690, 60582, -466237, -816132, -1260858, -1988249, -2934833, -3839262, -4435840, -4612831, -4426737, -3991956, -3369707, -2570297, -1639432, -695608, 117748, 659069, 758315, 263068, -783599, -2046239, -3088214, -3686257, -3901098, -3847753, -3500043, -2773749, -1728934, -604512, 341759, 993019, 1402826, 1723167, 2108371, 2646864, 3340411, 4105843, 4769739, 5103513, 4966096, 4466224, 3933569, 3664770, 3705855, 3904936, 4121186, 4302765, 4380589, 4193194, 3584573, 2562870, 1341524, 230681, -532251, -918965, -1141091, -1527414, -2288040, -3326206, -4269053, -4723618, -4549446, -3902440, -3033353, -2091644, -1152024, -361160]
41024c61160M30601o455k54880j67219J74441N56731P44800N32050j45547j063597
41014D39765j775622j926638j492052p03437J76295R59803J515009J753949J656855
41005F03927J291149Q28275N15013N14093P17248P98780N26375k4933n86519r19393
40995D264015q80564m28182K75778Q39287Q93425M00268l48639r80827j210769
40986B823792q94681j48601N95025Q71662O17395K02026k969N1504K27595M46567
40976D789315O48746O54069K81320m00786j080012j468556j479773j169776o39073
40967A35474k4846N20711R27300J246823J546022J777133J792159J481794Q85477
40958A0288047J77529m39934q50937j073277j208441j326774j383441j254837
$$ y = [-361160, 69441, 62986, -191894, -359113, -184672, 372059, 1116859, 1648909, 1503362, 439765, -1335857, -3262495, -4754547, -5457984, -5281689, -4321886, -2806877, -1052928, 603927, 1895076, 2723351, 3238364, 3752457, 4469705, 5268485, 5794860, 5769927, 5183408, 4264015, 3383451, 2955269, 3231047, 4070334, 4963759, 5364027, 5015388, 4034561, 2823792, 1929111, 1780510, 2375535, 3247197, 3864592, 4066618, 4063649, 4115153, 4342748, 4789315, 5438061, 6092130, 6373450, 5972664, 4892652, 3424096, 1944323, 774547, 135474, 110628, 631339, 1558639, 2805462, 4351484, 6128617, 7920776, 9402570, 10288047, 10465576, 10025642, 9174705, 8101428, 6892987, 5566213, 4182772, 2927935]
40950B927935q79442l68102M2242J60634k4103l63633o80230q83092r92268j062699
40940b122758j064477q45935k79098N19559J168934J310923R41748M30947K03252
40931B63095L99687Q09762J088029J047631P87912N52095M59789L98415J79875
40922E986290k42110p31368j085226j148110q83064m25533l3290J27462J67201
40913A732252L69160Q60634J414436J594290J107018P1667j003286j557923j397672
40904C190576q05400k33125O3567N6813k41265p98284j403252j688824j425853
40895c285047p34489M3943O27414R32145J027683J016003R20323O79527K92882
40886A520384n8411j35008R8861M16589N39105L32043j71654q07159j324534j544353
$$ y = [2927935, 2048493, 1680391, 1722633, 1883267, 1859164, 1495531, 815301, -67791, -1060059, -2122758, -3187235, -4033170, -4312268, -3792709, -2623775, -1312852, -371104, 59843, 263095, 662782, 1472544, 2560573, 3608204, 4396116, 4948211, 5408000, 5806415, 5986290, 5744180, 5012812, 3927586, 2779476, 1896412, 1470879, 1437589, 1565051, 1732252, 2101412, 2962046, 4376482, 5970772, 7077790, 7149457, 6146171, 4588248, 3190576, 2385176, 2152051, 2215618, 2272431, 2031166, 1232882, -170370, -1859194, -3285047, -4019536, -3975593, -3348179, -2416034, -1388351, -372348, 547975, 1227502, 1520384, 1461973, 1326965, 1425826, 1842415, 2381520, 2713563, 2541909, 1734750, 410216, -1134137]
40876a134137j516575j421953j309055j074160p12202l84124j57224J20376N56483
40867g032571R98678J235245J263394J192184J022572P23494M07109J97573k52
40858G426l63362q16320j067230r80222p00093l94488r2599J75731L03051K67953
40848c660153K03354J89199J16370j21379m02854m67603j73070M08950J075309
40839b831877J585401J744747J517089J064047O18985L01709M8707k92110p66738
40830B989960j166579j133608n35520K78427P36465N87816P4344m35107p92633
40821F03565r86804r24207m97714K00895R00932J367220J500775J292448Q18738
40812D275848K69276j47353l50994l85418k97483j13672Q0325J52300N8852q6395
$$ y = [-1134137, -2650712, -4072665, -5381720, -6455880, -7168082, -7552206, -7709430, -7589054, -7032571, -6033893, -4798648, -3535254, -2343070, -1320498, -597004, -189895, 7678, 7426, -355936, -1172256, -2239486, -3219708, -3919801, -4314289, -4406888, -4231157, -3928106, -3660153, -3456799, -3267600, -3151230, -3272609, -3675463, -4143066, -4316136, -3907186, -2831877, -1246476, 498271, 2015360, 3079407, 3698392, 4000101, 4048808, 3756698, 2989960, 1823381, 689773, 154253, 432680, 1169145, 1756961, 1831305, 1396198, 603565, -383239, -1307446, -1805160, -1604265, -703333, 663887, 2164662, 3457110, 4275848, 4545124, 4397771, 4046777, 3661359, 3363876, 3250204, 3330529, 3482829, 3541681, 3455286]
40802C455286j09702P1030L66580N50533M11752n6348o25432j035847j205836
40793A822016j195078j023171o35119m4613N81186J004590J046090O70106M2374
40784B268381n07064p00378n46578l03687j93604k25765l00490l61345l85719
40775a256249l35177k20542j54739k30637l64317l48560o7700L91283Q22647J037240
40765g26751R42838N89175J65069j10195j40001Q474J99748L21952K99363J06170
40755A655842j74653l53437k71423M8362M11835O16534N91279L92374J03079k39017
40745B780775o19295r71146j154243j038811o18636k6730N56364R86224J166365
40736A060867J059441P47515M41860L42525M51559N52753L99312p5367p05225
$$ y = [3455286, 3345584, 3416614, 3783194, 4333727, 4745479, 4689131, 4063699, 3027852, 1822016, 626938, -396233, -1031352, -1075965, -494779, 509811, 1555901, 2226007, 2268381, 1761317, 1060939, 514361, 210674, 17070, -208695, -509185, -870530, -1256249, -1591426, -1811968, -1966707, -2197344, -2561661, -2910221, -2977921, -2586638, -1763991, -726751, 216087, 805262, 970331, 860136, 720135, 728609, 928357, 1250309, 1549672, 1655842, 1481189, 1127752, 856329, 904691, 1316526, 1933060, 2524339, 2916713, 3019792, 2780775, 2161480, 1190334, 36091, -1002720, -1621356, -1648086, -1091722, -105498, 1060867, 2120308, 2867823, 3309683, 3652208, 4103767, 4656520, 5055832, 4980465, 4275240]
40727D275240j204613j341998j070252n38320K8776M80439P78790R11110Q15321
40718C134493M29481j85682p92746j080656q84944l52138J46878L32564K42622
40709I89872J00700J3127p7096j42843J9532M93423R71630R89707M40154k91803
40699C506403p38614p74658n91212l93243k48922j71974j95375l17175m46465
40690c71235m58703k91428K6553M07244P34917Q97610Q58397P24600O94810Q69460
40680D092225J119629J204955J031512P32667M78549K84005N3548k60114o22886
40671H114090r82248j253208j275160r25561l21287J87840K96418q651m82371
40662C349862q44538r52474q24654n57669k25889J31293M23688M97670L17062
$$ y = [4275240, 3070627, 1728629, 658377, 120057, 148833, 629272, 1408062, 2319172, 3134493, 3563974, 3378292, 2585546, 1504890, 619946, 267808, 414686, 747250, 989872, 1090572, 1103699, 1026603, 883760, 903292, 1396715, 2368345, 3358052, 3798206, 3506403, 2767789, 1993131, 1401919, 1008676, 759754, 587780, 392405, 75230, -371235, -829938, -1121366, -1094813, -687569, 47348, 944958, 1803355, 2527955, 3222765, 4092225, 5211854, 6416809, 7448321, 8180988, 8659537, 8943542, 8997090, 8736976, 8114090, 7131842, 5878634, 4603474, 3677913, 3356626, 3544466, 3840884, 3832233, 3349862, 2505324, 1552850, 728196, 170527, -55362, 75931, 499619, 997289, 1314351]
40653A314351J13278J92116N56448Q69018Q58490O20554M16792L21698K33119
40644E495864J26597Q3172Q7912P440j97997m16111n88849p98311j044334j099712
40634A655671p60207j55673L62400O09438O77123O66901N18982J91759j52201
40625C614193k95146k26058j11489m6906J0693O9186L5976j04401j91533r1647
40615B662868Q6645J15760n1173k38013k96831k71087k79393l53768m57302n77187
40605C40519p14933q19585p99249o00144k59450R1147K64851J23821k98522p89644
40595c461189j097750j078569p33406j77913M06213Q62730J154291J322779J342199
40586a460615J107687O39053J96164M9059J52297J83767n6105l88071m65329j78163
$$ y = [1314351, 1427629, 1619745, 2176193, 3045211, 3903701, 4524255, 4941047, 5262745, 5495864, 5622461, 5705633, 5793545, 5800985, 5602988, 5186877, 4598028, 3799717, 2755383, 1655671, 895464, 739791, 1102191, 1711629, 2388752, 3055653, 3574635, 3766394, 3614193, 3319047, 3092989, 2981500, 2934594, 2945287, 3014473, 3050449, 2946048, 2754515, 2662868, 2749513, 2865273, 2814100, 2576087, 2279256, 2008169, 1728776, 1375008, 917706, 340519, -374414, -1193999, -1993248, -2593392, -2852842, -2761695, -2496844, -2373023, -2671545, -3461189, -4558939, -5637508, -6370914, -6548827, -6142614, -5279884, -4125593, -2802814, -1460615, -352928, 286125, 482289, 531348, 683645, 867412, 811307, 423236, -42093, -220256]
40576b20256K37608M80006M81806L95390L46153L04777K13409J21088R6936P9999
40566B536916m1585k14687k42011o0320J51482K21449J96178J80843J06924j40714
40556B694475m26887m19960K0716O73170J219888J548099J716183J750996J603269
40547A0379949J262156Q21035M22670J62902K8706p8135k22950l44498l31061
40538A2100774j93023r1218j69315m14888p06863r37367j059565j082645j062977
40529F382913j045929r75330p16929k24597L60619Q27773J069995J086738Q64053
40520G629306L58300l76065j111735j568939j624548j384820j039396o63561k09391
40511I151L05480O83218P01346L56736j19647m72589n72177l96080j2719L75648
$$ y = [-220256, 17352, 497358, 979164, 1374554, 1720707, 2025484, 2238893, 2359981, 2456917, 2536916, 2495331, 2280644, 2038633, 1978313, 2129795, 2351244, 2547422, 2728265, 2835189, 2694475, 2267588, 1847628, 1868344, 2541514, 3761402, 5309501, 7025684, 8776680, 10379949, 11642105, 12463140, 12885810, 13048712, 13077418, 12999283, 12776333, 12431835, 12100774, 11907751, 11816533, 11647218, 11232330, 10525467, 9588100, 8528535, 7445890, 6382913, 5336984, 4361654, 3644725, 3420128, 3780747, 4608520, 5678515, 6765253, 7629306, 7987606, 7611541, 6499806, 4930867, 3306319, 1921499, 882103, 218542, 9151, 314631, 997849, 1699195, 2055931, 1936284, 1463695, 891518, 495438, 482719, 858367]
40501H58367N06245K81826j18389m11990m54280k74865L7674L96778P05807Q81016
40491B408189R07864Q51187Q06616Q17887P94744N52682N0003m23726m65090k8004
40481F272352M80213O73486N99166N42239N97068O61032P24730Q63103R54722
40472A2368111P18064J23665m56629o33908l77036P7760M99774P15241N69235
40463A3604277N3369n83237j005100j055922p86854l19049J99290N81645P03077
40454A1391496N88406L07397j41265p09728j154419j222953r92626q36111r99340
40445F230857j351289j590955j558294j283014q72824m59605j60678J2545J56352
40436h76905L20954M22730L79082K62286K37098L92169O94833J047024J308225
$$ y = [858367, 1364612, 1646438, 1528049, 1116059, 661779, 386914, 424588, 821366, 1527173, 2408189, 3316053, 4167240, 4973856, 5791743, 6586487, 7139169, 7189172, 6765446, 6300356, 6272352, 6752565, 7426051, 8025217, 8567456, 9164524, 9825556, 10550286, 11413389, 12368111, 13086175, 13209840, 12753211, 12119303, 11742267, 11820027, 12319801, 13035042, 13604277, 13657646, 13074409, 12069309, 11013387, 10226533, 9907484, 10106774, 10688419, 11391496, 11979902, 12287299, 12146034, 11436306, 10281887, 9058934, 8066308, 7230197, 6230857, 4879568, 3288613, 1730319, 447305, -425519, -885124, -1045802, -1033257, -876905, -555951, -133221, 245861, 508147, 745245, 1137414, 1832247, 2879271, 4187496]
40427D187496J335607J118992Q50049P56131Q72326J046262J125543J042470P63442
40418A3098318L14407j21976k87190j11223J88742L45757L11908K28644K08551
40409A4175938K46229L02412L60186L83391L06527J14374j03750k17537j68870
40400A5398900j0634J59494K93715M18203N60624O67607O29013M06059J18416
40391A8641397k7766Q4969L74349O17714O38805M65144K99420L05305M22260M33886
40381B2255483K29067n7679j97846j12450Q5692K51501L31370L36251K81943K03240
40371B3606572J77085K70094M72604P25279R99291J295431J557083J658008J540748
40362C2302195J328038J205158J186021J090734P99384M41865K59098L45663O28766
$$ y = [4187496, 5523103, 6642095, 7492144, 8248275, 9120601, 10166863, 11292406, 12334876, 13098318, 13412725, 13290749, 13003559, 12892336, 13081078, 13426835, 13738743, 13967387, 14175938, 14422167, 14724579, 15084765, 15468156, 15774683, 15889057, 15785307, 15567770, 15398900, 15388266, 15547760, 15841475, 16259678, 16820302, 17487909, 18116922, 18522981, 18641397, 18613631, 18698600, 19072949, 19690663, 20329468, 20794612, 21094032, 21399337, 21821597, 22255483, 22484550, 22426871, 22229025, 22116575, 22202267, 22453768, 22785138, 23121389, 23403332, 23606572, 23783657, 24053751, 24526355, 25251634, 26250925, 27546356, 29103439, 30761447, 32302195, 33630233, 34835391, 36021412, 37112146, 37911530, 38353395, 38612493, 38958156, 39586922]
40353C9586922J035257J523800J962057K153347K062157J887815J828875J881497
40345E3921727J958306K072601K236248K251100J821248R19715j02975q49133
40337F4228837j218547j354850j329131r89291j41193J162426K540728L508838
40329F6407817L808562L541921L017990K527268K261458K326999K704747L215823
40321H9812585L644117L925890M160892M440414M751541N073592N480665O079162
40313A27368858O866441P692375Q372951Q862287R325607R996456J0923148J1923440
40305B01331563J2863256J3886178J5203606J6695020J7927810J8630978J8971005
40298C15509416J9264750J9584622J9791621J9824437J9745371J9516529J8882077
$$ y = [39586922, 40622179, 42145979, 44108036, 46261383, 48323540, 50211355, 52040230, 53921727, 55880033, 57952634, 60188882, 62439982, 64261230, 65180945, 65077970, 64228837, 63010290, 61655440, 60326309, 59337018, 59195825, 60358251, 62898979, 66407817, 70216379, 73758300, 76776290, 79303558, 81565016, 83892015, 86596762, 89812585, 93456702, 97382592, 101543484, 105983898, 110735439, 115809031, 121289696, 127368858, 134235299, 141927674, 150300625, 159162912, 168488519, 178484975, 189408123, 201331563, 214194819, 228080997, 243284603, 259979623, 277907433, 296538411, 315509416, 334774166, 354358788, 374150409, 393974846, 413720217, 433236746, 452118823]
40291D52118823J7492268J5073011J1535242P076735K197441k519612o724997
40284D96248911j0379476j3539922j6171133j8191989j9595564k0434449k0735968
40277C77200410k0524805j9934898j9229683j8661825j8315615j8099239j7867952
40270B44566393j7512747j6941912j6073168j4925095j3670874j2500887j1442548
40263A41499162j0411820r424448q608509p974226p338806o586494n866932n384577
40255G9903350n086201m737619m270043l864449l672316l605926l456931l114358
40247D8095507k621430k112461j742402j598539j621737j652018j573989j384498
40239C3788433j138033r04520p73004p93224q84987q88409p34126m99227k95728
$$ y = [452118823, 469611091, 484684102, 496219344, 503296079, 505493520, 502973908, 496248911, 485869435, 472329513, 456158380, 437966391, 418370827, 397936378, 377200410, 356675605, 336740707, 317511024, 298849199, 280533584, 262434345, 244566393, 227053646, 210111734, 194038566, 179113471, 165442597, 152941710, 141499162, 131087342, 121662894, 113054385, 105080159, 97741353, 91154859, 85287927, 79903350, 74817149, 70079530, 65809487, 61945038, 58272722, 54666796, 51209865, 48095507, 45474077, 43361616, 41619214, 40020675, 38398938, 36746920, 35172931, 33788433, 32650400, 31745880, 30972876, 30179652, 29294665, 28406256, 27672130, 27172903, 26877175]
40230B6877175j97714k72970n40714q50513r53440p93324o06768o14446p20017
40221B1327269o69950m37954k60882k98877m41272n01829m53147l65205k17955
40212A7680198P5008M62403O94139N33413K32o50726j198007j644266k093373
40203A3859021k478758k526083k040289j158241k34250M83256R66479J234891
40195H106026J225985R18907M87508J96539J42928J85140J49151L2452m5459m8809
40185A1350368j01347l34815p04897j004360j062568r01903o75743m72468k30281
40176E861986J31717N40173P88165P33536M24249J3588l79580o79128p99670p04692
40166E930344n06455l89030l94364l82487k61431j62708k85970o12754q77825
$$ y = [26877175, 26679461, 26406491, 25865777, 25015264, 24061824, 23268500, 22661732, 22047286, 21327269, 20657319, 20219365, 19958483, 19659606, 19218334, 18716505, 18263358, 17898153, 17680198, 17755206, 18217609, 18911748, 19445161, 19445393, 18794667, 17596660, 15952394, 13859021, 11380263, 8854180, 6813891, 5655650, 5421400, 5904656, 6871135, 8106026, 9332011, 10250918, 10738426, 10934965, 11077893, 11263033, 11412184, 11444636, 11399177, 11350368, 11249021, 10914206, 10209309, 9204949, 8142381, 7240478, 6564735, 6092267, 5861986, 5993703, 6533876, 7322041, 8055577, 8479826, 8493414, 8113834, 7434706, 6635036, 5930344, 5423889, 5034859, 4640495, 4258008, 3996577, 3833869, 3547899, 2935145, 2057320]
40157B057320q29241m59710R105L20511L82239L32276L92696O12999P96289P42367
40147D356851N10984L42090L51069M34072M70088M64912M52221M03213L34187
40138H119687L88390O68604J031996J178863R48997M45658j29525o66231j134624
40129A0851815j463648j518073j214074o30671J3159M92206O88059O01144L05538
40120H125455q9509m80525q15162j070864j168673r86546n42889j02876L8650
40111B907061j18487l01111l29318l20433m58853o91253p77742n92540k63841
40102i46517k5660K8j15312j89569r9040J05599K60366K65417J68219Q2219Q8704
40091d05546K10468L84449M50984K97273N8859M2417L53944P12750P45758L85030
$$ y = [2057320, 1228079, 768369, 777474, 1097985, 1480224, 1812500, 2205196, 2818195, 3614484, 4356851, 4867835, 5209925, 5560994, 5995066, 6465154, 6930066, 7382287, 7785500, 8119687, 8508077, 9176681, 10208677, 11387540, 12336537, 12782195, 12652670, 11986439, 10851815, 9388167, 7870094, 6656020, 6025349, 6038508, 6530714, 7218773, 7819917, 8125455, 8035946, 7555421, 6740259, 5669395, 4500722, 3514176, 2971287, 2868411, 2907061, 2788574, 2487463, 2158145, 1837712, 1378859, 687606, -90136, -682676, -946517, -972177, -972149, -1087461, -1277030, -1376070, -1270471, -1010105, -744688, -576469, -494250, -405546, -195078, 189371, 640355, 937628, 996487, 1038904, 1392848, 2105598, 2851356, 3236386]
40081C236386j20095m78093n15820j80501M16088R80789J242560J194450J023729
40072F799493Q30492N64453K33253l035j2362J42369K73134K34052o4l42186o58699
40061H060900q85597j067766j218011j196659q70208l67215j1025K9400j20584
40052B353235k73449l88473m92288n54401n45700n04787m50228l24981j07734
40043a288806J30513L66763O93457J115856J390595J237335O72084p312n36483
40034C774002q57063j009067j015878r17930q08068p65768p93612q34151q11620
40025d039155o63617l84549m1600K85460N59433P38132P14315L96493j37425o35339
40015c207852q53865p27354l64656P4280M80622P99502R61136Q59718M70940j3475
$$ y = [3236386, 3116291, 2638198, 2122378, 1941877, 2357965, 3338754, 4581314, 5775764, 6799493, 7629985, 8194438, 8427691, 8424656, 8412294, 8554663, 8827797, 9061849, 9061785, 8719599, 8060900, 7175303, 6107537, 4889526, 3692867, 2822659, 2455444, 2444419, 2473819, 2353235, 2079786, 1691313, 1199025, 644624, 98924, -405863, -856091, -1181072, -1288806, -1158293, -791530, -98073, 1017783, 2408378, 3645713, 4317797, 4310485, 3774002, 2916939, 1907872, 891994, -25936, -834004, -1599772, -2393384, -3227535, -4039155, -4702772, -5087321, -5128921, -4843461, -4284028, -3545896, -2831581, -2435088, -2572513, -3207852, -4061717, -4789071, -5153727, -5079447, -4598825, -3799323, -2838187, -1978469, -1507529, -1521004]
40005a521004k86103k44395j36592k70993o09754p74406m70355J87935P94926
39996c330741J013205P97698L70404N2500O5314L93850Q11222J058172J023235
39987B254859P78696M80987K45105Q1697p7712k99123n77471q29815r39966q25721
39977B91536n08217j27535J55870L01635L92736M80464M97617L86823K52200K80224
39967B403353N18269Q13640R77733R47637P89970O19346N25405N14280M97190
39958H606823L77475J54615r6091l27573n35229o76087o65509m85808k36739n6689
39948F059188m8752k79390p41646j265971j556340j409453q85780k37102K87024
39939g8222N40525M90780K31064n0863k08065k42650k39312k29066j86137j21877
$$ y = [-1521004, -1807107, -2051502, -2188094, -2459087, -3068841, -3843247, -4313602, -4125667, -3330741, -2317536, -1519838, -1149434, -1096934, -1031620, -637770, 173452, 1231624, 2254859, 3033555, 3514542, 3759647, 3841344, 3763632, 3464509, 2887038, 2057223, 1117257, 291536, -216681, -344216, -188346, 113289, 506025, 986489, 1484106, 1870929, 2123129, 2403353, 2921622, 3735262, 4712995, 5660632, 6450602, 7069948, 7595353, 8109633, 8606823, 8984298, 9138913, 9042822, 8715249, 8180020, 7503933, 6838424, 6352616, 6115877, 6059188, 6010436, 5731046, 4989400, 3723429, 2167089, 757636, -128144, -365246, -78222, 462303, 953083, 1184147, 1133284, 925219, 682569, 443257, 214191, 28054, -93823]
39929i3823p7563j8632J56931M47315O54127N53622J67306j97248k23097R5292
39919A464230M34748M68334J91130j11295k01402j28001j09847k60889m93947
39910A253061o45294o18253m35523k31395j72803k96127m22052l26469j4600K66321
39900a643134L20255K17481J68648K75295M77581O64724P35145O10959L21998
39891B148952N3621j3627Q6664J75505K10137L46084O60037R59808R95072P62824
39881F385077M61537J99967q7027m41255p63721r44220r80826q98884o60868k64072
39871B005708J37079L26965K41665Q262k16302l62484m05067l06785o9680K05264
39861A564625L83892M33587M58265N81552Q00885R62242Q79010M83560j17101
$$ y = [-93823, -171386, -190018, -33087, 414228, 1068355, 1621977, 1789283, 1592035, 1368938, 1464230, 1898978, 2367312, 2558442, 2447147, 2245745, 2117744, 2007897, 1747008, 1253061, 607767, -10486, -446009, -677404, -850207, -1146334, -1568386, -1894855, -1909455, -1643134, -1322879, -1105398, -936750, -661455, -183874, 480850, 1215995, 1826954, 2148952, 2202573, 2188946, 2275610, 2451115, 2661252, 3007336, 3667373, 4627181, 5622253, 6385077, 6846614, 7046581, 6959554, 6518299, 5754578, 4810358, 3829532, 2930648, 2269780, 2005708, 2142787, 2469752, 2711417, 2719679, 2503377, 2140893, 1735826, 1429041, 1359361, 1564625, 1948517, 2382104, 2840369, 3421921, 4222806, 5185048, 6064058, 6547618, 6430517]
39852F430517p11034j106150j227818j143702r95158q63844o92281l71027Q0683
39843e99814M66535N83087M08373Q5594k37104m76515n42635l11511K46504R36939
39833E59453J419574J465582J140992P27300M61314L53189K37681m1631n16673
39824E806781j101057j622483j851753j610314r35668j10276N41900Q93447J035527
39815A046104J108232J156719J115866Q69938L48650l64814j026844j398184j419689
39806A435978j187518q00186l28006Q7679K50493R3990k25672m77919n42172m20678
39796b114011j74909O3903J00069j80983o64885j067927j141619q02055j42675
39787f125092N79848J030393J026048P23238M74725M57435N25269M67677L05387
$$ y = [6430517, 5719483, 4613333, 3385515, 2241813, 1246655, 382811, -309470, -680497, -599814, -133279, 449808, 858181, 943775, 706671, 230156, -312479, -623990, -377486, 559453, 1979027, 3444609, 4585601, 5312901, 5774215, 6127404, 6365085, 6323454, 5806781, 4705724, 3083241, 1231488, -378826, -1314494, -1424770, -882870, 10577, 1046104, 2154336, 3311055, 4426921, 5296859, 5645509, 5280695, 4253851, 2855667, 1435978, 248460, -551726, -879732, -792053, -541560, -447570, -673242, -1151161, -1693333, -2114011, -2288920, -2225017, -2124948, -2305931, -2970816, -4038743, -5180362, -5982417, -6125092, -5545244, -4514851, -3488803, -2765565, -2290840, -1833405, -1308136, -840459, -535072]
39778e35072K33681L41184N10854N91696N52149M25361K00725j36073m83863o44004
39768A056638n02827j68252J06573J30780r4986m17197o53804o96996n59020l52125
39758b151216j91806q0792R6528M26487Q18312J045512R50778N87528J50808k00425
39748A451714m33177n93517p31566q80439j052779j207538j236374j041299o52150
39739f377125k38498K7584J18136J54022K87286N87994R93797J312366J308765
39730a825673Q92331K49543k78629m99406n05709m85737m75088l76027j62795
39721c467190N3462J66923J82508J55046J16805J14637K37085N17140Q32591R69653
39711a21340P91115L27763k54974p39171r47943q36997n08910j18016K12198L62010
$$ y = [-535072, -301391, 39793, 550647, 1142343, 1694492, 2119853, 2320578, 2184505, 1700642, 1056638, 553811, 385559, 492132, 622912, 527926, 110729, -543075, -1240071, -1799091, -2151216, -2343022, -2423814, -2327286, -1900799, -1082487, -36975, 913803, 1501331, 1652139, 1451714, 1018537, 425020, -306546, -1186985, -2239764, -3447302, -4683676, -5724975, -6377125, -6615623, -6588039, -6469903, -6315881, -6028595, -5440601, -4446804, -3134438, -1825673, -933342, -683799, -962428, -1461834, -1967543, -2453280, -2928368, -3304395, -3467190, -3413728, -3246805, -3064297, -2909251, -2792446, -2677809, -2440724, -1923584, -1090993, -121340, 669775, 997538, 742564, 3393, -944550, -1781547, -2290457, -2408473, -2196275, -1834265]
39701a834265K06984k29914o44939o46062j64290M26890O97895O03011M41139
39692a143551M41857N29466M96477K74042l1890k84235m12211m08241l07632j72744
39682a018662n2503M6761J24467J28702k1287l33506o86592r16114r79756j017700
39672d726190j205553j532190j757254j620610j084091l61163K53290N70967O10171
39663a0852623N84996P42668J113101J441429J457399J181012Q58593O49720N46594
39654b277111N72638Q01280J086821J034434M55948k96387o82905n74202k81790
39645a61274q4846k887j6042j97824n24608p87509q36404p55156o82082o10553
39635d659185m89355l70120k99899j80561R9912M64515P14030P40270N65956K66568
$$ y = [-1834265, -1627281, -1857195, -2502134, -3148196, -3312486, -2885596, -2187701, -1584690, -1143551, -701694, -172228, 324249, 598291, 566401, 282166, -130045, -538286, -845918, -1018662, -1071165, -1024404, -899937, -771235, -792522, -1126028, -1812620, -2728734, -3708490, -4726190, -5931743, -7463933, -9221187, -10841797, -11925888, -12287051, -12033761, -11462794, -10852623, -10267627, -9524959, -8411858, -6970429, -5513030, -4332018, -3473425, -2823705, -2277111, -1704473, -903193, 183628, 1218062, 1674010, 1377623, 694718, 120516, -161274, -246120, -249007, -265049, -462873, -987481, -1774990, -2611394, -3366550, -4048632, -4659185, -5148540, -5518660, -5818559, -5999120, -5899208, -5434693, -4720663, -3980393, -3414437, -3147869]
39625c147869p521l2739K61176O03342O21435K79358r9213k63163l04933m36945
39615b527072o65939q05276p11056m02639j5084K83527L84877L39726L40022N35775
39605c243139Q74973J151056J182160R26342M71305m2123n06276q85820j166083
39596a237605j284435j176276q95811o15262m65157m24705l92309k96089r6732
39587f884381K38801O80487J077915J230178J029899N40831l0100m39362n65334
39578c121066n04526m51615m54683l79539j68173l186p5482k72282k89340n3107
39568e772999J58861R2107j37486j88747R9152N71414R85632J244025J380333
39559a567708J417882J311392J008241N31269N021l90332n13589l50351k7783
$$ y = [-3147869, -3155390, -3188129, -2926953, -2323611, -1702176, -1422818, -1522031, -1785194, -2090127, -2527072, -3193011, -3998287, -4709343, -5111982, -5127066, -4843539, -4458662, -4118936, -3778914, -3243139, -2368166, -1217110, -34950, 891392, 1362697, 1320574, 814298, -71522, -1237605, -2522040, -3698316, -4594127, -5209389, -5674546, -6099251, -6491560, -6787649, -6884381, -6645580, -5965093, -4887178, -3657000, -2627101, -2086270, -2116370, -2555732, -3121066, -3625592, -4077207, -4531890, -4911429, -5079602, -5082788, -5158270, -5430552, -5719892, -5772999, -5614138, -5522031, -5659517, -5848264, -5749112, -5177698, -4192066, -2948041, -1567708, -149826, 1161566, 2169807, 2701076, 2706097, 2315765, 1802176, 1451825, 1424042]
39550A424042K68850M25684M71153N19233O39234P94967R15244R84715J027639
39541G470761J035823R76656Q52574O61660K97426l76286j264468j969091k141242
39532E543813j876362j595758j521104j447393j117248o34383l18897k59704k50733
39523c477769j61704j22140k44736l79535l19757j16124K2672P1952K03861M58013
39513d065267O33968N99023N05943N50207O42110N08539O7526m74267q88976j125511
39503c046705j204934j074721o77642j04391M07678O20977M41291p207m12572
39494e058226m72920j61251K36207M12524L36836J98415J19465M9219p0806j87215
39484d597752k45177l08569m61771o33036o14229k67652L30759R47635J354882
$$ y = [1424042, 1692892, 2118576, 2589729, 3108962, 3748196, 4543163, 5458407, 6443122, 7470761, 8506584, 9483240, 10335814, 10997474, 11294900, 10918614, 9654146, 7685055, 5543813, 3667451, 2071693, 550589, -896804, -2014052, -2648435, -2967332, -3227036, -3477769, -3639473, -3761613, -4006349, -4385884, -4705641, -4821765, -4799093, -4727141, -4523280, -4065267, -3431299, -2832276, -2326333, -1776126, -1134016, -625477, -557951, -1032218, -1921194, -3046705, -4251639, -5326360, -6004002, -6108393, -5700715, -5079738, -4638447, -4645654, -5058226, -5531146, -5692397, -5456190, -5043666, -4706830, -4508415, -4388950, -4339731, -4410537, -4597752, -4842929, -5151498, -5613269, -6246305, -6860534, -7128186, -6797427, -5849792, -4494910]
39475d494910J458872J332021J139263J012761R85323J024949J074950J030601
39467D563830P52560K05327m29241q68853r82227q66375o81331n02345l54949
39458H36396k80713k88922l20017l47612m57911p17642r94427j041839p97025
39449d409712m96618m34391o53047r23716r90509p84536m27795r9628Q2220J04220
39439i033512M8374N4935K44051O12904J004572J224896J209733J044824Q22877
39430b766346N58373K77744Q8238M0673k0794l17071q22721j227028j260877r58999
39420f408808n36746j22033K73248N93207P16469O22008M69391M54259O23175
39411c315830Q59229J019206J062485J058297J068903J020646P29334J08502o60129
$$ y = [-4494910, -3036038, -1704017, -564754, 448007, 1433330, 2458279, 3533229, 4563830, 5316390, 5521717, 5092476, 4223623, 3241396, 2375021, 1693690, 1191345, 836396, 555683, 266761, -53256, -400868, -858779, -1576421, -2570848, -3612687, -4409712, -4906330, -5340721, -5993768, -6917484, -7907993, -8692529, -9120324, -9219952, -9137732, -9033512, -8985138, -8930203, -8686152, -8073248, -7068676, -5843780, -4634047, -3589223, -2766346, -2207973, -1930229, -1841991, -1801318, -1822112, -2139183, -2961904, -4188932, -5449809, -6408808, -6945554, -7067587, -6794339, -6201132, -5484663, -4862655, -4393264, -3939005, -3315830, -2456601, -1437395, -374910, 683387, 1752290, 2772936, 3502270, 3610772, 2950643]
39402B950643j226823j355642j067554n30018Q6844O07312Q29881O60657K63717
39393A219017m1756r0072j1472j1740o3669Q5064N75901J176769J422125J032487
39383E292654J85525o28558j008416r04071n29921j03212K73341N19973N16605
39374C613920K29997j51931l45127k67152j34406k17313n51502r29289j115343
39365A31854j015170o95177l34884j43449k29293n18481q24258r77493q65830
39356e472181m30760K51938R20573J305586J391316J385169J403387J334916J082377
39347C172321P73212N81397M42877J28077m34354j059952j522337j716721j606846
39338a242326j179885n34257R7483N09045O62401O34769M95740K86999N4814j65696
$$ y = [2950643, 1723820, 368178, -699376, -1229394, -1142550, -535238, 294643, 955300, 1219017, 1177261, 1087189, 1075717, 1063977, 1000308, 1085372, 1661273, 2838042, 4260167, 5292654, 5478179, 4849621, 3841205, 2937134, 2407213, 2304001, 2577342, 3097315, 3613920, 3843917, 3691986, 3346859, 3079707, 2945301, 2727988, 2176486, 1247197, 131854, -883316, -1578493, -1913377, -2056826, -2286119, -2804600, -3628858, -4606351, -5472181, -5902941, -5651003, -4730430, -3424844, -2033528, -648359, 755028, 2089944, 3172321, 3945533, 4526930, 4969807, 5097884, 4663530, 3603578, 2081241, 364520, -1242326, -2422211, -2956468, -2858985, -2349940, -1687539, -1052770, -557030, -270031, -215217, -380913]
39328c80913l58371m69615l94812q4854L62187P65086R90915R97954Q14427N45131
39318B787135L51087L25303L84793L42240P6591m06987j029256j639981j988979
39309g98054j848798j256677n67072j73830j81090l64495m06455j35090L94059
39300e337502R50587J267910J215371Q78661M63723J33965m1310l3782J53732
39291c48645M33608O49573O92272N66889L33588L5666k85836n63994p38473p76095
39281a447o30992k61885K35589N86253N60323K40798n1180j24592j05329k09163
39271B38375m35034n74225m61664j29513K45998M64829M11870J60502k6540R7639
39261g763N12421R36498J113775J044035R04690Q01478O57890L46001j10002m82361
$$ y = [-380913, -739284, -1208899, -1603711, -1688565, -1326378, -561292, 429623, 1427577, 2242004, 2787135, 3138222, 3463525, 3848318, 4190558, 4267149, 3860162, 2830906, 1190925, -798054, -2646852, -3903529, -4470601, -4644431, -4825521, -5190016, -5596471, -5731561, -5337502, -4386915, -3119005, -1903634, -1024973, -561250, -427285, -468595, -502377, -348645, 84963, 734536, 1426808, 1993697, 2327285, 2362951, 2077115, 1513121, 774648, -1447, -632439, -894324, -658735, -72482, 487841, 728639, 677459, 552867, 447538, 238375, -196659, -770884, -1232548, -1362061, -1116063, -651234, -239364, -78862, -105402, -7763, 504658, 1441156, 2554931, 3598966, 4503656, 5305134, 5963024, 6309025, 6199023, 5716662]
39251E716662n11269j49654L68987P27002P76256N83053K73299q5648m55742p77873
39241F465073j006408j156416j277404j391969j459526j369255r94107l40258
39233b530270L39944O85102N47315J30485k35576l92232l77629k64371j01337
39224b198569L1593O2129M2890J23632L65913O53632Q12447P59737N33212K56119
39214A442735R5899J62444L89778N83592O37960O41414P08723P71792O25832J58924
39204F219093n32033j227404j714327j857561j649338j230767q08039n00877k84138
39195c585391q3560J02501J93477J19464r0061l06162l97100l40965k34479j78486
39185d800762j79099j86570j92155k21904k48324j92623m6579P4210O2443j6010
$$ y = [5716662, 5205393, 5055739, 5424726, 6151728, 6927984, 7511037, 7784336, 7698688, 7242946, 6465073, 5458665, 4302249, 3024845, 1632876, 173350, -1195905, -2190012, -2530270, -2190326, -1505224, -957909, -827424, -1063000, -1455232, -1832861, -2097232, -2198569, -2166976, -2104847, -2061957, -1938325, -1572412, -918780, -106333, 653404, 1186616, 1442735, 1538634, 1701078, 2090856, 2674448, 3312408, 3953822, 4662545, 5434337, 6060169, 6219093, 5687060, 4459656, 2745329, 887768, -761570, -1992337, -2800376, -3301253, -3585391, -3668951, -3566450, -3372973, -3253509, -3343570, -3649732, -4046832, -4387797, -4622276, -4800762, -4979861, -5166431, -5358586, -5580490, -5828814, -6021437, -6068016, -5993806, -5931363, -5947373]
39175e947373N6743M51174J120650J815051K244412K253182J886271J317089P08768
39166E905967J25688m43425r94533j443873j651394j520557j094107n51951j02849
39157a771034J23520R0902j77601n87548r50381j069087r05807o34654m82203
39148f363893n17805o12968n81907l40590M0635L94763N67636N00525K22807k13764
39138f904561p45145j220575j382109j013248j42718R22723J782842K167628K033503
39129d501660J532156R27760M93788L97561O15665R34842J055813P68103J07697
39120B331725o31470j092436j123613q66661n63520k92966N8083N63014J070429
39111e47415J317725J198342Q28910L50183k23332q86092j474398j761199j709622
$$ y = [-5947373, -5890630, -5439456, -4318806, -2503755, -259343, 1993839, 3880110, 5197199, 5905967, 6031655, 5588230, 4593697, 3149824, 1498430, -22127, -1116234, -1668185, -1771034, -1647514, -1556612, -1734213, -2321761, -3272142, -4341229, -5247036, -5881690, -6363893, -6881698, -7494666, -8076573, -8417163, -8376528, -7981765, -7414129, -6913604, -6690797, -6904561, -7649706, -8870281, -10252390, -11265638, -11408356, -10485633, -8702791, -6535163, -4501660, -2969504, -2041744, -1547956, -1150395, -534730, 400112, 1455925, 2224028, 2331725, 1700255, 607819, -515794, -1382455, -1945975, -2238941, -2180858, -1617844, -547415, 770310, 1968652, 2797562, 3147745, 2924413, 2038321, 563923, -1197276, -2906898]
39102b906898j511682j351578j230364j052434p74377m09154J5481M15694O46982
39093h158330O40918M99751L75278L11193K86569L26660M30927M55616K54784
39084d576634o4411k15645j07926L3029R045m4630J58785O70342J249968J639311
39074a248766J742918J570423J168328O61317K52151R4252J77881L56615M61494
39065E236613L99946J99012l0730k09002l73215o17687r36240j165432j117858
39056A385407p69137l03810K4048Q5591m4708j84849k01541p1164J63994M27231
39046E11062N94120N31951K07139k80204p91117j222541j469262j416634j064125
39037d399611n90077j85969J31230M34487O69178O83721M82138K73903K03643
$$ y = [-2906898, -4418580, -5770158, -7000522, -8052956, -8827333, -9236487, -9221006, -8805312, -8158330, -7517412, -7017661, -6642383, -6331190, -6044621, -5717961, -5287034, -4831418, -4576634, -4641045, -4856690, -4964616, -4931587, -4922542, -4967172, -4808387, -4138045, -2888077, -1248766, 494152, 2064575, 3232903, 3894220, 4146371, 4240623, 4418504, 4775119, 5236613, 5636559, 5835571, 5804841, 5595839, 5222624, 4604937, 3668697, 2503265, 1385407, 616270, 312460, 336508, 422099, 377391, 192542, -8999, -80163, 83831, 511062, 1105182, 1637133, 1844272, 1564068, 772951, -449590, -1918852, -3335486, -4399611, -4989688, -5175657, -5044427, -4609940, -3940762, -3257041, -2774903, -2501000, -2297357]
39028b297357J66051k1161l69813p41560j006788j057780p60695q0964P52615
39019e417452J371437J595841J536521J360453J099609P47986M01733J71579K9766
39010B897473j23266k69412k79193j22044L8058J2634k00529m25315n03071m50224
39000E75111m23619n29375o68921o25136l50086j09940k26550o69624j027855
38991d055995r41052m68185L4887L03748L37695K75484K39345K68404K78360J02251
38981c625058l02941o96115p37425l58484J79159O17257R34021J181630J271849
38972a536107J081623O67274K04375k27525o35981r34412r69998p64195n45837
38963c660783m58962l75509j11586K73963N40662N76833M99305M35343L41839
$$ y = [-2297357, -2131306, -2152467, -2522280, -3263840, -4270628, -5328408, -6089103, -6170067, -5417452, -4046015, -2450174, -913653, 446800, 1546409, 2294395, 2696128, 2867707, 2897473, 2774207, 2504795, 2225602, 2103558, 2141616, 2154250, 1953721, 1528406, 1025335, 575111, 151492, -377883, -1046804, -1671940, -2022026, -2131966, -2358516, -3028140, -4055995, -4997047, -5465232, -5430345, -5126597, -4788902, -4513418, -4274073, -4005669, -3727309, -3625058, -3927999, -4624114, -5361539, -5720023, -5540864, -4923607, -3989586, -2807956, -1536107, -454484, 212790, 417165, 189640, -446341, -1380753, -2350751, -3114946, -3660783, -4119745, -4495254, -4606840, -4332877, -3792215, -3215382, -2716077, -2280734, -1938895]
38954a938895J07578k51439n83816p49305p02188m62921r8711K67407N20936O65429
38944c225925Q01222R65014J072747J072829J054327J092731J062718P61609K10298
38935D867570l14840n75192n72978m47414l22377l11053n05406q38499j067819
38926h8008j017876p54536m17186j899N21491R68886J041986O78813J38676k81435
38916G88912m71688m45062k30822Q5020L38360M08054L09867J39049o219l2161
38906H83310R7195K54902K12863r5017m45485n62779m44480l62457n50543r55214
38896a967705j296194j332420j061740o75563l31995j1141L75479P88641J066000
38887d446638J100982R09339N22860m3296o72200j130984j273835j179055j007288
$$ y = [-1938895, -1831317, -2082756, -2666572, -3415877, -4118065, -4580986, -4679697, -4412290, -3891354, -3225925, -2424703, -1459689, -386942, 685887, 1740214, 2832945, 3895663, 4657272, 4867570, 4552730, 3977538, 3404560, 2957146, 2634769, 2323716, 1818310, 979811, -88008, -1105884, -1860420, -2277606, -2279505, -1758014, -789128, 252858, 931671, 1070347, 788912, 317224, -127838, -358660, -273640, 64720, 472774, 782641, 921690, 915471, 883310, 980505, 1235407, 1448270, 1353253, 907768, 344989, -99491, -461948, -1012491, -1967705, -3263899, -4596319, -5658059, -6333622, -6665617, -6676758, -6301279, -5512638, -4446638, -3345656, -2436317, -1913457, -1956753, -2628953, -3759937, -5033772, -6212827, -7220115]
38878g220115q10641n74039l58080k67847l10602l92991m42549m40117l54585
38869a1171566j54745J02447K89273L52950L91741N49233Q52021J168889J328778
38860f290979J283849J148102J049176R63852P70353M59601J88212Q3447J07023
38851b37364J79429L13834N02696N74920L45985j15759n28878p02911o63694m81582
38841h13324j50239K99234P01026Q72315P65446M53263M1995l48058o01707o92343
38831E27608o99182o78708n67786k84533J09642M26282N33705M88849M83746O65440
38821A005063R82711J204029J123368P58710L16657j8790j91962j98420m8660
38812D932706J37391J44427r9330l77271m12083j87842Q7067K90108M83165O92350
$$ y = [-7220115, -8030756, -8604795, -8962875, -9230722, -9541324, -9934315, -10376864, -10816981, -11171566, -11326311, -11223864, -10934591, -10581641, -10189900, -9640667, -8788646, -7619757, -6290979, -5007130, -3859028, -2809852, -1846000, -1075647, -616046, -427834, -344387, -237364, -57935, 255899, 758595, 1333515, 1679500, 1563741, 1034863, 331952, -331742, -813324, -963563, -664329, 36697, 909012, 1674458, 2127721, 2169716, 1821658, 1219951, 527608, -171574, -850282, -1418068, -1702601, -1592959, -1166677, -632972, -144123, 339623, 1005063, 1987774, 3191803, 4315171, 5073881, 5390538, 5371748, 5179786, 4981366, 4932706, 5070097, 5214524, 5115194, 4737923, 4325840, 4137998, 4225065, 4515173, 4998338, 5690688]
38802E690688P71402N74442J57724k68186n05801m41847p4624M21440P46599P22579
38792G794416M53766J50899j37597m86407q46140j034423j010556r89627j186292
38783B708039j543446j794866j717769j263373n45829J86505O39925O70753L97071
38774b262990N9596j87358k86756j71195K03566P18797J112200J181726R20324
38765A287910M65988K791l03057l85236l35131l09657l62059m22523m37437m38612
38755a237023m66650n14512n58453n58199m28663j26355K22437M09975L99550
38746b857893L56576L81820L73430K50732J60244K98927O19712Q66645Q55059
38737A305252N93822J91669k09436m43320m25751k77153k30432l92237o62512
$$ y = [5690688, 6462090, 7036532, 7194256, 6926070, 6420269, 5978422, 5903798, 6325238, 7071837, 7794416, 8248182, 8399081, 8261484, 7775077, 6928937, 5894514, 4883958, 3894331, 2708039, 1164593, -630273, -2348042, -3611415, -4157244, -3970739, -3330814, -2660061, -2262990, -2203394, -2390752, -2677508, -2848703, -2645137, -1926340, -814140, 367586, 1287910, 1753898, 1756689, 1453632, 1068396, 733265, 423608, 61549, -360974, -798411, -1237023, -1703673, -2218185, -2776638, -3334837, -3763500, -3889855, -3667418, -3257443, -2857893, -2501317, -2119497, -1746067, -1495335, -1335091, -1036164, -416452, 450193, 1305252, 1899074, 2090743, 1881307, 1437987, 1012236, 735083, 504651, 112414, -550098]
38728e50098q69483q94875o96370l33232J8949J91530J92821J75379K24617K75161
38718b265601K55726K05292J79729J20367q8569m29617o70185n20764P6948Q14615
38708b322059J244994J209897R95667R97825J284746J575514J582880J246940
38700G816404O68606j4798o47820j088847j303428j361419j311825j139374q71373
38691G46126o35358n57152o55354q56442j046844j100589r47093o42754k97569
38682e993029Q2246N72040J118604J478891J448936J066953N22364l3251m87646
38673b23892o85920n20671j13083K14715K05033j21817n13095p01958n87265k52818
38663c300771J42743M71315O46127O07848L82729J20117m4912j79729m80387r47903
$$ y = [-550098, -1419581, -2314456, -3010826, -3344058, -3325109, -3133579, -2940758, -2765379, -2540762, -2265601, -2009875, -1804583, -1624854, -1504487, -1593056, -2022673, -2692858, -3213622, -3136674, -2322059, -1077065, 132832, 1128499, 2126324, 3411070, 4986584, 6569464, 7816404, 8485010, 8470212, 7822392, 6733545, 5430117, 4068698, 2756873, 1617499, 746126, 110768, -446384, -1101738, -1958180, -3005024, -4105613, -5052706, -5695460, -5993029, -5910783, -5338743, -4220139, -2741248, -1292312, -225359, 297005, 263754, -223892, -909812, -1430483, -1543566, -1328851, -1123818, -1245635, -1758730, -2460688, -3047953, -3300771, -3158028, -2686713, -2040586, -1432738, -1050009, -929892, -974804, -1154533, -1634920, -2582823]
38653b582823j248150j013182k55934N91823J047077R49404N15217R0482j42347
38644b048433k35203k78775k09866J00174O04417J067927J318599J376769J296169
38635B991778J037967O02128J37973k23936n47250r35851j280282j344586j088625
38626f50684p33710m84489l18645q2223L18560Q50108J371272J680650J632995
38617C583834J262231P45547K35631k15413n78726p98592q54927p99130o86371
38608A894084n27869l36886j57950j1734J35569L06311M57668N36179N57986N98004
38598C451362P09304Q62391R42864Q14967M42329k7068l40390l56339j84774r3851
38588F220795k78402p15172j214066j576683j701789j576005j230682p52064k92273
$$ y = [-2582823, -3830973, -4844155, -5100089, -4508266, -3461189, -2511785, -1996568, -1906086, -2048433, -2283636, -2562411, -2772277, -2672103, -2067686, -999759, 318840, 1695609, 2991778, 4029745, 4631873, 4769846, 4545910, 3998660, 3062809, 1782527, 437941, -650684, -1384394, -1868883, -2187528, -2269751, -1951191, -1101083, 270189, 1950839, 3583834, 4846065, 5591612, 5827243, 5611830, 5033104, 4234512, 3379585, 2580455, 1894084, 1366215, 1029329, 871379, 859645, 995214, 1301525, 1759193, 2295372, 2853358, 3451362, 4160666, 5023057, 5965921, 6780888, 7223217, 7196149, 6855759, 6499420, 6314646, 6220795, 5942393, 5227221, 4013155, 2436472, 734683, -841322, -2072004, -2824068, -3116341]
38579c116341K1157K07578L93602O19531P59737O87485M48222K01257N4603L6157
38569C12988J56486L85604O11917P47317Q46518R95429J104238R70787N73157
38560F704441J47134q6217j46021j87970l04095n02159p53757r50812r24893o53199
38550B342452l73693l43398n19219o28189n40789m17947m63392o78837r25302
38541b548314j093030j106629q60959l04029M18821J009343J243295J123887Q29436
38532a288179N70760M85384N72288O78938O09098L04799r9453m39241p01370r90009
38522b96985j338699j624475j671292j390800q34875j83110L15457M78696L27567
38513f218516N0117j93725l82012n38528o34189o49621o45731o57263n65666k10506
$$ y = [-3116341, -3095184, -2887606, -2494004, -1874473, -1114736, -427251, 20971, 222228, 276831, 312988, 469474, 855078, 1466995, 2214312, 3060830, 4056259, 5160497, 6131284, 6704441, 6851575, 6765358, 6619337, 6431367, 6127272, 5625113, 4871356, 3920544, 2995651, 2342452, 1968759, 1625361, 1106142, 477953, -62836, -480783, -944175, -1623012, -2548314, -3641344, -4747973, -5608932, -5912961, -5494140, -4484797, -3241502, -2117615, -1288179, -717419, -232035, 340253, 1019191, 1628289, 1933088, 1833635, 1394394, 693024, -296985, -1635684, -3260159, -4931451, -6322251, -7157126, -7340236, -7024779, -6546083, -6218516, -6168399, -6362124, -6744136, -7282664, -7916853, -8566474, -9212205, -9869468, -10435134, -10645640]
38503a0645640L75621R66321J401570J736899K076431K346749K324426J857901
38495B440278J009930J6764q37533j343462j458305j314570j101656r04279o59370
38486d152203k80469J88577N66709O88570N48407K81249K6736j52998k41501k27854
38476b754777j30061j1122O8866R3928P3760L3546L8242J45407K79670K39896
38466a922645p0860m79639p16219p07342n74762l79379m7283M05197P32004O59831
38456c101097J73054m67013r35134j039458p92423l65494N6831M11314P03877
38447e355543Q39208O47959J70001k19393j42506L37566P41032O59252J31118
38438b191306m61724p50226n84020j7733P45616J386870J579648J200965M60519
$$ y = [-10645640, -10270019, -9303698, -7902128, -6165229, -4088798, -1742049, 582377, 2440278, 3450208, 3466972, 2629439, 1285977, -172328, -1486898, -2588554, -3492833, -4152203, -4432672, -4244095, -3677386, -2988816, -2440409, -2159160, -2132424, -2285422, -2526923, -2754777, -2884838, -2895960, -2827094, -2733166, -2659406, -2625860, -2587618, -2442211, -2162541, -1922645, -1993505, -2473144, -3189363, -3896705, -4471467, -4850846, -4898129, -4492932, -3760928, -3101097, -2928043, -3395056, -4330190, -5369648, -6162071, -6527565, -6470734, -6059420, -5355543, -4516335, -3868376, -3698375, -3917768, -4060274, -3722708, -2981676, -2322424, -2191306, -2653030, -3403256, -3987276, -4005009, -3259393, -1872523, -292875, 908090, 1368609]
38429A368609k43578o51727q10269q95482r41300q34345n38862j79370J37589
38420c588735M47224P85172J041402J097065J042099J088668J260157J309665
38412D482717J001702L82978k70003o85878p38528m67565p5002J53327O2615k05869
38402C640494l48019k27093k522J03203P7102O8023J30221J56871Q0876n645j8536
38391C654975n2771k42087n02632n89972m32303k48622k58059l97346m45945l55072
38381A30166l10467m74032p71316r61324q56923m72118j8147K32652J48341j50117
38371c503285m00509m43864l39096k36272j87222j16199N4916L04858N37982O69962
38361c658729O67093N29344K81545q557k41294l48303l36440k56495j60107j15508
$$ y = [1368609, 1125031, 473304, -336965, -1232447, -2173747, -3008092, -3546954, -3726324, -3588735, -3141511, -2356339, -1314937, -217872, 824227, 1912895, 3173052, 4482717, 5484419, 5867397, 5597394, 4911516, 4172988, 3705423, 3630421, 3783748, 3846363, 3640494, 3292475, 3065382, 3062860, 3166063, 3243165, 3311188, 3441409, 3598280, 3679156, 3673511, 3654975, 3602204, 3360117, 2857485, 2267513, 1835210, 1586588, 1328529, 931183, 485238, 130166, -180301, -654333, -1425649, -2386973, -3243896, -3716014, -3734161, -3501509, -3353168, -3503285, -3903794, -4347658, -4686754, -4923026, -5110248, -5226447, -5171531, -4866673, -4328691, -3658729, -2991636, -2462292, -2180747, -2189304, -2430598, -2778901, -3115341, -3371836, -3531943, -3647451]
38351c647451k09682m43742o38334n59886j98964J52841J80749j31725n11943
38342f008137o86041n90164l31478m0994K06103L85235M90670N15353M65067L95804
38332e198582M06601N51859P55337Q35225O33888J50077m16158p54533o58560
38323c694846k11813K66633N09287N11381M29080L34636J65343j07896l73046
38314b171241m78442l82892j72089K9251J31210J06499n678j22478j65153j00977
38304c331990L7684J62811J95091J64723K23512M84667Q43308J032351R02954
38295G15111O00918M04484M07630M28796K45960j32896m82045o23502o20225o71485
38285B72746q49728j001834r24285n97573k25615o4018k12633n35577p65789p29401
$$ y = [-3647451, -3857133, -4300875, -4939209, -5499095, -5698059, -5545218, -5364469, -5496194, -6008137, -6694178, -7284342, -7615820, -7656814, -7450711, -7065476, -6574806, -6059453, -5594386, -5198582, -4791981, -4240122, -3484785, -2649560, -2015672, -1865595, -2281753, -3036286, -3694846, -3906659, -3640026, -3130739, -2619358, -2190278, -1855642, -1690299, -1798195, -2171241, -2649683, -3032575, -3204664, -3175413, -3044203, -2937704, -2943382, -3065860, -3231013, -3331990, -3294306, -3131495, -2936404, -2771681, -2548169, -2063502, -1220194, -187843, 715111, 1316029, 1720513, 2128143, 2556939, 2802899, 2670003, 2187958, 1564456, 944231, 272746, -576982, -1578816, -2503101, -3100674, -3326289, -3390307, -3602940, -4138517, -4904306, -5633707]
38275e633707m97046k79431j51578N6980N33010J181087J641589J614986J115780
38266d18330M10366k25534o62954q97454r45456p95780m72965j28478Q83k06857
38256d342559o09288r04831q99347o44756l34408j19631l2734k2733j4684N4310
38246g870661K21594M95316Q43340J180143J389196J383727J148355P38450K80483
38237a90057l9529q2198R8508K86677L47745L65521M44243M52950J25370n88287
38227A220943j408156j989191k181490k007491j539970r12658l51365l7201Q0873
38218i125706K59398P00947J319436J772828J763721J343478Q88003P16405P68526
38209D07036P40255M91897J78581k6840j65187l66254o35716q84051j066234j164492
$$ y = [-5633707, -6130753, -6410184, -6561762, -6504782, -5971772, -4790685, -3149096, -1534110, -418330, -7964, -233498, -896452, -1793906, -2739362, -3535142, -4008107, -4136585, -4135702, -4342559, -4951847, -5856678, -6756025, -7400781, -7735189, -7854820, -7887554, -7910287, -7924971, -7870661, -7649067, -7153751, -6310411, -5130268, -3741072, -2357345, -1208990, -470540, -190057, -229586, -311784, -213276, 73401, 421146, 786667, 1230910, 1683860, 1809230, 1220943, -187213, -2176404, -4357894, -6365385, -7905355, -8818013, -9169378, -9206579, -9125706, -8866308, -8165361, -6845925, -5073097, -3309376, -1965898, -1077895, -361490, 407036, 1147291, 1639188, 1817769, 1790929, 1625742, 1259488, 623772, -260279, -1326513, -2491005]
38199b491005j106565q41327m61064j22965J34754L86476O41117P89035P48214
38190b323330N75311M05347L38408L84565M54377M12354K21074L1218L6711K23991
38180G60026L58292K57642J225j85002j84210o8023L7080R5775J79603L66186
38170A618594O18393P65923O46161K77702j47304m64221o86795r30858j232026
38161D65569j480242j505972j201412o05481O8692N24285N94358L95274K11474
38152b533455J91850K02351K4971l30631n89026m99226j03575L30586O09469P67235
38142a929451R20050J053710J024560P38890K64031k32652n95297p29637o21863
38133a07659l62150j11245K0254O3677J29920K57753L63157L49401K27123R4890
$$ y = [-2491005, -3597570, -4438897, -4899961, -5022926, -4888172, -4501696, -3860579, -3071544, -2323330, -1748019, -1342672, -1004264, -619699, -165322, 247032, 468106, 499324, 536035, 760026, 1118318, 1375960, 1377185, 1192183, 1007973, 939950, 977030, 1072805, 1252408, 1618594, 2236987, 3002910, 3649071, 3926773, 3779469, 3315248, 2628453, 1697595, 465569, -1014673, -2520645, -3722057, -4327538, -4258846, -3734561, -3140203, -2744929, -2533455, -2341605, -2139254, -2114283, -2444914, -3033940, -3533166, -3636741, -3306155, -2696686, -1929451, -1009401, 44309, 1068869, 1807759, 2071790, 1839138, 1243841, 514204, -107659, -469809, -581054, -560800, -497123, -367203, -109450, 253707, 603108, 830231, 925121]
38123I25121K8925L4479Q4984J38000R7798j51948n99323j027829j184680j029698
38113b684171p38243m53423j42497K51445O17837P41553N16179J9886n67959j032841
38103c472234j167716r04888m26485k0796K13163M16964O92968R00814Q29715
38094b938495M88386J08940r7635r4472L1977J60073J75486L9026j47289k04546
38084b478549l5104L19110P55701J161857J382301J261258Q03470K35563j79338
38075C226269l73432m72795n99232p42177q13483p58138n96518m02076k47229
38066a778811j36234J0570K70035O14616R33801J145410J230168J166828R28990
38057D385373N87757L26599K55855K43589K6324m97941j140394j580861j599870
$$ y = [925121, 954046, 988525, 1073509, 1211509, 1309307, 1157359, 558036, -469793, -1654473, -2684171, -3422414, -3875837, -4018334, -3766889, -3149052, -2407499, -1891320, -1871434, -2439393, -3472234, -4639950, -5544838, -5971323, -5992119, -5778956, -5361992, -4669024, -3768210, -2938495, -2450109, -2341169, -2438804, -2533276, -2501299, -2341226, -2165740, -2126714, -2274003, -2478549, -2513653, -2194543, -1438842, -276985, 1105316, 2366574, 3170044, 3405607, 3226269, 2852837, 2380042, 1780810, 1038633, 225150, -532988, -1129506, -1531582, -1778811, -1915045, -1904475, -1634440, -1019824, -86023, 1059387, 2289555, 3456383, 4385373, 4973130, 5299729, 5555584, 5799173, 5825497, 5327556, 4187162, 2606301, 1006431]
38048A006431j171596m40325L33089Q75681J059011R68354P84180O07935M34766
38039D457526K54964R4254n7293k69574n63639q20379q69649o72014l67101j42489
38029A044606j02627k68142o22532j089514j500659j682624j611130j424307j239126
38020h496055r91105n17713K01127R41816J405412J463916J219646Q54003M77983
38011c440970J46349n0349r610K37568M81615N21111L77844K44289K18756K00335
38001a073062R4970J3458J39253M43160O70726O39223M39846K89959K57731K01138
37991B116402n0542m96560r20959j031968p00824j08960L79238N37910M54413
37982A78150L64459L72028L87722K88176M4383k86599n98211p54935o79062m67785
$$ y = [1006431, -165165, -605490, -272401, 603280, 1662291, 2630645, 3414825, 4022760, 4457526, 4712490, 4806744, 4749451, 4479877, 3916238, 3095859, 2226210, 1554196, 1187095, 1044606, 941979, 673837, 51305, -1038209, -2538868, -4221492, -5832622, -7256929, -8496055, -9487160, -10004873, -9803746, -8861930, -7456518, -5992602, -4772956, -3918953, -3440970, -3294621, -3344970, -3354580, -3117012, -2635397, -2114286, -1736442, -1492153, -1273397, -1073062, -978092, -964634, -825381, -382221, 288505, 927728, 1367574, 1657533, 1915264, 2116402, 2065860, 1569300, 648341, -383627, -1084451, -1193411, -814173, -276263, 178150, 542609, 914637, 1302359, 1590535, 1634918, 1348319, 750108, -4827, -683889, -1151674]
37972a151674l48350m38256n79941m87804o8610M44673O87243M69625r4020p06157
37962b273271j099071j159379r12130m42747J43773P12427J108002J230767J111909
37953a579720Q85240O71857N18150M50826N20795P13090Q48238P00624K64777
37944C993877j88380l94081l55832k35803p2369K25939O21467Q72834P97618M85501
37934E750771J66985k9005j08985j22617j50962k87855m93722n50593l30374m6606
37924C797037l2108k80096m41762l32604j92858k96761n12622m89337j72130J26779
37914A173538J59622J3624r3483q1685J9850J86934L33374K57757j41756o31955
37904A195820q09638n42898j17062J15126J16945J16091K50937L91071L11469
$$ y = [-1151674, -1500024, -1938280, -2518221, -3006025, -3074635, -2629962, -1942719, -1473094, -1567114, -2273271, -3372342, -4531721, -5443851, -5886598, -5742825, -5030398, -3922396, -2691629, -1579720, -694480, -22623, 495527, 946353, 1467148, 2180238, 3028476, 3729100, 3993877, 3805497, 3411416, 3055584, 2819781, 2747412, 2973351, 3594818, 4467652, 5265270, 5750771, 5917756, 5888751, 5779766, 5657149, 5506187, 5218332, 4724610, 4174017, 3843643, 3797037, 3764929, 3484833, 3043071, 2710467, 2517609, 2220848, 1708226, 1218889, 1046759, 1173538, 1333160, 1346784, 1253301, 1171616, 1191466, 1378400, 1711774, 1969531, 1827775, 1195820, 386182, -156716, -273778, -158652, -41707, 74384, 325321, 716392, 1027861]
37895A027861l5508m54343o86503o44341m69550l47806k77176q4963K97442O63396
37885a011491P31718M76892J42660p0709k11146m33202p66506j098100j302475
37876c542359j305498j082057o88367k69396M9636K67917M45587N66804N45644
37867e012089L51035M5040k86377n41184n45840j39731N89415J233120J355151
37858b951460Q84733J72525l49201n18916m58741l20784j26026J27186L06462
37849c234222K36097m8270k64796j89651P1958K02911J0823m34860r32237j273007
37839e855254j268304q33148j21210N37323R14648J035093J009842Q47401N36872
37830c196737K22490J25980K95186N58779P57506R06168J063041J131346R17423
$$ y = [1027861, 992353, 538010, -148493, -792834, -1262384, -1610190, -1887366, -1972329, -1674887, -1011491, -279773, 197119, 339779, 269070, 57924, -375278, -1141784, -2239884, -3542359, -4847857, -5929914, -6618281, -6887677, -6838041, -6570124, -6124537, -5557733, -5012089, -4661054, -4616014, -4902391, -5443575, -5989415, -6129146, -5539731, -4306611, -2951460, -2066727, -1894202, -2243403, -2762319, -3221060, -3541844, -3667870, -3540684, -3234222, -2998125, -3046395, -3311191, -3500842, -3428884, -3225973, -3215150, -3650010, -4582247, -5855254, -7123558, -7956706, -8077916, -7540593, -6625945, -5590852, -4581010, -3733609, -3196737, -2974247, -2848267, -2553081, -1994302, -1236796, -330628, 732413, 1863759, 2781182]
37821B781182M02149j29123l05578l2766L97673N82997L75443m6736m29422o78763
37811B917056q38895r43661r94276j049591j211369j463429j599519j408500r33980
37802g526164m74724k85463l22389l40320k06555k7576M1652P164r515N4120J66740
37791h923030K91451L96705L99984K26406m7576k05636r4805K33475N93862Q12278
37781f316886Q09474O46904N10239N34707O08388M69500N8799l50385m58477k51030
37771c738767J01213N08048R44397J268044J287476J014038O59573L66195J15710
37762B525927p2190p2621J05651J96778l4562m73556p70545p11356l41898J94485
37752E46113P44424J074356R34734L23494m14505q73715r44919q23545p24826
$$ y = [2781182, 3183331, 3054208, 2748630, 2715864, 3113537, 3696534, 4071977, 4025241, 3595819, 2917056, 2078161, 1134500, 140224, -909367, -2120736, -3584165, -5183684, -6592184, -7526164, -8000888, -8286351, -8608740, -8949060, -9155615, -9183191, -9141539, -9134375, -9143890, -9089770, -8923030, -8631579, -8234874, -7834890, -7608484, -7656060, -7861696, -7956501, -7723026, -7129164, -6316886, -5507412, -4860508, -4350269, -3815562, -3207174, -2737674, -2678875, -3029260, -3487737, -3738767, -3637554, -3129506, -2185109, -917065, 370411, 1384449, 2044022, 2410217, 2525927, 2453737, 2381116, 2486767, 2683545, 2648983, 2175427, 1404882, 693526, 351628, 546113, 1290537, 2364893, 3299627, 3623121, 3208616, 2334901, 1389982, 566437, -158389]
37743a58389o97767o93719o83934o63383o32780o37740p40346q59904p13237o5115
37733f546314R40536J811956K126180J859684J305195P78965M59141L68735L65061
37724C469139K00601k46440p83236j052584q98848n01194j27963J40851M01042
37715F01368P27904J079084J351558J452504J318675R36956L82201j94428o65939
37706F989883j041210j443470j919290k277001k215747j681581j014912o26640
37698e229968n62632n26207l31280j55318k41737m85251m96548p0766N56260R73328
37688f570119J017856Q51782O73682M85531J87545j91770m77520n57054n05510
37679e085577m61371m52945m06692k62149m308L56915P37451R50915Q56594N37245
$$ y = [-158389, -856156, -1549875, -2233809, -2897192, -3529972, -4167712, -4908058, -5767962, -6481199, -6546314, -5605778, -3793822, -1667642, 192042, 1497237, 2276202, 2735343, 3104078, 3469139, 3669740, 3423300, 2640064, 1587480, 688632, 187438, 59475, 200326, 601368, 1329272, 2408356, 3759914, 5212418, 6531093, 7468049, 7850250, 7655822, 6989883, 5948673, 4505203, 2585913, 308912, -1906835, -3588416, -4603328, -5229968, -5792600, -6318807, -6650087, -6805405, -7047142, -7532393, -8028941, -8099707, -7543447, -6570119, -5552263, -4700481, -4026799, -3541268, -3353723, -3545493, -4023013, -4580067, -5085577, -5546948, -5999893, -6406585, -6668734, -6673042, -6316127, -5578676, -4627761, -3771167, -3233922]
37669c233922K16306j2159k50187n65191q30877q83762p39037n44750l76842j77571
37659g397992J28637N34634R46825J220782J224075R33271M76615N3745j76502
37650b055910j32707J79833O22922R39935R27375O24318K89572J67186K72652
37641A835176L86559K45438k23430q23154j260734j405250j329987j110791p07740
37632d393913j24982M23682O68879N91093M38617M16966M70265M19591K29614
37623h60188N6835O3857K48454M55827N23549M09551K08865P3345J02289K52664
37613A535048L17067M9945n73904j216129j397723r29301p3512P26832J182665
37604c79012J213968Q69976L47915l9061j28499j16841l27147p79330j156479
$$ y = [-3233922, -3017616, -3029775, -3279962, -3845153, -4676030, -5559792, -6298829, -6843579, -7220421, -7397992, -7269355, -6734721, -5787896, -4567114, -3343039, -2409768, -1933153, -1879408, -2055910, -2188617, -2008784, -1385862, -445927, 481448, 1105766, 1395338, 1562524, 1835176, 2221735, 2467173, 2243743, 1420589, 159855, -1245395, -2575382, -3686173, -4393913, -4518895, -4095213, -3426334, -2835241, -2396624, -1979658, -1509393, -1089802, -860188, -803353, -739496, -491042, -35215, 488334, 897885, 1106750, 1180095, 1282384, 1535048, 1852115, 1902060, 1328156, 112027, -1285696, -2214997, -2288509, -1561677, -379012, 834956, 1704932, 2052847, 2013786, 1885287, 1768446, 1441299, 661969, -494510]
37595d94510j192492r06740m30265J87008Q87510J484371J771500J679871J246563
37586D232816N43233k53462q31607r55613o93274l22268k8366K10266M64354O93692
37576C059771P74158O28535L14265n483k10615l62425o22185r83584j183505r88919
$$ y = [-494510, -1687002, -2593742, -3024007, -2836999, -1949489, -465118, 1306382, 2986253, 4232816, 4776049, 4522587, 3690980, 2735367, 2042093, 1719825, 1691459, 1901725, 2366079, 3059771, 3833929, 4462464, 4776729, 4771246, 4560631, 4198206, 3576021, 2592437, 1408932, 420013]
$$ [...]
##END NTUPLES=NMR SPECTRUM
##END=
