##TITLE=31Pdec_LR-698-R3-FK
 CDCl3, 124 sc
 27.1.2020
##JCAMPDX= 6.0         $$ Bruker NMR JCAMP-DX V2.0
##DATA TYPE= NMR SPECTRUM
##DATA CLASS= NTUPLES
##ORIGIN= UXNMR, Bruker Analytische Messtechnik GmbH
##OWNER= root
$$ XWIN-NMR		Version 3.5
$$ Mon Jan 27 14:37:26 2020 Russian Standard Time (UT+4h)  she@DPX200
##.OBSERVE FREQUENCY= 81.013821
##.OBSERVE NUCLEUS= ^31P
##.ACQUISITION MODE= SIMULTANEOUS
##.ACQUISITION SCHEME= undefined
##.AVERAGES= 124
##.DIGITISER RES= 17
##SPECTROMETER/DATA SYSTEM= spect
##.PULSE SEQUENCE= zgpg30
##.SOLVENT NAME= CDCl3
##.SHIFT REFERENCE= (INTERNAL, CDCl3, 0, 182.463)
##AUDIT TRAIL= $$ (NUMBER, WHEN, WHO, WHERE, WHAT)
$$ ##TITLE= Audit trail, XWIN-NMR		Version 3.5
$$ ##JCAMPDX= 5.01
$$ ##ORIGIN= Bruker BioSpin GmbH
$$ ##OWNER= she
$$ F:/spectra/data/she/nmr/P31/1/pdata/1/auditp.txt
$$ ##AUDIT TRAIL=  $$ (NUMBER, WHEN, WHO, WHERE, WHAT)
(   1,<2020-01-27 14:35:51.23 +0400>,<she>,<DPX200>,
      <continue with go, POWCHK disabled, PULCHK disabled
       configuration hash MD5:
       00 E9 B6 7A A2 85 ED C7 34 08 36 98 17 FE 4E 26
       data hash MD5: 32K
       3F F1 FB 10 7A B7 B7 18 70 D8 AC F6 31 89 62 1E>)
(   2,<2020-01-27 14:35:54.87 +0400>,<she>,<DPX200>,
      <Start of raw data processing
       efp BC_mod = 2 LB = 1 FT_mod = 6 PKNL = 1 PHC0 = -1687.16 PHC1 = 138.0012 SI = 64K 
       data hash MD5: 64K
       56 53 3A D9 56 BC 34 4E 8D BF 74 DA 47 FE 2C 87>)
(   3,<2020-01-27 14:36:12.51 +0400>,<she>,<DPX200>,
      <pk PHC0 = 32.07931 PHC1 = 0 
       data hash MD5: 64K
       F1 E7 6C BB C6 30 5F AA FC F8 78 D6 FD 74 78 28>)
(   4,<2020-01-27 14:36:15.79 +0400>,<she>,<DPX200>,
      <abs ABSG = 5 
       data hash MD5: 64K
       8F 83 73 D5 DD D7 09 C2 32 2A 34 5E AD 25 43 5B>)
$$ ##END=
$$ 
$$ hash MD5
$$ C0 B0 28 24 F9 A0 5D 4D F3 B3 61 3F A0 CA 5C CB
##$RELAX= 
##$RELAX= 
##$RELAX= 
##$RELAX= 
##$RELAX= 
##$RELAX= 
##$RELAX= 
##$RELAX= 
$$ Bruker specific parameters
$$ --------------------------
##$DU= <F:/spectra>
##$EXPNO= 1
##$NAME= <P31>
##$PROCNO= 1
##$TYPE= <nmr>
##$USER= <she>
##$AMP= (0..31)
100 100 100 100 100 100 100 100 100 100 100 100 100 100 100 100 100 100 
100 100 100 100 100 100 100 100 100 100 100 100 100 100 
##$AQSEQ= 0
##$AQ_mod= 1
##$AUNM= <au_zg>
##$AUTOPOS= <>
##$BF1= 81.014009
##$BF2= 200.13
##$BF3= 200.13
##$BF4= 200.13
##$BF5= 200.13
##$BF6= 200.13
##$BF7= 200.13
##$BF8= 200.13
##$BYTORDA= 1
##$CFDGTYP= 0
##$CFRGTYP= 5
##$CHEMSTR= <none>
##$CNST= (0..31)
1 1 145 1 1 1 1 1 1 1 1 1 1 1 1 1 1 1 1 1 1 1 1 1 1 1 1 1 1 1 1 1 
##$CPDPRG= <waltz16>
##$CPDPRG1= <>
##$CPDPRG2= <waltz16>
##$CPDPRG3= <>
##$CPDPRG4= <mlev>
##$CPDPRG5= <mlev>
##$CPDPRG6= <mlev>
##$CPDPRG7= <mlev>
##$CPDPRG8= <mlev>
##$CPDPRGB= <>
##$CPDPRGT= <>
##$D= (0..31)
0 1 0 0 0 0 0 0 0 0 0 0.03 2e-05 3e-06 0 0 0 0 0 0 0 0 0 0 0 0 0 0 0 0 
0 0 
##$DATE= 1580121165
##$DBL= (0..7)
120 120 120 11 120 120 24 19 
##$DBP= (0..7)
150 150 150 150 150 150 150 150 
##$DBP07= 0
##$DBPNAM0= <>
##$DBPNAM1= <>
##$DBPNAM2= <>
$$ [...]
##$SUBNAM3= <"">
##$SUBNAM4= <"">
##$SUBNAM5= <"">
##$SUBNAM6= <"">
##$SUBNAM7= <"">
##$SUBNAM8= <"">
##$SUBNAM9= <"">
##$SW= 369.568048894756
##$SWIBOX= (0..15)
0 1 3 0 0 0 0 0 0 0 0 0 0 0 0 0 
##$SW_h= 29940.119760479
##$TD= 32768
##$TD0= 1
##$TE= 0
##$TE2= 300
##$TE3= 300
##$TEG= 300
##$TL= (0..7)
0 120 53 12 22 120 120 120 
##$TP= (0..7)
150 150 150 150 150 150 150 150 
##$TP07= 0
##$TPNAME0= <>
##$TPNAME1= <>
##$TPNAME2= <>
##$TPNAME3= <>
##$TPNAME4= <>
##$TPNAME5= <>
##$TPNAME6= <>
##$TPNAME7= <>
##$TPOAL= (0..7)
0.5 0.5 0.5 0.5 0.5 0.5 0.5 0.5 
##$TPOFFS= (0..7)
0 0 0 0 0 0 0 0 
##$TUNHIN= 0
##$TUNHOUT= 0
##$TUNXOUT= 0
##$USERA1= <user>
##$USERA2= <user>
##$USERA3= <user>
##$USERA4= <user>
##$USERA5= <user>
##$V9= 5
##$VALIST= <valist>
##$VCLIST= <CCCCCCCCCCCCCCC>
##$VD= 0
##$VDLIST= <DDDDDDDDDDDDDDD>
##$VPLIST= <PPPPPPPPPPPPPPP>
##$VTLIST= <TTTTTTTTTTTTTTT>
##$WBST= 1024
##$WBSW= 4
##$XGAIN= (0..3)
0 0 0 0 
##$XL= 0
##$YL= 0
##$YMAX_a= 8431
##$YMIN_a= -13826
##$ZGOPTNS= <>
##$ZL1= 120
##$ZL2= 120
##$ZL3= 120
##$ZL4= 120
##$ABSF1= 182.463
##$ABSF2= -187.1042
##$ABSG= 5
##$ABSL= 3
##$ALPHA= 0
##$AQORDER= 0
##$ASSFAC= 0
##$ASSFACI= 0
##$ASSFACX= 0
##$ASSWID= 0
##$AUNMP= <proc_1d>
##$AZFE= 0.1
##$AZFW= 0.5
##$BCFW= 0
##$BC_mod= 2
##$BYTORDP= 0
##$COROFFS= 0
##$CY= -3
##$DATMOD= 1
##$DC= 0
##$DFILT= <>
##$DTYPP= 0
##$F1P= 0
##$F2P= 0
##$FCOR= 1
##$FTSIZE= 65536
##$FT_mod= 6
##$GAMMA= 0
##$GB= 0
##$INTBC= 1
##$INTSCL= 5.30512e-09
##$ISEN= 30
##$LB= 1
##$LEV0= 0
##$LPBIN= 0
##$MAXI= 10000
##$MC2= 0
##$MEAN= 0
##$ME_mod= 0
##$MI= 50
##$NCOEF= 0
##$NC_proc= -9
##$NLEV= 6
##$NOISF1= 182.463
##$NOISF2= 159.3651
##$NSP= 0
##$NTH_PI= 0
##$NZP= 0
##$OFFSET= 182.463
##$PC= 4
##$PHC0= -1655.081
##$PHC1= 138.0012
##$PH_mod= 1
##$PKNL= yes
##$PPARMOD= 0
##$PSCAL= 0
##$PSIGN= 0
##$REVERSE= no
##$SF= 81.0140089999434
##$SI= 65536
##$SIGF1= 159.3651
##$SIGF2= -187.1042
##$SINO= 113.3802
##$SIOLD= 16384
##$SREGLST= <1H.CDCl3>
##$SSB= 0
##$STSI= 65536
##$STSR= 0
##$SW_p= 29940.119760479
##$SYMM= 0
##$S_DEV= 0
##$TDeff= 32768
##$TDoff= 0
##$TI= <>
##$TILT= no
##$TM1= 0
##$TM2= 0
##$TOPLEV= 0
##$USERP1= <user>
##$USERP2= <user>
##$USERP3= <user>
##$USERP4= <user>
##$USERP5= <user>
##$WDW= 1
##$XDIM= 65536
##$YMAX_p= 517371835
##$YMIN_p= -194404748
$$ End of Bruker specific parameters
$$ ---------------------------------
##NTUPLES= NMR SPECTRUM
##VAR_NAME=  FREQUENCY,     SPECTRUM/REAL,   SPECTRUM/IMAG
##SYMBOL=    X,             R,               I
##VAR_TYPE=  INDEPENDENT,   DEPENDENT,       DEPENDENT
##VAR_FORM=  AFFN,          ASDF,            ASDF
##VAR_DIM=   65536,         65536,           65536
##UNITS=     HZ,            ARBITRARY UNITS, ARBITRARY UNITS
##FACTOR=    0.456856943014862, 1,           1
##FIRST=     14782.0589164792, 0,            0
##LAST=      -15158.0608439998, 0,           0
##MIN=       -15158.0608439998, -194404748,  0
##MAX=       14782.0589164792, 517371835,    0
$$ Real data points
##PAGE= N=1
##DATA TABLE= (X++(R..R)), XYDATA
$$ [...]
##PAGE= N=2
##DATA TABLE= (X++(I..I)), XYDATA
4625I288313m111196k9011067l4189665o757864K5793135K8139058O187579k018801
$$ 9288313 5177117 -23833950 -58023615 -64781479 -38988344 -10849286 -4661707 -6680508
4617f680508J6868619L2185018J6679749j2850942k3581119j6388556j7242348
$$ -6680508 10188111 42373129 59052878 46201936 22620817 6232261 -11010087
4610a1010087k6680954j4298110K7884704N9993281M4777264M52830k5416239
$$ -11010087 -37691041 -51989151 -24104447 35888834 80666098 81118928 55702689
4603E5702689k0394723j2609313j7222769j4993645O161144K1706501O059837
$$ 55702689 35307966 22698653 5475884 -9517761 -3356617 18349884 24409721
4596B4409721k2827406k2939467J3800832M8027976M1480089J504277l1608654
$$ 24409721 1582315 -21357152 -7556320 40471656 81951745 83456022 51847368
4589E1847368l1403657q863196P439307M554290o008139p770289Q12964Q373592
$$ 51847368 20443711 11580515 19019822 23574112 17565973 9795684 10608648 18982240
4581A8982240O066003n003150j8061372k5445514k1111972n961075R102560J1664512
$$ 18982240 25048243 20045093 1983721 -23461793 -44573765 -50534840 -41432280 -29767768
4573b9767768N00832j3742908j9219507j0944727P292170K3292397K4507978J4203769
$$ -29767768 -29266936 -43009844 -62229351 -73174078 -65881908 -42589511 -18081533 -3877764
4565c877764J2767456L0125683M2937528J8536553l7076963p4995678n6874814
$$ -3877764 8889692 39015375 81952903 100489456 63412493 -11583185 -68457999
4558f8457999K5929M1911245L5646906j146707k3274008o062167K9152121L9464656
$$ -68457999 -68432070 -26520825 9126081 7979374 -15294634 -21356801 7795320 47259976
4550D7259976J1984636j9612344k0564231k573294j895074j9264864j7842243
$$ 47259976 59244612 39632268 19068037 16494743 14599669 -4665195 -22507438
4543b2507438J3971452L6893914J8576022j6077845k3604480o602021j126459
$$ -22507438 -8535986 28357928 46933950 30856105 7251625 649604 -476855
4536d76855j3326140j2550868J1213851K5513252P019323j8578656j4287647J1929802
$$ -476855 -13802995 -26353863 -15140012 10373240 17392563 -1186093 -15473740 -3543938
4528c543938J9632620l291923k3825985j3922192R099690J0700209q517311j5077026
$$ -3543938 16088682 12796759 -11029226 -24951418 -15851728 -5151519 -13668830 -28745856
4520b8745856N028755K4398243J6328124m729353p392819P300543J0258019o973460
$$ -28745856 -23717101 681142 17009266 12279913 4887094 12187637 22445656 15472196
4512A5472196j9554493j0502448M862584P740643L389284L113823J112631r797090
$$ 15472196 -4082297 -14584745 -9722161 -1981518 1407766 4521589 5634220 -4162870
4504d162870j7235085p468091Q541487J1251812M879042Q538281K1038728K0775283
$$ -4162870 -21397955 -28866046 -20324559 -9072747 -4193705 4344576 25383304 46158587
4496D6158587P89008k0104146k5607068k0814955j5896056q661416O111261K2176615
$$ 46158587 46947595 26843449 1236381 -19578574 -35474630 -44136046 -38024785 -15848170
4488a5848170K8253884K3228200J5738450J0478222K463833j2154769k4157233
$$ -15848170 12405714 35633914 51372364 61850586 64314419 52159650 28002417
4481B8002417j8894492J377150J3957173N411698o158967K269033J9022982J3911082
$$ 28002417 9107925 10485075 24442248 29853946 23694979 25964012 44986994 58898076
4473E8898076q816593j1522058J4738159L1053318J3252360r006306o702860k845104
$$ 58898076 50081483 38559425 53297584 84350902 97603262 88596956 81894096 79048992
4465G9048992k4883111m3065036j5276508L1782890L4340747o315344k5605300
$$ 79048992 54165881 11100845 -4175663 27607227 61947974 55632630 30027330
4458C0027330k554165J0101857j7422886l8296337j1221610K5298372J4075616
$$ 30027330 27473165 37575022 20152136 -18144201 -29365811 -4067439 10008177
4451A0008177k9124832m2850855j2314137K0326585K3964647Q165188q972602
$$ 10008177 -19116655 -61967510 -74281647 -53955062 -29990415 -21825227 -30797829
4444c0797829k0191115j7094287N765804L2421961L8008391J9870727m611963
$$ -30797829 -50988944 -68083231 -62317427 -29895466 8112925 27983652 23371689
4437B3371689k3985352l3497277k1778146J2631051L9782113K8172390o488958
$$ 23371689 -613663 -34110940 -55889086 -43258035 -3475922 24696468 18207510
4430A8207510j8088898K301749J3458245j0891346m0226719l1921550Q325769
$$ 18207510 118612 2420361 15878606 4987260 -35239459 -67161009 -58835240
4423e8835240L6536792K7390873q75278j3194881N373771L6758283M6307910J6995842
$$ -58835240 -22298448 5092425 4217147 -8977734 -3603963 33154320 79462230 96458072
4415I6458072k8364734m7179531k4171937J0954282J8937808n519533l3488846
$$ 96458072 68093338 20913807 -3258130 7696152 26633960 21114427 -12374419
4408a2374419l7257119j7095804L541361L610388j2476323j6896076R548409M7737879
$$ -12374419 -49631538 -66727342 -63185981 -59575593 -72051916 -88947992 -79399583 -31661704
4400c1661704N5916755K0697070k2181946l0391599o136477J3489229R651208
$$ -31661704 24255051 44952121 22770175 -7621424 -13757901 -268672 9382536
4393I382536K98938K573175L925206j1303385k6220208j1301702K5720030M1265326
$$ 9382536 9681474 12254649 16179855 4876470 -21343738 -32645440 -6925410 34339916
4385C4339916J4796895k1194185k6225293l850142J3952094J5683240J3946789
$$ 34339916 49136811 27942626 1717333 -2132809 11819285 27502525 41449314
4378D1449314J1660060o96118j5701975j1457761J0150941J9056510J536870j9942354
$$ 41449314 53109374 52413256 36711281 25253520 35404461 54460971 55997841 36055487
4370C6055487k4369702k0210550j8399717p095658K1188857M1676730K7279388
$$ 36055487 11685785 -8524765 -26924482 -34020140 -12831283 28845447 56124835
4363E6124835q855900k9616161k2462033o228241J698177J003680j994825k78061
$$ 56124835 47268935 17652774 -4809259 -11037500 -9339323 -8335643 -10330468 -10608529
4355a0608529J0728144K0381025P979700k1772948l0286843J986707L7307511
$$ -10608529 119615 20500640 28480340 6707392 -23579451 -21592744 15714767
4348A5714767L0342316m300079j7287524k292824K201691j6092264k4406973m838841
$$ 15714767 46057083 41757004 24469480 22176656 24378347 8286083 -16120890 -20959731
4340b0959731J6128191J3713615r45449r322598j1246137o718152J1294452K9922875
$$ -20959731 -4831540 8882075 7936626 -1385972 -12632109 -19350261 -8055809 21867066
4332B1867066J9676258j7208612l9176160k5977110p860450j0863995j4437801
$$ 21867066 41543324 24334712 -14841448 -40818558 -48679008 -59543003 -73980804
4325g3980804N006069K7522290K5558636J3675321K0002681L4635456L0038952
$$ -73980804 -68974735 -41452445 -15893809 -2218488 17784193 52419649 82458601
4318H2458601J1242776K029300n50509j3838999k7841843k1091450m736778m431098
$$ 82458601 93701377 95730677 95180168 81341169 53499326 32407876 27671098 23240000
4310B3240000j0560815L198958K1675167N802923l3562307m1074146n332876J9668111
$$ 23240000 12679185 15878143 37553310 43356233 9793926 -31280220 -36613096 -16944985
4302a6944985J420224k2104429j1076481J3121920J4983417Q585520K3147369
$$ -16944985 -15524761 -37629190 -48705671 -35583751 -20600334 -12014814 11132555
4295A1132555L9634407J9565876k2275651l2164858L36967K7452846J6039843
$$ 11132555 50766962 70332838 48057187 15892329 16229296 43682142 59721985
4288E9721985j0942390j8797744p900327K053754L776228j239478j3522831k3939430
$$ 59721985 48779595 29981851 22081524 24135278 27911506 26672028 13149197 -10790233
4280a0790233j3047271J8189177L7054176K0275245j1286426k3179231j5342361
$$ -10790233 -23837504 -5648327 31405849 51681094 40394668 17215437 1873076
4273A873076r824184n514004J5097941L8411610K5146190k4821114n6125811l1542303
$$ 1873076 -7951108 -13465112 1632829 40044439 65190629 40369515 -15756296 -47298599
4265d7298599J3546107K3807042K475733n029754J2399129K0473257J692621j8470842
$$ -47298599 -33752492 -9945450 -7469717 -12499471 -100342 20372915 22065536 3594694
4257C594694j6409512j978579P634565J1561256R664285l393026j4313996L406364
$$ 3594694 -12814818 -14793397 -7158832 4402424 14066709 10673683 -3640313 -233949
4249b33949M2112821N4815257K1343546j7277285k0720814q021016j4779725k7119016
$$ -233949 41878872 96694129 118037675 100760390 80039576 72018560 57238835 30119819
4241C0119819j0443732K1014525K3046762k022889q509030J3211396J9674871
$$ 30119819 19676087 40690612 63737374 61714485 53205455 66416851 86091722
4234H6091722j2499886m9667895n5075773l4174528p629157J7985445L2502895
$$ 86091722 73591836 23923941 -31151832 -65326360 -72955517 -54970072 -22467177
4227b2467177J7904812j3561175j7127230K0271351N1186582L4840240l269137
$$ -22467177 -4562365 -18123540 -35250770 -14979419 36207163 71047403 67778266
4220F7778266j6640760r247907j5602943l4019736l1869811o696719P910622j797280
$$ 67778266 51137506 41889599 26286656 -7733080 -39602891 -46299610 -38388988 -40186268
4212d0186268j0914777j14310J6579818J8741262O976820o581387j3946336j0326243
$$ -40186268 -51101045 -51215355 -34635537 -15894275 -8917455 -15498842 -29445178 -39771421
4204c9771421L888651J5451829J0149099m654533p198571O514831J6653321R908047
$$ -39771421 -35882770 -20430941 -10281842 -14936375 -22134946 -15620115 1033206 10941253
4196A0941253k249646k576298Q742120J6492677P144319j7949029l7868712k6276448
$$ 10941253 8691607 6115309 14857429 31350106 38494425 20545396 -17323316 -43599764
4188d3599764J6339587N2373343M8289898J8757158M679394J2819584J0660380
$$ -43599764 -27260177 25113166 73403064 92160222 96839616 109659200 120319580
4181A20319580j5728885l6745748k8052090j0202112j3657600l0296373l1201974
$$ 120319580 104590695 67844947 39792857 29590745 15933145 -14363228 -45565202
4174d5565202j5308358n956822p435939o83K0526642L0526550J6110884k895987
$$ -45565202 -60873560 -66830382 -74266321 -74267004 -53740362 -23213812 -7102928 -9998915
4166i998915k074435J2621978J6548134J763084j6520365k3307115j8304775q747909
$$ -9998915 -12073350 548628 17096762 18859846 2339481 -20967634 -39272409 -48020318
4158d8020318n16419L147243M034324R991409K3935609L2955255K0910660o718456
$$ -48020318 -48536737 -45389494 -41355170 -31363761 -7428152 25527103 46437763 39719307
4150C9719307k4855996k0688491q934140p046182j0474282o071259L410031O183376
$$ 39719307 14863311 -5825180 -14759320 -21805502 -32279784 -38351043 -34941012 -28757636
4142b8757636K844155J190738k101927j2264176j6091874J677263K5016627K2151760
$$ -28757636 -25913481 -24722743 -26824670 -39088846 -55180720 -53503457 -28486830 -6335070
4134f335070k577402q837630J5809229L0325577K711289l5239492l0628434J5004392
$$ -6335070 -8912472 -17750102 -1940873 28384704 31095993 -4143499 -34771933 -19767541
4126a9767541N0606993M4527182J2852780j5943108l1129280l3296680k5994762
$$ -19767541 30839452 75366634 88219414 72276306 41147026 7850346 -18144416
4119a8144416j8258511j5339140p277763J4195921L2616652K4779285j760447
$$ -18144416 -36402927 -51742067 -59019830 -44823909 -12207257 12572028 10811581
4112A0811581j5769185o353449O927154R158293P511839R084724P852420Q63266
$$ 10811581 -4957604 -11311053 -4383899 4774394 12286233 21370957 29223377 30086643
4104C0086643n486931j0634736j9118684k2791636r743723P482314L637709j5125539
$$ 30086643 24599712 13964976 -5153708 -27945344 -37689067 -30206753 -26569044 -41694583
4096d1694583j4634752J0653199K4135915P492829o333954J1842849L6675164
$$ -41694583 -56329335 -45676136 -21540221 -14047392 -20381346 -8538497 28136667
4089B8136667K9092636j586558j8113274j6598690k2247419l5729246l0110410
$$ 28136667 57229303 55642745 37529471 20930781 -1316638 -37045884 -67156294
4082f7156294j000369K1562937J8968906Q305858J0345117K0550869K3811330
$$ -67156294 -68156663 -46593726 -27624820 -19318962 -8973845 11577024 35388354
4075C5388354J6527293K904807j3358212k4168764j9105383j355781J1230944
$$ 35388354 51915647 54820454 41462242 17293478 -1811905 -3167686 8063258
4068H063258Q779409J624252K851326R528953J0150628L397183O4626P377613
$$ 8063258 16842667 18466919 21318245 30847198 40997826 44395009 44459635 51837248
4060E1837248J6595223R854956j7477809m3787665m1050722j0930258J2416962
$$ 51837248 68432471 78287427 60809618 17021953 -24028769 -34959027 -22542065
4053b2542065M831362j6170799j7091131N385006K3450139J7676703k691738j8195111
$$ -22542065 -17710703 -33881502 -50972633 -45587627 -22137488 -4460785 -7152523 -25347634
4045b5347634j9958587r716194O432504K0203228K5832248K3701608J4739662
$$ -25347634 -45306221 -55022415 -48589911 -28386683 -2554435 21147173 35886835
4038C5886835k185406j9901314k1502446k929107J4215055R940249m435216m831009
$$ 35886835 33701429 13800115 -7702331 -10631438 3583617 13523866 9088650 4257641
4030D257641O700795P141913q459740k0226677j5243072r10641J3304229K1955203
$$ 4257641 10958436 18100349 9640609 -10586068 -25829140 -26739781 -13435552 8519651
4022H519651J2753949j9904080m8319227l3194146J8119587M9406039K8091591
$$ 8519651 21273600 1369520 -46949707 -80143853 -62024266 -12618227 15473364
4015A5473364j1912158k1518147j208149J3618398Q256790l627176j2956343k1466406
$$ 15473364 3561206 -17956941 -19165090 -5546692 2710098 -917078 -13873421 -35339827
4007c5339827k1132649J95574L0651411L9084964J5543033j3010451j6891834
$$ -35339827 -56472476 -56276902 -25625491 13459473 29002506 15992055 -899779
4000h99779M30275J0986198j142667k2237085k7537689j0863450J0241670J8982531
$$ -899779 -469504 10516694 9374027 -12863058 -40400747 -51264197 -41022527 -22039996
3992b2039996J9152122K1387324J9128502k177281l3823091m5706264k6280415
$$ -22039996 -2887874 18499450 37627952 35450671 1627580 -44078684 -70359099
3985g0359099J587015J5492038K1638786L1715537L3311568Q339478l1522829
$$ -70359099 -68772084 -53280046 -31641260 74277 33385845 41725323 10202494
3978A0202494n3002234m0235929o922288K4788419M0045561L2665549R914633
$$ 10202494 -42799740 -83035669 -89957957 -65169538 -25123977 7541572 17456205
3971A7456205p923305r159735o517446j5440963k5636208j5981315Q300615J8862915
$$ 17456205 9532900 373165 -6144281 -21585244 -47221452 -63202767 -54902152 -36039237
3963c6039237N047253j2063082j0776586N895927K1479305K5576810J6828407
$$ -36039237 -30991984 -43055066 -53831652 -47935725 -26456420 -879610 15948797
3956A5948797J025372r154624n049915N137520O325351j590954n887551k595832
$$ 15948797 16974169 7819545 2769630 7907150 14232501 12641547 6753996 4158164
3948D158164O27437L15621k869165j5343350l7533215m3870771q590249M5563699
$$ 4158164 4785601 5101222 2232057 -13111293 -50644508 -94515279 -103105528 -57541829
3940e7541829O1761419K4580484j6519079j9227312m871886j0847144k2981276
$$ -57541829 4219590 28800074 12280995 -6946317 -11818203 -22665347 -45646623
3933d5646623l706720L4243096L9340634L894347j9793139O81978K9302781J8466350
$$ -45646623 -49353343 -15110247 24230387 28124734 8331595 9013573 38316354 56782704
3925E6782704k2143773m5980599l4788784r487131R647417J9874524J8482230
$$ 56782704 34638931 -11341668 -46130452 -55617583 -45970166 -26095642 -7613412
3918g613412N69929k1388419k1387818O975299L8191727M4110389K2693465q056663
$$ -7613412 -7043483 -28431902 -49819720 -42844421 -4652694 39457695 62151160 54094497
3910E4094497l0883617l6765268k5392179q388065j750690n971347m102059J1374755
$$ 54094497 23210880 -13554388 -38946567 -47334632 -49085322 -55056669 -59158728 -47783973
3902d7783973K3009232J3427058o840230j5579007j3094247j6165698k2739675
$$ -47783973 -24774741 -11347683 -18187913 -33766920 -46861167 -63026865 -85766540
3895h5766540j1648207J7998364L6211779K4788118O047979Q707345K4066247
$$ -85766540 -97414747 -79416383 -43204604 -18416486 -12368507 -3661162 20405085
3888B0405085K1835744j455960j7890040j0214882P085248J4025629J1288844
$$ 20405085 42240829 40784869 22894829 12679947 19765195 33790824 45079668
3881D5079668R865406R723971K126153j3863892k8065775l0211617j8053903L182021
$$ 45079668 54945074 64669045 66795198 52931306 24865531 -5346086 -23399989 -20217968
3873b0217968K3519826L0991710J8078137r323284l0264717k3761725P770712
$$ -20217968 3301858 34293568 52371705 43048421 12783704 -10978021 -3207309
3866c207309L4599376K9898116K430281j4506925p505031K274572m134010j4029577
$$ -3207309 31392067 61290183 63720464 49213539 41708508 43983080 39849070 25819493
3858B5819493p783762N396022K110297j5224081k1524147r523166R69233k174655
$$ 25819493 18035731 23431753 25542050 10317969 -11206178 -20729344 -19760111 -21934766
3850b1934766n557497L615365J5424658J4184920K234934n281247N12747J5506273
$$ -21934766 -27492263 -23876898 -8452240 5732680 7967614 2686367 3199114 18705387
3842A8705387K5492984J3596518k1149152n0703201m2424444k560513K4895677
$$ 18705387 44198371 57794889 36645737 -14057464 -56481908 -59042421 -34146744
3835c4146744J2561151j7575019k9216087j8986180q762940p024676k598925J0200443
$$ -34146744 -21585593 -39160612 -68376699 -87362879 -96125819 -103150495 -105749420 -95548977
3827i5548977K2743932K7313444K4418069J5512079K070037q895155j0283819
$$ -95548977 -72805045 -45491601 -21073532 -5561453 -3491416 -12386571 -22670390
3820b2670390n379967l558171p232545j0847566r568827k007227J0522632K0493194
$$ -22670390 -28050357 -31608528 -38841073 -49688639 -59257466 -61264693 -50742061 -30248867
3812c0248867J7249243K013141q367321k242430J1067297J6634491J4271155J0153131
$$ -30248867 -12999624 -10986483 -19353804 -21596234 -10528937 6105554 20376709 30529840
3804C0529840j24860k1185407l8582022l1821788m704076J7243423K0055790J3612808
$$ 30529840 30404980 9219573 -29362449 -61184237 -65888313 -48644890 -28589100 -14976292
3796a4976292R132615L703246o226387j1840902l131085J4435840K2367275P438658
$$ -14976292 -5843677 -2140431 -8366818 -20207720 -23338805 -8902965 13464310 20902968
3788B0902968k2335208l9630941k3683029J0930036K4012711m58960k8691760
$$ 20902968 -1432240 -41063181 -64746210 -53816174 -29803463 -30262423 -58954183
3781e8954183k0017548J7276524L9160242K7545033P618322K700140M191698k982904
$$ -58954183 -78971731 -61695207 -22534965 5010068 12628390 15328530 19520228 16537324
3773A6537324j2693401j2022024l945543O23566j22466k374494n274942o334375
$$ 16537324 3843923 -8178101 -12123644 -11500078 -11622544 -13997038 -19271980 -25606355
3765b5606355l63806R485700J2816671R816627J1943824J9103257J5670603k317919
$$ -25606355 -25970161 -16484461 -3667790 6148837 18092661 37195918 52866521 50548602
3757E0548602j6689544j4191430k984786P807327J9581783K2900088l255195m9145524
$$ 50548602 33859058 19667628 16682842 24490169 44071952 66972040 63716845 14571321
3749A4571321o4842756k5835972K1682067K1847094j0276262j8743898K315369
$$ 14571321 -50271435 -76107407 -54425340 -32578246 -42854508 -61598406 -59283037
3742e9283037Q613432r665436j0699649J9237527L4191118N322753k7673237k1440082
$$ -59283037 -50669605 -60335041 -71034690 -51797163 -17606045 -12283292 -39956529 -61396611
3734f1396611K824030L397026r734168k287372J4649859N685558j4535034M113717
$$ -61396611 -58572581 -55175555 -64909723 -67197095 -52547236 -46861678 -61396712 -57282995
3726e7282995N8139407Q1756924M2405444j3746360l5768653l3691014l7205779
$$ -57282995 856412 82613336 125018780 111272420 75503767 41812753 4606974
3719D606974l7504285j5458239Q986197O514625p297745J103493K0086254J1537402
$$ 4606974 -32897311 -48355550 -39369353 -32854728 -40152473 -39048980 -18962726 -7425324
3711g425324j7188963j9510366J0394751K4799872M020369r418883J3500502L4416202
$$ -7425324 -24614287 -44124653 -33729902 -8930030 -4909661 -14328544 -828042 33588160
3703C3588160J2511988k2754741j8840913J2023234J4538704j6045504k7017950
$$ 33588160 46100148 23345407 4504494 16527728 31066432 15020928 -11997022
3696a1997022L609674L2905904K3312825m382552j3606875n839465j580180k27819
$$ -11997022 -8387348 24518556 47831381 43448829 29841954 24002489 22422309 22194490
3688B2194490P375991R676491q114744l1626876l3542539j3625808M617507J0942326
$$ 22194490 29570481 39246972 31132228 -494648 -34037187 -47662995 -43045488 -32103162
3680c2103162J5794789K3092127K0380701N65034k3440942l1192651j4015878
$$ -32103162 -16308373 6783754 27164455 27729489 4288547 -26904104 -40919982
3673d0919982J6988615L6829348K8064910K943150q162414J456759M056023j6211376
$$ -40919982 -23931367 12897981 40962891 43906041 35743627 37200386 41256409 25045033
3665B5045033l0595021q452471K7187019K7135420r378003l2388974j6600706
$$ 25045033 -5549988 -14002459 13184560 40319980 30941977 -1446997 -18047703
3658a8047703N938494L226504q343446O86272K1141094K1300845m562121l3281839
$$ -18047703 -12109209 -8882705 -17226151 -16539879 4601215 25902060 21339939 -11941900
3650a1941900m5860735l8508627j2757497J9967140L3636081J4207285j4109150
$$ -11941900 -57802635 -96311262 -109068759 -89101619 -55465538 -41258253 -55367403
3643e5367403j4206993J4696158L6926928K8932915M409853j1885374j2975589
$$ -55367403 -69574396 -54878238 -17951310 10981605 15391458 3506084 -9469505
3636i469505n565782L999987J0442796R460689M213420K005734J902459k547502
$$ -9469505 -15035287 -11035300 -592504 8868185 13081605 15087339 16989798 14442296
3628A4442296p805633l717741N251913J645625j5149517k1240280l449029J6216659
$$ 14442296 6636663 2918922 8170835 9816460 -5333057 -26573337 -30022366 -13805707
3620a3805707R982154j4944807k6657987j2779915P243297J2777399M927100m283858
$$ -13805707 -3823553 -18768360 -45426347 -58206262 -50962965 -38185566 -33258466 -37542324
3612c7542324q380773n861720K926422J0802552O984521o730839j3153562k043999
$$ -37542324 -45923097 -51784817 -48858395 -38055843 -31071322 -37802161 -50955723 -52999722
3604e2999722J4220463J8363474J2748261J1255705J3065676M864050j0462990
$$ -52999722 -38779259 -20415785 -7667524 3588181 16653857 21517907 11054917
3597A1054917j0747459R833387K3792495Q123289j7771946j8612444K335189Q982087
$$ 11054917 307458 10140845 33933340 42056629 24284683 5672239 8007428 16989515
3589A6989515p347103j1870587J5048221M0274658K7593745m413054j3382513
$$ 16989515 9642412 -2228175 12820046 53094704 80688449 76275395 62892882
3582F2892882k300059r600696l6668638l9152421k552749K4771472L583087l1620831
$$ 62892882 60592823 50992127 14323489 -24828932 -27381681 -2610209 972878 -30647953
3574c0647953k1755501K7241752N0553005J4765242l8980438n0640293j1613886
$$ -30647953 -52403454 -25161702 25391303 40156545 1176107 -49464186 -61078072
3567f1078072L4313399M4815728K1020760j052982M064538K0273551J4697091
$$ -61078072 -26764673 18051055 39071815 38018833 42083371 62356922 77054013
3560G7054013j0985395k0140366j47098J2123648j1334696l8214603k3200701
$$ 77054013 66068618 45928252 45781154 57904802 46570106 8355503 -14845198
3553a4845198J6964226K6832748j055378j9802453r370725m350786k5244806l9447195
$$ -14845198 2119028 28951776 27896398 8093945 -1276780 -5627566 -30872372 -70319567
3545g0319567j9843016O912336Q072874N07057J6307452M3484548M5333883J8144716
$$ -70319567 -90162583 -83250247 -75177373 -74670316 -58362864 -14878316 30455567 48600283
3537D8600283j0734850k5561670k6851943j2026122J1401951J2893421j9945439
$$ 48600283 37865433 12303763 -14548180 -26574302 -15172351 -2278930 -22224369
3530b2224369m6327981k4321613J9667044K6855669j119258p637034K2266543
$$ -22224369 -68552350 -92873963 -73206919 -46351250 -47470508 -55107542 -32840999
3523c2840999L8608453J4366629r231937M345981K5711645J3224991j6146464
$$ -32840999 5767454 20134083 10902146 15248127 40959772 54184763 38038299
3516C8038299j8016502O388760J6964537k93726j8106094j3941861K016641P225958
$$ 38038299 20021797 26410557 43375094 43081368 24975274 11033413 13050054 20276012
3508B0276012n879607k4304062k5953658k233047K5481637K5648656j875353k4015893
$$ 20276012 14396405 -9907657 -35861315 -38094362 -12612725 13035931 11160578 -12855315
3500a2855315k1019743q972152n345057k960368M934306O507915M78648Q796796
$$ -12855315 -33875058 -42847210 -48192267 -51152635 -46218329 -39710414 -39231766 -30434970
3492c0434970L2095477K9826842j6361602n4881598l0566973K8070166M6302060
$$ -30434970 1660507 31487349 15125747 -39755851 -70322824 -42252658 4049402
3485D049402J1731159j7028846n414942J7033693J9408362J1888611P031452p629536
$$ 4049402 15780561 -1248285 -6663227 10370466 29778828 41667439 48698891 41069355
3477D1069355l2055554l4531292j499888K9815455K1414439j1205582k6379199
$$ 41069355 9013801 -25517491 -27017379 2798076 24212515 13006933 -13372266
3470a3372266j4659829J703142R964901J5510057J8271460Q563156j3826560l3557650
$$ -13372266 -28032095 -26328953 -16364052 -853995 17417465 25980621 12154061 -21403589
3462b1403589l3695356r894882K3415503L9308437K3493491n063461j5048939
$$ -21403589 -55098945 -64993827 -41578324 -2269887 21223604 16160143 1111204
3455A111204m677868J5039r603084j1792562M006475J5751455O885934m550258
$$ 1111204 -3566664 -3551625 -13154709 -24947271 -20940796 -5189341 1696593 -2853665
3447b853665J745098J3352352Q730512o795676j5620433j7820273j8938913q497987
$$ -2853665 -1108567 12243785 20974297 14178621 -1441812 -19262085 -38200998 -46698985
3439d6698985J8046889L4538192J6705844j4498729j9546585m73234N418056j2068760
$$ -46698985 -28652096 5886096 22591940 8093211 -11453374 -11926608 -6508552 -18577312
3431a8577312k1770801m624545J7085124J7256796J952866q418377q978155n570235
$$ -18577312 -40348113 -44972658 -27887534 -10630738 -8677872 -17096249 -26074404 -31644639
3423c1644639J596347J2357556J6513660M573955j6755307k9450945k2258381
$$ -31644639 -30048292 -17690736 -1177076 3396879 -13358428 -42809373 -65067754
3416f5067754p07937J7849523J9778678R538932M759929J2775610K0604368J5681002
$$ -65067754 -65775691 -47926168 -28147490 -18608558 -13848629 -1073019 19531349 35212351
3408C5212351M692588l14035j714188n865393n813175M895788J2580658J668398
$$ 35212351 39904939 39590904 37876716 32011323 26198148 31093936 43674594 45342992
3400D5342992j6844953k1188377j4058038j2553962j1691020N533177K5817800
$$ 45342992 28498039 7309662 -6748376 -19302338 -30993358 -25460181 357619
3393C57619J6688771j4584344j9260714J8350052M8126570K4495890k6415613
$$ 357619 17046390 2462046 -16798668 1551384 49677954 74173844 47758231
3386D7758231m6506226k6451284n271115l621917j259581J7659971L4176591K3817919
$$ 47758231 1252005 -25199279 -30470394 -34092311 -35351892 -17691921 16484670 40302589
3378D0302589o166976k5834546j9682510j831658M818698m095848j3948061j5417426
$$ 40302589 34135613 8301067 -11381443 -13213101 -8394403 -12490251 -26438312 -41855738
3370d1855738j6958635k5113519k5585656l070747K7516139L5078653J7335485
$$ -41855738 -58814373 -83927892 -109513548 -112584295 -85068156 -49989503 -32654018
3363c2654018M285875J1487104J9010411Q565077p079365r380391l218057j39374
$$ -32654018 -28368143 -16881039 2129372 10694449 3615084 -5765307 -8983364 -9122738
3355i122738M419765J4124617J3709489n502486k0909044q924823J4808144J6401926
$$ -9122738 -4702973 9421644 23131133 17628647 -3280397 -12205220 2602924 19004850
3347A9004850n371143j9539941p924818J7720586L7536663L7323523R430470l2494158
$$ 19004850 13633707 -5906234 -13831052 3889534 41426197 78749720 88180190 55686032
3339E5686032m9659131k0870435J9462668K1424162r677947k3945728n017289
$$ 55686032 6026901 -14843534 4619134 26043296 16365349 -7580379 -12597668
3332a2597668J1049342K376039m393469J2629349K8801432J5624051j1045043
$$ -12597668 -1548326 827713 -3565756 9063593 37865025 53489076 42444033
3325D2444033k0510411j6495515j9810943k3836921p056858K2707513L4357592
$$ 42444033 21933622 5438107 -14372836 -38209757 -45266615 -22559102 11798490
3318A1798490J8687925m030636j7233541j9503722p985070J7336060L3789908
$$ 11798490 30486415 26455779 9222238 -10281484 -18266554 -930494 32859414
3311C2859414J4630037k6453572m1729713j2579846K2767485K2594244k215535
$$ 32859414 47489451 21035879 -20693834 -33273680 -10506195 12088049 9872514
3304I872514j0573178O874930J8744778L155677k1035944k3160176k310250J5968000
$$ 9872514 -700664 6174266 24919044 28074721 7038777 -16121399 -18431649 -2463649
3296b463649J5934118O921822K379411J247514j196494J151289J2770989J9492008
$$ -2463649 13470469 20392291 22771702 24019216 22822722 23974011 36745000 56237008
3288E6237008N372790j7435643k0723992l640777M552009o706492j0429360R019824
$$ 56237008 61609798 44174155 23450163 19809386 24361395 17654903 7225543 16245367
3280A6245367K1285270l537644m0296996m2423573j3183154M094868r95759M433741
$$ 16245367 37530637 33992993 -6304003 -48727576 -61910730 -57815862 -58811621 -54377880
3272e4377880K9905248L9639010J5860981o772183K62742J1159020m833723k3684128
$$ -54377880 -24472632 15166378 31027359 24255176 24517918 35676938 30843215 7159087
3264G159087n397875L2864761L7032383q82342l2523088k6923753o572603l85399
$$ 7159087 1761212 34625973 71658356 70776014 38252926 11329173 4756570 4371171
3256D371171l614114k126814j691435j0495401j7191769q519801P395911J3155483
$$ 4371171 757057 -1369757 -3061192 -13556593 -30748362 -39268163 -31872252 -18716769
3248a8716769N842554l947981o544535J625692J6668070K6291043K1734026J0721102
$$ -18716769 -12874215 -16822196 -23366731 -21741039 -5072969 21218074 42952100 53673202
3240E3673202L573444q134251l3969882n0604669k3207879L3149118N6422170
$$ 53673202 57246646 49112395 15142513 -35462156 -58670035 -25520917 30901253
3233C0901253K0584523k5343480k8373255k316812Q381686j142873q631504j7538420
$$ 30901253 51485776 26142296 -2230959 -4547771 3833915 2691042 -5940462 -23478882
3225b3478882m1159109n2370149j2001440N5549004P7078443L1806691j8128739
$$ -23478882 -64637991 -117008140 -129009580 -73460576 3617867 35424558 17295819
3218A7295819j8089866R040050J2651806q268579j6525675O86641J8914749J5920428
$$ 17295819 -794047 8246003 20897809 12629230 -3896445 -3209804 15704945 31625373
3210C1625373l486382j8767509j5455872m79198J030094k2512511m2741723k2396209
$$ 31625373 28138991 9371482 -6084390 -6563588 -5533494 -28046005 -70787728 -93183937
3202i3183937K5775727M6228212J7289302j7549619j4384386J3124094K7932492
$$ -93183937 -67408210 -21179998 -3890696 -21440315 -35824701 -22700607 5231885
3195E231885K5618356K0480514O652278k4121532m7685852l4793365J03099J8067350
$$ 5231885 30850241 51330755 57983033 33861501 -13824351 -48617716 -48514617 -30447267
3187c0447267J2712184Q456348J2128266Q862484J101594Q903737L0352425L9859659
$$ -30447267 -17735083 -9278735 2849531 11712015 12813609 21717346 52069771 91929430
3179I1929430K8156947R750682q323921k9171650m0269401k5909470n263307j3632131
$$ 91929430 120086377 129837059 121513138 92341488 52072087 26162617 20899310 7267179
3171G267179m2000288m2913463n776394K3908818J7172678L056214J2137302K5842964
$$ 7267179 -34733109 -77646572 -83422966 -59514148 -42341470 -39285256 -27147954 -1304990
3163a304990J6053887m247272p914545k63519j776618r761382j1559753j2021300
$$ -1304990 14748897 10501625 2587080 2323561 546943 -9214439 -20774192 -32795492
3155c2795492j4918128k030463L3949453N9996054M4741479Q275888r886773j1351965
$$ -32795492 -47713620 -49744083 -15794630 44201424 88942903 97218791 87332018 75980053
3147G5980053k2567261l6442853k2375858J3303914K8922104J0808855j1544143
$$ 75980053 53412792 16969939 -5405919 7897995 36820099 47628954 36084811
3140C6084811j7599002j8157353j8728704n509491J8309594K2582831n111075
$$ 36084811 18485809 328456 -18400248 -23909739 -5600145 16982686 11871611
3133A1871611l7289019m5289502l1158221q319985J8006303L6840646L0659730
$$ 11871611 -25417408 -70706910 -101865131 -110185116 -92178813 -55338167 -24678437
3126b4678437O647220j998874J4909218K5539357Q065197j1390987k969638J4447927
$$ -24678437 -18031217 -20030091 -5120873 20418484 28483681 17092694 14123056 28570983
3118B8570983L931923k6020486l1690911j175038K8683984K6581606N748897k343444
$$ 28570983 32502906 6482420 -25208491 -26383529 2300455 28882061 34630958 32287514
3110C2287514R222857K0442960J3792165n520385j7715963j3298504n522524j1339530
$$ 32287514 41510371 61953331 75745496 70225111 52509148 39210644 33688120 22348590
3102B2348590k3670628j9186293L890827J7952713O988713p672834j980395J1278627
$$ 22348590 -1322038 -20508331 -16617504 1335209 8323922 651088 -1329307 9949320
3094I949320N120895j3611270j2313232J4386710L2271643J5701590j6944378
$$ 9949320 15070215 1458945 -10854287 3532423 35804066 51505656 34561278
3087C4561278k8358797o659196K6744843M2989899L0063833j593322k9493725
$$ 34561278 6202481 -456715 26288128 69278027 99341860 97748538 68254813
3080F8254813l7249589k6459246j1405005m001297m813470m600361O382037K4573162
$$ 68254813 31005224 4545978 -6859027 -10860324 -15673794 -20274155 -13892118 10681044
3072A0681044K9932568R003316j9056011j9582928Q531510K5802702Q347077j6033757
$$ 10681044 40613612 49616928 30560917 10977989 19509499 45312201 53659278 37625521
3064C7625521j2425968N881531K004052k2511590l2929277k0869033j2964938
$$ 37625521 25199553 31081084 33085136 10573546 -22355731 -43224764 -56189702
3057e6189702j7481331q395603K3206853M3590898K5978397o870300j7327203
$$ -56189702 -73671033 -82066636 -58859783 -15268885 10709512 3839212 -13487991
3050a3487991n845267l47973r771320j7454490j2312281j051312Q254454J5047137
$$ -13487991 -19333258 -19681231 -29452551 -46907041 -59219322 -60270634 -52016180 -36969043
3042c6969043J8264128J3565867J004932j1313766j2009476M794769K9838557
$$ -36969043 -18704915 -5139048 -4134116 -15447882 -27457358 -22662589 7175968
3035G175968M0493752K3981340l017466j3774302q739801j1763200k8176280l4178872
$$ 7175968 47669720 71651060 68633594 54859292 46119491 34356291 6180011 -27998861
3027b7998861j6311006O536107J4275323J2187815R872136O51855j6947892k2685300
$$ -27998861 -44309867 -37773760 -23498437 -11310622 -1438486 -786631 -17734523 -40419823
3019d0419823m714298J5689012J5081380K486439k812265m667054j0864146n019646
$$ -40419823 -45134121 -29445109 -14363729 -11877290 -14689555 -19356609 -30220755 -35240401
3011c5240401K4083365M5475629K2795709k4591314m2835462j9132112Q425610
$$ -35240401 -11157036 34318593 57114302 32522988 -10312474 -29444586 -21018976
3004b1018976J2049743n3055j6893301l5613299l7679546m553238L6561737L4798201
$$ -21018976 -8969233 -9022288 -25915589 -61528888 -99208434 -103761672 -67199935 -32401734
2996c2401734n711850k4291042K428019K5071595Q643684o392954K3247494O1602693
$$ -32401734 -38113584 -62404626 -59976607 -34905012 -26261328 -32654282 -9406788 52195905
2988E2195905M4412305k0786474o6802097o0694938k9319432j830399J9537841
$$ 52195905 96608210 75821736 9019639 -51675299 -80994731 -82825130 -63287289
2981f3287289L3166112L0159277J7317128J1415372R942769L26476p332721N464941
$$ -63287289 -30121177 38100 17355228 28770600 38713369 39039845 31707124 37172065
2973C7172065K3957259J5692669j3132524k2888111o513497j244626k1251306
$$ 37172065 61129324 76821993 63689469 40801358 34287861 33043235 11791929
2966A1791929k8287067M801972M3628044L9430826l302719m0231844m6261131
$$ 11791929 -16495138 -11693166 31934878 71365704 68062985 27831141 -18429990
2959a8429990k9803367n788366J4104802J6069822k072565j8697087j3186461
$$ -18429990 -48233357 -54021723 -39916921 -23847099 -25919664 -44616751 -57803212
2952e7803212M932744J2823295R622889J0055178J1902929m51097k1871660k5681525
$$ -57803212 -52870468 -40047173 -30424284 -20369106 -8466177 -8917274 -30788934 -56470459
2944e6470459l295699K0066735J9908214L807007m012557M359305J6131537J8428405
$$ -56470459 -59766158 -39699423 -19791209 -15984202 -19996759 -15637454 494083 18922488
2936A8922488J1810684N930430Q232515J5528352J5372842N12134j7746252j9330690
$$ 18922488 30733172 36663602 44896117 60424469 75797311 76309445 58563193 39232503
2928C9232503k076129J1400934J856879j9427606k4438533o747137Q925273K51801
$$ 39232503 37156374 48557308 50414187 30986581 6548048 -199089 8726184 8977985
2920H977985k2488052l0809014j4776947R082082K4052545L0701596L3973633
$$ 8977985 -13510067 -44319081 -59096028 -50013946 -25961401 4740195 38713828
2913C8713828K9190626J2464045o033317j3489958j3000490j6663061k3870740
$$ 38713828 67904454 80368499 74335182 60845224 47844734 31181673 7310933
2906G310933k1302065m661322J2703411J5541019J878739j8143739l0126806k3593797
$$ 7310933 -13991132 -18652454 -5949043 9591976 11470715 -6673024 -36799830 -60393627
2898f0393627k269807J5477921J6292095P776022L141500j626213j5305096k3214995
$$ -60393627 -62663434 -47185513 -30893418 -23117396 -19975896 -21602109 -36907205 -60122200
2890f0122200j392886L8303721N0592505J8216741j9565704k1671837r14956M942679
$$ -60122200 -61515086 -23211365 27381140 45597881 26032177 4360340 3445384 8388063
2882H388063m408703J568617K4521256K8080559l905351l7310996l4516005m562020
$$ 8388063 3979360 5547977 30069233 58149792 54244441 16933445 -17582560 -22144580
2874b2144580J6113710J4651782Q023901Q442839R651717P574803R582348J4672967
$$ -22144580 -6030870 8620912 16644813 25087652 34739369 42314172 51896520 66569487
2866F6569487N465934k3614687m4799615k6900270J7589026M0598229J9542574
$$ 66569487 72035421 48420734 3621119 -23279151 -5690125 34908104 54450678
2859E4450678j3161424j5832614P227852J8471153K215186j9909844k4989579
$$ 54450678 41289254 25456640 32684492 51155645 53370831 33460987 8471408
2852H471408j4357631l01657J0405871J4169680J0397940Q218106J5944625K2311108
$$ 8471408 -5886223 -6187880 4217991 18387671 28785611 37003717 52948342 75259450
2844G5259450R529412j3118647j5426929P619353K5040672J6328545j911952j1425096
$$ 75259450 84788862 71670215 56243286 63862639 88903311 105231856 103319904 91894808
2836I1894808k1132884l6982968l6342151o287827K0079761O234040k8528523
$$ 91894808 70761924 33778956 -2563195 -8851022 11228739 17462779 -11065744
2829a1065744l5770331j0172721J0924667J2473682J6278375K8771784K4846313
$$ -11065744 -46836075 -57008796 -46084129 -33610447 -17332072 11439712 36286025
2822C6286025k556941k1372658r582687J1629132J6517606J3224941J7598110
$$ 36286025 33729084 12356426 2773739 14402871 30920477 44145418 61743528
2815F1743528J8150160j548473k6879139l0808990j4921517k299994O68411O139144
$$ 61743528 79893688 78345215 51466076 20657086 5735569 3435575 4103986 10243130
2807A0243130J3720234P182354j4258899k5544196o899663K8115592M5134331
$$ 10243130 23963364 31145718 16886819 -8657377 -15557040 12558552 57692883
2800E7692883K4999861j5910871l9853014k4950557R939633K4940887P100382
$$ 57692883 82692744 66781873 26928859 1978302 11917935 36858822 43959204
2793D3959204j4029237q300020J2337015J2899367j1239389k6753321j2210983
$$ 43959204 29929967 21629947 33966962 46866329 35626940 8873619 -3337364
2786c337364R941707P343025j3754691j8160752M973886K4810898J3501636j3102033
$$ -3337364 6604343 13947368 192677 -17968075 -12994189 11816709 25318345 12216312
2778A2216312j8615144K051088J8600895J1351896l949452m819835O485702J3639603
$$ 12216312 -6398832 -4347744 14253151 25605047 21655595 16835760 23321462 36961065
2770C6961065J1082804K865337q773584j7735774j1206175R817478K1328788P786660
$$ 36961065 48043869 50909206 42135622 24399848 13193673 23011151 44339939 52126599
2762E2126599j1646842j1888571k097240p583749k3926115k4549047p396309M461364
$$ 52126599 40479757 28591186 26493946 18910197 -5015918 -29564965 -36961274 -32499910
2754c2499910P410343K1327930M4037117M4326630J3869395j3413141j2561179
$$ -32499910 -25089567 -3761637 40275480 84602110 98471505 85058364 72497185
2747G2497185k309505o980637j7328763j5103673o868543n039173p89137J4936649
$$ 72497185 70187680 63207043 45878280 30774607 23906064 18866891 18077754 33014403
2739C3014403K5611730J4008896n957242j0955534m694085m724918r424252o870448
$$ 33014403 58626133 72635029 66677787 55722253 51028168 46303250 36878998 30008550
2731C0008550j640945l803775m795210O788737J7722634P274680j8785740l7452209
$$ 30008550 28367605 24563830 19768620 26557357 44279991 51554671 32768931 -4683278
2723d683278l9526900k7060031K072818L7597556M5446292J0042786k9806020
$$ -4683278 -44210178 -71270209 -69197391 -31599835 13846457 23889243 -5916777
2716e916777k8901700l309192j727225k1966859j4722377K8697184N4143125K7239374
$$ -5916777 -34818477 -38127669 -39854894 -61821753 -76544130 -47846946 6296179 33535553
2708C3535553j5500650k4789393m629336R800778O350124k825247r317106j0453981
$$ 33535553 18034903 -6754490 -11383826 -1583048 4767076 1941829 -7375277 -17829258
2700a7829258j874471J0796074J0401876n342375j5434506p777093K604603K254400
$$ -17829258 -19703729 -8907655 1494221 -3848154 -19282660 -27059753 -24455150 -22200750
2692b2200750J236537Q535010J0527561m386762k1389562k1401643q564453M028060
$$ -22200750 -20964213 -12429203 -1901642 -6288404 -27677966 -49079609 -57644062 -53616002
2684e3616002J5542342K4530953J7630833n686911j9266732o599110J0619450
$$ -53616002 -38073660 -13542707 4088126 -1598785 -20865517 -27464627 -16845177
2677a6845177P365295m330296j987964L309995j0295265k6402046j1148232K5081149
$$ -16845177 -9479882 -13810178 -15798142 -12488147 -22783412 -49185458 -60333690 -35252541
2669c5252541L5895197J0285546j2465634q710177l706218j9302161l2040560
$$ -35252541 642656 10928202 -1537432 -10247609 -13953827 -33255988 -65296548
2662f5296548j4593471J4452734J9759612O380438Q136562K9837757M0751803
$$ -65296548 -79890019 -65437285 -45677673 -39297235 -31160673 -1322916 39428887
2655C9428887K5682401N626217k067618j0944461l3037117m5500215k0055315
$$ 39428887 65111288 70737505 68669887 57725426 24688309 -20811906 -40867221
2648d0867221K6553137M5026557J8086443j7446146k3646439r158194l956231
$$ -40867221 -14314084 30712473 48798916 31352770 7706331 -1451863 -5408094
2641e408094r262128l333429J3927407J7140224j744389j8252852j3207423M88493
$$ -5408094 -14670222 -18003651 -4076244 13063980 11319591 -6933261 -20140684 -19652191
2633a9652191L388261k33408L991673J3079130J2993598K978111l497279L043516
$$ -19652191 -16263930 -16497338 -12505665 573465 13567063 16545174 13047895 16091411
2625A6091411J9946749L5965697L5865819J2632659j7573396k7288516j3344724
$$ 16091411 36038160 72003857 107869676 120502335 102928939 75640423 62295699
2618F2295699k446893r712028j4738026J221504J7420648K888051l1697487m5017955
$$ 62295699 59848806 50136778 35398752 36620256 54040904 56928955 25231468 -19786487
2610a9786487k1970276J0966608K4965728J6217843l955717j9890587j4487550
$$ -19786487 -41756763 -30790155 -5824427 10393416 6437699 -13452888 -27940438
2603b7940438J1847085K7838310O309614l0046994l2522876K709980K7263085
$$ -27940438 -16093353 11744957 18054571 -11992423 -44515299 -41805319 -14542234
2596a4542234J2877252j1232402j2093485k570495p007816j2301522O586910L4958983
$$ -14542234 -1664982 -12897384 -24990869 -27561364 -34569180 -46870702 -40283792 -5324809
2588e324809L5426199O566887j5238242j0646197J184838p94453j2283023k0270773
$$ -5324809 30101390 36668277 21430035 10783838 11968676 11174223 -1108800 -21379573
2580b1379573k1486052j5721200j827613J1884291J2318906L387318L868320J6687200
$$ -21379573 -42865625 -58586825 -60414438 -48530147 -36211241 -32823923 -28955603 -12268403
2572a2268403K1634872Q798673l196133J827545Q906971l830029k7242678l3012124
$$ -12268403 9366469 18165142 14969009 16796554 25703525 21873496 -5369182 -38381306
2564c8381306j5444398L991651J0787827J0691320P871067l688604j9073995j7430938
$$ -38381306 -53825704 -49834053 -39046226 -28354906 -20483839 -24172443 -43246438 -60677376
2556f0677376P210011K9631281K6175400Q830222N638250J7548534J9183133K292
$$ -60677376 -53467365 -23836084 2339316 11169538 16807788 34356322 53539455 53541747
2548E3541747j9065291j5487972O141211K3296548K1504628M238910j4226381
$$ 53541747 34476456 18988484 25129695 48426243 69930871 74169781 59943400
2541E9943400k0404958j2674531l240751k699528m370467N075018K0926859K2130003
$$ 59943400 39538442 26863911 23623160 20923632 16553165 21628183 42555042 64685045
2533F4685045J165172k2825523k7228708j0101485J3814732K8491026K4007417
$$ 64685045 65850217 43024694 15795986 5694501 19509233 48000259 72007676
2526G2007676L252667j4684230j4285962q686445k1111072l7707457j5956768
$$ 72007676 75260343 60576113 46290151 37603706 16492634 -21214823 -37171591
2519c7171591M0806428N9188736j1131948j08428124j20385138k8025519O9275703
$$ -37171591 3634837 62823573 51691625 -56736499 -177121637 -205147156 -135871453
2512a35871453Q2869436L4777624K239017Q837779J5660112l617065k8373368
$$ -135871453 -53002017 -18224393 -15985376 -7147597 8512515 4895450 -23477918
2505b3477918l1562965j6749393k399104P098892J8445162K9105579K6234477
$$ -23477918 -55040883 -71790276 -74189380 -67090488 -48645326 -19539747 6694730
2498F694730N912158j6632869k1926985q363492P167975J1053651P145921N405947
$$ 6694730 12606888 -4025981 -25952966 -34316458 -27148483 -16094832 -8948911 -3542964
2490c542964O322146N700276O143540J0851678J2716469M663428m631034k785500
$$ -3542964 2779182 8479458 14622998 25474676 38191145 42854573 38223539 35438039
2482C5438039K994909m298673j9984284k0405698r55464J3545962N474582j1696284
$$ 35438039 38432948 34134275 14149991 -6255707 -7211171 6334791 11809373 113089
2474A13089j8187104j4981290j1263111m901023O532944J2393340O237184K133410
$$ 113089 -18074015 -33055305 -44318416 -49219439 -42686495 -30293155 -24055971 -21922561
2466b1922561J3478284K8010062K5175379P732984o333454j4341280k6397716
$$ -21922561 -8444277 19565785 44741164 52474148 46140694 31799414 5401698
2459E401698l7439581k8354412K855593L3108897M2038427L0539175R174583j3789745
$$ 5401698 -32037883 -60392295 -57536702 -24427805 17610622 48149797 57324380 43534635
2451D3534635k8434018k4952975p542812N890602M586133m189791q713385o455459
$$ 43534635 15100617 -9852358 -17395170 -11504568 -6918435 -11108226 -19821611 -26277070
2443b6277070n79649O027258Q610967K557338p595166j0037243j101430R030634
$$ -26277070 -26856719 -20829461 -12218494 -9661156 -17256322 -27293565 -28394995 -19364361
2435a9364361R775845K152326n499694p018137j585018O618515J1533802J3138816
$$ -19364361 -9588516 -7436190 -12935884 -19954021 -21539039 -14920524 -3386722 9752094
2427I752094J8534327K7600874K5229404J997736k4292151k7781091j1964777
$$ 9752094 28286421 55887295 81116699 83114435 58822284 31041193 19076416
2420A9076416m181341j2425485j5825958m608219K104211n785886m849018K1981859
$$ 19076416 14895075 2469590 -13356368 -17964587 -15860376 -21646262 -26495280 -4513421
2412d513421M6266404K9477644j7423941m6564177l8840750k0547869j4081937
$$ -4513421 41752983 71230627 53806686 7242509 -31598241 -52146110 -66228047
2405f6228047r121599O705966K0638334J6773789L547081O64768J2185849K6308913
$$ -66228047 -75349646 -68643680 -48005346 -31231557 -27684476 -27019708 -14833859 11475054
2397A1475054L0640675J8285208q300923l1381699l0711590j0432366L309142
$$ 11475054 42115729 60400937 52100014 20718315 -9993275 -20425641 -17116499
2390a7116499n46816m379787L548032P096640n346746j2607123N472063K6788699
$$ -17116499 -17663315 -22043102 -18495070 -11398430 -16745176 -29352299 -23880236 2908463
2382B908463J6662601j3495988j8207446J3309489M0304112K9275895n360147
$$ 2908463 19571064 6075076 -12132370 1177119 41481231 70757126 65396979
2375F5396979l0530324l3921669k1004508O368J5332981J1096629m839572p872201
$$ 65396979 34866655 944986 -20059522 -20053154 -4720173 6376456 1536884 -6335317
2367f335317O682296J7116182J4836610J8083200L0824296K5116192r253882l3647373
$$ -6335317 346979 17463161 32299771 50382971 81207267 106323459 97069577 63422204
2359F3422204j6045199J3024040N547309k6235142l0757016l763883N350569k2109922
$$ 63422204 47377005 60401045 65948354 39713212 8956196 5192313 10542882 -11567040
2351a1567040m1635311j8179913J7529159J8626433o336869j0829232J8199190
$$ -11567040 -53202351 -71382264 -53853105 -35226672 -41563541 -52392773 -34193583
2344c4193583M4302383L5425766M565004j2678778m343173Q601084O152060k338090
$$ -34193583 10108800 45534566 50099570 37420792 33077619 41678703 47830763 45492673
2336D5492673M247987K0154061J5274927j7210694m2096601l0140109j111314
$$ 45492673 49740660 69894721 85169648 67958954 25862353 -4277756 -5389070
2329e389070Q920309K646288P423243K1200557J6558689o763262j9341357j3903560
$$ -5389070 3531239 6177527 13600770 34801327 51360016 44596754 25255397 11351837
2321A1351837j3633385k2024751j2891486J5272249K3750503m160070k9748836
$$ 11351837 -2281548 -24306299 -37197785 -21925536 1824967 -2335103 -32083939
2314c2083939j6975151J4891350K8348479K2130088J4990996P539754l925172
$$ -32083939 -49059090 -34167740 -5819261 16310827 31301823 38841577 34916405
2307C4916405m863784R494771J1567471j4957978l6852091j9089802J5238101
$$ 34916405 30052621 39547392 51114863 36156885 -695206 -19785008 -4546907
2300d546907K0114790m87582o715529O759182R882879k258993m375470N066252
$$ -4546907 15567883 15080301 8364772 15123954 25006833 22747840 18372370 23438622
2292B3438622k36742j9580418j8901520R655978K9808365J7572030p189251k1054340
$$ 23438622 23201880 3621462 -15280058 -5624080 24184285 41756315 34567064 13512724
2284A3512724k8429701l5569943l1133272j2123637L443881P161399J2909619
$$ 13512724 -14916977 -50486920 -81620192 -93743829 -90299948 -83138549 -70228930
2277g0228930K4723045K4901736R516296J901475J3126399K1753488J1095712
$$ -70228930 -45505885 -20604149 -11087853 -9186378 3940021 25693509 36789221
2270C6789221n656997j4735329k1538010k3334294j645756L5009047M2479369
$$ 36789221 31132224 16396895 -5141115 -28475409 -30121165 4887882 47367251
2263D7367251N395954l0338876k5184188n600021j2546076k9202687j4978077
$$ 47367251 52763205 22424329 -2759859 -8359880 -20905956 -50108643 -65086720
2256f5086720J8156564K5315492O684190K428799J7817703J7072024o452730j6068767
$$ -65086720 -46930156 -21614664 -14930474 -12501675 5316028 22388052 15935322 -133445
2248a33445J122464J0558119p811983k5860700j9025888n182577n434418q501660
$$ -133445 989019 11547138 3735155 -22125545 -41151433 -46334010 -51768428 -60270088
2240f0270088k681511k828314j3592155n397442L4546286O3593951M1388526m163866
$$ -60270088 -62951599 -65779913 -79372068 -84769510 -50223224 13370727 54759253 50595387
2232E0595387j9410812q305206j4516672l6471982k8048621J5166573L9032448
$$ 50595387 31184575 22879369 8362697 -28109285 -56157906 -40991333 -1958885
2225a958885J7597539o866107l7202P736267j5283798l4160652k727267M8001564
$$ -1958885 15638654 8772547 8735345 16471612 1187814 -32972838 -35700105 12301459
2217A2301459M6533246q542890m4754232k5279036M614572r20991k1135587j6600069
$$ 12301459 58834705 50291815 5537583 -19741453 -15126881 -16047872 -37183459 -53783528
2209e3783528M322305J0184896L611338P418128J4938929L98612l0608493m2819040
$$ -53783528 -49461223 -39276327 -35664989 -28246861 -13307932 -12909320 -43517813 -86336853
2201h6336853k2549500O937644K2760339K5903439K5259875K3945650K3853672
$$ -86336853 -108886353 -101948709 -79188370 -53284931 -28025056 -4079406 19774266
2194A9774266K2365566O826707k4816212m4230183k3568222J7437678L0293613
$$ 19774266 42139832 48966539 24150327 -20079856 -43648078 -26210400 4083213
2187D083213N423032j6649935r141289O213746M057859m296987n63840M360792
$$ 4083213 9506245 -7143690 -16284979 -10071233 -6013374 -10310361 -10874201 -6513409
2179f513409m921331j4149317l642497J3846737J4089934L875784O293377J5761600
$$ -6513409 -11434740 -25584057 -29226554 -15379817 -1289883 2585901 8879278 24640878
2171B4640878P373382j4041724j5893815O787133J8187686j840112k3616697j3413785
$$ 24640878 32014260 17972536 2078721 8865854 27053540 25213428 1596731 -11817054
2163a1817054J3777784J8331621k169729j0092181J2548427L3118679J3415464
$$ -11817054 1960730 20292351 18122622 8030441 20578868 53697547 67113011
2156F7113011l3448484n5711260k9332132J1551343J9591219p900654l3023731
$$ 67113011 33664527 -22046733 -51378865 -39827522 -20236303 -28136957 -61160688
2149f1160688k8803883m799450J6532786K5580307K1571460M456079j5736211
$$ -61160688 -89964571 -94764021 -78231235 -52650928 -31079468 -26623389 -42359600
2142d2359600j7353818P935188L7246838L8996299R303353k5406684l8142517
$$ -42359600 -59713418 -51778230 -14531392 24464907 33768260 8361576 -29780941
2135b9780941k4094139J621929J8788282J7071482L770269n026954l721161j399035
$$ -29780941 -53875080 -52253151 -33464869 -16393387 -12623118 -17650072 -21371233 -22770268
2127b2770268m555091o796017j790889N464449Q917176J1391644J4615008J1768491
$$ -22770268 -27325359 -34121376 -35912265 -30447816 -21530640 -10138996 4476012 16244503
2119A6244503J787441j775392R147599K0374070J6183366N552962O740433J4275591
$$ 16244503 18031944 16256552 25404151 45778221 61961587 67514549 74254982 88530573
2111H8530573O140085j8884071l6335852l1506392j6754841p174665p72903O570685
$$ 88530573 94670658 75786587 39450735 7944343 -8810498 -15985163 -16758066 -10187381
2103a0187381O343555n897961j3302915K077987K7483826K9044669l043619l6361585
$$ -10187381 -3843826 -9741787 -23044702 -20966715 6517111 35561780 32518161 -3843424
2095c843424l4633744l467228J8529334J1573238j468998Q967805L5438860M2927699
$$ -3843424 -38477168 -41944396 -23415062 -11841824 -13310822 -4343017 31095843 74023542
2087G4023542J5465405k4319846m2344770k6366522P635229K9853541J9073845
$$ 74023542 89488947 65169101 22824331 -3542191 4093038 33946579 53020424
2080E3020424j5138968l4647356j3224508K7771494M3651766K3538524j853082
$$ 53020424 37881456 3234100 -9990408 17781086 61432852 84971376 83118294
2073H3118294r494616r506540j3752552j3245813m262026n867757k7429904m4501780
$$ 83118294 73623678 64117138 50364586 37118773 32856747 26988990 -440914 -44942694
2065d4942694l3786244j0078260n3369P33770J2800950L0612792L0474321J1923041
$$ -44942694 -78728938 -88807198 -88860567 -88126797 -75325847 -44713055 -14238734 -2315693
2057b315693k048079k390943j342970l672756Q33685J3753952K1408179J6261844
$$ -2315693 -4363772 -6754715 -8097685 -11770441 -10936756 2817196 24225375 40487219
2049D0487219O073548j098344n549060q836778j0861566j2759481j3443740r088327
$$ 40487219 46560767 45462423 39913363 31076585 20215019 7455538 -5988202 -15076529
2041a5076529l203252m800290q566335L651965K9396254L8327207J6437045j0158089
$$ -15076529 -18279781 -23080071 -31646406 -27994441 1401813 39729020 56166065 46007976
2033D6007976j8676712k4319003l9355550l3879019J4853777O3765814N4160430
$$ 46007976 27331264 3012261 -36343289 -70222308 -55368531 8397283 62557713
2026F2557713K665094k1682785k583388R087408j1581994k6267710p444936J4021543
$$ 62557713 65222807 43540022 40956634 50044042 38462048 12194338 4749402 18770945
2018A8770945N215391j6215681j8950719p023218l92073P05129M111040N888936
$$ 18770945 23986336 7770655 -11180064 -18203282 -18595355 -17890226 -13779186 -7890250
2010g890250L938279N631246P004045n792275k2735685j4092368J8189168L3819309
$$ -7890250 -3951971 1679275 8683320 2891045 -19844640 -33937008 -15747840 18071469
2002A8071469J5428527o950533j1758823j7763224l4169198l0749337N413454
$$ 18071469 33499996 26549463 14790640 -2972584 -37141782 -67891119 -62477665
1995f2477665L2117455J6073175q661832K902722L0405894K5793400l616047j2661696
$$ -62477665 -30360210 -14287035 -22948867 -20046145 10359749 36153149 32537102 19875406
1987A9875406J331994O26076j9210411k0865207O097938K4373274Q585630j9766340
$$ 19875406 21207400 21833476 2623065 -18242142 -12144204 12229070 20814700 1048360
1979A048360l0995746k3442270p715879J2596027K9988705K9145927Q339904j3575630
$$ 1048360 -29947386 -53389656 -61105535 -48509508 -18520803 10625124 18965028 5389398
1971E389398k0649949j5562545q059808k383976J436098N624394J2821544J7384068
$$ 5389398 -15260551 -30823096 -38882904 -41266880 -39830782 -34206388 -21384844 -4000776
1963d000776P070675j5450022k6418161j1800976J1162091K1156295K2461714
$$ -4000776 3069899 -12380123 -38798284 -50599260 -39437169 -18280874 4180840
1956D180840K4433654J3689066j9770018m6442879k8757588J8589327M0861501
$$ 4180840 28614494 42303560 22533542 -23909337 -52666925 -34077598 6783903
1949F783903J6872751j6777492k0820640J56563J6131661J0653102r277668k4832937
$$ 6783903 23656654 6879162 -13941478 -13784915 2346746 12999848 3722180 -21110757
1941b1110757k1025889k907754O518621k862441j0002136O688088L4191199M4308555
$$ -21110757 -42136646 -45044400 -38525779 -41388220 -51390356 -44702268 -10511069 33797486
1933C3797486L4261921J9716673J806475k4539696m1326373k6303354M840626
$$ 33797486 68059407 87776080 89582555 65042859 23716486 -2586868 2253758
1926B253758J5052720J691133m763452M027179M575933r391664j3923527r68140
$$ 2253758 17306478 18997611 14234159 18261338 22837271 13445607 -477920 -1446060
1918a446060N721316n165211j2853524n230143m8318o535184l729098J9886528
$$ -1446060 4275256 -889955 -13743479 -18973622 -19021940 -25557124 -29286222 -9399694
1910i399694L9331592L1082660Q742228l743362p321269j2129693j2756676m336701
$$ -9399694 29931898 61014558 69756786 66013424 58692155 46562462 33805786 29469085
1902B9469085O72801l607366J53384J9809136K9771251J0028887j4057077o956878
$$ 29469085 30141886 26534520 26687904 46497040 76268291 86297178 72240101 65283223
1894F5283223J8896880J9629543j3058735m0110326l2417763o801994M299498
$$ 65283223 84180103 103809646 90750911 50640585 18222822 11420828 15720326
1887A5720326n649800j8203809j6958654k774362J0820821J2062622M137580K719842
$$ 15720326 10070526 -8133283 -25091937 -27866299 -17045478 -4982856 -845276 1874566
1879A874566J5692548L0053817K7053803O644688j2118915j3323363P38249J5701193
$$ 1874566 17567114 47620931 74674734 81319422 69200507 55877144 56615393 72316586
1871G2316586K0008380J3409220M076794k098042p858457j6623299k1191242r900843
$$ 72316586 92324966 105734186 109810980 107712938 99854481 83231182 62039940 52139097
1863E2139097J4405185L1384718K4633414J64935k1305559k6450377j9504201
$$ 52139097 66544282 97929000 122562414 122727349 101421790 74971413 55467212
1856E5467212j2385029q941869l253269M540161p83859k8412445n4557177m0311146
$$ 55467212 43082183 34140314 30887045 35427206 34643347 6230902 -48326275 -88637421
1848h8637421J4927710O1747634N9208513K3491997k852593p810934p287852n774739
$$ -88637421 -73709711 -11962077 47246436 70738433 67885840 60074906 52787054 47012315
1840D7012315K783668O630193j0805358l3488317k7764860M341267K4591283J4971572
$$ 47012315 49795983 56426176 45620818 12132501 -15632359 -11291092 13300191 28271763
1832B8271763k323120p297938p276445r765736n833900O046377J0915962M726755
$$ 28271763 25948643 18650705 11374260 1608524 -4225376 1821001 12736963 17463718
1824A7463718J587256L887435k902384j5591869r545741J5425249K2613357o207034
$$ 17463718 19050974 22938409 20036025 4444156 -5101585 10323664 32937021 26729987
1816B6729987l6187041k6812508J2295966L9475603L4526344J0403452j1820696
$$ 26729987 -9457054 -36269562 -23973596 15502007 50028351 60431803 48611107
1809D8611107j8989922r822342K472936L147495k821580K57143Q082865J642953
$$ 48611107 29621185 19798843 22271779 25419274 22597694 22854837 30937702 32580655
1801C2580655j4441672j2656349J0597036K4578952J1889891r158540k1469182
$$ 32580655 18138983 5482634 16079670 40658622 52548513 43389973 21920791
1794B1920791k9697674l0665442o800431L1773677M3178697J6109695p206564
$$ 21920791 -7776883 -38442325 -45242756 -13469079 29709618 45819313 38612749
1787C8612749K988694J9807146J2406693k953431j952605J008480j2637815k3357364
$$ 38612749 41601443 61408589 73815282 70861851 68909246 69917726 57279911 33922547
1779C3922547r874560Q254909Q152664O513317J8884149J6263047k2956795n5751362
$$ 33922547 24047987 32302896 40455560 46968877 65853026 82116073 59159278 3407916
1771C407916l3416098J2406641J2982270k8198064m2786888o662971L0175487
$$ 3407916 -30008182 -17601541 -4619271 -32817335 -75604223 -82267194 -52091707
1764e2091707K7990276P775997L367179J4631412K4498221K3618753P599060j7977338
$$ -52091707 -24101431 -16325434 -12958255 1673157 26171378 49790131 57389191 39411853
1756C9411853k7577272l656597K7726610K4478120j1759595l9846131l8817654
$$ 39411853 11834581 8177984 35904594 60382714 48623119 8776988 -30040666
1749c0040666k4622348j0487306Q133159K6673759K7555865R631097p717384j2452497
$$ -30040666 -54663014 -65150320 -57017161 -30343402 -2787537 6843560 -873824 -13326321
1741a3326321p857961K789684J5268147J6860467L994733n134621J310121P467841
$$ -13326321 -21184282 -18394598 -3126451 13734016 17728749 12594128 13904249 21372090
1733B1372090J323878L27705J4845194J8723581n276426k5810585j3932992L508563
$$ 21372090 22695968 23023673 37868867 56592448 51316022 25505437 11572445 15081008
1725A5081008o081320j7306262M225482K8330975R708815k3720981j5719247J3610540
$$ 15081008 8999688 -8306574 -4081092 24249883 33958698 10237717 -5481530 8129010
1717H129010J551206l7997687l0977213K5691610N3227197K1513667q786008L731266
$$ 8129010 9680216 -28317471 -59294684 -33603074 19624123 41137790 32351782 36083048
1709C6083048K0538478K779794k7306176l6345408k6699319j0307806Q129805
$$ 36083048 56621526 59401320 32095144 -4250264 -30949583 -41257389 -33127584
1702c3127584J2927930k088682k353654L5268392O2803754L2555066q402014K999613
$$ -33127584 -20199654 -22288336 -24641990 10626402 73430156 105985222 97583208 100582821
1694A00582821J8415800l6110474r3607886m1055430N2697469K5548378o5125512
$$ 100582821 118998621 82888147 -10719739 -51775169 922300 26470678 -38654834
1687c8654834P841014K19462311K30580097r2746855l90034029k87582472O1625618
$$ -38654834 -30813820 188648491 419228588 326481733 -63552296 -351134768 -289509150
1680b89509150K23526262J03193914k2513653k344639K3382121l9307918p1534536
$$ -289509150 -65982888 37211026 14697373 12352734 35734855 -3573063 -75107599
1673g5107599J976268O3444359K3786001k5014430L401668L7953066M870588k9986434
$$ -75107599 -73131331 -9686972 14099029 -10915401 -7513733 30439333 35309921 5323487
1665E323487J856094L4632777l728333m9022934j5803170M7120786M4657398m832885
$$ 5323487 7179581 41812358 38084025 -10938909 -26742079 20378707 65036105 60203220
1657F0203220k1879179q551133j8226966l8474275k0721264J4246819Q720623
$$ 60203220 38324041 29772908 11545942 -26928333 -47649597 -33402778 -24682155
1650b4682155k4974487k8738709l722712K583442p243775J0605084M7761395M7036534
$$ -24682155 -49656642 -78395351 -82118063 -79534621 -86778396 -76173312 -28411917 18624617
1642A8624617m58410l7654549k7751250M384158K3439297K3164262R367911j1244826
$$ 18624617 18166207 -19488342 -47239592 -42855434 -19416137 3748125 13116036 1871210
1634A871210k1142649p571086J2508362J3389169j339508j0238418r371453o487587
$$ 1871210 -19271439 -26842525 -14334163 -944994 -2284502 -12522920 -21894373 -28381960
1626b8381960K195649J7802495K1467361L977059r767376l14379Q606992q533914
$$ -28381960 -26186311 -8383816 13083545 17060604 7293228 6978849 15585841 7051927
1618G051927k8016601j5031265J1266521N402602k7488173l8596952j2209702
$$ 7051927 -20964674 -35995939 -24729418 -19326816 -46814989 -85411941 -97621643
1611i7621643J7801786K6581757K3320927J5595688l591380k5625969k5300946
$$ -97621643 -79819857 -53238100 -29917173 -14321485 -17912865 -43538834 -68839780
1604f8839780q77446J9054722J7549570Q164949N420883M703239j402581j0212166
$$ -68839780 -69717226 -50662504 -33112934 -24947985 -19527102 -14823863 -16226444 -26438610
1596b6438610j6782477j6009080K9955K6417027L5297104P497747l3046615m4964775
$$ -26438610 -43221087 -59230167 -59200212 -32783185 2513919 10011666 -23034949 -67999724
1588f7999724k3474398O75744R830664J3782480J8382783J4841340L929775J23538
$$ -67999724 -91474122 -90798378 -80967714 -67185234 -48802451 -33961111 -30031336 -29907798
1580b9907798N929038P654262K48484o978419r837258j1008313m780891J3988063
$$ -29907798 -23978760 -16324498 -16076014 -23054433 -32891691 -43900004 -48680895 -34692832
1572c4692832K8933945J9419155l150517p769383P310956J2432486k539270j1200488
$$ -34692832 -5758887 13660268 10509751 2740368 10051324 22483810 19944540 8744052
1564H744052M097648K2970899K0074380Q75556j4182247k0293553k4373536k5787544
$$ 8744052 12841700 35812599 55886979 56762535 42580288 22286735 -2086801 -27874345
1556b7874345j8274720k528944J4122427K3945490K0461387L913609j2164060
$$ -27874345 -46149065 -48678009 -34555582 -10610092 9851295 13764904 1600844
1549A600844j1838587K507346J1765228M923198q637524j3664675o332156M006580
$$ 1600844 -10237743 -7730397 4034831 8958029 320505 -13344170 -19676326 -15669746
1541a5669746M135548q476743j6320304J161351L3598962M1848043J0196827k4739849
$$ -15669746 -11534198 -20010941 -36331245 -35169894 -1570932 40277111 50473938 25734089
1533B5734089k1556586R608271K8741027K4739524J4449198q75067l1042923n6286817
$$ 25734089 4177503 13785774 42526801 67266325 81715523 80840456 49797533 -6489284
1525f489284m2714802j578562J6885868j856128j7475469n017112O414505r706571
$$ -6489284 -49204086 -50782648 -33896780 -35752908 -53228377 -58245489 -51830984 -61537555
1517f1537555k8201018j4468320J8813852L3294294J8544533o924453k6572756
$$ -61537555 -89738573 -104206893 -85393041 -52098747 -33554214 -40478667 -67051423
1510f7051423l0298424r661457K4261651L8430593J8698652p083084r867621J501291
$$ -67051423 -97349847 -107011304 -82749653 -44319060 -25620408 -32703492 -42571113 -41069822
1502d1069822P793240J6413900L5914532M1352870R976929k8029129k4369546
$$ -41069822 -33276582 -16862682 19051850 60404720 70381649 42352520 17982974
1495A7982974J1551001K2830879r213277m0133293l3080080p677642J618066l173779
$$ 17982974 29533975 52364854 43151577 3018284 -30061796 -37739438 -36121372 -39295151
1487c9295151j542386M327809j975049j5689688j2909255J3780461M1349525M2284411
$$ -39295151 -40837537 -36509728 -38484777 -54174465 -67083720 -53303259 -11953734 30330677
1479C0330677J5486511j2962026j8392300m083769N967461P32875m071491O203515
$$ 30330677 45817188 32855162 14462862 10379093 16346554 17079429 13007938 19211453
1471A9211453J9076530J4264521l186573j2657414j2827826j8783503k7146059
$$ 19211453 38287983 52552504 49365931 36708517 23880691 5097188 -22048871
1464b2048871j6131319J3966187L1604635J8203276n395881j2510193o005956
$$ -22048871 -38180190 -24214003 7390632 25593908 20198027 7687834 1681878
1457A681878j225754L159216J2975963J5995543k62822k0419337j9660582k782054
$$ 1681878 456124 3615340 16591303 32586846 32324024 11904687 -7755895 -10537949
1449a0537949M172507k654228j107498J5007324K2367925P759679p725050k829668
$$ -10537949 -6365442 -9019670 -10127168 4880156 27248081 35007760 27282710 24453042
1441B4453042Q971240L317224j2794956j1890111Q196005K0258396J1450118Q71273
$$ 24453042 33424282 36741506 23946550 12056439 20252444 40510840 51960958 52832231
1433E2832231K289470k197034k8292142n0505153l0775125K0349860M7331330
$$ 52832231 55121701 52924667 24632525 -25872628 -56647753 -36297893 11033437
1426A1033437K2565175j6468093k1622157J326392J1296794l022608j3649727
$$ 11033437 33598612 17130519 -4491638 -3165246 8131548 5108940 -8540787
1419h540787m610514M835741l066225j6518679j8543390j3363655r563754J95415
$$ -8540787 -13151301 -8315560 -11381785 -27900464 -46443854 -59807509 -69371263 -69175848
1411f9175848J9813160K9750561J3689580r245798q556726J1276130J9878011
$$ -69175848 -49362688 -19612127 -5922547 -15168345 -23725071 -12448941 7429070
1404G429070R918799K027502J619430j0545409l5541645m1412423j0449240K8611431
$$ 7429070 17347869 19375371 20994801 10449392 -25092253 -66504676 -76953916 -48342485
1396d8342485L9195419K4518733J2022722R110353J655456j4400294k4970057
$$ -48342485 -9147066 15371667 27394389 36504742 38160198 23759904 -1210153
1389a210153j7423785P307157L5449607M2979556J2344889l9365482o6107553
$$ -1210153 -18633938 -11326781 24122826 67102382 79447271 40081789 -26025764
1382b6025764m4121381m99937K6338151L2122853L0473321J8437979p837169k5713272
$$ -26025764 -70147145 -70647082 -44308931 -12186078 18287243 36725222 28888053 3174781
1374C174781j4731974M333712J355381r012669N656991K8696783J4510940k8395616
$$ 3174781 -11557193 -7223481 -5868100 -14880769 -9223778 19473005 33983945 5588329
1366E588329m0856094q473023J4066257m549287k2342878j679611K4479895J2087317
$$ 5588329 -35267765 -43740788 -29674531 -34223818 -56566696 -58246307 -33766412 -21679095
1358b1679095j7398488j4772538J7415416L6545442K6640221N932566j1653089
$$ -21679095 -39077583 -53850121 -36434705 110737 26750958 32683524 21030435
1351B1030435k0380182r309822J5258187J8117436j3707058l6626126j3120472
$$ 21030435 650253 -8659569 6598618 24716054 11008996 -25617130 -38737602
1344c8737602K2315378J5422301j8024997k0585923Q936397J9271042n22741q240300
$$ -38737602 -16422224 -999923 -19024920 -39610843 -30674446 -11403404 -11926145 -20166445
1336b0166445Q850265J4063289l580768p611763J1644401J2335649j9389818l3115543
$$ -20166445 -11316180 2747109 -833659 -8445422 3198979 15534628 -3855190 -36970733
1328c6970733J942593L7304361J9062117k7974468m3658155k1647796k50785P521996
$$ -36970733 -35028140 2276221 21338338 -6636130 -50294285 -71942081 -72192866 -64670870
1320f4670870J9418611L5448459L4198340J2792275p600225j3621308r849968
$$ -64670870 -45252259 -9803800 24394540 37186815 29586590 15965282 6115314
1313F115314l698212j693626r380515j6957151l475959K6041375L3729368M013434
$$ 6115314 2417102 723476 -8657039 -25614190 -29090149 -3048774 30680594 34694028
1305C4694028k4154469j4051236R071677q76026l3144362l6764884l841952K0007473
$$ 34694028 10539559 -3511677 5560000 4683974 -28460388 -65225272 -69067224 -49059751
1297d9059751J1474928K392744K0177273M0258526K6047826j2818429l3592814
$$ -49059751 -37584823 -35192079 -15014806 25243720 51291546 38473117 4880303
1290D880303j9259725K486970r1227k0982362k6589714l747214J8466095Q166388
$$ 4880303 -14379422 -11892452 -11983679 -32966041 -59555755 -63302969 -44836874 -36670486
1282c6670486j9630779k0276656J3528969L7013216J9798092p775650j631328
$$ -36670486 -56301265 -76577921 -63048952 -26035736 -6237644 -14013294 -15644622
1275a5644622L1128321M8155313L2634561L334509k1062011l3287781k5591917
$$ -15644622 15483699 63639012 96273573 99608082 78546071 45258290 19666373
1268A9666373j038884J3629348L47881j6100429k684989K4756785K2569122q439905
$$ 19666373 18627489 32256837 32604718 16504289 13819300 38576085 61145207 52705302
1260E2705302k0644607N321552L0486494J8129598j5464444l2377912k5055586
$$ 52705302 32060695 37382247 67868741 85998339 70533895 38155983 13100397
1253A3100397j4264484j4990747k2857144k2885567l244417K8592140M3744363
$$ 13100397 -1164087 -16154834 -39011978 -61897545 -65141962 -36549822 7194541
1246G194541K2721242j4506799k9699252j3598111J0520754K3153846K0914975
$$ 7194541 29915783 15408984 -14290268 -27888379 -17367625 5786221 26701196
1239B6701196K165832k4720096k7369654J3388890N6905932M3347956j6918108
$$ 26701196 28867028 4146932 -23222722 -9833832 47072100 90420056 73501948
1232G3501948n0030584k4872333P790531L904571r104792O300665K8539077J9992513
$$ 73501948 23471364 -1400969 6389562 10294133 1189341 7490006 36029083 56021596
1224E6021596m652158q986763q99225j0872285k8700677k0304985P301366J4680076
$$ 56021596 51369438 42382675 41483450 30611165 1910488 -18394497 -11093131 3586945
1216C586945l692109j4880144o385947J286154J272577Q683707J7321263o2854
$$ 3586945 -105164 -14985308 -21371255 -20085101 -18812524 -10128817 7192446 7129592
1208G129592l5262946l8887538N806629M7536791L6507873n811973k2539566j720126
$$ 7129592 -28133354 -67020892 -61214263 -13677472 22830401 17018428 -5521138 -7241264
1200g241264J8936056J4587972N51373l950228n322252j5920602k7216450k1315735
$$ -7241264 11694792 26282764 26834137 22883909 17561657 1641055 -25575395 -46891130
1192d6891130L66657J7879477K1025508K0173225K3007371J7422320n911863k6245686
$$ -46891130 -46524473 -28644996 -7619488 12553737 35561108 52983428 47071565 20825879
1184B0825879j5033733J5989272K1234554j2984667m1331574k2133149J9786728
$$ 20825879 5792146 21781418 43015972 30031305 -11300269 -33433418 -13646690
1177a3646690K7981640m489395k9973701j8793195M306529N832603r228417j5127407
$$ -13646690 14334950 9845555 -20128146 -38921341 -34614812 -28782209 -38010626 -53138033
1169e3138033o745636p89718o413272j2739677m339194J8772506L6979853K9008929
$$ -53138033 -59883669 -60673387 -67086659 -79826336 -84165530 -65393024 -28413171 595758
1161E95758j185889k2171068j0642927J8079005L0834473K0545307Q250153O233816
$$ 595758 -590131 -22761199 -33404126 -15325121 15509352 36054659 44304812 50538628
1153E0538628N486542Q00159L73692L812840k399069j7004461j7686253K991322
$$ 50538628 56025170 56825329 57199021 61011861 58612792 41608331 23922078 26913400
1145B6913400J9731935J0496552j1168622j9692929j3771310o806852R36169J3979552
$$ 26913400 46645335 57141887 45973265 26280336 12509026 5702174 6638343 20617895
1137B0617895J8663921j830561l5085605m9278681l3940060p084458J6378868
$$ 20617895 39281816 37451255 2365650 -46913031 -80853091 -87937549 -71558681
1130g1558681L7048575M9771158L8266712K428445l0459942l5796930j7896773
$$ -71558681 -34510106 15261052 53527764 55956209 25496267 -10300663 -28197436
1123b8197436M870439K4444385L7592691L1921372M03701l6052538m4007564j8835721
$$ -28197436 -23326997 1117388 38710079 70631451 71035152 34982614 -9024950 -27860671
1115b7860671P734552Q621063n703397p239356Q140850J6660760J549064k4521060
$$ -27860671 -20126119 -11505056 -17208453 -24447809 -16306959 353801 1902865 -22618195
1107b2618195l6934123k7642164q645955N627859J1177517J3208131J8287326
$$ -22618195 -59552318 -87194482 -95840437 -90212578 -79035061 -65826930 -47539604
1100d7539604K5793258K5148224P720858j6074758k2764505o680853P733094j565371
$$ -47539604 -21746346 3401878 11122736 -4952022 -27716527 -34397380 -26664286 -28229657
1092b8229657k0870282k0400552J22128J2105869M517316J71429J5483925L1551648
$$ -28229657 -49099939 -69500491 -69378363 -57272494 -52755178 -52583749 -37099824 -5548176
1084e548176K4682688M557082k723298L884692K729596j2103279k0713470q424983
$$ -5548176 19134512 23691594 20968296 24852988 27582584 15479305 -5234165 -13659148
1076a3659148J3426156K3983736J6111130k247309j8952368k5022657j9208543
$$ -13659148 -232992 23750744 39861874 37614565 18662197 -6360460 -25569003
1069b5569003q896673j719872K516161N571540J812682j2667396k5564458j9057241
$$ -25569003 -34465676 -36185548 -33669387 -28097847 -26285165 -38952561 -64517019 -83574260
1061h3574260L236078J6079023O261793p029831L132683L3736007N1529826L1700875
$$ -83574260 -80338182 -64259159 -57997366 -65027197 -61894514 -28158507 23371319 55072194
1053E5072194j0578138l3638216j5612338J8855385K7600705M149178j5327656
$$ 55072194 44494056 10855840 -4756498 14098887 41699592 45848770 30521114
1046C0521114m200837J7395137J6017254l979721j2801100o963263j0683351k6018221
$$ 30521114 26320277 43715414 59732668 55752947 42951847 35988584 25305233 -712988
1038g12988k3178445O572660K7083356J0023786k0149361k3579906k659971J1109172
$$ -712988 -23891433 -17318773 9764583 19788369 -360992 -23940898 -26600869 -15491697
1030a5491697R495827J0052504J6646838J4342748Q67433j0073688j6793828k9225521
$$ -15491697 -5995870 4056634 20703472 35046220 35913653 25839965 9046137 -20179384
1022b0179384l9433989k6114122N662431K2867709J3489983M522192J5630334
$$ -20179384 -59613373 -85727495 -80065064 -57197355 -43707372 -39185180 -23554846
1015b3554846K6916277J5549436l425158k279437J3253799J4815794l145288j9406264
$$ -23554846 3361431 18910867 15485709 13206272 26460071 41275865 38130577 18724313
1007A8724313k2038334j9928750j8679641j0910894M915081J6980958J8088256
$$ 18724313 -3314021 -23242771 -41922412 -52833306 -47918225 -30937267 -12849011
1000a2849011J5592353J7732802K2167555K1651755J0876511j2127253l8804925
$$ -12849011 2743342 20476144 42643699 64295454 75171965 63044712 24239787
993B4239787m6097145j7854425K6277614M2558955J3909199k5844365l1427027
$$ 24239787 -21857358 -39711783 -13434169 29124786 43033985 17189620 -14237407
986a4237407N76565L2027225L0568834J644928k5774888l1066602j4273159J2549495
$$ -14237407 -13660842 18366383 48935217 50580145 24805257 -6261345 -20534504 -7985009
978g985009L4691085L8013097J6172933j7750128l4965276j9041718J1570346
$$ -7985009 26706076 64719173 80892106 63141978 28176702 9134984 20705330
971B0705330K2611605O541349j0590408j0109187p431353k1780171l8178954k7055249
$$ 20705330 43316935 49858284 39267876 29158689 21727336 -52835 -38231789 -65287038
963f5287038O679430K5367331J2227145n813483k84372J8279340K0402598J869626
$$ -65287038 -58607608 -33240277 -21013132 -26826615 -27110987 -8831647 11570951 13440577
955A3440577j3688351r549512N846644J5325629J3421562O574930J419830j639444
$$ 13440577 -247774 -9797286 -3950642 11374987 24796549 31371479 32791309 31151865
947C1151865m954041p143930l609393M520523O607921n371038k3223048k9618120
$$ 31151865 26197824 19053894 15444501 19965024 26572945 21201907 -2021141 -31639261
939c1639261j8396515L32954J4392143J9308472J4889261L719358n797702o038023
$$ -31639261 -50035776 -49702822 -35310679 -16002207 -1112946 2606412 -3191290 -9229313
931i229313q19026J466834L869184J4959372K7702427K4098414M607299q486503
$$ -9229313 -10048339 -8581505 -4712321 10247051 37949478 62047892 66655191 58168688
923E8168688m845808j057391r854745j6850536o211935R451016P581141q747581
$$ 58168688 53322880 52265489 42410744 25560208 19348273 28799289 36380430 27632849
915B7632849j6598689o798841Q296578J5056522R884913l196985j1859312k449671
$$ 27632849 11034160 4235319 12531897 27588419 37473332 34276347 22417035 19967364
907A9967364J7182062J6647496j4529274m0192149k2590194J9056912L1588244
$$ 19967364 37149426 53796922 39267648 -924501 -23514695 -4457783 27130461
900B7130461L518466k3279136k0275125p523682q303847r562222O390977K2679129
$$ 27130461 30648927 7369791 -12905334 -20429016 -28732863 -38295085 -31904108 -9224979
892i224979J3325690j1974159k1422619q773399K635432q17605o692521j115248
$$ -9224979 4100711 -7873448 -29296067 -38069466 -35434034 -36251639 -42944160 -44059408
884d4059408J1931366K1310235K3545682K0988160J4562502L217316j2600080
$$ -44059408 -32128042 -10817807 12727875 33716035 48278537 51495853 38895773
877C8895773k6757187k7042227p507442J6082540J7535098l779191j4586697P843246
$$ 38895773 12138586 -14903641 -22411083 -6328543 11206555 7427364 -7159333 683913
869F83913L8105556L4714332N88693j9964124n519137J4413223P714399j3911061
$$ 683913 38789469 73503801 74092494 54128370 48609233 63022456 70736855 56825794
861E6825794j9615942r032160p286880j9796349k3358779n707040J2371277O958115
$$ 56825794 37209852 28177692 20890812 1094463 -22264316 -27971356 -15600079 -8641964
853h641964j4255499k2947331p030186J8468633L4126171L5765743K9133835J6319046
$$ -8641964 -22897463 -45844794 -52874980 -34406347 -280176 35485567 64619402 80938448
845H0938448m080299k6471029l6412480k4453612p61605J0600949j872704j9389632
$$ 80938448 76858149 50387120 13974640 -10478972 -11240577 -639628 -2512332 -21901964
837b1901964j2054741K1403568M5299354K8938303j2024895l2816426j5987355
$$ -21901964 -33956705 -12553137 32746217 61684520 49659625 16843199 855844
830H55844Q622996O565717j6498539k7702932j3680190N319434P319673l119050
$$ 855844 9478840 16044557 -453982 -28156914 -41837104 -36517670 -29197997 -32317047
822c2317047o204859M524333J6274124J6608522Q743527L957338N101578M695811
$$ -32317047 -38521906 -33997573 -17723449 -1114927 7628600 11585938 16687516 21383327
814B1383327j948322r893413j4034150j7575201k3784658k5603639j4526138L368131
$$ 21383327 19435005 9541592 -4492558 -22067759 -45852417 -71456056 -85982194 -82614063
806h2614063J3247482J3003461J4460321K0752700J9041491L594532r521808m141590
$$ -82614063 -69366581 -56363120 -41902799 -21150099 -2108608 1485924 -8035884 -12177474
798a2177474J0573741J1864906n000863k1117645j8721351j144160J2309670N887014
$$ -12177474 -1603733 10261173 5260310 -15857335 -34578686 -35722846 -23413176 -17526162
790a7526162j6373610l1491356k0454916Q028902K6533412K3546095J3994181
$$ -17526162 -33899772 -65391128 -85846044 -77817142 -51283730 -27737635 -13743454
783a3743454J0440124M580041j0026029j8374940p551157P902334Q095727L26508
$$ -13743454 -3303330 1276711 -8749318 -27124258 -34675415 -26773081 -18677354 -18350846
775a8350846K990292J0547920N357983o035523l181875Q249580M946448p518504
$$ -18350846 -15360554 -4812634 545349 -5490174 -8672049 -422469 4523979 -2994525
767b994525P53195K7004266K8369437j1661470n0529528m5587552j1205740J2329650
$$ -2994525 -2241330 24762936 53132373 41470903 -9058625 -54646177 -65851917 -53522267
759e3522267J7027317K0149333K2615955J3120374K84604L195382J5482862J2636153
$$ -53522267 -36494950 -16345617 6270338 19390712 19675316 22870698 38353560 50989713
751E0989713o290120j6126792p877043l488845j8529671l5002756k7311859J46473
$$ 50989713 44699593 28572801 20695758 17206913 -1322758 -36325514 -63637373 -63490900
743f3490900J8455744J1651901m769290m839507J5316279L2430997K5108007J079286
$$ -63490900 -45035156 -33383255 -38152545 -42992052 -27675773 4755224 29863231 30942517
735C0942517j4033046j1785567q993793j7450668k3887801j2215178Q758878J7039757
$$ 30942517 16909471 5123904 -3869889 -21320557 -45208358 -57423536 -48664658 -31624901
727c1624901R070506K481806R594514K2465604K5509767J3559506m062356j2428923
$$ -31624901 -22554395 -20072589 -10478075 11987529 37497296 51056802 46994446 34565523
719C4565523m808614R611011J4788835N725982q025897j6284065j6915299j1053620
$$ 34565523 29756909 39367920 54156755 59882737 51856840 35572775 18657476 7603856
711G603856j275754N073304L628783L018292J1036679J4223134m711327l0147715
$$ 7603856 6328102 11401406 15030189 18048481 29085160 43308294 38596967 8449252
703H449252k6992689K475025J3436403j2391983l2387949q037782L0848381K8549882
$$ 8449252 -18543437 -16068412 -2632009 -15023992 -47411941 -55449723 -24601342 3948540
695C948540j3988545m4772965l6054934r464118R419762J9912841K6815135K6826779
$$ 3948540 -10040005 -54812970 -90867904 -100332022 -90912260 -70999419 -44184284 -17357505
687a7357505K0427940J2406252L65342j5317376j8157586N27510J5619755P93695
$$ -17357505 3070435 15476687 15842029 524653 -17632933 -17105423 -1485668 -691973
679f91973k2988302j3936742K0522229K9298531j499043k4414244n222149K4599824
$$ -691973 -23680275 -37617017 -17094788 12203743 10704700 -13709544 -18931693 5668131
671E668131J8516297j6824082l6513023j9371461J2598383K5062989M758920k7557295
$$ 5668131 24184428 7360346 -29152677 -48524138 -35925755 -10862766 -6103846 -33661141
663c3661141l1247546J0112619N7030482N2766498j805057m4054595l0083385
$$ -33661141 -64908687 -54796068 2234414 55000912 53195855 9141260 -20942125
656b0942125J4825095M0690193L2451575N340995k4690972m0672734k5667664
$$ -20942125 -6117030 34573163 67024738 72365733 47674761 7002027 -18665637
649a8665637Q514244K1422411p17056j9149958j162933K7268812K4239972j680845
$$ -18665637 -10151393 11271018 10553962 -8595996 -9758929 17509883 41749855 40069010
641D0069010j1953464k575147P30785k476375J1097383L5404072L3213767n432613
$$ 40069010 28115546 25540399 26271184 23794809 34892192 70296264 103510031 98077418
633I8077418m3740718m7682419k2447696Q426917K9262241K9556090N836398k2362398
$$ 98077418 54336700 6654281 -15793415 -7366498 21895743 51451833 57288231 34925833
625C4925833k4717073K50124K0706118J5742065K7370o108476o153001j1367402
$$ 34925833 10208760 10458884 31165002 46907067 46934437 40825961 34672960 23305558
617B3305558j6315761r610216M461870J2572637J2232952J0759717R891644L648882
$$ 23305558 6989797 -2620419 1841451 14414088 26647040 37406757 47298401 50947283
609E0947283r710799k1275876j9045735j801712J5367001J5523417K470566k234587
$$ 50947283 41236484 19960608 914873 -886839 14480162 30003579 32474145 30239558
601C0239558P627230Q699070j6164616m3008494l4459293N327100L3957895K8848691
$$ 30239558 37866788 46565858 30401242 -12607252 -47066545 -41739445 -7781550 21067141
593B1067141J0996423N035846O636760K999588j455241J064529K582048n934643
$$ 21067141 32063564 37099410 43736170 46735758 45280517 46345046 48927094 42992451
585D2992451j5741336j5010106j0007883j2983594j8869086j3360060J942260
$$ 42992451 27251115 12241009 2233126 -10750468 -29619554 -42979614 -41037354
578d1037354J1088831Q016093K627070K617383M250764M153299P160701J5691652
$$ -41037354 -29948523 -21932430 -19305360 -16687977 -12437213 -8283914 -1123213 14568439
570A4568439K0217634R683506j1355361k4885586k1065079j0516697q319135j1124488
$$ 14568439 34786073 44469579 33114218 8228632 -12836447 -23353144 -31672279 -42796767
562d2796767k843962J6716742K5412576R770625j2131923j3773202M044877J8024200
$$ -42796767 -45640729 -28923987 -3511411 6259214 -5872709 -19645911 -15601034 2423166
554B423166J5883184N485072n518369j7236736k3531088j2167287J3949668L2659244
$$ 2423166 18306350 23791422 18273053 1036317 -22494771 -34662058 -20712390 11946854
546A1946854K8326364R734405l982319m531005K932261Q012378K553354j0458291
$$ 11946854 40273218 50007623 46025304 41494299 44426560 52438938 54992292 44534001
538D4534001j4857167N94667K3031169K8023876J0067789j4536423l2191060l9983810
$$ 44534001 29676834 30271501 53302670 81326546 91394335 76857912 44666852 4683042
530D683042l2300009n515436K1590880K0827247l742925j5491116J499484J8276759
$$ 4683042 -27616967 -33132403 -11541523 9285724 5542799 -9948317 -8448833 9827926
522I827926P671443j3950803j6429844k758772L584250O2551J916109R637743
$$ 9827926 17499369 3548566 -12881278 -15640050 -12055800 -11993249 -10077140 -439397
514d39397J1415738J0701205J9970442L0310364J8706447j2135330l0723038k0685578
$$ -439397 10976341 21677546 41647988 71958352 90664799 78529469 47806431 27120853
506B7120853k022381J916885l863725j923057O959728O942143o781390k0479157
$$ 27120853 25098472 27015357 23151632 21228575 28188303 35130446 28349056 7869899
498G869899k0198443q355166Q05699r58231o426971l809208N854052J0241498
$$ 7869899 -12328544 -20683710 -19878011 -20836242 -27263213 -31072421 -25218369 -14976871
490a4976871M938443j011463l260372j0559172k3843161k2756991O812330M1271252
$$ -14976871 -10038428 -11049891 -14310263 -24869435 -48712596 -71469587 -64657257 -23386005
482b3386005M0156585j219948m1442760m1243495o302685K5113125K5567699K396128
$$ -23386005 16770580 15550632 -25892128 -67135623 -73438308 -48325183 -22757484 -20361356
474b0361356j4608518m545795K2469754L5466638J8394594j0614226k3399762
$$ -20361356 -34969874 -39515669 -17045915 18420723 36815317 26201091 2801329
467B801329j6175285o278121k657506J057870O826909O563614o32782l728859
$$ 2801329 -13373956 -19652077 -22309583 -21251713 -14424804 -7861190 -8493972 -12222831
459a2222831K488111J0065044J2901365J4272166J4577809O952391q173604j8030759
$$ -12222831 -9734720 330324 13231689 27503855 42081664 49034055 40860451 22829692
451B2829692j4500607m449367K519701M426571Q35745q601946j4116009j851014
$$ 22829692 8329085 3879718 6399419 10825990 11661735 3059789 -11056220 -12907234
443a2907234K1299231K7388891M989330k0541785k1306762n280914J134636m084563
$$ -12907234 8391997 35780888 40770218 20228433 -1078329 -6359243 -5224607 -9309170
435i309170q65382J2897998J3860832p792056k7561770j9495246P239864K2073828
$$ -9309170 -10174552 2723446 16584278 8792222 -18769548 -38264794 -31024930 -8951102
427h951102J3943968P02287K9590P534984Q796879J350710n122371n470988n351909
$$ -8951102 4992866 5695153 5724743 13259727 22056606 23407316 18284945 12813957 7462048
418G462048r922755j4631346j1796626j594542Q189932J0691301N272954k201363
$$ 7462048 -2460707 -17092053 -28888679 -30483221 -22293289 -11601988 -6329034 -8530397
410h530397k217056R370013K1915574J8189213j847987j6055571r262133M384664
$$ -8530397 -10747453 -1377440 20538134 38727347 36879360 20823789 11561656 15946320
402A5946320M334403k734223L486773J6783278J0102640j5715040k4291735N05195
$$ 15946320 20280723 17546500 21033273 37816551 47919191 32204151 7912416 8417611
394H417611K4310289J2736792j5608388j9839466m91474P372221m830423q393246
$$ 8417611 32727900 45464692 29856304 10016838 9525364 16897585 12067162 3673916
386C673916R440062K2680029J1162891p044642q871140l370175r537574j9026493
$$ 3673916 13113978 35794007 46956898 39912256 31041116 27670941 18133367 -893126
378h93126j1633883N622238P267039q089556j5533888n738959J309524o933520
$$ -893126 -12527009 -6904771 362268 -7727288 -23261176 -29000135 -27690611 -34624131
370c4624131j3141469o20037J6455115J5199496Q53618l421509M835330N258177
$$ -34624131 -47765600 -48385637 -31930522 -16731026 -15877408 -19298917 -14463587 -9205410
362i205410r403685k0054444j0660428Q905047J9210262J5402371N367746l066921
$$ -9205410 -18609095 -38663539 -49323967 -40418920 -21208658 -5806287 -438541 -3505462
354c505462l629319O668831J7113328Q515605j8547131l5153180k0068114R196552
$$ -3505462 -7134781 -465950 16647378 25162983 6615852 -28537328 -48605442 -39408890
346c9408890K1527768J6066815J5467121K3861058K2138955M323461j2128461
$$ -39408890 -17881122 -1814307 13652814 37513872 59652827 63976288 51847827
339E1847827j7118691j9444868j9958845m550499K2384869K8848135J031653k8940362
$$ 51847827 34729136 15284268 -4674577 -9225076 13159793 42007928 43039581 14099219
331A4099219k7190127o823966k257663j3994540j4560918J951749J3836245J2134068
$$ 14099219 -13090908 -19914874 -22172537 -36167077 -50727995 -48776246 -34940001 -22805933
323b2805933J1309765J6427788J2546720m756342j6859788j1566330j326833Q558
$$ -22805933 -11496168 4931620 17478340 12721998 -4137790 -15704120 -17030953 -17022395
315a7022395k040525K422106R645712J1643565R274415O077612K556359L351975
$$ -17022395 -19062920 -16640814 -6995102 4648463 13922878 20000490 22556849 25908824
307B5908824J3994560K4242087J4602455j1203704k2299613l337893K0059347
$$ 25908824 39903384 64145471 78747926 67544222 45244609 41906716 61966063
300F1966063J6951504o769934k3529525k4857598k1703535j6388305k909513J0140477
$$ 61966063 78917567 72147633 48618108 23760510 2056975 -14331330 -17240843 -7100366
292g100366N205307j4400933k4341250j3092968M424684J1842744J0788953Q371643
$$ -7100366 -1895059 -16295992 -40637242 -53730210 -49305526 -37462782 -26673829 -18302186
284a8302186K851604p464678j3919262q371603K524837M472401n350703j3684696
$$ -18302186 -15450582 -22915260 -36834522 -45206125 -42681288 -38208887 -43559590 -57244286
276e7244286o628771J3491811K9220943K7056640J2396386O0524o505243j4736410
$$ -57244286 -63873057 -50381246 -21160303 5896337 18292723 18353247 11848004 -2888406
268b888406k2780986j8363738l281301K904762l954447j07874K4512843L7896834
$$ -2888406 -25669392 -44033130 -47314431 -44409669 -48364116 -48471990 -23959147 13937687
260A3937687J2340872k1908960j4808870K2103156K6521916j7553998n0410215
$$ 13937687 26278559 4369599 -10439271 11663885 38185801 20631803 -29778412
253b9778412k6698032J6876070K1377946p851610k1984877q474125K392280k258765
$$ -29778412 -56476444 -39600374 -18222428 -26074038 -48058915 -56533040 -54140760 -56399525
245e6399525k769454Q040193J1133656R32421j368082J2277098J8441343J857190
$$ -56399525 -59168979 -51128786 -39995130 -39062709 -40430791 -28153693 -9712350 -7855160
237g855160j6118227j0427243R329294J6917911Q929457K287376L370358K913433
$$ -7855160 -23973387 -34400630 -25071336 -8153425 776032 3063408 6433766 9347199
229I347199l239103q492137r693481j0802461j1638109o320528M814177J2328915
$$ 9347199 6108096 -2384041 -12077522 -22879983 -34518092 -40838620 -36024443 -23695528
221b3695528J0340972N083631O818085J5907106J9681329N369156k1501344l5770899
$$ -23695528 -13354556 -8270925 -1452840 14454266 34135595 39504751 18003407 -17767492
213a7767492j9180222J2800306K4860749O777127j2147116m191633J8185265K3771890
$$ -17767492 -36947714 -24147408 713341 7490468 -4656648 -8848281 9336984 33108874
205C3108874R981728K807752J2983875K0166982P278315j3815945k3781505k3520181
$$ 33108874 43090602 45898354 58882229 79049211 86327526 72511581 48730076 25209895
197B5209895k3977259k3310957j3828108k128986j417837p884913n211545P560796
$$ 25209895 1232636 -22078321 -35906429 -38035415 -39453252 -47338165 -52549710 -44988914
189d4988914J3030550M520021j543278Q110488K1764860K0996293Q170217q30255
$$ -44988914 -31958364 -27438343 -28981621 -20871133 893727 21890020 30060237 29229982
181B9229982k936689q108715j6154878j3177578M429074J8772453J2500236q277793
$$ 29229982 26293293 18184578 2029700 -11147878 -6718804 12053649 24553885 16276092
173A6276092k2420508j8433029k557603J2437271J8077346J2983608K895429k941390
$$ 16276092 -6144416 -24577445 -27135048 -14697777 3379569 16363177 19258606 16317216
165A6317216j201216O91454n830447j7510909k1808145j2479462K739067J1637138
$$ 16317216 15116000 15807454 9977007 -7533902 -29342047 -41821509 -39082442 -27445304
157b7445304J0911902P604270Q778603J2253224R165555m029993j8769331k2983273
$$ -27445304 -16533402 -8929132 -150529 12102695 21268250 17238257 -1531074 -24514347
149b4514347j4997439l861876L425654Q038793J1677363J1366928O135257J425459
$$ -24514347 -39511786 -43373662 -39948008 -31909215 -20231852 -8864924 -2729667 -1304208
141a304208J254178K225671N92671j829024m564793j2228514k2802090k2143600
$$ -1304208 -50030 2175641 2768312 939288 -3625505 -15854019 -38656109 -60799709
133f0799709l228582J7284872J8311239N062600J304511J2340035J7701849N620292
$$ -60799709 -64028291 -46743419 -28432180 -23369580 -22065069 -9725034 7976815 13597107
125A3597107p350265l416790P773658N112973j0667902j8999208j0190952L865523
$$ 13597107 6246842 2830052 10603710 15716683 5048781 -13950427 -24141379 -20275856
117b0275856J0314413J1103311J3099729J3947455O225611q975730j9814412j5819584
$$ -20275856 -9961443 1141868 14241597 28189052 34414663 25438933 5624521 -10195063
109a0195063j60468J1717866P707866o407165j2060093l61123J5385189J5751195
$$ -10195063 -10355531 1362335 9070201 2663036 -9397057 -9758180 5627009 21378204
101B1378204K36349j2966137j2134638n815865n944283p334954L556712K3125945
$$ 21378204 21614553 8648416 -3486222 -9302087 -15246370 -22581324 -19024612 4101333
93D101333K9213657J0092001j7343528k7899384j8096003m159670L353656P419433
$$ 4101333 33314990 43406991 26063463 -1835921 -19931924 -24091594 -20737938 -13318505
85a3318505R498608M529779n822517j1378887j0270974j1249174j3151835k078724
$$ -13318505 -3819897 709882 -5112635 -16491522 -26762496 -38011670 -51163505 -53242229
77e3242229K0043358K6576611M621905j8468733j2443810R710730J4339404J764540
$$ -53242229 -33198871 -6622260 -2000355 -20469088 -32912898 -23202168 -8862764 -7098224
69g098224L6912J1320203Q772903j0102260j3408346Q154241J9339231j072205
$$ -7098224 -7061312 4258891 13031794 2929534 -10478812 -2324571 17014660 15942455
61A5942455k1551543j0378839R976884L013833j6317327o915316K4187721K7812042
$$ 15942455 -5609088 -15987927 -6011043 -2997210 -19314537 -26229853 -2042132 25769910
53B5769910p986374l6207875k0754949J4979585K8622528J4056463n969102j6071759
$$ 25769910 17783536 -18424339 -39179288 -24199703 4422825 18479288 12510186 -3561573
45c561573j3776203J563071K2554683K9966001J4856175n971843j2922570j0299665
$$ -3561573 -17337776 -15774705 6779978 36745979 51602154 45630311 32707741 22408076
37B2408076j2651166j6256411o362170J3142605K0366525O772120j1289324j6541799
$$ 22408076 9756910 -6499501 -12861671 280934 20647459 27419579 16130255 -411544
29d11544j0382640k865023K611527O007898L280134o799349j5335689j3577973
$$ -411544 -10794184 -13659207 -11047680 -5039782 -1759648 -8558997 -23894686 -37472659
21c7472659o237228l790057m297392L977267K0301029K6074164R928609j2492268
$$ -37472659 -43709887 -47499944 -51797336 -47820069 -27519040 -1444876 8483733 -4008535
13d008535j6191557J346173J9013493K0535840J0487709P31576n380615r468301
$$ -4008535 -20200092 -18853919 159574 20695414 31183123 31914699 26534084 17065783
5A7065783r621604m151692J727951N08838p699837
$$ 17065783 7444179 3292487 5020438 5529276 -2170561
0b170561
$$ -2170561
##END NTUPLES=NMR SPECTRUM
##END=
