##TITLE=31Pdec_LR-698-R3-ETPH5
 CDCl3, 124 sc
 27.1.2020
##JCAMPDX= 6.0         $$ Bruker NMR JCAMP-DX V2.0
##DATA TYPE= NMR SPECTRUM
##DATA CLASS= NTUPLES
##ORIGIN= UXNMR, Bruker Analytische Messtechnik GmbH
##OWNER= root
$$ XWIN-NMR		Version 3.5
$$ Mon Jan 27 14:50:46 2020 Russian Standard Time (UT+4h)  she@DPX200
##.OBSERVE FREQUENCY= 81.013821
##.OBSERVE NUCLEUS= ^31P
##.ACQUISITION MODE= SIMULTANEOUS
##.ACQUISITION SCHEME= undefined
##.AVERAGES= 124
##.DIGITISER RES= 17
##SPECTROMETER/DATA SYSTEM= spect
##.PULSE SEQUENCE= zgpg30
##.SOLVENT NAME= CDCl3
##.SHIFT REFERENCE= (INTERNAL, CDCl3, 0, 182.463)
##AUDIT TRAIL= $$ (NUMBER, WHEN, WHO, WHERE, WHAT)
$$ ##TITLE= Audit trail, XWIN-NMR		Version 3.5
$$ ##JCAMPDX= 5.01
$$ ##ORIGIN= Bruker BioSpin GmbH
$$ ##OWNER= she
$$ F:/spectra/data/she/nmr/P31/1/pdata/1/auditp.txt
$$ ##AUDIT TRAIL=  $$ (NUMBER, WHEN, WHO, WHERE, WHAT)
(   1,<2020-01-27 14:48:00.54 +0400>,<she>,<DPX200>,
      <continue with go, POWCHK disabled, PULCHK disabled
       configuration hash MD5:
       00 E9 B6 7A A2 85 ED C7 34 08 36 98 17 FE 4E 26
       data hash MD5: 32K
       93 6D 1D E5 D7 CC 39 83 D2 BA 39 A7 AD DA 6D 51>)
(   2,<2020-01-27 14:49:24.68 +0400>,<she>,<DPX200>,
      <Start of raw data processing
       efp BC_mod = 2 LB = 1 FT_mod = 6 PKNL = 1 PHC0 = -1655.081 PHC1 = 138.0012 SI = 64K 
       data hash MD5: 64K
       82 80 03 58 3B 17 5D 6B 16 38 03 2E 85 AD CD 19>)
(   3,<2020-01-27 14:49:55.18 +0400>,<she>,<DPX200>,
      <pk PHC0 = -36.00159 PHC1 = 76.60001 
       data hash MD5: 64K
       D7 6F 31 18 3A C2 8A 61 0E 03 9F E0 52 C5 C0 71>)
$$ ##END=
$$ 
$$ hash MD5
$$ B3 15 0E C5 52 2E 94 A7 C9 8E 99 25 59 C0 AA 5F
##$RELAX= 
##$RELAX= 
##$RELAX= 
##$RELAX= 
##$RELAX= 
##$RELAX= 
##$RELAX= 
##$RELAX= 
$$ Bruker specific parameters
$$ --------------------------
##$DU= <F:/spectra>
##$EXPNO= 1
##$NAME= <P31>
##$PROCNO= 1
##$TYPE= <nmr>
##$USER= <she>
##$AMP= (0..31)
100 100 100 100 100 100 100 100 100 100 100 100 100 100 100 100 100 100 
100 100 100 100 100 100 100 100 100 100 100 100 100 100 
##$AQSEQ= 0
##$AQ_mod= 1
##$AUNM= <au_zg>
##$AUTOPOS= <>
##$BF1= 81.014009
##$BF2= 200.13
##$BF3= 200.13
##$BF4= 200.13
##$BF5= 200.13
##$BF6= 200.13
##$BF7= 200.13
##$BF8= 200.13
##$BYTORDA= 1
##$CFDGTYP= 0
##$CFRGTYP= 5
##$CHEMSTR= <none>
##$CNST= (0..31)
1 1 145 1 1 1 1 1 1 1 1 1 1 1 1 1 1 1 1 1 1 1 1 1 1 1 1 1 1 1 1 1 
##$CPDPRG= <waltz16>
##$CPDPRG1= <>
##$CPDPRG2= <waltz16>
##$CPDPRG3= <>
##$CPDPRG4= <mlev>
##$CPDPRG5= <mlev>
##$CPDPRG6= <mlev>
##$CPDPRG7= <mlev>
##$CPDPRG8= <mlev>
##$CPDPRGB= <>
##$CPDPRGT= <>
##$D= (0..31)
0 1 0 0 0 0 0 0 0 0 0 0.03 2e-05 3e-06 0 0 0 0 0 0 0 0 0 0 0 0 0 0 0 0 
0 0 
##$DATE= 1580121894
##$DBL= (0..7)
120 120 120 11 120 120 24 19 
##$DBP= (0..7)
150 150 150 150 150 150 150 150 
##$DBP07= 0
##$DBPNAM0= <>
##$DBPNAM1= <>
##$DBPNAM2= <>
##$DBPNAM3= <>
##$DBPNAM4= <>
##$DBPNAM5= <>
##$DBPNAM6= <>
##$DBPNAM7= <>
##$DBPOAL= (0..7)
0.5 0.5 0.5 0.5 0.5 0.5 0.5 0.5 
##$DBPOFFS= (0..7)
$$ [...]
##$SUBNAM2= <"">
##$SUBNAM3= <"">
##$SUBNAM4= <"">
##$SUBNAM5= <"">
##$SUBNAM6= <"">
##$SUBNAM7= <"">
##$SUBNAM8= <"">
##$SUBNAM9= <"">
##$SW= 369.568048894756
##$SWIBOX= (0..15)
0 1 3 0 0 0 0 0 0 0 0 0 0 0 0 0 
##$SW_h= 29940.119760479
##$TD= 32768
##$TD0= 1
##$TE= 0
##$TE2= 300
##$TE3= 300
##$TEG= 300
##$TL= (0..7)
0 120 53 12 22 120 120 120 
##$TP= (0..7)
150 150 150 150 150 150 150 150 
##$TP07= 0
##$TPNAME0= <>
##$TPNAME1= <>
##$TPNAME2= <>
##$TPNAME3= <>
##$TPNAME4= <>
##$TPNAME5= <>
##$TPNAME6= <>
##$TPNAME7= <>
##$TPOAL= (0..7)
0.5 0.5 0.5 0.5 0.5 0.5 0.5 0.5 
##$TPOFFS= (0..7)
0 0 0 0 0 0 0 0 
##$TUNHIN= 0
##$TUNHOUT= 0
##$TUNXOUT= 0
##$USERA1= <user>
##$USERA2= <user>
##$USERA3= <user>
##$USERA4= <user>
##$USERA5= <user>
##$V9= 5
##$VALIST= <valist>
##$VCLIST= <CCCCCCCCCCCCCCC>
##$VD= 0
##$VDLIST= <DDDDDDDDDDDDDDD>
##$VPLIST= <PPPPPPPPPPPPPPP>
##$VTLIST= <TTTTTTTTTTTTTTT>
##$WBST= 1024
##$WBSW= 4
##$XGAIN= (0..3)
0 0 0 0 
##$XL= 0
##$YL= 0
##$YMAX_a= 22570
##$YMIN_a= -9159
##$ZGOPTNS= <>
##$ZL1= 120
##$ZL2= 120
##$ZL3= 120
##$ZL4= 120
##$ABSF1= 0
##$ABSF2= 0
##$ABSG= 0
##$ABSL= 0
##$ALPHA= 0
##$AQORDER= 0
##$ASSFAC= 0
##$ASSFACI= 0
##$ASSFACX= 0
##$ASSWID= 0
##$AUNMP= <proc_1d>
##$AZFE= 0.1
##$AZFW= 0.5
##$BCFW= 0
##$BC_mod= 2
##$BYTORDP= 0
##$COROFFS= 0
##$CY= -3
##$DATMOD= 1
##$DC= 0
##$DFILT= <>
##$DTYPP= 0
##$F1P= 0
##$F2P= 0
##$FCOR= 1
##$FTSIZE= 65536
##$FT_mod= 6
##$GAMMA= 0
##$GB= 0
##$INTBC= 1
##$INTSCL= 5.30512e-09
##$ISEN= 30
##$LB= 1
##$LEV0= 0
##$LPBIN= 0
##$MAXI= 10000
##$MC2= 0
##$MEAN= 0
##$ME_mod= 0
##$MI= 50
##$NCOEF= 0
##$NC_proc= -7
##$NLEV= 6
##$NOISF1= 182.463
##$NOISF2= 159.3651
##$NSP= 0
##$NTH_PI= 0
##$NZP= 0
##$OFFSET= 182.463
##$PC= 4
##$PHC0= -1691.083
##$PHC1= 214.6012
##$PH_mod= 1
##$PKNL= yes
##$PPARMOD= 0
##$PSCAL= 0
##$PSIGN= 0
##$REVERSE= no
##$SF= 81.0140089999434
##$SI= 65536
##$SIGF1= 159.3651
##$SIGF2= -187.1042
##$SINO= 113.3802
##$SIOLD= 16384
##$SREGLST= <1H.CDCl3>
##$SSB= 0
##$STSI= 65536
##$STSR= 0
##$SW_p= 29940.119760479
##$SYMM= 0
##$S_DEV= 0
##$TDeff= 32768
##$TDoff= 0
##$TI= <>
##$TILT= no
##$TM1= 0
##$TM2= 0
##$TOPLEV= 0
##$USERP1= <user>
##$USERP2= <user>
##$USERP3= <user>
##$USERP4= <user>
##$USERP5= <user>
##$WDW= 1
##$XDIM= 65536
##$YMAX_p= 300424470
##$YMIN_p= -62921216
$$ End of Bruker specific parameters
$$ ---------------------------------
##NTUPLES= NMR SPECTRUM
##VAR_NAME=  FREQUENCY,     SPECTRUM/REAL,   SPECTRUM/IMAG
##SYMBOL=    X,             R,               I
##VAR_TYPE=  INDEPENDENT,   DEPENDENT,       DEPENDENT
##VAR_FORM=  AFFN,          ASDF,            ASDF
##VAR_DIM=   65536,         65536,           65536
##UNITS=     HZ,            ARBITRARY UNITS, ARBITRARY UNITS
##FACTOR=    0.456856943014862, 1,           1
##FIRST=     14782.0589164792, 0,            0
##LAST=      -15158.0608439998, 0,           0
##MIN=       -15158.0608439998, -62921216,   0
##MAX=       14782.0589164792, 300424470,    0
$$ Real data points
##PAGE= N=1
##DATA TABLE= (X++(R..R)), XYDATA
$$ [...]
##PAGE= N=2
##DATA TABLE= (X++(I..I)), XYDATA
9059 -2856746 2680831 6018926 5614362 5888303 9691771 13488497 12652114 7347190 750121
9050 750121 -4867614 -8236447 -8715712 -7554780 -6624131 -5436290 -3062056 -2507790 -7538970
9041 -7538970 -14689876 -15260227 -7508436 -203349 -546492 -4784355 -5464329 -2479314 -928176
9032 -928176 -1804213 -1192810 2850667 7716162 9900744 7887341 2591770 -2235189 -1933504
9023 -1933504 3647433 8630893 8339989 5949903 7823224 13725033 16656802 12687332
9015 12687332 6439142 4973733 9277168 14196688 15029248 11439085 5339101 -1968322
9007 -1968322 -8882771 -12104193 -9820273 -6074156 -7667385 -14828685 -18851656 -12438643
8999 -12438643 611832 10242129 12257337 10607840 9174367 7232371 3350569 -1522233
8991 -1522233 -6156571 -10241097 -12668185 -12234988 -10267044 -8709680 -5978185 391411
8983 391411 6989692 6463178 -2154761 -10457693 -10459508 -2979191 5907221 12362793 16016378
8974 16016378 17305134 16491982 13497519 7960821 1740156 166282 6097344 13415747
8966 13415747 12628372 3458368 -4659154 -5726153 -3740773 -4233487 -6865594 -9664992
8958 -9664992 -13183786 -16122536 -13709203 -5501186 1346768 1893572 780086 4329239
8950 4329239 10750845 14145267 13440162 11346755 8662855 5330442 3267058 3128070 2621213
8941 2621213 2520602 8262945 19616355 25520750 17544025 3224491 -2969186 2175475
8933 2175475 10524552 16693845 21728363 24727616 21548178 12543331 3347655 -2491202
8925 -2491202 -4917123 -2744256 4461772 10998847 10127474 4291575 1814859 3499724
8917 3499724 1467507 -7794126 -18083447 -22989642 -22742886 -19749410 -15095195 -11586323
8909 -11586323 -12741112 -16438282 -16560640 -12671393 -10450912 -10760239 -7094617 2645069
8901 2645069 10413129 9047283 2069685 -2540270 -2351823 350996 3612197 5279074
8893 5279074 2577968 -3480683 -8027639 -9833015 -12932562 -17524272 -16849210 -8435270
8885 -8435270 -966288 -2760677 -9512671 -11390619 -7335657 -3965462 -4251558 -6012718
8877 -6012718 -8791444 -13288310 -15616424 -10993959 -2682890 1215663 105702 1503295
8869 1503295 7996738 12375259 9288298 4106825 4744336 10163722 13328367 12349153 12118817
8860 12118817 15543626 19000665 18249359 14994176 14559978 18443800 21946164 19560040
8852 19560040 10984166 952775 -5575877 -6759001 -3518197 2004904 7549236 11839380
8844 11839380 14836946 16084412 13811386 7658763 1351890 -347025 2639655 5909539
8836 5909539 6549045 5544738 3881958 434002 -4489746 -7340951 -5959628 -3301964
8828 -3301964 -3535987 -6233675 -7283062 -4577211 -532123 718176 -2415977 -6944516
8820 -6944516 -7531991 -2290277 4034298 5164057 1282615 -1419754 794092 5318813
8812 5318813 8342373 9079094 7438205 2702702 -2740000 -3242290 2765293 9077813 8987566
8803 8987566 2935332 -4179704 -9329953 -11279875 -8323349 -918280 6364197 9806154
8795 9806154 10614765 10443195 7098711 -307308 -6300935 -5767653 -2572147 -4279573 -10423334
8786 -10423334 -13552262 -10777807 -6452596 -3336122 971189 7072208 10315945 7387725
8778 7387725 1198172 -3748915 -6784043 -9250899 -10821575 -10533045 -9346593 -9437960 -11870083
8769 -11870083 -15594797 -17867533 -16327835 -12041776 -8927088 -8355772 -7004976 -2915699
8761 -2915699 -51537 -2101082 -5278005 -3791874 260484 441130 -2159024 -11980
8753 -11980 7175091 9620059 1625646 -9863942 -15568366 -15611489 -15346862 -15302339 -12088041
8744 -12088041 -6191939 -2690354 -4702702 -9446143 -10512428 -3615824 7683428 12697299
8736 12697299 4793886 -8338295 -12195522 -4083364 3949951 3315159 208135 2882890
8728 2882890 7192997 4452711 -3078656 -5947834 -3188939 -2887792 -8039516 -12485658
8720 -12485658 -12110381 -10808442 -12776710 -16441088 -18949643 -20392490 -20687352 -17792196
8712 -17792196 -11886546 -6547445 -3211842 924192 6948288 10856895 9353046 5040798
8704 5040798 2294668 1036943 -1849375 -7050690 -11844048 -13334049 -10794662 -6078367
8696 -6078367 -2532453 -1563043 -151508 5009629 10769600 9761455 1093115 -6372163
8688 -6372163 -4691384 3653189 10691414 13030551 12333235 9980176 7370139 8388100
8680 8388100 14457290 18830777 13403165 1012740 -6679214 -4667045 -290868 -975788
8672 -975788 -4053123 -3629937 -1167541 -2530423 -8243616 -13075353 -13250634 -8902696 -1588121
8663 -1588121 5413182 6777981 1276505 -3601011 88894 9122520 13290533 10424692
8655 10424692 8033863 8927652 6021477 -3933461 -11777893 -9044561 -1485574 214726
8647 214726 -2934736 -2084473 3066959 4381832 717858 277658 5468694 7642530 1722133
8638 1722133 -4593385 -2970279 2918231 4694903 2350921 1590889 3256450 4112879 4787760
8629 4787760 8489793 13766572 16085143 15169389 13890555 11681663 6528061 2019813
8621 2019813 4065104 10803392 14120899 11730289 9205970 8793823 5602821 -1947614
8613 -1947614 -7205941 -5976189 -3925030 -6846276 -10660859 -8829738 -3966135 -3359590
8605 -3359590 -7001838 -9154766 -9203502 -11530602 -15730130 -16535972 -13892738 -13539135 -15764850
8596 -15764850 -13503479 -5697905 -2824497 -11784542 -22894553 -21625862 -9020013 70319
8588 70319 -2036125 -7151723 -5729358 -598892 -513227 -6447847 -11746497 -12872642 -12623477
8579 -12623477 -13042904 -11879071 -7870310 -4084289 -2914389 -2134069 12247 -410665 -7200230
8570 -7200230 -15021804 -14007696 -4622771 33995 -8206550 -19115113 -16492030 -1060464
8562 -1060464 9230561 3307021 -8336864 -8836142 2410313 11271281 9775330 5067360
8554 5067360 5713056 8113322 2896504 -9730816 -18460459 -14656235 -2271446 7772950
8546 7772950 9470305 5216393 -331905 -5760209 -11403766 -15371253 -14113168 -6862223
8538 -6862223 2623753 9467688 11468164 9133654 4084100 -1030573 -2848514 -65842
8530 -65842 4747719 8142983 9841686 11635934 13445771 13842082 14032953 17177489 22901896
8521 22901896 26537690 25471686 22384393 19953959 16475636 10278285 4770336 4093466
8513 4093466 6010114 4587571 -848698 -4709750 -3278633 1013276 4271319 5431374
8505 5431374 4284432 -365401 -7789096 -13731667 -14803149 -12753324 -12106624 -14842305
8497 -14842305 -18975678 -21000837 -18569519 -12487217 -7167316 -7021685 -10993130 -12770197
8489 -12770197 -8029020 605213 7476443 10480085 11535135 12484088 13128910 12203453 8410987
8480 8410987 1872647 -4004671 -4479669 461463 4571233 2883078 -1752590 -3456653
8472 -3456653 -2058814 -1751126 -2619001 -310308 5035759 6296684 -862015 -10722255 -14333449
8463 -14333449 -10308826 -4512572 -1471584 -952458 -1872483 -4370243 -7181957 -7242354 -3992866
8454 -3992866 -1379897 -3401998 -9388774 -15498626 -19257338 -20479887 -19141570 -15386380
8446 -15386380 -11463043 -10525671 -12338790 -12472759 -7526060 224025 4999891 3478413
8438 3478413 -2478935 -7703575 -7172264 381830 10157702 14495531 11249921 7129993
8430 7129993 8988366 13632578 11786134 1715641 -7751192 -9524425 -6995074 -6908877
8422 -6908877 -9426441 -10501841 -9534325 -8584018 -7401983 -5622785 -7006604 -14195716 -21202005
8413 -21202005 -19547346 -11691750 -9289809 -15958215 -20599891 -12547042 3855077 15889352
8405 15889352 18224337 15113032 10786226 5757810 1608298 1702191 5463984 7504705
8397 7504705 4822938 753619 -815486 -1608687 -5638751 -11617618 -13098746 -7015167
8389 -7015167 1108717 3020787 -2330589 -7617489 -6358144 -520925 3139799 2219000
8381 2219000 686884 2336006 5965669 8168620 7961198 6872647 6363434 6702620 6965861
8372 6965861 5168501 108555 -6096519 -9409128 -8734571 -6894389 -5610875 -2758112
8364 -2758112 3162976 9053013 11115980 10269889 9798431 9541098 6877783 2328531 -810104
8355 -810104 -2393578 -5984062 -12403529 -17471590 -18244834 -17195739 -17205872 -16395741 -12406853
8346 -12406853 -9012132 -12432914 -21150986 -25224069 -18302451 -6242870 14797 -2267322
8338 -2267322 -5932073 -4813096 -1388493 -1797162 -6993168 -12217436 -13461470 -11100356
8330 -11100356 -7762124 -5696942 -6333523 -9527596 -12323627 -10614907 -3308086 6130876
8322 6130876 12599946 12986857 7738424 892710 -2118049 437805 3777856 1973940
8314 1973940 -3776980 -5945063 -411970 8699420 15373732 18440664 19480753 18376412
8306 18376412 14734316 10459419 6990844 2676222 -3402026 -7977222 -8287701 -7364384
8298 -7364384 -9666376 -13917491 -15771282 -15272286 -15130554 -13343299 -5683251 4103580 5181749
8289 5181749 -6110549 -19673734 -23441896 -16558818 -6835714 -76767 3108713 3762815
8281 3762815 3560356 5346789 9727240 12192630 7890158 -1388052 -8702573 -10036560
8273 -10036560 -7506359 -4867996 -3421581 -2943013 -3481024 -4580554 -4474733 -1729561 2666792
8264 2666792 5692208 5050440 1644411 -1068831 -902024 362781 -420514 -2814146 -2965237
8255 -2965237 650384 4512114 4909964 3031342 2354976 2529177 -536732 -8208408 -15744632
8246 -15744632 -17099151 -11851211 -5564029 -3212271 -3806768 -2805849 1109627 4213648
8238 4213648 3105185 -1107941 -5751691 -10497064 -15009380 -15534705 -8793667 1992970
8230 1992970 9863961 11940424 9483321 1984629 -11188353 -23377278 -24170616 -13521322
8222 -13521322 -4098462 -4984090 -10501848 -10731147 -5734039 -2052775 -1261372 -604696 -800942
8213 -800942 -4559243 -9867568 -12242316 -11296933 -8569700 -2567370 6457227 11046832 5199132
8204 5199132 -4909328 -8965686 -8184654 -11555780 -19161354 -22764114 -21900653 -23790532
8196 -23790532 -25662302 -14538894 9276754 25149877 18800047 2405665 -3891126 1012794
8188 1012794 4185730 1101741 -2406299 -4648157 -8884910 -12231919 -7972662 1621353
8180 1621353 7137265 6417863 5486116 5462366 1193598 -5578588 -4448032 7884552 20477983
8171 20477983 22031658 13803607 4238165 -1577849 -2362024 2303195 9731088 14043267
8163 14043267 12964217 10624712 10542822 10584057 7726279 2703549 -2863556 -8476995 -11155098
8154 -11155098 -6152757 4851590 12323194 10132933 2886666 -2170476 -4553229 -6789668
8146 -6789668 -7506338 -4973880 -2755565 -4825402 -8763096 -10396863 -11484776 -15551773
8138 -15551773 -19216759 -15661910 -5290429 4251086 7799654 6214205 1830525 -2768433
8130 -2768433 -2938759 3358631 9625761 7482278 -605146 -3625763 1823579 6782644
8122 6782644 4459990 528377 3117159 9808030 12355443 9821920 8532250 10439961
8114 10439961 9473670 877302 -11659298 -20960270 -24632545 -25125501 -23913886 -19841511
8106 -19841511 -13471329 -9295625 -10975233 -16225206 -19658032 -19941641 -20334512 -21992163
8098 -21992163 -21489803 -16886646 -11572224 -8766965 -6394950 -1633305 3440268 6037026
8090 6037026 8792572 15043596 20779131 19216666 12056172 7618820 7733416 5598142
8082 5598142 -1503404 -6646520 -4382006 871159 2916058 3150913 5533664 8229523
8074 8229523 7650680 6372153 9173380 13958834 14374969 10147683 7401648 8703263 9681833
8065 9681833 6864809 2848479 1101609 226657 -3136330 -8288258 -10826802 -8499185
8057 -8499185 -4244429 -2469321 -3311760 -2428613 2801782 8915764 10661008 8038895 5090796
8048 5090796 2531930 -2811036 -10333863 -13758459 -9931133 -3837072 -730801 1399907
8040 1399907 6308978 11413229 12022688 10227365 12191658 18259256 22581057 21791191 17905183
8031 17905183 13263937 8591108 5596816 5619986 6045811 3825201 1752270 4643026 9860350
8022 9860350 9484921 2712384 -2228895 -1020076 25228 -5341005 -12668763 -12901139 -4908635
8013 -4908635 3738432 6272129 2575773 -3071893 -6599629 -6753874 -4727465 -1378407
8005 -1378407 3773667 8953879 8646742 781943 -7139928 -6513508 -762875 -578264 -6054737
7996 -6054737 -5573374 4134375 9999940 2587159 -7879641 -7153338 574478 267488 -9392683
7987 -9392683 -14842715 -9944429 -4273416 -6369054 -11669106 -12219683 -8047280 -2861093
7979 -2861093 3233325 10146994 13295715 9405726 2717951 -117435 1897882 5440192
7971 5440192 8461457 9709927 6226057 -2834029 -11563864 -11887681 -2701112 9214365
7963 9214365 17014831 19179582 17388472 12793914 6014989 -1023143 -5405365 -6181211
7955 -6181211 -6481068 -10667311 -17849371 -20371761 -12381902 1099875 8488835 5536124
7947 5536124 -229694 -733077 2446481 2744422 -1195859 -5160919 -6314914 -5227487 -2565006
7938 -2565006 1212174 3454290 1089253 -5107958 -11319737 -15216650 -16432021 -13850264
7930 -13850264 -7014229 302419 3179222 2812781 5364864 11956900 15377051 10106335
7922 10106335 852182 -3718768 -2442060 -1234735 -3007800 -4351216 -2870827 -1903986
7914 -1903986 -4926551 -9238408 -9234431 -4200452 739757 990791 -2923347 -6963720 -7462864
7905 -7462864 -3561245 1905377 3986879 577023 -4192841 -4595793 -1768672 -3513321
7897 -3513321 -13748279 -26166992 -31679541 -28674923 -21714698 -13493378 -4209114 3142444
7889 3142444 4406711 1552244 1043993 3300788 1246354 -7333170 -13644061 -10062198
7881 -10062198 -2361320 -1943543 -9509056 -14849674 -11601269 -4286562 -307101 -1965287
7873 -1965287 -7776446 -15317886 -20475852 -19269375 -13253017 -8865990 -9004342 -9449911 -6299585
7864 -6299585 -2581953 -3646811 -9056009 -13064646 -11432980 -4679913 3813202 10130932
7856 10130932 11677982 9297220 6573004 5431779 4199944 1621228 198841 2912817
7848 2912817 8723464 14107293 17172296 17519762 14184119 7166960 -486164 -5480878
7840 -5480878 -7914754 -9281886 -8905042 -6007362 -3076897 -2372588 -932342 4990181 11477943
7831 11477943 10154532 924948 -5785561 -2724698 4602685 6590923 2406579 -1662550
7823 -1662550 -2777659 -3401666 -4171253 -1917142 4464315 11626391 16586127 19337173 19274871
7814 19274871 13959373 4338068 -2920709 -2425207 3071318 6686211 6127890 3831578
7806 3831578 159085 -7085127 -15598953 -17837678 -10983231 -2320428 478113 174018
7798 174018 4388848 12102014 14211083 7453315 -970698 -4881951 -6788173 -9928476
7790 -9928476 -10841082 -6557474 -2569462 -5150527 -10215985 -8848442 -1059932 5083706
7782 5083706 6109231 5237338 2932732 -3744565 -11262647 -10195862 861014 11791626
7774 11791626 15473468 16124839 18258254 17725628 11279579 5642281 7447306 11636734
7766 11636734 10290606 6686444 8912717 14297734 13346952 7008845 6272086 13512501
7758 13512501 17180882 9185938 -2954340 -6998945 -1392090 5735322 7377963 2645639
7750 2645639 -4790743 -9139720 -6383797 1484448 8351333 10749828 9587387 5842415
7742 5842415 -250025 -5815411 -7250193 -6218513 -7585520 -10674887 -9505913 -3003078
7734 -3003078 2492087 2929101 1206010 -147368 -2580785 -4578442 -141107 10719512
7726 10719512 18352326 16379385 10597306 8714815 9119102 7293360 5588428 7423865
7718 7423865 8322160 2859194 -4513239 -5855652 -2825480 -2996570 -6531518 -7264636 -4547205
7709 -4547205 -3115998 -3003977 -770065 553138 -5088548 -13311027 -12184633 -949814
7701 -949814 6613340 1963944 -6296141 -6210403 1628182 8951778 12435352 13587342 11967081
7692 11967081 6350714 -693197 -5306724 -6827381 -5962694 -2381422 1939525 1377477
7684 1377477 -6433945 -15687305 -18892782 -15635341 -11226952 -9411409 -9615498 -8622041 -2445824
7675 -2445824 9920646 22304018 25445149 18340489 10642348 10151844 13195715 12083809
7667 12083809 6770141 2790152 1632548 213528 -2231079 -3137863 -1476282 1455599
7659 1455599 4978908 8459391 9411867 6446702 2348120 204207 -1150103 -3497972
7651 -3497972 -4109967 139997 6022016 7627671 5094066 3098798 1946517 -2401324
7643 -2401324 -9270873 -11871060 -6982371 246109 3779302 3561191 2070175 -776307
7635 -776307 -5186247 -7830806 -5552256 -1082852 -623104 -5625061 -10451916 -9732129 -5846643
7626 -5846643 -6095158 -12324718 -17135301 -13740568 -6898569 -7726067 -17476990 -24097387 -18454691
7617 -18454691 -6758295 -420384 535358 5006131 15002488 22347018 21200261 14907682
7609 14907682 8682629 3482599 -31550 1299716 7723590 13652014 14270839 11207476
7601 11207476 8590946 7635491 8255331 11585402 16690601 18356639 12980277 4596306
7593 4596306 730815 3386098 7610022 8063368 3841508 -2615244 -8407119 -11711738
7585 -11711738 -12389554 -11611240 -10445805 -9328540 -9027393 -10583197 -13519054 -15548991 -14901247
7576 -14901247 -11616664 -6096252 1583345 9697410 14156985 11994121 5239315 -276791
7568 -276791 -813495 738361 -2583198 -13056966 -22971300 -21980009 -10869116 -2928008
7560 -2928008 -7874503 -19311479 -24182596 -20383766 -16315681 -15398647 -12092795 -4566982
7552 -4566982 -132253 -3276405 -7729418 -7091983 -5498027 -9541706 -15705800 -15361675 -8753396
7543 -8753396 -4234298 -4677615 -4025214 1287098 5659719 2852802 -4175225 -6487824 -15799
7534 -15799 10189279 16101931 15113071 11579012 10579439 11853062 11618842 8897858 6230635
7525 6230635 4374558 1338513 -2089752 -1635041 2827944 4923625 1414785 -1815115
7517 -1815115 531639 3248766 -1254593 -9207865 -10040141 -2945630 1884589 -569565
7509 -569565 -3238110 506722 6694380 8345368 5799198 3299206 978209 -2902397
7501 -2902397 -5529514 -2483267 4340796 7866728 5091549 697852 568046 4790767
7493 4790767 8264103 6597150 499074 -5361329 -7642689 -7593550 -7771036 -6976258 -2085882
7484 -2085882 5162324 8074623 3811114 -2024664 -3000066 -478328 -229348 -3074437 -4503978
7475 -4503978 -3106921 -3855380 -11048838 -21522771 -27711850 -26296066 -21664915 -20412181
7467 -20412181 -23257971 -23825234 -16620391 -5172864 929491 -2040311 -6647901 -3894986
7459 -3894986 4597917 8473280 1923128 -9378565 -15398290 -12074611 -2973922 6155416
7451 6155416 11668582 12343482 8370918 892212 -8000880 -15257506 -17835832 -15053532
7443 -15053532 -9802359 -5888526 -4094846 -2494958 -568618 -463805 -3268973 -6598014
7435 -6598014 -7734122 -7183196 -6868102 -6389310 -3746604 1147357 6281752 10220229 12394460
7426 12394460 11554416 7257573 2634009 1735687 3468376 2329451 -3192510 -7255165
7418 -7255165 -4566649 2158487 6374963 5944904 2599983 -3738202 -13869528 -23969899
7410 -23969899 -28125068 -26515147 -24665616 -23618867 -18007913 -6678575 1902472 -15397
7402 -15397 -9051608 -16355074 -19255518 -20600880 -19928752 -13644700 -3514038 2827109 1674468
7393 1674468 -2318497 -3744565 -3417511 -4800866 -7462448 -7789766 -4248999 953463 4583594
7384 4583594 5120699 3482620 1710713 272280 -2695654 -7702081 -10704548 -7166084
7376 -7166084 847805 5855408 4288178 525139 -146391 1561211 1840347 -142128 -2833923
7367 -2833923 -6218836 -10980264 -15302906 -16303466 -13686385 -8812730 -1573336 7984898
7359 7984898 16069155 17896246 14276289 11064249 11089801 10810343 6629474 506225 -3253719
7350 -3253719 -3245378 54076 6914888 15282473 17711065 7873634 -9586533 -21677249
7342 -21677249 -21596166 -15656942 -12926743 -13260522 -10792858 -5222526 -2058399 -2560199 -1298638
7333 -1298638 4132030 7552517 2486542 -8490878 -17336557 -20478039 -20497042 -19877876 -18030747
7324 -18030747 -14197911 -9308916 -4507536 -499744 1724424 1871346 1596279 2524262 3849470
7315 3849470 4299672 5231189 8688075 13379437 15926740 15307299 12689812 8064988 1409611
7306 1409611 -3543802 -2029546 4511733 8732019 6253859 56090 -5032318 -7449401
7298 -7449401 -6874627 -2289992 4750041 8976868 7139029 2124682 -1327069 -2101652 -1438293
7289 -1438293 365307 2815678 3825035 2727415 1891930 2111794 -481393 -8825671 -18731810
7280 -18731810 -22684040 -18378341 -9847866 -1813233 3328938 4586895 2564419 -347963
7272 -347963 -3108287 -7620654 -14037185 -17427637 -14020074 -8235761 -7371227 -10805852 -11398902
7263 -11398902 -7133248 -3639117 -3919847 -3548578 629424 4375734 3766480 2871626 6966960
7254 6966960 12344605 10817315 2646110 -3060958 -1549215 1445074 -204909 -2990997
7246 -2990997 665725 10167845 16410106 13582940 5999508 1310592 920671 316661 -3516323
7237 -3516323 -8818259 -12339979 -12286448 -7903415 245838 8402608 11199150 7170250 385981
7228 385981 -5243205 -10511746 -16872845 -20569935 -15859509 -4028031 5519005 5169911
7220 5169911 -2829518 -10306456 -12677788 -11645949 -10007232 -7918143 -5264676 -4268707
7212 -4268707 -6751789 -10364869 -11004794 -8762045 -7788393 -9508863 -10255673 -7916532 -6218914
7203 -6218914 -7878875 -7737966 110004 10513724 11405111 668741 -9692298 -9473540
7195 -9473540 -2727026 388438 -2502468 -6260710 -7024334 -4135354 2464746 9894698
7187 9894698 10870656 1911773 -9336864 -12104470 -5990917 574086 3497617 6468581
7179 6468581 11661906 15465098 15117665 12689639 10431336 7844399 4866004 2670420
7171 2670420 366881 -3763168 -7453351 -6913373 -4072661 -4156054 -5805061 -2403475 5200552
7162 5200552 7335707 764869 -4672125 -796568 6561388 7703330 3605937 1053581
7154 1053581 -317635 -5474017 -12650036 -15463005 -14294999 -15246701 -18666819 -18948737 -16053351
7145 -16053351 -16914274 -23244957 -27621677 -25423123 -21981887 -22767453 -23979160 -19457559
7137 -19457559 -11442465 -7325062 -9047141 -12336249 -14280237 -15238761 -14342128 -9550057
7129 -9550057 -2700848 1186748 1294016 2901119 9437785 16554322 17445616 11417493 3540174
7120 3540174 -2530117 -7423341 -12222973 -15707221 -16519801 -15491648 -14639834 -15554413 -18940639
7111 -18940639 -23302520 -24055704 -17757887 -8449859 -5379267 -11513343 -18311351 -15999733
7103 -15999733 -5700311 3488350 6498545 5508201 3463845 1451085 1736743 6072541
7095 6072541 10439364 8566389 1698959 -2493416 -2108683 -3508068 -8642796 -9479088 -1234878
7086 -1234878 7250268 4997724 -5256031 -12147359 -12588386 -13458075 -18133653 -21607618
7078 -21607618 -20303554 -18101057 -19193073 -20792533 -16778873 -5748624 6845962 13334171
7070 13334171 10632729 3815043 1339545 4965456 7654697 4504953 936020 4042406
7062 4042406 10067834 9067876 117665 -7492816 -8458322 -7625742 -9996567 -13152639 -13099938
7053 -13099938 -10373178 -6499684 -983039 4178376 3570657 -2932392 -6408807 -52393
7045 -52393 10136285 12251852 3536647 -7174968 -10504203 -5177657 3293565 8413525
7037 8413525 7641080 4341526 3998909 6978428 7625942 2610952 -3529033 -4733494 -1951217
7028 -1951217 -873443 -3817257 -8723999 -13977117 -18612926 -19089059 -12170284 -1603293
7020 -1603293 3680443 -87123 -7083365 -9763227 -7675680 -6069071 -8283900 -12225571
7012 -12225571 -13266902 -8693938 163251 8717232 12081644 8407677 267715 -6891922
7004 -6891922 -8404712 -4049426 1562125 3579986 2167839 1371383 2523145 1931473 -3037527
6995 -3037527 -8749632 -9614057 -5705365 -2318682 -2907858 -6160960 -9535760 -11687969 -11128128
6986 -11128128 -6518806 429361 5841203 9054592 13625538 20457784 23335493 15856002
6978 15856002 1634370 -7462037 -4724595 3574434 6644663 2734471 -270602 2870606
6970 2870606 7460520 6443069 687885 -3474565 -4635561 -7643156 -14084634 -17993309
6962 -17993309 -14263022 -6328711 -909847 1336159 4455920 8490723 8267550 1394950
6954 1394950 -7503778 -12263298 -11405445 -7327521 -2558531 826039 570420 -3826050 -9290146
6945 -9290146 -11699570 -10160966 -7082479 -4223739 -948039 2699513 3427730 -1953581
6937 -1953581 -10878061 -15820729 -12444200 -4911768 -838855 -2566056 -6306364 -8573773
6929 -8573773 -9363695 -9102912 -7130612 -4729924 -5550829 -10583794 -15954122 -18080123 -17811032
6920 -17811032 -16971497 -14606634 -10351372 -8007552 -10786607 -15246331 -15260407 -10872975 -8008694
6911 -8008694 -9598215 -11759947 -9331674 -1501124 8146092 13864225 10943931 1017610
6903 1017610 -6570199 -3811184 5790844 11712032 10968489 10912845 15762027 18642349 12264304
6894 12264304 944010 -5250553 -4311815 -2518643 -2864246 -1430186 3891814 8265535
6886 8265535 6779013 1754557 -735706 886474 2650706 1236670 -2060930 -4085004
6878 -4085004 -4281151 -4878695 -7375794 -10483438 -12032386 -11725010 -10834651 -9926514 -8568956
6869 -8568956 -7145826 -6957496 -7925233 -8031823 -6193610 -4300782 -5053959 -8603349 -12306573
6860 -12306573 -13011558 -9017203 -1257643 6362284 9413231 7489697 5171682 6487421
6852 6487421 9303631 7598801 -857936 -11420847 -17591530 -17126122 -12405499 -6819410
6844 -6819410 -2546025 -605385 -557879 99580 4001840 9956899 12405848 7136506 -2810466
6835 -2810466 -9510687 -9074348 -5541282 -4270839 -4383546 -1363729 4526295 7446911 4312088
6826 4312088 -691760 -2436004 -2239569 -5316399 -12794057 -20257320 -23795285 -23782273 -21963587
6817 -21963587 -18244551 -12624025 -8139915 -8591252 -13305320 -16845808 -15236430 -10761935
6809 -10761935 -8743656 -10683949 -13115102 -12883529 -10431220 -7013475 -2033790 4561448
6801 4561448 9962473 11718079 11378895 11582563 11255517 7875488 3377178 2734792 6287526
6792 6287526 8349469 4993013 -833022 -3780969 -2235671 1737465 5245133 5692402
6784 5692402 2399132 -1259580 -793361 2883349 4075836 1127879 -819808 1028718
6776 1028718 1375523 -4290382 -10361657 -8215653 518908 6012730 4340035 1262682
6768 1262682 1361298 1545953 -1657879 -4983461 -3201717 2871665 7458207 7011390 3292553
6759 3292553 337290 310399 1796624 1524436 -1523710 -4269304 -3340920 408980 3615252
6750 3615252 5119233 5362919 2569780 -5145218 -13930143 -16405493 -11236237 -4948888
6742 -4948888 -1989916 1167953 8221100 14804106 13925169 6496256 325291 -289591 1500244
6733 1500244 1780706 1664038 4356963 9226467 11523028 7990184 1339392 -2257447 -376151
6724 -376151 2833909 2584860 -145339 -1477991 -1637170 -3629867 -5985663 -3895638 1518892
6715 1518892 2853048 -1875242 -5070511 -1593965 3003649 2660185 1438266 5197192
6707 5197192 9257962 5494767 -2598900 -4318511 705390 2325993 -2395637 -4664946
6699 -4664946 -339208 2009310 -4572855 -14062291 -18007968 -17986108 -18719694 -16849575 -7175439
6690 -7175439 5094092 9122837 3167779 -4556095 -8106384 -8539521 -7521620 -4441916
6682 -4441916 -101370 3437540 6576308 9938193 10073659 4640017 58557 4657115
6674 4657115 14241093 14963359 3018202 -8803986 -8855551 -1407415 2916230 3038941 4806761
6665 4806761 8365503 8403464 4417880 1148640 -765400 -5724094 -13506332 -16873157 -12426676
6656 -12426676 -7624457 -11693492 -22787500 -29449668 -24338043 -12521983 -4973575 -6239040
6648 -6239040 -10807546 -11030014 -5756547 400646 3823688 4227154 1366182 -5500120 -13725182
6639 -13725182 -17821073 -16537993 -15014255 -16541914 -16770733 -10959079 -2959955 -491973
6631 -491973 -3713611 -5262796 -887250 6104002 10543720 9696270 2624754 -8106824
6623 -8106824 -14679701 -11730140 -6042871 -9605592 -21466994 -26936046 -19072443 -10061196
6615 -10061196 -13406356 -24383432 -29043788 -25541842 -23240292 -24070009 -19244996 -5857097
6607 -5857097 6085951 7885068 3644618 1754371 2417366 312902 -5323983 -9873916
6599 -9873916 -10147956 -7133154 -3365602 -863118 -377161 -746867 -700348 -1857033 -6445156
6590 -6445156 -11376107 -9958888 -1889011 4276338 2642944 -1562153 -542408 3992399
6582 3992399 4412706 -509450 -4781389 -5204442 -4376623 -3774025 -1460402 1924671 1809144
6573 1809144 -3139927 -8160527 -9473112 -9213407 -10352072 -11411855 -9932105 -7353669
6565 -7353669 -6312944 -5690740 -2381989 3356089 7499144 6711187 1687148 -2969994 -1865559
6556 -1865559 5818650 13739151 14643215 9795897 7398864 10163269 10858752 4332929 -2363771
6547 -2363771 1042112 12846113 21184547 19551176 12840152 7907539 5394467 2623508
6539 2623508 -1221411 -5097508 -7202893 -4984346 1860692 8097455 7736180 2699978
6531 2699978 990377 5068140 8500603 6330129 1850890 -527648 -2272915 -5494635
6523 -5494635 -7145744 -5124676 -4870704 -11954664 -21761263 -24948665 -20900222 -17120331
6515 -17120331 -16472680 -14323657 -8955023 -5313581 -5468044 -3787827 3678153 11709678
6507 11709678 13118963 8182328 1477011 -6012547 -15241661 -22770054 -23070533 -16346750
6499 -16346750 -8404349 -2944036 1078323 4501851 5707982 4717041 5009830 8577675
6491 8577675 11905640 9682800 1490507 -6966718 -8971349 -2607878 7705995 15032292
6483 15032292 15918536 12774389 9916116 8210494 5165904 -482839 -6807274 -11493523
6475 -11493523 -14028337 -14037658 -9886695 -1196103 8368477 13273210 11539144 6860730 4880689
6466 4880689 7830234 12970720 15851903 14692364 11457928 8956018 7722806 6359471
6458 6359471 4158604 1984722 594355 -325020 -758914 560597 4213097 7806592 7309443
6449 7309443 1258087 -7013345 -11951659 -10801927 -6283168 -4217855 -7853691 -14209874
6441 -14209874 -16776426 -12359605 -4274437 2190789 6037893 9962394 14259329 15020327
6433 15020327 9865532 2362372 -2053737 -2479887 -1597908 32436 4347211 10648755
6425 10648755 14769860 14643856 12629656 10588507 7081401 2327299 1298725 6902505
6417 6902505 13337555 12413561 5081870 383219 2976246 7983811 9396989 7402148
6409 7402148 4774754 1622672 -2379372 -4922534 -4636568 -4458113 -7190203 -10610900 -11355067
6400 -11355067 -10711232 -11376704 -11128038 -6326252 -355246 -786534 -7133830 -9154069 -713772
6391 -713772 11275447 16701863 15389414 13579217 11326363 2689140 -11399659 -19635309
6383 -19635309 -14149267 -1722611 4761526 2585342 378475 4350960 10350607 11254745
6375 11254745 6484605 726298 -2756721 -3537580 -1820062 578541 -898700 -8492282
6367 -8492282 -16755909 -17674244 -11502733 -6891900 -8509728 -10244351 -4454720 6628947
6359 6628947 14082766 14247894 11661392 10706278 10284196 8546714 8041742 12133515 18492715
6350 18492715 20697928 16842940 12763763 14035277 17185455 13524123 1946479 -7350918
6342 -7350918 -5286245 3914253 8159429 3010372 -4364910 -6406036 -3806150 -1212401
6334 -1212401 -38657 1179850 3202316 5829162 8309535 8226719 3529608 -2774298 -4298966
6325 -4298966 384250 5757600 7745340 8567816 10603724 11954318 12108350 14982409 20645027
6316 20645027 20984914 11159522 -626536 -3455968 1105067 3430306 1104241 -742144
6308 -742144 -1389059 -5496990 -12996324 -18440808 -20192973 -20552101 -17645786 -7941154 3585658
6299 3585658 7394271 3871073 1806444 1928153 -3939380 -14996815 -18577649 -10808161
6291 -10808161 -4655575 -8930613 -13940172 -8969160 -488950 641010 -1295839 4201977
6283 4201977 13829739 15884990 10325679 7326699 9151784 9243880 7737095 12066356 21387200
6274 21387200 25129035 19596492 13019028 11254222 10923055 10094945 13095504 19527529
6266 19527529 20368807 11857440 3058631 1966436 3118617 -2142008 -10516273 -11981831
6258 -11981831 -5634518 -360020 -1469116 -5225428 -6565710 -4986476 -1503615 4280290
6250 4280290 11353185 15358519 12859266 6203157 1344042 575383 -272423 -5683232 -13269790
6241 -13269790 -16322617 -13411136 -10815308 -13611070 -19064786 -22012084 -21999652 -20708491
6233 -20708491 -17098981 -10891343 -6519061 -6950199 -7743837 -4775051 -3255836 -9435216
6225 -9435216 -17370385 -16007187 -7322372 -3905899 -8461746 -10360600 -5199433 -2466346
6217 -2466346 -7804161 -12264999 -8172909 -2782916 -4927043 -8869894 -4622848 3588911
6209 3588911 3360340 -5846857 -12309274 -10209884 -6148788 -6736988 -9458404 -8175797 -1323621
6200 -1323621 7060426 10844627 7021221 154448 -1399625 3289607 5367420 -765491
6192 -765491 -8654575 -10180595 -7635279 -7327590 -8173938 -6618414 -6285840 -10760419 -12383813
6183 -12383813 -2196281 12772267 17346196 11410157 9098157 14664919 16419481 7986023
6175 7986023 -1458093 -4431679 -6718191 -13035391 -15545113 -7628767 2790431 5708220
6167 5708220 5128605 10277886 18716805 21244989 17791811 15423593 14486240 9332230 519455
6158 519455 -5545838 -7875474 -10692666 -12683165 -7703533 2910019 9221950 6135669
6150 6135669 -833792 -5339676 -7476384 -8869690 -8368096 -5770096 -3348321 -1221178
6142 -1221178 2583903 6016314 4511693 625330 3323119 13687693 20280713 14965613
6134 14965613 5367553 3428949 7857957 7691770 -364033 -8287410 -9469911 -5983760
6126 -5983760 -2377140 -174421 -417762 -4709256 -10875428 -13334111 -11027336 -10112262 -15074677
6117 -15074677 -21294512 -20920149 -13536783 -6513731 -5760598 -9685066 -12064062 -8396753
6109 -8396753 352852 8353059 9410449 2363462 -7954632 -15183846 -15512625 -7661601
6101 -7661601 7256535 23481440 31712056 26871961 13706953 1613725 -4394092 -4479191
6093 -4479191 905244 10463577 18030554 16669632 8114681 1431581 238913 -1627083
6085 -1627083 -8238006 -13081064 -8950763 -357023 2312103 -2505188 -7380174 -8415070
6077 -8415070 -8531393 -8342513 -3759962 4419061 7555888 1071883 -7626229 -9365288 -5970314
6068 -5970314 -5633965 -9204001 -9308878 -2424502 5643169 7844241 3872259 -2094493 -7216036
6059 -7216036 -10758827 -12167041 -11511777 -10439117 -10419419 -10876441 -10408692 -8766789 -6454664
6050 -6454664 -3824213 -1994122 -2855232 -5801865 -6042178 198000 9060672 11864997 5943304
6041 5943304 -1342967 -2263595 1224706 1531363 -3124542 -7317386 -7486006 -5517566 -2514787
6032 -2514787 3257917 9011641 6065421 -7634827 -19957405 -18227282 -6354274 1376859
6024 1376859 1075308 2172665 9099435 12891843 6466752 -2598855 -3363557 1771153 1773768
6015 1773768 -5642566 -11767352 -11351582 -9922080 -14196247 -21826716 -24570940 -18458029
6007 -18458029 -7821385 -286328 940962 -167397 2124371 7526911 10172445 7488993
5999 7488993 3928818 3010649 1167103 -4757568 -8728215 -2866594 8643076 12893799
5991 12893799 6407801 394814 4323565 12562527 13202918 4261547 -5603858 -9200324
5983 -9200324 -7463281 -5472982 -6686595 -10799089 -14304628 -13752686 -10040570 -7576827
5975 -7576827 -7862890 -7374214 -4209784 -2580113 -6436618 -12126139 -12559988 -6256488 2876559
5966 2876559 12212343 20748099 24973914 22175208 17592285 19887384 27467480 27453869 12692670
5957 12692670 -6784833 -15171501 -9267071 582627 4654815 2347803 -1995601 -5022275
5949 -5022275 -5040252 -1523338 4001289 8709961 10708561 9153398 3532075 -4460298 -9904401
5940 -9904401 -9362356 -5568514 -3180414 -1050156 5431487 14396995 17330341 11493288
5932 11493288 5511994 7650889 14275924 16393660 13095613 10360817 8969945 3118820
5924 3118820 -7982749 -15964571 -14637278 -8977579 -7836431 -12259847 -16296551 -16068278
5916 -16068278 -12273796 -5578172 4206275 13929834 17506324 12824564 5079978 1006724
5908 1006724 1826084 3700842 3327271 813714 -1987123 -3541892 -2834642 519097 5178366
5899 5178366 8078447 7119513 3992268 2940686 5868081 9865386 11163538 10575752 12289768
5890 12289768 17051508 19974510 17280635 12381687 11419346 14004155 13107090 5108715
5882 5108715 -4361397 -7438263 -3941070 -497374 -1139949 -2945021 -1329809 4087709
5874 4087709 10425575 15199765 16677080 13039982 4556290 -4455384 -9065957 -8978971 -7673974
5865 -7673974 -6808820 -4946912 -1951451 -326252 -623134 263813 3553906 5438380 3445420
5856 3445420 2158641 6796119 13502962 13369355 6120063 2014198 7263955 14426783
5848 14426783 12701837 3170359 -3021124 35522 6206719 6753324 1217792 -3936601
5840 -3936601 -4353387 -2013314 -1534406 -5152455 -11529790 -17210299 -18242395 -12387219 -2111957
5831 -2111957 5295159 3536639 -5821563 -14434880 -16200097 -12907691 -9640790 -7851012
5823 -7851012 -6102413 -4905278 -6206300 -9186412 -10987687 -11243092 -11863547 -12762078 -11984576
5814 -11984576 -9634600 -7188173 -3678803 1941883 5339923 850571 -8284148 -11707346
5806 -11707346 -6410520 -1327979 -3607144 -8448510 -8332758 -4791086 -3550719 -4273873
5798 -4273873 -3696421 -4075817 -9192535 -15263731 -15355563 -10935931 -9716771 -12911516 -13935061
5789 -13935061 -10036008 -6180540 -5841115 -6183990 -4853403 -4296238 -6342540 -8455545 -8253713
5780 -8253713 -6875316 -5681942 -4109776 -2376236 -2075752 -3197440 -4633591 -7242077
5772 -7242077 -11443305 -13197132 -9167520 -4565032 -7223366 -14317759 -15206651 -8489848
5764 -8489848 -4571514 -7953277 -9402619 -2119618 5896939 4503046 -3294843 -8646445
5756 -8646445 -10940022 -13426923 -12206658 -2659969 8056902 8892703 3105382 4806141
5748 4806141 17105052 27050854 25058155 17125497 12702602 10891922 5824327 -1803204
5740 -1803204 -6361236 -6062621 -3495669 -257387 3240888 4656646 2085919 -861532
5732 -861532 2486381 12682272 20872433 17746006 4735401 -6954947 -9334483 -6178321
5724 -6178321 -5523361 -7118096 -4104266 3712049 7448565 3213282 -456773 4159054
5716 4159054 11016976 9724203 1788937 -3838300 -7373948 -16700385 -29648784 -32287700
5708 -32287700 -19264655 -3529677 1262470 -1730841 -984997 5137244 8480994 5068984
5700 5068984 -750946 -4754961 -7272117 -8830206 -7944855 -4809439 -2595484 -3246675 -4827355
5691 -4827355 -4432104 -1918675 292525 332132 -715316 231961 4251255 8029881 7340966
5682 7340966 2409504 -2923216 -7003633 -11340604 -15303683 -14914590 -9325213 -3920596
5674 -3920596 -3423291 -5667669 -6247767 -5908753 -8170781 -11709300 -10752504 -3061517 6701835
5665 6701835 11968326 9592216 578892 -10857736 -18424911 -17219379 -7864556 3758755
5657 3758755 11188229 11349704 5551438 -1208739 -3174100 678810 4122409 -234235
5649 -234235 -11602482 -20573764 -19540120 -11350071 -5356978 -6194533 -9489130 -9032531 -4993114
5640 -4993114 -2296058 -2758438 -3473293 -3543619 -6840354 -14289108 -18385028 -12512618 -3391942
5631 -3391942 -5127950 -19368004 -30215413 -23700150 -5361660 8138291 9765247 6390645
5623 6390645 5055898 4094578 -638538 -7592193 -11198610 -8553482 -1990165 3403376
5615 3403376 3960790 695736 -1476151 580938 3808724 2456172 -4408065 -11524368
5607 -11524368 -13846487 -12149291 -11718425 -16648411 -25194924 -29961296 -24245432 -9959447
5599 -9959447 2535049 4840434 -1098871 -7667627 -11720068 -15170061 -17363399 -13776470
5591 -13776470 -3830910 5477511 6840182 515676 -6992655 -9391090 -4435369 5208242
5583 5208242 12782397 12113447 4056007 -3816697 -5929616 -4750415 -5968612 -10268114
5575 -10268114 -13178141 -11685654 -7729353 -5411480 -7072362 -11891427 -16439609 -16839962
5567 -16839962 -12151440 -5638294 -1467579 -481008 -467283 7171 -46485 -1672173 -3680629
5558 -3680629 -3807486 -1628972 477319 -502447 -5120807 -10626099 -13380085 -12049507 -8267151
5549 -8267151 -4662688 -3037619 -4081572 -7360505 -10975286 -12367495 -10572851 -7333917
5541 -7333917 -5218945 -4891632 -5044806 -5000844 -6223804 -10082525 -14330911 -13662575 -5448296
5532 -5448296 5697687 11205055 7008224 -2580986 -9610663 -9313132 -2119282 8057389
5524 8057389 15782427 16986217 12694597 8503239 8204176 9703032 9482863 8358578 8805456
5515 8805456 8697888 3254727 -6836125 -14486539 -14637617 -9280566 -2691698 3813791
5507 3813791 9891594 12911390 10453934 4246923 -1156818 -2576607 223570 5086793
5499 5086793 8095141 6234885 1668358 1019665 7688830 16703979 20123616 16209991
5491 16209991 10260596 7273727 7027871 6393509 3469318 -1656876 -8232769 -15243141
5483 -15243141 -20937313 -23166247 -21004086 -16179355 -12071912 -10384999 -9483178 -7294406
5475 -7294406 -4924023 -5176767 -8033814 -10483139 -10961862 -10777671 -10378490 -7633136 -1548047
5466 -1548047 5060541 8500139 7739910 3934240 -899080 -3655805 -2005422 1852424
5458 1852424 2811248 47747 -1580263 299334 1101025 -3013007 -8002630 -8207934 -5473584
5449 -5473584 -5057482 -5770991 -2665773 1999552 48013 -9079380 -15069737 -10663555 -1446178
5440 -1446178 3097612 2127132 861645 -23126 -4626441 -12427814 -15827509 -9588276 1281391
5431 1281391 6468858 2003645 -5813209 -8623714 -5813676 -3642409 -5653842 -8219002
5423 -8219002 -7236598 -4930828 -5819199 -8774473 -8483448 -3748294 917583 1888497 -134770
5414 -134770 -3282751 -6367938 -7614680 -6500842 -6515091 -10247110 -12348635 -5318850 6888908
5405 6888908 10607520 1318055 -8783750 -7888256 -175512 3655636 3194901 5051518
5397 5051518 8804063 8596713 5894454 8079324 14473961 15703154 9046960 3658794
5389 3658794 6808725 14159947 18118668 17699115 15135560 10021231 2633138 -2684334
5381 -2684334 -3067626 -1341042 -10101 3580969 10690969 15162440 10819242 1137540
5373 1137540 -5197272 -5510825 -3531088 -1429393 1391561 3386771 2076774 -490776
5365 -490776 -320747 780939 -2935070 -10974116 -15377116 -11714049 -5136226 -2685733 -4706657
5356 -4706657 -6968376 -7032834 -5234866 -2571243 -536847 -643525 -2063971 -2098692 -242361
5347 -242361 1067281 648269 -95595 -1018509 -3921345 -7783783 -8448136 -5657999 -4810978
5338 -4810978 -7742847 -7629648 757249 10483158 10259246 534589 -6757261 -4614749 884734
5329 884734 837151 -5057720 -10789213 -12305195 -9249346 -2484027 5306967 8931456 5517056
5320 5517056 -501301 -1316866 4601606 9898668 7086690 -1917216 -7453268 -3246540
5312 -3246540 6460198 12340771 10603706 5122450 55850 -4612889 -8828396 -9532836
5304 -9532836 -6413013 -5987542 -13421675 -22914010 -23723612 -14860781 -5842793 -2342513 228830
5295 228830 6173365 11193378 9789227 3951635 -1686130 -7457581 -14511748 -18213233
5287 -18213233 -13805627 -5114646 630888 3739161 8811916 12820008 7335870 -6632886
5279 -6632886 -16812229 -15896895 -10253842 -8208109 -8681166 -7438693 -6434747 -8910464
5271 -8910464 -11228516 -8367988 -3483839 -3140580 -5710992 -3675434 3525572 7959296
5263 7959296 5126449 -995283 -6568365 -13413328 -22527807 -29186161 -29214740 -24822235 -19601194
5254 -19601194 -12761689 -3834287 1345105 -3226561 -13192582 -16674090 -8687981 2621997
5246 2621997 6053541 -334322 -9153255 -12740185 -9327112 -1993490 5011275 8383599
5238 8383599 6682646 1417696 -2879117 -1793401 4137224 8790254 6781743 -92297
5230 -92297 -5263380 -5900398 -5419154 -6891896 -8558971 -8492541 -9312590 -13720832 -18424268
5221 -18424268 -18041487 -13461733 -10487162 -10598171 -9238670 -4376423 -767437 -2838109
5213 -2838109 -8036276 -11004901 -11119638 -11905994 -14740600 -16724246 -14546579 -8528426 -2992535
5204 -2992535 -2887080 -8476199 -13278461 -9955862 1116212 12194955 17669534 19010933
5196 19010933 18802473 15336219 7185609 -1332595 -4811161 -4195899 -4160031 -5058424 -3368629
5187 -3368629 773404 2619374 231003 -2082432 604573 7953767 15061198 16781320
5179 16781320 11753882 4545274 2217794 5505347 6044842 -2371060 -12439571 -11076115
5171 -11076115 2141142 13331105 12909541 6487793 2961483 953369 -5116258 -12109208
5163 -12109208 -11317980 -2272784 5423368 4579023 -1631386 -5303864 -2783187 2951377
5155 2951377 5500365 335860 -10284827 -18045338 -16921449 -9817725 -3897102 -1050774
5147 -1050774 2563757 8514872 13022198 12684722 8688636 3710582 -1661035 -7500237
5139 -7500237 -12421198 -14852034 -14573770 -11907901 -7434673 -3463156 -3373028 -7796738 -13043710
5130 -13043710 -14932365 -13234016 -11023872 -10174018 -8686978 -3041274 6725996 15046244
5122 15046244 15671823 8920306 1997511 955417 4542112 7539197 7325088 4521349
5114 4521349 124329 -4066469 -4465610 159936 4978979 4306263 -567261 -3876204 -4702571
5105 -4702571 -7461580 -12804085 -15064742 -11197272 -6110862 -5405048 -7595960 -7698523 -4829923
5096 -4829923 -1923525 -385312 954505 2952715 5141299 6474483 5331305 621964
5088 621964 -5623278 -9247440 -9138848 -8468357 -8965631 -7597290 -1790991 5444828 9244293
5079 9244293 9082154 7672843 6135027 4099038 2550840 2504037 2343808 364504 -1378460
5070 -1378460 276606 4019662 5128823 1887163 -2393497 -3678418 -831366 4685481
5062 4685481 10228906 13508709 14589820 15322044 15456695 12151072 5859930 2913471 7508720
5053 7508720 14185587 14390093 8609567 4783082 4980792 1791356 -9437047 -21680637
5045 -21680637 -24336773 -16112913 -5205103 931016 1677666 196426 -1646234 -3971419
5037 -3971419 -6213218 -5916424 -1691519 3096561 2478428 -4723918 -12482032 -15136523 -14378401
5028 -14378401 -14995676 -17000088 -17472289 -17451317 -19750007 -21339184 -16365227 -7202564 -3657133
5019 -3657133 -8912338 -14851888 -14796711 -12154485 -11347795 -8910087 -1190481 6248892 6115406
5010 6115406 1348483 242760 3123305 3501489 226699 -1679661 -1724836 -5093605 -11516226
5001 -11516226 -12650692 -4224794 6981624 12529535 12378525 11359931 11291368 11313254 11481264
4992 11481264 11307508 8445521 3133574 257234 2340172 3938937 -1539370 -11921519
4984 -11921519 -18948709 -19396763 -17501813 -16567692 -14473684 -9417959 -4922178 -5473824 -9940389
4975 -9940389 -12782927 -10649896 -5011759 1151904 6400205 9907453 10073040 6484524
4967 6484524 2445602 2573492 6875891 9756027 7061548 2009105 777837 3575529
4959 3575529 4558073 647597 -4647172 -7857650 -10889818 -16233985 -21038073 -20911410 -17166287
4950 -17166287 -15029387 -15706126 -15236213 -11212668 -6055452 -2802169 -1477530 -797996 -407794
4941 -407794 -316125 -426753 -931740 -909502 2517098 9793548 14535329 9097995 -4679394
4932 -4679394 -16319065 -20257798 -21895819 -26356711 -28435068 -20946785 -8024005 -959967
4924 -959967 -2874391 -6659189 -7923050 -10310738 -15636394 -18149293 -13997344 -9023152
4916 -9023152 -10133466 -14229082 -13762280 -9946439 -11271834 -19215515 -24337839 -19332825
4908 -19332825 -8975252 -2731081 -2451208 -2641664 -60207 2458729 1205698 -3603427
4900 -3603427 -8671789 -10361127 -6284551 3090646 13506521 19536979 19207706 15052623
4892 15052623 10586445 7306353 5120038 3357369 500147 -4752647 -10490225 -11620838
4884 -11620838 -5360294 4212477 9503295 7205553 1011326 -3026442 -1689751 4471044
4876 4471044 12273588 16930978 14824199 7531893 1358041 455033 1637889 -1378396
4868 -1378396 -9483254 -17109711 -19705220 -18799795 -18279696 -18681274 -17757845 -14761939 -11064927
4859 -11064927 -7220320 -2317911 3581692 8786089 12234916 14346381 15079165 13394480
4851 13394480 9622003 6088296 3839959 898421 -4015496 -7931678 -6949930 -2227854
4843 -2227854 721747 -1183735 -5571283 -8770506 -9674417 -8228128 -3458237 4292096
4835 4292096 11123873 12375371 7097361 -1604016 -9433675 -12910990 -10532098 -4098232
4827 -4098232 2327460 6236831 7735739 5984825 -1449520 -12732209 -19571739 -16318702
4819 -16318702 -8500462 -6225063 -11110113 -16543587 -19147612 -21292930 -22306757 -17323011
4811 -17323011 -7615889 -2091767 -3613686 -3521305 3246475 7046237 -2236393 -17200007
4803 -17200007 -21918716 -15060039 -10468512 -15086623 -19693886 -14939339 -5136423 -145215
4795 -145215 -1827179 -5232216 -7745256 -10686392 -14683085 -18060565 -18492410 -14565038 -8126049
4786 -8126049 -5231000 -10162978 -17773663 -17565711 -7392072 2840489 4082814 -1014703
4778 -1014703 -4037040 -2338633 202432 223074 -2001128 -4214794 -3785087 321873 5553693
4769 5553693 8450744 9375312 10019129 7030520 -3975305 -17198722 -19642318 -9315652
4761 -9315652 -174418 -2592628 -8976354 -7324648 437947 4675106 4735887 6788909 10562953
4752 10562953 11383049 11466120 15665789 18550757 9866197 -7745660 -20306181 -22430316
4744 -22430316 -22166047 -24475794 -24108600 -18531355 -14102473 -13587022 -9905715 786422
4736 786422 10788201 12947473 10963327 9954646 6739291 -1248364 -6157168 257465
4728 257465 12677123 18523529 14243142 6674024 2137684 2490983 8159326 16360851
4720 16360851 19171468 11725691 221915 -5642161 -5361264 -4800206 -4065895 1336751
4712 1336751 8063768 5091865 -10248787 -25226878 -26277210 -15351281 -6168675 -6775985
4704 -6775985 -11126601 -8572585 1745428 9324552 5618887 -4325704 -7480165 1133715
4696 1133715 13297929 19065475 17537591 14002524 12133587 12733166 15428600 17573718
4688 17573718 15374936 9366068 4501999 2216422 -1837417 -8889080 -12983510 -10690477
4680 -10690477 -7616188 -9033752 -11258773 -9697796 -8070128 -10555411 -11758571 -5457265
4672 -5457265 2345699 1416948 -5648277 -7334741 -1860690 1377437 -1623933 -4762867
4664 -4762867 -4794892 -6237428 -10651311 -12639038 -10029016 -7620568 -7259866 -4235506 2573226
4655 2573226 6727782 4954847 2921839 5570257 9820068 11429458 11341012 10878370 8341101
4646 8341101 4660118 4699003 8581862 9556764 4971652 1321524 3484644 7075630 6846176
4637 6846176 4517479 2519653 -1508880 -7210785 -7097710 1993573 10448693 8076737
4629 8076737 -1207652 -6179909 -4792422 -4308473 -8492238 -13916879 -17115114 -17500389 -14424001
4620 -14424001 -7755432 -216095 5503800 9554397 11317218 7775253 176108 -3437179
4612 -3437179 1483456 8622776 10175180 7625338 5919988 3525322 -2523836 -7578737
4604 -7578737 -5857902 -1240457 -736987 -1503029 3787390 12186604 14228520 10396061 9892738
4595 9892738 13221496 10687787 788701 -4131807 3965069 16880803 22908638 21601063
4587 21601063 18863716 15723091 9856528 2633078 -2439382 -4786928 -5405101 -3746120
4579 -3746120 319528 4540470 6763590 6309377 2347170 -4282344 -7697383 -2510561
4571 -2510561 6195474 6708730 -2872078 -10730200 -7987148 -462395 2083573 4358
4563 4358 -945726 -1421784 -5744657 -11420111 -11280206 -4621212 2356095 6760689 11591857
4554 11591857 17307134 18551066 12433815 4414855 1533257 2798725 815468 -7623308
4546 -7623308 -16519491 -18116630 -13062170 -9447258 -11581534 -14186491 -10655755 -3190132
4538 -3190132 498012 -1653178 -4383747 -3854491 -1465290 1562414 6566706 12443589
4530 12443589 14603787 11850326 8842395 8746697 8804360 6545365 5036643 7710445 12483514
4521 12483514 15376412 16094567 15813285 13125018 6749710 -468870 -4264445 -3535243 322205
4512 322205 5567444 9228291 8008688 3031398 -136240 1147044 3366466 3123577 1182305
4503 1182305 -2091685 -8146401 -13388144 -9546402 2759373 9449747 968795 -12595670
4495 -12595670 -15135332 -6905834 -459440 1033028 5763050 14366841 15654805 5711926
4487 5711926 -3040026 347749 9381479 10936220 3798686 -3282444 -6252740 -8138590
4479 -8138590 -9709959 -7918430 -3875821 -3712838 -8936770 -12543626 -8663829 -1435165
4471 -1435165 675206 -3261688 -6244346 -4529466 -2896814 -5927389 -9683014 -8016943
4463 -8016943 -3523619 -3904350 -8184875 -6209589 5244262 15041537 12276286 857915
4455 857915 -7804727 -10384272 -11049137 -10289674 -4989138 2480698 5720878 4751766 5567180
4446 5567180 8867198 8727300 3803388 182656 367712 -1156784 -7184056 -11328215 -7996977
4437 -7996977 -1703907 -70125 -2949817 -4730690 -3292488 -943256 262659 -798285
4429 -798285 -5092550 -10302926 -10376770 -3176334 4447883 4404647 -2266412 -7848042 -8565126
4420 -8565126 -7293365 -7111807 -7959437 -9748346 -13535017 -18108842 -19215064 -14356520 -6460323
4411 -6460323 -1019216 -264542 -1340777 -457590 2007200 2191360 -1170476 -4198944 -3651041
4402 -3651041 -2044489 -2663298 -2392298 3694195 11956236 12842685 4947032 -2279834 -2664630
4393 -2664630 -1361482 -4219149 -7845835 -7020553 -4299746 -3846965 -2070559 5844671 14707792
4384 14707792 15160097 8100599 2919921 2902853 3253068 3577679 10504045 24483841 34220688
4375 34220688 30168997 16781712 5831254 2649704 3855800 4340830 1536324 -4163705
4367 -4163705 -8925252 -7833241 -1296361 3241566 -612851 -10492351 -18882786 -22370604
4359 -22370604 -23482602 -24534655 -23947013 -19552930 -12722064 -7348082 -5653725 -6543705
4351 -6543705 -8327190 -11552438 -17215064 -22670757 -22718994 -16396943 -9474754 -7062201 -6443553
4342 -6443553 -1658494 6561905 10804441 6776088 -1970975 -9879995 -15236149 -18626039
4334 -18626039 -19645772 -17426756 -12037724 -4307735 3533393 7351404 4787063 -610427
4326 -610427 -2938276 -1627494 -1131932 -3302336 -5977082 -9453692 -16865224 -25857993 -27795776
4317 -27795776 -19639520 -9494583 -4869603 -2370250 3901708 10442522 10557600 7761274
4309 7761274 11176260 18881478 18355768 6252357 -3654129 1193794 14080839 17970256
4301 17970256 8167682 -3143186 -4621721 296084 827765 -5023659 -8078517 -1542917
4293 -1542917 8534824 10221867 837600 -9934292 -12570016 -8251397 -4081415 -2339405
4285 -2339405 59379 3616350 4381854 1077293 -1215358 2505736 9945376 13865798
4277 13865798 10643427 4104123 591905 1576498 2479443 -748443 -5483851 -5514875 100517
4268 100517 5333793 5772879 4197530 4118655 2511009 -4902923 -14067267 -15738611 -7739265
4259 -7739265 2735671 9385311 12599707 13995939 12508876 8747991 6737997 7572289
4251 7572289 6877549 2394548 -1452957 -961319 417354 -1460560 -3561605 -945154 4019818
4242 4019818 5130190 2446753 1250152 2411088 1810019 -714250 148160 6100865 11698373
4233 11698373 12488138 10634966 9310652 6974623 1374805 -4827674 -6867972 -4047454
4225 -4047454 121277 2026568 -21544 -5365819 -10224046 -10011673 -5118427 -1779360
4217 -1779360 -4296239 -9097775 -10155402 -7873802 -7855234 -11821700 -14764101 -11991748 -5194457
4208 -5194457 175865 1010764 -1662723 -5188830 -7571266 -7730274 -5082645 165405 6138497
4199 6138497 9462630 7776500 2582567 -1534586 -1279670 2532581 6651986 8317591
4191 8317591 6184507 753549 -4750839 -6311246 -4091443 -3482668 -8593598 -16435899
4183 -16435899 -20634891 -19429952 -16270841 -13440411 -9751316 -5160669 -3012187 -5334853
4175 -5334853 -9246276 -10942695 -10982236 -12401870 -14913661 -14508083 -9017866 -1181173 4940188
4166 4940188 8408316 10500017 10939306 7939457 2132677 -2485494 -3249980 -2232354 -2413733
4157 -2413733 -2416976 976739 5980564 6731129 2123787 -1638705 -4979 3568822 4347160
4148 4347160 4436551 7979327 11892794 9395125 1622025 -2490727 1090301 6538394 8259330
4139 8259330 8631184 11448265 13738733 10032516 1319513 -5813576 -7412527 -5453954
4131 -5453954 -4248136 -6728129 -12734865 -18024184 -16668094 -7471538 3336013 8256667
4123 8256667 5804681 -143132 -5333775 -6737753 -2623945 4680928 8635860 5756512
4115 5756512 1146708 2037754 7668727 11169296 10324446 9881984 12481021 13681423 8741214
4106 8741214 -218649 -7048792 -8861829 -7932418 -7975514 -10270350 -12693008 -12313237 -9688892
4097 -9688892 -9093381 -12401593 -15081391 -12233213 -6654638 -5392494 -9174044 -11719361
4089 -11719361 -9922093 -7658359 -7619222 -6624655 -2715761 -209171 -2374551 -4353016 425235
4080 425235 10204232 17095245 16896484 11715782 5329385 1151278 2519224 9238830 15067687
4071 15067687 13811186 6932397 651894 -2406306 -3114725 189267 9824918 21055290
4063 21055290 24373152 17547554 8587860 4192463 1854800 -3026115 -8502435 -9717610
4055 -9717610 -6642241 -2747052 901973 5073162 8236867 8012800 5289323 2524688
4047 2524688 -641597 -5682520 -10492291 -11561898 -10445525 -12516856 -18086550 -19847764
4039 -19847764 -12033877 1330213 10700368 11659693 8089955 5473930 4361906 1824904
4031 1824904 -2481831 -4534279 -1326118 3745977 3896954 -2299930 -8470145 -8860036 -6265233
4022 -6265233 -7726519 -14057879 -18747259 -17589127 -14264473 -14037512 -16085525 -15783434 -11973672
4013 -11973672 -7719566 -4841838 -1771803 2751427 7088252 9046708 8706118 7603148
4005 7603148 6502156 5145203 3309402 1168820 -792819 -1640907 -456394 2502670
3997 2502670 5800624 8406121 10214206 10290548 6256615 -2333756 -10635411 -11639180 -4013067
3988 -4013067 5375074 8810509 5953550 2101632 -194907 -3353186 -8267873 -10874429
3980 -10874429 -8427428 -5176088 -6750832 -11095243 -10825752 -4233215 2059399 2632569
3972 2632569 -221017 -1931093 -2169307 -2239232 -911687 2000172 1835293 -4861514 -12895075
3963 -12895075 -13767119 -7480032 -2303925 -2802800 -5007409 -4617470 -2862290 -1432030 1739586
3954 1739586 7213008 9934679 5779140 -1370106 -4188371 -1030364 3877258 6646874
3946 6646874 5489957 -1010580 -11696570 -20282928 -20532513 -13615099 -5822685 -97529
3938 -97529 4753542 7233395 2583596 -8916377 -18687471 -18433776 -9075798 1182138
3930 1182138 5402369 3080071 -976923 -1725777 688736 1005067 -3592001 -8030451 -5881644
3921 -5881644 560655 3394227 1787668 3137446 9672405 13085930 7567155 37347
3913 37347 -46816 4996886 5535939 -618510 -6696577 -7888130 -5368333 -922913 3969675
3904 3969675 4483993 -3096245 -12727564 -13556696 -5332894 427931 -2016891 -3602580 4986737
3895 4986737 18149125 23243341 17855384 9844843 3705425 -3005410 -10263268 -12377084
3887 -12377084 -6663683 2049858 8869645 14736067 20862554 22436877 13736522 -2480277
3879 -2480277 -15820740 -18648290 -12633742 -5094801 -1581277 -2472041 -4559260 -4722880
3871 -4722880 -2839042 -1659782 -3650527 -8349765 -13345468 -16846178 -17951337 -15447465
3863 -15447465 -8972090 -1664019 1075515 -2810636 -9224023 -12354731 -10587615 -6157483
3855 -6157483 -558694 6446028 13525705 17117299 15456540 10804991 6285686 2863227
3847 2863227 938865 1936498 5401651 6906406 2705101 -4778496 -9987233 -11743606
3839 -11743606 -13156644 -14481890 -11939127 -5202893 -181720 -768526 -2687278 -251112
3831 -251112 4699253 6227178 3611664 696548 -1980072 -6723333 -10959803 -8801634
3823 -8801634 -2049625 -422831 -6494078 -9491142 -1591482 7416138 2503295 -14267956
3815 -14267956 -26285582 -25949291 -22366914 -23346249 -23503129 -17191076 -11307133 -14370951
3807 -14370951 -21110119 -20431447 -13669243 -11404815 -14243087 -11218629 878370 10571764
3799 10571764 9578365 5453909 7987991 12746828 9036902 -2019674 -9221193 -8510836
3791 -8510836 -7302487 -11274785 -16478740 -16937976 -12528342 -6226532 438189 5698124
3783 5698124 5990448 -26833 -8357291 -13026794 -11071696 -3989386 2829955 2397014 -7458427
3774 -7458427 -19040294 -21237127 -12879311 -4415129 -3667497 -6013505 -3656362 951352
3766 951352 -1088766 -10225024 -15961455 -10600342 1217753 9581841 10754343 7642082
3758 7642082 2777127 -3472840 -8504229 -6949325 2722352 13842536 17277483 11233143
3750 11233143 2795390 -534660 1810521 5532763 7715508 8150099 6650391 3205680
3742 3205680 335555 1166277 4483459 5420563 2322066 -689391 -8888 1841996 -200686
3733 -200686 -6676680 -13063747 -15315267 -13903459 -13070390 -16936110 -24688120 -29014513 -22335923
3724 -22335923 -6399379 7420790 10041719 4196268 -743666 -302343 2844371 5624355
3716 5624355 8259133 11691493 15774509 20273314 24364199 25428448 21645491 15360493
3708 15360493 10569247 7697890 4373239 416874 -2103003 -2982325 -3301116 -1384310
3700 -1384310 5055590 12741142 15200245 12445213 11520418 15143989 17042249 12654396
3692 12654396 7461640 8477002 13016718 13373949 8728344 4291292 1125790 -4114159
3684 -4114159 -9572149 -7731292 2530903 11119296 8970703 182566 -3485536 2487165
3676 2487165 11024421 13083320 7345826 -416516 -4716155 -5185044 -4876434 -5708878 -6993076
3667 -6993076 -7851549 -8498817 -8001500 -3634487 4704085 11725530 12351208 8595658 6322069
3658 6322069 6359460 4762469 1770824 3116249 10047027 15365310 14053446 11601271 15522145
3649 15522145 23471453 27077332 24064887 18601491 11982224 2089116 -8118875 -10900226
3641 -10900226 -4727856 2798211 5687834 5733337 4913359 145565 -8699023 -13150236 -6583574
3632 -6583574 4765813 9700845 7432226 6188828 8812155 9715839 6431750 4351561
3624 4351561 7110591 10506936 10140016 8256735 8159633 7726463 4315273 1469846 4033144
3615 4033144 9373761 10284915 5614524 1728330 2983170 6179259 5994950 1691034 -3605495
3606 -3605495 -7187523 -8266333 -7345732 -5951114 -5657517 -6262378 -6120176 -4712389 -2971315
3597 -2971315 -467548 4954415 12783012 17540117 14310218 5836343 618024 3287529
3589 3287529 9748037 13061325 11227029 6767782 1289865 -5327524 -11178396 -12610757
3581 -12610757 -9531557 -6391028 -5767539 -4762725 -799450 2759029 1407354 -2824016
3573 -2824016 -4225245 -2589938 -3156900 -7177689 -9205348 -5893748 -1567263 -1612276 -5122027
3564 -5122027 -8112582 -10138824 -13127059 -16192295 -16041714 -11390222 -4106207 2621225
3556 2621225 5527872 3556621 927939 3962553 11898464 15688481 10428068 3844310
3548 3844310 5771076 13452462 15894365 10404494 5020992 4495177 3951840 -692895 -5014279
3539 -5014279 -3936226 -761779 -2424194 -9614063 -16633606 -18617542 -15254575 -9454297
3531 -9454297 -4919663 -2890475 56173 7594439 15972183 15894086 4719138 -8593823
3523 -8593823 -14673933 -14795764 -15845153 -19178695 -21106783 -20913896 -20784933 -19442122 -13558671
3514 -13558671 -5475851 -2176238 -5081965 -7342027 -3826454 1756854 3248991 1087960
3506 1087960 456417 2890560 4315506 1092905 -5255566 -10038207 -10392655 -7749664 -6206174
3497 -6206174 -8753419 -14546803 -19501861 -19674190 -14506344 -7345033 -2783314 -2786271 -5203070
3488 -5203070 -6676684 -6730383 -7514748 -9549748 -10127435 -7125355 -2267532 1146436 1948738
3479 1948738 727378 -2090754 -5043774 -4404350 1940539 9765209 11563926 5393664
3471 5393664 -2229852 -3861414 447745 4148582 2581931 -1839985 -3549905 -1541995
3463 -1541995 -788125 -5073140 -11061130 -12839036 -10799320 -10757476 -13958664 -14560467 -9999612
3454 -9999612 -6960830 -10933562 -15478361 -10709048 567264 5453693 -193846 -5881502
3446 -5881502 -2511673 5132707 7541499 4325652 1301177 -752820 -5423639 -11306943
3438 -11306943 -12449506 -8548946 -6741940 -10760401 -14817797 -12383189 -6416510 -5637270
3430 -5637270 -12665738 -20885873 -23114349 -19344518 -14573167 -11977438 -10613029 -8287287
3422 -8287287 -4090084 1599572 7380002 10887324 10629002 8262971 6994849 6995347 4881173
3413 4881173 -926160 -7229661 -10831354 -13230769 -16625458 -17750938 -11561753 -636333
3405 -636333 5510406 2462321 -3300608 -3975139 -1072475 -1620245 -6749761 -9843860 -5761045
3396 -5761045 2572048 7692833 5038657 -3514364 -11201710 -11274749 -2830863 7426860
3388 7426860 10917508 5410885 -3303275 -7636506 -4703768 2688839 9038970 9793122
3380 9793122 4515141 -2267744 -5017419 -3163881 -1604883 -3995640 -7494361 -6663934
3372 -6663934 -1355686 2857123 2510831 754515 1728839 3542020 1108035 -5084991 -8010369
3363 -8010369 -3145146 5703663 11958353 13959589 13794226 11979589 8499506 7127728
3355 7127728 12249957 20846871 23681029 16831515 7118056 2829430 3385514 2681165 -540301
3346 -540301 -1621993 1298933 3265273 -651329 -8063412 -12112666 -10458669 -8295336
3338 -8295336 -11278475 -17311709 -18166832 -9813006 1595238 6452628 2659443 -3497159
3330 -3497159 -6350069 -6231969 -5454271 -3995293 -1695242 -675020 -2118414 -3573026 -2952969
3321 -2952969 -2698251 -6039847 -11022474 -12509258 -9314316 -5565033 -5273153 -8587776 -12856558
3312 -12856558 -14539605 -11076145 -4132357 51706 -2638555 -7900948 -7642957 -537948
3304 -537948 6734936 9102762 8775536 9731614 11453841 11104487 8311682 4667889 1212655
3295 1212655 -708124 1319131 7351552 12738379 12558063 7480849 2513189 806216
3287 806216 1332724 1971704 2107432 2248078 3465362 7443797 14998156 23916485 29746454
3278 29746454 29479539 23901351 16406542 10336399 7229998 6467033 6240287 5376911 4258941
3269 4258941 3779030 3972442 4199399 3946660 2667199 -314614 -4474309 -7314942 -6678438
3260 -6678438 -3870373 -2681152 -4489507 -5815200 -2324579 5317078 11471036 11876405
3252 11876405 8278846 5189271 3181980 -1767575 -11575419 -21322358 -23638206 -16874311
3244 -16874311 -6804078 -609595 -972732 -5483708 -9459434 -9333725 -5760404 -3905475
3236 -3905475 -8340712 -16861151 -21656443 -17676211 -7654637 2180381 8575571 11500024
3228 11500024 10886923 6750036 1350524 -2216034 -3500237 -4191265 -4505061 -3065111 -551419
3219 -551419 -128236 -2749542 -4617407 -1606871 5099714 9994645 9401490 4829695 257583
3210 257583 -2004655 -1822684 854091 6274394 12595199 15282774 10993992 1945578 -5354679
3201 -5354679 -6175711 -1059328 6602882 13790288 17411470 13820083 2520442 -10596969
3193 -10596969 -17535569 -16343637 -12243460 -10174515 -9502036 -7568172 -4960795 -3877285
3185 -3877285 -3292309 -16139 5473731 8195093 5235873 300786 -803955 2433331
3177 2433331 5219436 4224488 1159457 -1171312 -3287492 -6976728 -10608033 -10056947 -4671143
3168 -4671143 541565 205424 -5545581 -11862513 -14623667 -13695585 -11778841 -11539003 -13314953
3159 -13314953 -14465514 -11627740 -4679391 2508939 6467804 7888307 9276462 10647358
3151 10647358 10543493 10099035 12014375 15358055 15595532 11119229 5979166 4141458 4502709
3142 4502709 4141519 3190419 3028197 2295222 -1156163 -5889707 -8424199 -8130707 -6895226
3133 -6895226 -5011070 -1716616 690499 -1953336 -9668720 -17526116 -21577415 -21803862
3125 -21803862 -18812998 -12422691 -4947509 -990207 -1478548 -2068994 157822 2901374
3117 2901374 4208243 6512169 10918325 12738035 8726614 4475576 7125380 13358471
3109 13358471 12961491 3800727 -4880317 -5331129 -188900 3838775 4841991 4969169 5708971
3100 5708971 7243362 8991622 8589656 3937956 -2159301 -3750349 61411 3391327
3092 3391327 2097350 -1186024 -2991542 -4001127 -4556420 -1744362 3750515 4228925 -4312926
3083 -4312926 -13106606 -10895831 -36735 6944261 5293424 2795570 6063215 11508276
3075 11508276 12837721 9691667 4839364 -938315 -6675559 -8801522 -5604196 -920250
3067 -920250 545354 -893280 -1920249 -1817301 -2869501 -6667517 -12414982 -17775207 -20008017
3058 -20008017 -17863127 -13342368 -9682816 -7189622 -3932817 -966025 -2593075 -9618883
3050 -9618883 -16645352 -19095860 -19072575 -20307086 -20671480 -15172698 -5151224 1059165 -2070582
3041 -2070582 -10345896 -14598330 -10486351 -1856983 4734444 6748319 5999604 4034647
3033 4034647 633370 -2349930 -214261 7435855 12269880 6530595 -4584172 -7651429
3025 -7651429 772920 8680228 4667913 -7939883 -18094293 -21515360 -21352063 -19512396
3017 -19512396 -15680984 -12456825 -13289905 -15664723 -13244350 -5341474 1558662 2599626
3009 2599626 -154865 -2309252 -2604884 -2333213 -2556663 -3188507 -2945760 -390861 3349807
3000 3349807 4760372 3328726 3736602 8609446 12630979 10015917 4806784 5583253 11543216
2991 11543216 13661129 10305722 10731180 19011941 24871767 17895900 3141432 -6256983
2983 -6256983 -6801172 -5467183 -5802841 -3243608 5233252 15164878 20764189 21102503 17809024
2974 17809024 11819208 5466634 3554506 8217376 14692429 15576457 8551282 -2250399
2966 -2250399 -11523169 -16957835 -18515320 -16378471 -11250006 -5672909 -3109354 -4755674
2958 -4755674 -7768641 -7780683 -3628618 1098003 1934474 -1433032 -4914052 -4707143 -1227769
2949 -1227769 1951420 1890363 -2022244 -9003730 -17078169 -22090597 -19542441 -9903552 -477538
2940 -477538 1136712 -4986391 -12334541 -16252371 -17042786 -15115514 -8864425 97880 4820048
2931 4820048 803470 -7204729 -10841530 -8347114 -4678351 -3342629 -3104084 -1970515
2923 -1970515 118789 2344127 3189936 588772 -4538279 -6747920 -2664333 2753863
2915 2753863 2015162 -4308494 -8896093 -8487063 -6610422 -6107276 -6301505 -7607741 -10979837
2906 -10979837 -12209077 -5584764 5286798 9966457 7182460 7784188 16969227 24508870
2898 24508870 20258318 9584445 3607380 2119301 -2488093 -10026359 -13244025 -10691304
2890 -10691304 -7837111 -7109608 -6858043 -8659645 -15349714 -22247929 -20374776 -9095507
2882 -9095507 3182888 11048238 15852912 17609920 13537654 6375415 3984815 7546899
2874 7546899 9215398 4714117 -721394 -2482877 -3218233 -4667562 -2467259 4365854
2866 4365854 7460064 847014 -8007576 -7656880 1732432 10621506 13931449 14006722 12484323
2857 12484323 8089526 2055981 -1700468 -2408838 -2853065 -3771351 -2806574 747480 4446465
2848 4446465 6107287 5305119 2038930 -2742810 -6213168 -6557651 -5509042 -4815833 -2429871
2839 -2429871 3502155 9104016 8808995 3845997 853644 2098667 2870425 -464119 -5352829
2830 -5352829 -8056516 -9046070 -10354611 -10744116 -7006009 927163 8481925 10313914 5292164
2821 5292164 -2291542 -6836561 -6778981 -4737279 -2792723 -675532 800531 -1042062 -5645893
2812 -5645893 -7838760 -5228623 -2537004 -3916504 -5709385 -3151787 196166 -2129483
2804 -2129483 -7980092 -9911845 -7978556 -8716234 -11875903 -9664349 -835307 6067513
2796 6067513 6877523 7580245 11058130 10279573 2388672 -2124263 4834187 13670306 10477563
2787 10477563 -1497410 -8134229 -7396378 -10027605 -18482339 -21712166 -14390744 -6679815
2779 -6679815 -8131633 -13542470 -13132384 -7800636 -4975405 -5552432 -4519058 -1101575 539380
2770 539380 -528440 -703426 954326 252271 -5783659 -13937907 -18016864 -15354110 -9250547
2761 -9250547 -5324315 -5113852 -3865518 3200878 12989023 16935960 12003035 4238554
2753 4238554 -548022 -3666958 -7213162 -7305376 -656588 6740854 6357664 517258 -163370
2744 -163370 7262112 13963130 13311966 9918564 10099137 11184277 7410001 1266492 670741
2735 670741 6613710 11107537 8104064 772482 -3826582 -3193238 -271878 1489042 1622399
2726 1622399 2124593 4784044 8891512 11667484 11473065 9797728 8833189 8131884 5867093
2717 5867093 2764484 1714181 2981848 3117697 552684 -577504 4376118 12949827
2709 12949827 17335573 14295647 9203598 7890725 8148609 3963964 -3570086 -5799721
2701 -5799721 1582772 11756523 15551053 12609126 8714181 5577136 556123 -4731942
2693 -4731942 -4092784 2985379 8624234 8159019 7252009 11398389 14971922 9818143 582089
2684 582089 477 9009913 13397146 4457047 -7438454 -7804320 848825 3301614 -6121116
2675 -6121116 -16432467 -16135856 -7118950 1480824 5825999 7531036 6052971 -1019950
2667 -1019950 -10661105 -14586907 -9518034 -2806217 -4035884 -13225190 -21194982 -21049753
2659 -21049753 -15616319 -12433656 -14160244 -16338481 -13706208 -6431721 429806 2497393
2651 2497393 241361 -2151650 -1408007 1944424 5317285 7476739 8772629 8627314 5524153
2642 5524153 619485 -1193444 3414219 10975676 14369658 11230516 6443605 5625374
2634 5625374 8845692 12232492 13273265 12047945 8855881 3922388 -554442 -1140926
2626 -1140926 2559298 6231770 5444329 1116425 -1637488 11078 3633461 5897186
2618 5897186 7240231 9596657 11417602 9396677 5171724 4973925 9957010 11787134
2610 11787134 3082486 -10848940 -17430476 -13166052 -7303215 -7707680 -10470596 -7986590
2602 -7986590 -1549346 755256 -3982403 -10089709 -11376452 -7434890 -1646578 2762541
2594 2762541 4037580 2828760 2367792 4687331 6829992 4530170 -423491 -1213828 4452989
2585 4452989 10388224 9645463 2378207 -6110893 -11200818 -10414275 -3503442 5268405 8863081
2576 8863081 5718213 2576874 4431984 6100465 769525 -6795763 -5369303 5059887
2568 5059887 11471145 6576178 -587484 1318099 9581706 13262229 9645476 5583553
2560 5583553 5322417 6276448 6332335 6756392 6736552 2751107 -4231719 -7574117 -4251197
2551 -4251197 135973 -828352 -6228523 -11234711 -14339871 -16557122 -16619976 -12316541 -5482132
2542 -5482132 -1256623 -2168800 -5633340 -7485334 -6490126 -5410269 -7774964 -12659759 -14001333
2533 -14001333 -8515470 -3028931 -7585170 -20345772 -27288074 -20785837 -10469191 -9090818
2525 -9090818 -15052256 -18196053 -17024616 -18564381 -24454356 -29834937 -34932991 -43982569
2517 -43982569 -51045769 -41610555 -14105367 13103319 24249616 24301423 24998420 24178146
2509 24178146 13192892 -2559794 -7419627 1648861 11144114 11799755 9650065 12110782
2501 12110782 15392657 13199139 8647205 8410899 10670417 7898137 -1100189 -9777015
2493 -9777015 -13441003 -13579094 -12616474 -10400094 -7156179 -4983422 -4248348 -2221570 2220234
2484 2220234 5469026 3737307 -1245701 -4436453 -4380128 -4236488 -5777463 -6365329 -3765395
2475 -3765395 -469082 189304 -41442 3431417 10678743 16454982 16995601 13506595 8202331
2466 8202331 1283471 -6453815 -12107921 -14163274 -14189769 -13230706 -10422286 -7193188 -7790198
2457 -7790198 -12171438 -13425298 -6953957 2339141 7293631 8239583 9204548 9258596 5978777
2448 5978777 3731963 8464847 16137554 17044864 11266316 8356045 10293898 7180050
2440 7180050 -5623453 -17778715 -18625177 -11965461 -7737841 -6708555 -2846892 4841727
2432 4841727 12369729 18526651 23730330 24760259 19577510 14205888 15286049 18215265
2424 18215265 13086257 1287202 -5146094 -1902081 1169908 -4234588 -12713289 -14491077
2416 -14491077 -8987131 -2252155 3166583 8315271 11519951 9451947 3362098 -1512752
2408 -1512752 -2581485 -1745040 -1059858 -521992 -244926 -1322976 -3752831 -5997315 -7391540
2399 -7391540 -9119102 -12062444 -15085115 -16232680 -14777237 -11443208 -7306486 -3456691
2391 -3456691 -1595785 -3338574 -7369143 -8346684 -1855284 8698820 13606500 7895850
2383 7895850 -1879941 -5283935 -74326 7373203 11291870 10674226 5804375 -2498378
2375 -2498378 -9980248 -12135566 -11322776 -13671498 -17636117 -14501331 -3761327 2048726
2367 2048726 -4903920 -14089832 -10991204 1470220 8230303 4765798 426991 -35390
2359 -35390 -2856347 -9431550 -8891079 4869148 20004899 21597878 12185166 5945353
2351 5945353 7492429 8832280 5404764 2636483 4931050 8746611 10133594 10532155
2343 10532155 10876309 7516421 -782010 -8049851 -9148866 -7547721 -8919563 -11285477
2335 -11285477 -8680971 -1848856 2424902 1738614 435684 1057304 573712 -2741175 -5020091
2326 -5020091 -3046091 -99143 -1342089 -6386321 -10326147 -10112501 -6564577 -1851688
2318 -1851688 1725906 1874605 -1439894 -4682566 -4566595 -2440569 -2165181 -4472625 -6431939
2309 -6431939 -5960881 -3776999 -1204268 703919 -13646 -4605119 -10264719 -12121855 -9669074
2300 -9669074 -7471911 -7923988 -7621314 -4057100 -1811604 -6755297 -16030670 -19803281 -13509868
2291 -13509868 -3235759 2915365 4266192 5073853 6048115 3475910 -3604065 -9861034
2283 -9861034 -9163353 -1323321 8310344 14370159 14864606 10590826 4022612 -1041445 -1262955
2274 -1262955 3204950 8450176 10724693 9978072 8654700 8081969 7649563 6915775 6434433
2265 6434433 6311187 5961777 6086140 8927048 14902676 20252823 20269182 14798852 8696374
2256 8696374 6232994 6428565 5041039 583024 -3098917 -1175416 5459739 9304708
2248 9304708 3812006 -8248138 -16298662 -13294678 -3678296 2379257 1021730 -2939627
2240 -2939627 -5168319 -7480457 -11549947 -12247093 -3610075 10492418 18679897 15981629
2232 15981629 9263654 6315697 5550826 1374253 -4859140 -6189370 -735401 5597408
2224 5597408 7403582 5137254 1426410 -2170919 -2979176 2085688 10006338 11380531
2216 11380531 2073408 -8830392 -9204800 274207 7507369 5621069 727323 1160132
2208 1160132 5783248 7382208 3145547 -3513893 -9320747 -14134134 -17802195 -18256401
2200 -18256401 -14198600 -7539600 -1765112 1436719 3342407 6187494 10057350 12158369
2192 12158369 10152308 5965593 4392600 7384139 11788952 13719413 12787772 10522599
2184 10522599 7471562 4671049 5327012 10720691 15733966 13341109 3822948 -5033965
2176 -5033965 -8051299 -8563271 -11982723 -17351679 -18866705 -13750771 -5334376 835543
2168 835543 1810710 -857453 -2429083 484673 5383556 5836046 -640436 -9432605 -15482560
2159 -15482560 -19262082 -22576053 -22593128 -16078687 -6889240 -1907443 -496714 3909674
2151 3909674 11105187 12101947 3314071 -5809050 -5615856 -180207 -515255 -7940757 -12646608
2142 -12646608 -7461418 4282847 14580272 18382618 15195326 8484996 4062725 4609035
2134 4609035 5920119 2957884 -1561100 -583055 5842034 9689440 6520737 644450
2126 644450 -3446654 -7341476 -12551020 -14918671 -10717954 -3351162 1552374 3603837
2118 3603837 4870149 3849696 -1197493 -5900223 -3969597 3450318 9160728 10107466
2110 10107466 9808540 10417465 9077846 4160493 -677738 -2076294 -2557644 -6680746 -13887885
2101 -13887885 -18726254 -17388996 -11413276 -5026130 -880050 986212 1360099 579856
2093 579856 -881637 -2125658 -3435925 -6947707 -13276091 -17921364 -14275598 -1230939
2085 -1230939 14577192 24781487 25192535 16308971 2842048 -6149023 -2686433 10684245
2077 10684245 21433252 21262745 15539576 13907313 16361291 15540726 9438588 3595509
2069 3595509 1642029 1381281 764178 1011875 2689227 4595397 7706155 14445588 22460460
2060 22460460 24721912 18292843 8518347 2131081 58762 -675875 -1509085 -1653894 -859883
2051 -859883 -674185 -3341802 -9369281 -15606133 -17649449 -15679758 -14786953 -16992311 -17485025
2042 -17485025 -13116157 -9176335 -10904432 -13607654 -10421972 -5114788 -5409083 -7126216
2034 -7126216 290691 13083764 14705843 1480490 -9939278 -7793865 -2061886 -5723902
2026 -5723902 -13398924 -12376291 -4077091 769840 917491 3115077 6508758 3658604
2018 3658604 -4790591 -10072125 -9393830 -7949288 -7111267 -2421258 5983240 12012229 13838250
2009 13838250 15012067 14292180 5507598 -9766598 -20008047 -18306335 -10151269 -2956092
2001 -2956092 3029001 8701319 10183476 5675609 1159952 2046517 4421782 1676238
1993 1676238 -4407299 -6707108 -4405889 -3960840 -8398593 -12062952 -8446476 464135
1985 464135 5896435 2555969 -5324618 -9404673 -7173331 -3568509 -2828540 -3186268 -1900030
1976 -1900030 -805463 -2246518 -3357237 -640425 2278969 -1368529 -10698657 -17443952
1968 -17443952 -17108081 -13117450 -9487828 -6487075 -4831449 -6905394 -11234441 -12092673
1960 -12092673 -7501433 -2026349 861567 3200850 6330073 6489114 918025 -6678604
1952 -6678604 -11109575 -11873839 -10466828 -6150979 745931 5220635 2933364 -2999214
1944 -2999214 -5621500 -3501706 -2195928 -6474648 -14233310 -18736025 -15488068 -6517504
1936 -6517504 2079269 6716440 8649859 8745362 4004947 -6155239 -14004048 -11774040
1928 -11774040 -4347304 -4157024 -12343917 -15282690 -4114122 11684196 16976331 9859989
1920 9859989 68924 -5930537 -9433043 -12046880 -12328644 -9843216 -6574698 -3685856
1912 -3685856 -604148 2868020 6191969 8894226 9962921 8590603 7047827 9360932
1904 9360932 15061753 18563195 17574915 17130515 21192429 25454876 24167476 19766651 18860970
1895 18860970 21342959 20498159 12923902 2330304 -6169842 -10464782 -10327652 -6409538
1887 -6409538 -733205 4672956 9080002 11102769 8076717 684907 -4595447 -2095101
1879 -2095101 5792405 11926976 13085662 11401214 9430071 8390753 9558106 12666464
1871 12666464 14080037 10864920 5536885 2636529 1899374 -738401 -6237799 -10951534
1863 -10951534 -11708111 -8628210 -3043779 4006282 10817596 14673892 12926444 4772380
1855 4772380 -5956776 -10651169 -3814004 7783170 10274855 48453 -10864040 -11218637
1847 -11218637 -5074757 -3155904 -6588016 -8593993 -7746189 -8867669 -12297518 -12203482 -6414842
1838 -6414842 -185078 1307685 -1290844 -3763750 -1989243 5696059 15457101 19180305
1830 19180305 13376782 4417793 290181 874744 1911519 3657774 7915709 10953881
1822 10953881 8613285 5067088 6721481 10259232 7413060 -347926 -3331682 933336
1814 933336 5385096 6742615 9098200 12658021 11121263 3847553 -532256 2454073
1806 2454073 5639231 1528866 -6761911 -10900966 -7249964 2367900 13585155 20129128
1798 20129128 17620364 9161290 1576819 -4328456 -12562690 -21344049 -23321662 -17443471
1790 -17443471 -10316123 -3981877 6253783 18733298 22739630 14829708 6551377 8229205
1782 8229205 14571350 14579746 7712820 1671443 273057 1369995 2385665 2014622 352336
1773 352336 673921 5610241 9730349 4274421 -8104460 -13602207 -6524978 2895758
1765 2895758 5816152 7841535 16221613 25411646 26586283 22618819 21810930 23576829
1757 23576829 21756560 16545116 12230118 7875921 725829 -5236825 -4075634 2173914
1749 2173914 7165224 10063866 13380504 15338926 13196383 10179081 10377966 10465916 5028924
1740 5028924 -3467570 -8464622 -9712063 -11736507 -14838695 -15064753 -10569079 -2129255
1732 -2129255 9056344 19194299 22907149 21366526 22552901 28097352 28433990 17742523
1724 17742523 4391031 -1418859 -852680 1045983 5350410 12071601 14222618 10052614
1716 10052614 9729554 18032920 23007488 15468672 6446080 9254929 17488093 18709882
1708 18709882 16624208 19483605 19848600 8894627 -1443203 4244235 16599517 17042807
1700 17042807 10431983 13540398 22424461 23399025 24950635 41857269 58560597 51324929
1692 51324929 37253048 50107189 74118283 65845100 45011255 84029811 178245600
1685 178245600 207992389 90703625 -89590267 -179669030 -145409298 -84040050 -71356585
1678 -71356585 -83387799 -74173853 -50864369 -41034570 -41475041 -35997641 -29082738 -31160410
1670 -31160410 -34963603 -30864945 -26237924 -29939875 -34587240 -30919306 -24528948 -23982640
1662 -23982640 -26262093 -26129852 -26357689 -28113110 -25060548 -16800390 -13898540 -19958554
1654 -19958554 -23457841 -17438430 -12063691 -16230213 -21687036 -18489714 -12460362 -12899655
1646 -12899655 -15028077 -9974494 -2240267 -1630674 -5726423 -5605716 -2551983 -4014156
1638 -4014156 -8029715 -6899480 -3204047 -6968883 -17429697 -21796728 -14379633 -5200967
1630 -5200967 -5675912 -14436673 -21635409 -21255221 -15233430 -9189252 -7282375 -9623332 -12901969
1621 -12901969 -13558337 -10254619 -4098473 1393462 1422894 -5032272 -11504732 -10326633 -2758358
1612 -2758358 3000481 3906659 4357974 5432459 1921169 -5985165 -8443024 -278104 9336815
1603 9336815 9704153 3270408 -1559744 -4720326 -10466162 -15048912 -11592449 -4561116
1595 -4561116 -5987467 -16855543 -24464051 -20886418 -13133446 -10545745 -11491674 -9011341
1587 -9011341 -2941720 1034495 1074926 1181830 4122193 7246722 6423081 1443383 -3964906
1578 -3964906 -6602168 -6956666 -7509271 -8807097 -8746454 -5769717 -1056769 2904719 4228808
1569 4228808 1865704 -3641317 -8851297 -9586964 -5893761 -2660927 -4029944 -9251069
1561 -9251069 -14755241 -17543212 -15868354 -10168671 -4625523 -4193705 -8746759 -13869064
1553 -13869064 -18072703 -23857138 -30233877 -31085550 -24455304 -16837521 -13579735 -11537592
1545 -11537592 -6915075 -3479944 -5218309 -7093217 -3175672 454738 -7099664 -22619189
1537 -22619189 -29170024 -17896294 597705 10597985 8742970 2331174 -2679664 -5346412
1529 -5346412 -5626863 -3580614 -2083385 -5433891 -13807700 -21034020 -19491573 -7863286
1521 -7863286 6220944 12820308 9592040 3117942 -242832 -1070549 -2355688 -3206796
1513 -3206796 -1941742 -1472033 -5243224 -10507230 -12433059 -12597300 -15509290 -18293430 -13257664
1504 -13257664 -1194586 7585822 7825137 5661945 7018323 9063574 8425762 8728204
1496 8728204 12488941 13352464 5707232 -3724776 -4272731 2237683 4171876 -2143026 -8073780
1487 -8073780 -6868446 -1838048 2431972 7268317 13198221 14528086 8064340 1248815
1479 1248815 2897012 9186295 8176217 -2263678 -10331991 -6782626 2227654 4110410
1471 4110410 -3294691 -10215446 -8275184 569777 8420624 9953204 5387802 -1413597
1463 -1413597 -6046356 -6982843 -7101598 -10000965 -14243030 -13688242 -4728420 8773077 18859716
1454 18859716 20273341 13670752 4559928 -385059 1166968 4357655 2723218 -2557771
1446 -2557771 -3078472 5161251 15026959 16797385 9880001 1786419 -1651009 -364993
1438 -364993 3354146 7251352 9159602 8888156 8958611 10034252 8262501 1867177 -2933543
1429 -2933543 352333 6970430 5756191 -4650563 -13727895 -15021215 -14349162 -17519813
1421 -17519813 -19228832 -12174918 -614128 4914290 3156332 2674895 7326651 10675502
1413 10675502 7528487 3128388 5274502 11819519 12667267 3523459 -7872901 -11055620
1405 -11055620 -4668118 4018002 8943469 9964131 8048723 1708349 -8368802 -15575911
1397 -15575911 -14058264 -7283574 -3913173 -5503487 -4859454 1903853 8253999 6080902
1389 6080902 -3178816 -11113557 -13104813 -11786155 -11284739 -12261718 -12487670 -9702661 -4252892
1380 -4252892 -244231 -2292931 -9361894 -14330155 -12298508 -6695059 -3701864 -3237204
1372 -3237204 -266169 6393159 12039079 13003364 10557036 6814695 1564681 -4380415
1364 -4380415 -6602355 -1586736 7883463 14866509 15111053 9821731 2781947 -2590398
1356 -2590398 -3695578 464389 7219625 10719874 7007081 -1266098 -6934073 -5901734
1348 -5901734 -1455386 -55277 -3885487 -9022960 -10410518 -7008290 -2070397 293147
1340 293147 -1305233 -4418410 -5466344 -4269025 -4574106 -8462628 -12221612 -11190785 -7344243
1331 -7344243 -7054270 -10993937 -11953970 -5277235 3489318 5593419 447981 -4584315 -3899628
1322 -3899628 1042498 4860235 2762739 -7078186 -21433855 -32276060 -32875536 -24432176
1314 -24432176 -14136373 -6705962 -885348 5393491 9989644 8792934 1313238 -7836345
1306 -7836345 -13008612 -12833495 -11478668 -13736951 -18513833 -19188726 -11928177 -1293649
1298 -1293649 5213931 6271839 6662895 9292434 11873500 11860480 10235158 8796744 7234534
1289 7234534 5022206 3551283 4084753 5402076 5516137 4425088 3400527 2525551 582756
1280 582756 -2979769 -7049257 -9854428 -10791186 -11217313 -12626369 -13698574 -11263455 -5973015
1271 -5973015 -4201598 -10039092 -17118216 -14580339 -1790341 9501090 10471709 6274081
1263 6274081 6676077 11205583 11485849 5709545 1677193 4369047 8600820 7719928 3263923
1254 3263923 603124 -614174 -4946683 -11803635 -14472978 -9670967 -2657226 -103541
1246 -103541 -1697098 -2377632 -511311 341465 -2691927 -7866498 -11723715 -13394953 -14581520
1237 -14581520 -16725926 -19478026 -21129266 -19829977 -15448878 -11117948 -11679964 -18809350
1229 -18809350 -27806485 -30849062 -24392689 -13010312 -5161115 -4898124 -8275223 -8624944
1221 -8624944 -4752066 -1919213 -4193552 -8508391 -8828403 -4379783 -71543 741871 -126735
1212 -126735 804 695861 569423 171219 435769 642996 17766 -809702 -1690836 -3753905
1202 -3753905 -6426006 -6618300 -3243374 598459 2634450 4811817 7866718 6734236
1194 6734236 -2567201 -14184911 -17666900 -11252871 -3341871 -710802 -2041331 -4063110
1186 -4063110 -6874748 -10185339 -10329643 -5165771 2107012 7292941 9568989 8776690 3046987
1177 3046987 -6730082 -14037499 -13398540 -7523044 -3389039 -3436739 -5159898 -7197068 -10168221
1168 -10168221 -12216083 -9591019 -2847298 2222036 1897998 -595095 213913 4967221
1160 4967221 9571195 10799868 9183253 6745426 4352932 2163692 943644 1059379
1152 1059379 762745 -2202750 -6778173 -8828379 -6706247 -4030417 -4236143 -4820464 -1358399
1143 -1358399 4033098 3685880 -5396844 -17027635 -23049400 -21078683 -13878940 -5623767
1135 -5623767 -717429 -1673408 -5394609 -5507926 -761331 3269903 3062437 2027109 3069286
1126 3069286 2741728 -1669335 -5248467 -2916549 1023245 -879299 -6972474 -9368529
1118 -9368529 -6567353 -3758210 -1918867 3184935 10805985 14277579 12284803 11490472
1110 11490472 14851340 16431357 11978589 6207676 4548631 5267027 5196568 6072145 9065642
1101 9065642 9741211 5294848 881593 1443494 2608178 -2271521 -10425399 -13424874 -9329338
1092 -9329338 -2876338 3514445 10303395 14701643 13168854 8948844 8073314 8377379 2043409
1083 2043409 -10282271 -17883810 -15091883 -9016364 -8474168 -13164373 -18190609 -22073083
1075 -22073083 -25015771 -25104683 -21579334 -17328804 -13800810 -8212434 -36130 5048721
1067 5048721 2851403 -2365757 -4000973 -1886314 450802 2683284 5429368 5287561
1059 5287561 -348873 -6379529 -5595724 670643 5043377 5831115 8287871 14519397 20092265
1050 20092265 21515101 19967002 16747960 12112378 9406069 12440657 17072187 13910327
1042 13910327 2547740 -5505962 -2879753 2812042 661209 -8083274 -14254346 -14950808
1034 -14950808 -14269610 -13105539 -7859231 1082438 7806000 8885430 6661200 3796926
1026 3796926 518559 -1814204 -439855 3493822 4477195 -15202 -5822224 -8118193
1018 -8118193 -7509781 -7471406 -8534521 -7904106 -3533577 3181191 8101780 7602090 2495025
1009 2495025 -1880279 -1572108 1100997 1547516 149463 822685 3384607 3722555 2253986
1000 2253986 5036769 13448766 19485308 16383095 8705505 5772334 8756450 10984267
992 10984267 8961877 6133733 5677372 5657569 3057173 -1436873 -4473188 -3460910 1771628
983 1771628 8577715 12499067 10844312 5605567 1383048 927599 4057450 9170567 13167015
974 13167015 11642338 3031214 -8009919 -14850597 -16008191 -14590513 -11687470 -5238389
966 -5238389 4185047 11578121 13358587 11183030 8191553 5075501 1736743 -750597
958 -750597 -2199620 -4283495 -7216901 -8412890 -6590752 -3969520 -1920687 1815154 8005020
949 8005020 11595349 7563079 -945503 -5619846 -3400937 989798 2782170 2465481 2523208
940 2523208 3478884 4991025 7006599 7565263 2927457 -7006256 -15874778 -17012682 -11282425
931 -11282425 -5552809 -3873589 -3446840 28480 5937596 9590372 8032307 3002556
923 3002556 -1584556 -3455722 -2981428 -1806902 -1597329 -3470366 -7177269 -10480556 -10429557
914 -10429557 -6192828 -278157 3840451 5188194 5624209 6649748 6918435 3992222 -1624465
905 -1624465 -5713665 -4853270 -989958 563448 -1792386 -3225641 1030263 8069362 9680691
896 9680691 2591438 -6923170 -10206797 -5448770 2342539 8323157 11516988 12494432 11217858
887 11217858 8543177 7416362 10120392 14549820 15048326 8400728 -1022502 -3914644
879 -3914644 4015230 15184535 16387593 3373840 -13524523 -20876507 -17054975 -12160205
871 -12160205 -14614539 -22599626 -29065189 -30145892 -26122202 -18003317 -7286935 2435799
863 2435799 7338984 6891535 3489181 -879134 -5411408 -8545000 -8184111 -4626243 -984411
854 -984411 653324 1904292 5228874 9261687 9226068 2780217 -5914817 -9720499 -6277467
845 -6277467 -734163 321677 -3529995 -6856574 -5654968 -1648091 1224918 1747649 956467
836 956467 -1092162 -5290746 -11043979 -16191754 -18918186 -18023503 -12585668 -4067186 2308708
827 2308708 2094625 -2270995 -3676222 438744 5028778 5424159 4160423 6268056 10926676
818 10926676 12733365 10171507 8038299 10866108 17552799 23593143 25858768 24037800
810 24037800 19647475 14890778 10915867 6542585 346800 -5830189 -7943301 -5127856
802 -5127856 -1387584 -360638 -738964 999774 5093591 8132860 7175299 2206481 -4548895
793 -4548895 -9699279 -9919220 -4627237 2434241 6144868 4878474 1292033 -1474143 -2743768
784 -2743768 -3286898 -3030979 -882861 3570433 8874170 12615777 13742230 13464322 12973815
775 12973815 10976242 5592318 -1361142 -5029050 -3659498 -966356 -197762 854070
767 854070 5215520 9687546 7612940 -1797707 -11634250 -15387896 -13006124 -8266502 -4149160
758 -4149160 -2105659 -2188848 -2022048 1365790 6986936 10089791 8604906 6300914 7243309
749 7243309 9876723 9373119 3943744 -3597205 -8977849 -9305077 -4661013 1159867 3275281
740 3275281 774027 -2728591 -4690269 -6678083 -9941268 -11662170 -8739490 -2114695
732 -2114695 5916022 15051647 23543126 25478315 17543960 5681647 -1684904 -4914390
724 -4914390 -10014154 -15754217 -13702539 -2812069 5818416 3721146 -3151735 -3879275
716 -3879275 2108503 6702233 6100392 3690013 1410691 -3191970 -9649130 -11414224 -4300572
707 -4300572 5812592 8456221 916792 -8346652 -9293267 -1036585 8648888 13196995
699 13196995 13498516 13427995 12728896 8370910 1562032 -1716629 1801849 8836236 14744754
690 14744754 18378324 19547188 16182189 8031416 -77476 -3292764 -3107275 -4381226
682 -4381226 -7592627 -8680900 -5995158 -2979103 -3483528 -7573773 -12217330 -13718126 -10067197
673 -10067197 -3483149 297002 -2041497 -7459852 -11296060 -13506926 -16163446 -17548330
665 -17548330 -14797455 -10711692 -10788690 -13854588 -13312851 -8389485 -5769748 -7879252 -8352452
656 -8352452 -3263847 1692807 1096302 -1107908 123930 906075 -3789193 -8211049 -3349435
647 -3349435 6822658 9237109 1621765 -4029535 -279801 5484350 4715424 864404
639 864404 1176260 3715849 1882460 -3634878 -6938420 -7650306 -10166565 -13650695 -12074898
630 -12074898 -4962161 349758 -338197 -1960992 1336399 7327150 9844314 7647437
622 7647437 4285195 1899608 220857 282675 3972445 9536853 11779607 8201090 2049962
613 2049962 -2157581 -3614879 -4008818 -3824671 -2731560 -2259890 -4567157 -8310540 -8952513
604 -8952513 -4610253 869277 2790056 1740925 2078296 5180168 7451024 5577915 1073045
595 1073045 -1830042 -1092811 1693809 3529713 2358513 -1733047 -6186050 -7422376 -4075773
586 -4075773 1143384 3638604 1270098 -3589073 -6387782 -5172564 -3158103 -5319657
578 -5319657 -11565705 -15411785 -12079439 -5864866 -4651224 -7863326 -6769895 1060767
570 1060767 5257641 -3121668 -16419726 -18628613 -7056343 3958629 2757671 -5066165
562 -5066165 -6661323 275649 6892937 7046037 4001841 2917036 2889463 -393907 -7357262
553 -7357262 -13571260 -15531452 -14582899 -14020728 -14103789 -12347877 -8441481 -5652308 -5694893
544 -5694893 -5265274 -1212324 3016277 1356978 -4644311 -5647183 2932556 13220433
536 13220433 14064453 4742313 -5424805 -9527404 -9757764 -11089810 -13081267 -11129682
528 -11129682 -4041838 2986049 3902402 -1198475 -6499329 -7875821 -7508714 -9507341 -13379105
519 -13379105 -15346880 -14699818 -14012416 -13063959 -8125515 883443 7875213 8411066 5469358
510 5469358 3793090 3087259 1476027 1255816 4970260 8923567 7548138 2440380 88736
501 88736 1588536 1797357 -1339947 -3948290 -3685950 -3011720 -3260175 -2203442 250578
492 250578 696067 -610973 1708558 8410534 11360462 4661694 -5807195 -10530120 -9227709
483 -9227709 -8369059 -9621525 -8979836 -5563143 -3188573 -3210041 -2721072 -436155 1797989
474 1797989 3949103 8089519 12632317 12444052 6776940 1537610 1072256 2684215 2195754
465 2195754 254905 -327434 584303 1985718 4550948 8145049 9828301 8339131 7337924
456 7337924 9621130 11248389 7208980 706235 -148684 5438534 9069730 4902403 -3271703
447 -3271703 -9338652 -12892865 -15470430 -14318716 -6792840 1877826 2736747 -4988762 -12536379
438 -12536379 -13291051 -9738364 -6453597 -2511911 3996692 8431094 3774630 -8664140
430 -8664140 -19148414 -20997580 -16864835 -12059985 -7183583 -1013101 3692014 2808779
422 2808779 -2214983 -4990676 -1986390 3931603 8212312 9641048 9763836 10121806 11382181
413 11382181 13113163 13335177 10354142 6076908 5070320 8600056 11897538 9817118
405 9817118 3460552 -1807752 -3803595 -5372091 -8745286 -11837458 -11933166 -10339827 -10594229
396 -10594229 -13104199 -14222747 -10997467 -5238560 -2049744 -4700759 -11149501 -15625799
388 -15625799 -14208588 -9199525 -7105800 -11414640 -18264530 -20732668 -16713004 -10349547
380 -10349547 -5668581 -1767623 3829650 9328287 9726871 3886731 -2526923 -3137443 1517707
371 1517707 4874226 2968383 -138367 2602197 11825442 20219085 21199225 16413710 12075579
362 12075579 9787783 5333811 -3172489 -10588862 -10844670 -4639376 2184505 5795828
354 5795828 6456664 5255873 3004867 1725698 2963549 4450490 2477648 -2007099 -4034871
345 -4034871 -2290020 -1232732 -3417546 -4830968 -1810147 1783362 -123082 -5939936
337 -5939936 -8075234 -3846180 1123994 1287786 -2109998 -4562781 -4455985 -3261063 -2610150
328 -2610150 -3556563 -6357585 -8882202 -7617523 -2547107 1416672 730503 -1368804 424255
319 424255 5003878 6026399 1579129 -2577763 -1433002 2146210 2184096 -1900723 -6012322
310 -6012322 -8354225 -10394845 -11716842 -9881293 -6438309 -7069950 -12837818 -16670286 -13046812
301 -13046812 -6719899 -5973782 -10529019 -13227584 -11915117 -11407262 -13194237 -11768282 -4340978
292 -4340978 3234953 5148916 4335429 6696151 11159374 11969310 7907276 2781974 -1385955
283 -1385955 -5357644 -7991408 -6994604 -4381619 -5222511 -10141958 -14321794 -14808764 -13470240
274 -13470240 -11474053 -6692746 694242 5295534 3288919 -1512491 -2570934 803002
266 803002 3775660 3408147 1953171 2992847 7032148 11196996 11839472 7671229 1372429
257 1372429 -2423965 -1555861 1912018 4691655 5706559 5974500 6682713 8283155 9995446
248 9995446 9342846 3940602 -4953561 -12159339 -13339191 -9196827 -4106080 -1714403 -2572094
239 -2572094 -4602830 -4952469 -2644450 -79379 -476971 -3501872 -5530846 -4804437 -3559748
230 -3559748 -3775991 -3833716 -1759251 726343 479482 -2259161 -4315666 -3963852 -2191331
221 -2191331 -264162 1302787 1610121 -180891 -2877559 -3746828 -1646032 1593368 3277148
212 3277148 2350472 -345783 -3275643 -5250809 -5878487 -5429502 -4280685 -2471459 289730
203 289730 4120831 7884569 8704909 4394196 -2504422 -5436875 -1416392 3898322 2708634
194 2708634 -4260723 -8569357 -5873037 -1384067 -1436213 -4729107 -5571999 -2023148 3232981
185 3232981 7491042 9727474 9524192 7423937 4984363 2600197 -461796 -2552482 -194450
176 -194450 5468362 7712547 3742120 230761 3842919 10642571 11959714 7564677 4928001
167 4928001 6902439 8465181 5940048 1831309 -758181 -1797847 -940898 3260206 9048987
158 9048987 12245917 12953012 15524486 20128183 20822383 14744565 7000693 3031118 1885111
149 1885111 749181 342655 1268858 360003 -3966941 -7151851 -5028536 -1395334 -3169090
140 -3169090 -10470955 -17011664 -18351181 -14686337 -7454143 1300934 7351617 7415199 3575159
131 3575159 413361 -1388764 -4338040 -8178297 -9597202 -7583976 -4509928 -1953639
123 -1953639 248305 1081189 -762529 -2915449 -1156440 4049797 7570380 7159466 6031272
114 6031272 6250611 4780404 -851234 -7382181 -10262720 -10092311 -10535303 -12088426 -12096279
105 -12096279 -9643395 -6437411 -3369013 129469 3286285 4064520 2778257 2526207 4620841
96 4620841 6219817 4582941 1680564 1691364 4720517 6284293 3865443 1107288 3054550
87 3054550 8667496 11279191 7032826 307490 -1129062 4622533 11015976 10013624 783639
78 783639 -9116677 -11371401 -5430461 1406672 2521070 -1179610 -4235358 -4132500 -2444933
69 -2444933 150596 4970221 10667448 12600936 9363532 5575688 4989665 5118407 2895470
60 2895470 1233528 3853242 7051996 4502768 -1282070 -1203977 5904508 10256050 5984643
51 5984643 221278 1198798 4834846 2137565 -4763707 -4947025 3483700 8667963 1682751
42 1682751 -10463006 -14656882 -8966855 -2715160 -1950259 -2894094 -728061 2197185 979157
33 979157 -3301555 -4869651 -1604682 2660579 4344632 4337080 4579049 4167441 1624809
24 1624809 -1488414 -2493112 -1589705 -620248 1060792 5548441 11319948 13442135 10144089
15 10144089 5514474 3575676 2919699 179708 -3708841 -4565123 -1286313 2458268 2939582
6 2939582 18128 -4129666 -7337609 -7902328 -5078608 -287607
0 -287607
##END NTUPLES=NMR SPECTRUM
##END=
