##TITLE=31Pdec_LR-698-R3-ETP7
 CDCl3, 124 sc
 27.1.2020
##JCAMPDX= 6.0         $$ Bruker NMR JCAMP-DX V2.0
##DATA TYPE= NMR SPECTRUM
##DATA CLASS= NTUPLES
##ORIGIN= UXNMR, Bruker Analytische Messtechnik GmbH
##OWNER= root
$$ XWIN-NMR		Version 3.5
$$ Mon Jan 27 15:30:18 2020 Russian Standard Time (UT+4h)  she@DPX200
##.OBSERVE FREQUENCY= 81.013821
##.OBSERVE NUCLEUS= ^31P
##.ACQUISITION MODE= SIMULTANEOUS
##.ACQUISITION SCHEME= undefined
##.AVERAGES= 124
##.DIGITISER RES= 17
##SPECTROMETER/DATA SYSTEM= spect
##.PULSE SEQUENCE= zgpg30
##.SOLVENT NAME= CDCl3
##.SHIFT REFERENCE= (INTERNAL, CDCl3, 0, 182.463)
##AUDIT TRAIL= $$ (NUMBER, WHEN, WHO, WHERE, WHAT)
$$ ##TITLE= Audit trail, XWIN-NMR		Version 3.5
$$ ##JCAMPDX= 5.01
$$ ##ORIGIN= Bruker BioSpin GmbH
$$ ##OWNER= she
$$ F:/spectra/data/she/nmr/P31/1/pdata/1/auditp.txt
$$ ##AUDIT TRAIL=  $$ (NUMBER, WHEN, WHO, WHERE, WHAT)
(   1,<2020-01-27 14:59:43.51 +0400>,<she>,<DPX200>,
      <continue with go, POWCHK disabled, PULCHK disabled
       configuration hash MD5:
       00 E9 B6 7A A2 85 ED C7 34 08 36 98 17 FE 4E 26
       data hash MD5: 32K
       43 1E A0 B7 2B B5 3F F2 E2 43 AE C3 86 D7 BA 27>)
(   2,<2020-01-27 15:29:07.53 +0400>,<she>,<DPX200>,
      <Start of raw data processing
       efp BC_mod = 2 LB = 1 FT_mod = 6 PKNL = 1 PHC0 = -1691.083 PHC1 = 214.6012 SI = 64K 
       data hash MD5: 64K
       C3 4B 20 E9 23 20 D7 4A 8C 22 71 37 6A 0E 65 60>)
(   3,<2020-01-27 15:29:37.31 +0400>,<she>,<DPX200>,
      <pk PHC0 = -11.38343 PHC1 = 44 
       data hash MD5: 64K
       ED A7 FA E9 04 E1 3E 5B 37 FF 34 20 41 4F EA F7>)
(   4,<2020-01-27 15:29:40.71 +0400>,<she>,<DPX200>,
      <abs ABSG = 5 
       data hash MD5: 64K
       C8 46 A4 B8 75 0D 76 6D 6F 0F 9C BF 2A 2E 98 D8>)
$$ ##END=
$$ 
$$ hash MD5
$$ 68 F5 4C BE 9E 20 1D A8 EA E3 03 DC 73 DC C3 EC
##$RELAX= 
##$RELAX= 
##$RELAX= 
##$RELAX= 
##$RELAX= 
##$RELAX= 
##$RELAX= 
##$RELAX= 
$$ Bruker specific parameters
$$ --------------------------
##$DU= <F:/spectra>
##$EXPNO= 1
##$NAME= <P31>
##$PROCNO= 1
##$TYPE= <nmr>
##$USER= <she>
##$AMP= (0..31)
100 100 100 100 100 100 100 100 100 100 100 100 100 100 100 100 100 100 
100 100 100 100 100 100 100 100 100 100 100 100 100 100 
##$AQSEQ= 0
##$AQ_mod= 1
##$AUNM= <au_zg>
##$AUTOPOS= <>
##$BF1= 81.014009
##$BF2= 200.13
##$BF3= 200.13
##$BF4= 200.13
##$BF5= 200.13
##$BF6= 200.13
##$BF7= 200.13
##$BF8= 200.13
##$BYTORDA= 1
##$CFDGTYP= 0
##$CFRGTYP= 5
##$CHEMSTR= <none>
##$CNST= (0..31)
1 1 145 1 1 1 1 1 1 1 1 1 1 1 1 1 1 1 1 1 1 1 1 1 1 1 1 1 1 1 1 1 
##$CPDPRG= <waltz16>
##$CPDPRG1= <>
##$CPDPRG2= <waltz16>
##$CPDPRG3= <>
##$CPDPRG4= <mlev>
##$CPDPRG5= <mlev>
##$CPDPRG6= <mlev>
##$CPDPRG7= <mlev>
##$CPDPRG8= <mlev>
##$CPDPRGB= <>
##$CPDPRGT= <>
##$D= (0..31)
0 1 0 0 0 0 0 0 0 0 0 0.03 2e-05 3e-06 0 0 0 0 0 0 0 0 0 0 0 0 0 0 0 0 
0 0 
##$DATE= 1580122604
##$DBL= (0..7)
120 120 120 11 120 120 24 19 
##$DBP= (0..7)
150 150 150 150 150 150 150 150 
##$DBP07= 0
##$DBPNAM0= <>
##$DBPNAM1= <>
$$ [...]
##$SUBNAM3= <"">
##$SUBNAM4= <"">
##$SUBNAM5= <"">
##$SUBNAM6= <"">
##$SUBNAM7= <"">
##$SUBNAM8= <"">
##$SUBNAM9= <"">
##$SW= 369.568048894756
##$SWIBOX= (0..15)
0 1 3 0 0 0 0 0 0 0 0 0 0 0 0 0 
##$SW_h= 29940.119760479
##$TD= 32768
##$TD0= 1
##$TE= 0
##$TE2= 300
##$TE3= 300
##$TEG= 300
##$TL= (0..7)
0 120 53 12 22 120 120 120 
##$TP= (0..7)
150 150 150 150 150 150 150 150 
##$TP07= 0
##$TPNAME0= <>
##$TPNAME1= <>
##$TPNAME2= <>
##$TPNAME3= <>
##$TPNAME4= <>
##$TPNAME5= <>
##$TPNAME6= <>
##$TPNAME7= <>
##$TPOAL= (0..7)
0.5 0.5 0.5 0.5 0.5 0.5 0.5 0.5 
##$TPOFFS= (0..7)
0 0 0 0 0 0 0 0 
##$TUNHIN= 0
##$TUNHOUT= 0
##$TUNXOUT= 0
##$USERA1= <user>
##$USERA2= <user>
##$USERA3= <user>
##$USERA4= <user>
##$USERA5= <user>
##$V9= 5
##$VALIST= <valist>
##$VCLIST= <CCCCCCCCCCCCCCC>
##$VD= 0
##$VDLIST= <DDDDDDDDDDDDDDD>
##$VPLIST= <PPPPPPPPPPPPPPP>
##$VTLIST= <TTTTTTTTTTTTTTT>
##$WBST= 1024
##$WBSW= 4
##$XGAIN= (0..3)
0 0 0 0 
##$XL= 0
##$YL= 0
##$YMAX_a= 38121
##$YMIN_a= -9694
##$ZGOPTNS= <>
##$ZL1= 120
##$ZL2= 120
##$ZL3= 120
##$ZL4= 120
##$ABSF1= 182.463
##$ABSF2= -187.1042
##$ABSG= 5
##$ABSL= 3
##$ALPHA= 0
##$AQORDER= 0
##$ASSFAC= 0
##$ASSFACI= 0
##$ASSFACX= 0
##$ASSWID= 0
##$AUNMP= <proc_1d>
##$AZFE= 0.1
##$AZFW= 0.5
##$BCFW= 0
##$BC_mod= 2
##$BYTORDP= 0
##$COROFFS= 0
##$CY= -3
##$DATMOD= 1
##$DC= 0
##$DFILT= <>
##$DTYPP= 0
##$F1P= 0
##$F2P= 0
##$FCOR= 1
##$FTSIZE= 65536
##$FT_mod= 6
##$GAMMA= 0
##$GB= 0
##$INTBC= 1
##$INTSCL= 5.30512e-09
##$ISEN= 30
##$LB= 1
##$LEV0= 0
##$LPBIN= 0
##$MAXI= 10000
##$MC2= 0
##$MEAN= 0
##$ME_mod= 0
##$MI= 50
##$NCOEF= 0
##$NC_proc= -9
##$NLEV= 6
##$NOISF1= 182.463
##$NOISF2= 159.3651
##$NSP= 0
##$NTH_PI= 0
##$NZP= 0
##$OFFSET= 182.463
##$PC= 4
##$PHC0= -1702.466
##$PHC1= 258.6012
##$PH_mod= 1
##$PKNL= yes
##$PPARMOD= 0
##$PSCAL= 0
##$PSIGN= 0
##$REVERSE= no
##$SF= 81.0140089999434
##$SI= 65536
##$SIGF1= 159.3651
##$SIGF2= -187.1042
##$SINO= 113.3802
##$SIOLD= 16384
##$SREGLST= <1H.CDCl3>
##$SSB= 0
##$STSI= 65536
##$STSR= 0
##$SW_p= 29940.119760479
##$SYMM= 0
##$S_DEV= 0
##$TDeff= 32768
##$TDoff= 0
##$TI= <>
##$TILT= no
##$TM1= 0
##$TM2= 0
##$TOPLEV= 0
##$USERP1= <user>
##$USERP2= <user>
##$USERP3= <user>
##$USERP4= <user>
##$USERP5= <user>
##$WDW= 1
##$XDIM= 65536
##$YMAX_p= 410816061
##$YMIN_p= -174223903
$$ End of Bruker specific parameters
$$ ---------------------------------
##NTUPLES= NMR SPECTRUM
##VAR_NAME=  FREQUENCY,     SPECTRUM/REAL,   SPECTRUM/IMAG
##SYMBOL=    X,             R,               I
##VAR_TYPE=  INDEPENDENT,   DEPENDENT,       DEPENDENT
##VAR_FORM=  AFFN,          ASDF,            ASDF
##VAR_DIM=   65536,         65536,           65536
##UNITS=     HZ,            ARBITRARY UNITS, ARBITRARY UNITS
##FACTOR=    0.456856943014862, 1,           1
##FIRST=     14782.0589164792, 0,            0
##LAST=      -15158.0608439998, 0,           0
##MIN=       -15158.0608439998, -174223903,  0
##MAX=       14782.0589164792, 410816061,    0
$$ Real data points
##PAGE= N=1
##DATA TABLE= (X++(R..R)), XYDATA
$$ [...]
$$ plain form
3965 -16541203 -35910172 -17493657 6888793 6872574 -3746066 451693 12433828 7963725
3957 7963725 -16630787 -45093474 -62521689 -58966286 -31678463 292278 6990299 -9414244
3949 -9414244 -9248504 24774465 51713746 28004195 -26703915 -58197850 -53754176 -46578934
3941 -46578934 -54814979 -61582731 -55704553 -50002867 -51490799 -48900476 -38749015 -31878353
3933 -31878353 -25887299 -3701329 30073651 44624419 28517248 7205170 -930811
3926 -930811 -10924334 -31553569 -36417550 -8624022 16966255 17750 -37481102 -38811893
3918 -38811893 794829 25850654 3323253 -33851270 -41812258 -24294676 -12641507
3911 -12641507 -18238447 -32236107 -51115849 -74731009 -91655237 -90176014 -75738868
$$ packed form
3965a6541203j9368969J8416515K4382450j6219j0618640M197759J1982135m470103
3957G963725k4594512k8462687j7428215L555403K7287823L1970741O698021j6404543
3949i414244J65740L4022969K6939281k3709551n4708110l1493935M443674P175242
3941d6578934q236045o767752N878178N701686j487932K590323J0151461O870662
3933c1878353N991054K2185970L3774980J4550768j6107171k1312078q135981
3926i30811r993523k0629235m863981K7793528K5590277j6948505l7498852j330791
3918c8811893L9606722K5055825k2527401l7174523p960988J7517582J1653169
3911a2641507n596940j3997660j8879742k3615160j6924228J479223J4437146
$$ plain form
3904 -75738868 -59739056 -41138264 -16366623 4370240 10289039 8767664 10256265 5596108
3896 5596108 -17263382 -43488035 -47661735 -35888125 -40287086 -69118023 -92725631 -85977198
3888 -85977198 -55894542 -17945379 24830626 63970250 76270872 54832951 26787213
3881 26787213 16883116 13972173 -866559 -13327857 3501367 39863235 57234149
3874 57234149 43303656 25570894 26267973 34295134 31627917 21981384 19137508 24410440
3866 24410440 28773229 25856034 14524864 -865834 -7417684 7756034 40932153 73242201
3858 73242201 90055555 88707679 70891338 44574276 30276858 41944492 60278903
3851 60278903 51690632 19148679 4035734 25638038 51208271 47096943 28378322
$$ packed form
3904g5738868J5999812J8600792K4771641K0736863N918799j521375J488601m660157
3896E596108k2859490k6224653m173700J1773610m398961k8830937k3607608O748433
3888h5977198L0082656L7949163M2776005L9139624J2300622k1437921k8045738
3881B6787213r904097k910943j4838732j2461298J6829224L6361868J7370914
3874E7234149j3930493j7732762O97079Q027161k667217r646533k843876N272932
3866B4410440M362789k917195j1331170j5390698o551850J5173718L3176119L2310048
3858G3242201J6813354j347876j7816341k6317062j4297418J1667634J8334411
3851F0278903q588271l2541953j5112945K1602304K5570233m111328j8718621
$$ plain form
3844 28378322 26226316 31072034 9546345 -33460080 -52366023 -22954986 27699700
3837 27699700 60120411 61794015 39316204 141926 -42053429 -65078607 -59368238
3830 -59368238 -39725996 -24715495 -16846240 -12757753 -17264262 -32198440 -43152234 -34650488
3822 -34650488 -12326384 5205211 12078750 17548001 24913865 24938613 14255228 5818458
3814 5818458 10758923 17644988 2831914 -37405213 -74705977 -75234465 -35166662 16075544
3806 16075544 45471995 41846125 13960526 -23146676 -53781541 -65792922 -61749215
3799 -61749215 -59758060 -71149392 -82429247 -72532453 -43281846 -16293880 -1689166
3792 -1689166 10757337 26750754 34537367 25958340 13082223 11558808 20878508 33113932
$$ packed form
3844B8378322k152006M845718k1525689m3006425j8905943K9411037N0654686
3837B7699700L2420711J673604k2477811l9174278m2195355k3025178N710369
3830e9368238J9642242J5010501P869255M088487m506509j4934178j0953794Q501746
3822c4650488K2324104J7531595O873539N469251P365864K4748j0683385q436770
3814E818458M940465O886065j4813074m0237127l7300764n28488M0067803N1242206
3806A6075544K9396451l625870k7885599l7107202l0634865j2011381M043707
3799f1749215J991155j1391332j1279855R896794K9250607K6987966J4604714
3792a689166J2446503J5993417P786613q579027j2876117j523415R319700J2235424
$$ plain form
3784 33113932 47692854 63238116 67858553 55804955 43960803 51396519 68933186
3777 68933186 70446169 50444244 27071096 9001884 -13506272 -39335878 -47217968
3770 -47217968 -30362155 -15187910 -23919900 -38498066 -28993311 -4462193 -3031828 -34302656
3762 -34302656 -63532625 -59067430 -27545243 8604672 42000960 71007222 82005873
3755 82005873 65780630 39229417 26878581 27853795 23364490 11221714 8125453 18564215
3747 18564215 27067923 26176755 28015125 38867555 44345022 32917202 14873065 2074084
3739 2074084 -13957595 -44351178 -76502009 -86860072 -71975558 -46740150 -18952378
3732 -18952378 12492739 39312131 48936822 48318726 57487100 74056425 68774331 27425503
$$ packed form
3784C3113932J4578922J5545262M620437j2053598j1844152P435716J7536667
3777F8933186J512983k0001925k3373148j8069212k2508156k5829606p882090
3770d7217968J6855813J5174245q731990j4578166R504755K4531118J430365l1270828
3762c4302656k9229969M465195L1522187L6149915L3396288K9006262J0998651
3755H2005873j6225243k6551213j2350836R75214m489305j2142776l096261J0438762
3747A8564215Q503708q91168J838370J0852430N477467j1427820j8044137j2798981
3739B074084j6031679l0393583l2150831j0358063J4884514K5235408K7787772
3732a8952378L1445117K6819392R624691o18096R168374J6569325n282094m1348828
$$ plain form
3724 27425503 -24761666 -56503350 -70688694 -91274945 -121130341 -135036120 -112949279
3717 -112949279 -63314542 -11326458 24339239 40858862 45838006 45700603 37565501 16055643
3709 16055643 -9982448 -18296448 -573470 20929422 19818196 2053651 -4586061 3650584
3701 3650584 -3282314 -42709409 -85421392 -89172389 -53643147 -18826506 -12884679 -24786871
3693 -24786871 -31247007 -28001470 -23501333 -19562468 -14517744 -14179309 -22163526 -26497073
3685 -26497073 -14560790 2405954 852648 -17575271 -23048218 -1600423 18746042
3678 18746042 3537698 -40221409 -72411536 -68995936 -42293082 -15091065 2988968
3671 2988968 8887006 -3198913 -31455601 -58362520 -65925143 -54323748 -37704903 -27168065
$$ packed form
3724B7425503n2187169l1741684j4185344k0586251k9855396j3905779K2086841
3717a12949279M9634737N1988084L5665697J6519623M979144j37403q135102k1509858
3709A6055643k6038091q314000J7722978K1502892j111226j7764545o639712Q236645
3701C650584o932898l9427095m2711983l750997L5529242L4816641N941827j1902192
3693b4786871o460136L245537M500137L938865N044724L38435p984217m333547
3685b6497073J1936283J6966744j553306j8427919n472947K1447795K0346465
3678A8746042j5208344m3759107l2190127L415600K6702854K7202017J8080033
3671B988968N898038j2085919k8256688k6906919p562623J1601395J6618845J0536838
$$ plain form
3663 -27168065 -25498220 -32289320 -43529342 -48938803 -40918046 -27216075 -25086289 -39170404
3655 -39170404 -53252202 -50241451 -34026293 -21731064 -17203546 -6177025 17227720
3648 17227720 33245639 20224252 -11647933 -29252005 -19369600 -3136866 -2116363
3641 -2116363 -10464434 -13675524 -15765795 -26739194 -36023394 -23943710 5597214 29330989
3633 29330989 41013662 57697754 84456022 98085144 78513982 37242126 166931
3626 166931 -22661182 -35023392 -35749041 -21706806 -4626625 -6654708 -35187654 -71104111
3618 -71104111 -86175482 -70049859 -39207568 -18791016 -15507715 -14030133 -3896267
3611 -3896267 1844019 -10766311 -25787400 -14256262 19498514 37153327 19941067
$$ packed form
3663b7168065J669845o791100j1240022n409461Q020757J3701971K129786j4084115
3655c9170404j4081798L010751J6215158J2295229M527518J1026521K3404745
3648A7227720J6017919j3021387l1872185j7604072R882405J6232734J020503
3641b116363q348071l211090k090271j0973399r284200J2079684K9540924K3733775
3633B9330989J1682673J6684092K6758268J3629122j9571162m1271856l7075195
3626A66931k2828113j2362210p25649J4042235J7080181k028083k8532946l5916457
3618g1104111j5071371J6125623L0842291K0416552L283301J477582J0133866
3611c896267N740286j2610330j5021089J1531138L3754776J7654813j7212260
$$ plain form
3604 19941067 -4821380 -5874003 8311109 9588471 -5428668 -16288495 -12300017 -1012661
3596 -1012661 10520547 21964890 30407800 31188158 25091493 13851907 -3630341 -20783323
3588 -20783323 -23213553 -12933131 -15559309 -44020327 -72650382 -71763637 -50810548 -37197332
3580 -37197332 -28408414 -3759519 25740390 24375100 -8871785 -30955903 -15882538
3573 -15882538 12955264 26288306 28733397 34904670 38019533 28080900 16921883 18743262
3565 18743262 23598717 14113766 -6199495 -22884291 -35006647 -48953800 -60392123
3558 -60392123 -62644109 -61789768 -64477100 -62445092 -48402078 -34714431 -34630271 -36514584
3550 -36514584 -21288860 3231901 12096861 3009298 -595686 13091439 29076529 32579724
$$ packed form
3604A9941067k4762447j052623J4185112J277362j5017139j0859827L988478J1287356
3596a012661J1533208J1444343Q442910P80358o096665j1239586j7482248j7152982
3588b0783323k430230J0280422k626178k8461018k8630055Q86745K0953089J3613216
3580c7197332Q788918K4648895K9499909j365290l3246885k2084118J5073365
3573a5882538K8837802J3333042K445091O171273L114863r938633j1159017J821379
3565A8743262M855455r484951k0313261j6684796j2122356j3947153j1438323
3558f0392123k251986Q54341k687332K032008J4043014J3687647Q4160j884313
3550c6514584J5225724K4520761Q864960r087563l604984J3687125J5985090L503195
$$ plain form
3542 32579724 28832894 27421077 24777511 12688825 -8044491 -31153620 -52481302 -66528453
3534 -66528453 -63723680 -40213119 -7894521 11365717 3989715 -21231409 -38113250
3527 -38113250 -28065350 -1975979 10905130 -795923 -17056893 -16327289 -5141473
3520 -5141473 -4693314 -19563062 -36628043 -46336335 -46975554 -35421984 -14110938 -1221936
3512 -1221936 -10376782 -22939990 -6815851 34771006 60450941 45118548 12097710
3505 12097710 -1817932 9496035 29239032 48566898 65734610 67665334 40403769
3498 40403769 -2922642 -27259953 -14850446 14967748 31239521 26116598 17000909
3491 17000909 20766550 34476394 41549755 31367859 8944404 -13059343 -25877226
$$ packed form
3542C2579724l746830j411817k643566j2088686k0733316k3109129k1327682j4047151
3534f6528453K804773K3510561L2318598J9260238p376002k5221124j6881841
3527c8113250J0047900K6089371J2881109j1701053j6260970P29604J1185816
3520e141473M48159j4869748j7064981r708292o39219J1553570K1311046J2889002
3512a221936r154846j2563208J6124139M1586857K5679935j5332393l3020838
3505A2097710j3915642J1313967J9742997J9327866J7167712J930724k7261565
3498D0403769m3326411k4337311J2409507K9818194J6271773n122923r115689
3491A7000909L765641J3709844P073361j0181896k2423455k2003747j2817883
$$ plain form
3484 -25877226 -25823274 -11307411 13103553 34370371 43962279 50781907 67414053 84094462
3476 84094462 75500290 40445804 14459798 25959221 55033371 59489825 34665056
3469 34665056 19428131 39134350 70189561 76882010 62407919 58364487 72995049
3462 72995049 78632386 55025100 20522302 5772134 13078819 20812421 18451872 15219083
3454 15219083 15530314 7891529 -14800130 -39895085 -49052566 -36982863 -10284391 20207229
3446 20207229 39772757 37216335 21545068 17151071 31475559 43055905 35329735 24041273
3438 24041273 30600995 45464388 45559273 34810264 33547898 34800029 10407067 -36359306
3430 -36359306 -63616821 -48417572 -16456248 1814678 10666286 22743946 26064220
$$ packed form
3484b5877226N3952J4515863K4410964K1266818R591908O819628J6632146J6680409
3476H4094462q594172l5054486k5986006J1499423K9074150M456454k4824769
3469C4665056j5236925J9706219L1055211O692449j4474091m043432J4630562
3462G2995049N637337k3607286l4502798j4750168P306685P733602k360549l232789
3454A5219083L11231p638785k2691659k5094955r157481J2069703K6698472L0491620
3446B0207229J9565528k556422j5671267m393997J4324488J1580346p726170j1288462
3438B4041273O559722J4863393R4885j0749009j262366J252131k4392962m6766373
3430c6359306k7257515J5199249L1961324J8270926Q851608J2077660L320274
$$ plain form
3423 26064220 8521417 -9559002 -2920823 14629218 9027648 -21154543 -44789948
3416 -44789948 -45840249 -38087726 -33890743 -29576435 -23250295 -17656517 -3529029 29044671
3408 29044671 58841130 47232820 -5609420 -51108071 -54655800 -36094823 -27297514
3401 -27297514 -21713262 1517277 27872461 23763621 -6465679 -20304577 3086319
3394 3086319 37147670 51730711 53073791 63467922 83187528 93987740 88526074 76083217
3386 76083217 63527405 47458841 25526322 2675893 -16415992 -31265926 -37939124
3379 -37939124 -25816209 9810834 53946648 78744615 68851503 37939599 15621043
3372 15621043 17518679 32121757 37917056 27189114 8175671 -10236934 -26192094
$$ packed form
3423B6064220j7542803j8080419O638179J7550041n601570l0182191k3635405
3416d4789948j050301P752523M196983M314308O326140N593778J4127488L2573700
3408B9044671K9796459j1608310n2842240m5498651l547729J8560977Q797309
3401b7297514N584252K3230539K6355184m108840l0229300j3838898K3390896
3394C086319L4061351J4583041J343080J0394131J9719606J0800212n461666j2442857
3386G6083217j2555812j6068564k1932519k2850429j9091885j4849934o673198
3379c7939124J2122915L5627043M4135814K4797967r893112l0911904k2318556
3372A5621043J897636J4603078N795299j0727942j9013443j8412605j5955160
$$ plain form
3365 -26192094 -38558939 -43537328 -41285376 -38765300 -41674835 -48595147 -55853308 -61652607
3357 -61652607 -61851680 -50003324 -28634675 -13066607 -13925709 -20605074 -13555408 9132745
3349 9132745 29428886 33916597 28585897 26222006 30225702 35915261 38305490 33033870
3341 33033870 18495956 3120130 1558662 16385982 31814706 32720059 20534827 2651307
3333 2651307 -20544206 -44356756 -49416506 -25040543 4756047 5903141 -14832297 -13228844
3325 -13228844 27901844 65589100 49712247 -8995342 -49936523 -34449986 16910317
3318 16910317 57662840 63845159 43184229 13702378 -12675178 -30095432 -34092130
3311 -34092130 -22749014 -2264696 13753814 17165261 15762755 21171592 26421727 10733384
$$ packed form
3365b6192094j2366845m978389K251952K520076k909535o920312p258161n799299
3357f1652607j99073J1848356K1368649J5568068q59102o679365P049666K2688153
3349I132745K0296141M487711n330700k363891M003696N689559K390229n271620
3341C3033870j4537914j5375826j561468J4827320J5428724R05353j2185232j7883520
3333B651307k3195513k3812550n059750K4375963K9796590J147094k0735438J603453
3325a3228844M1130688L7687256j5876853n8707589m0941181J5486537N1360303
3318A6910317M0752523O182319k0660930k9481851k6377556j7420254l996698
3311c4092130J1343116K0484318J6018510L411447j402506N408837N250135j5688343
$$ plain form
3303 10733384 -27738297 -61930646 -71739688 -72436997 -86937212 -104760142 -97567631 -68396364
3295 -68396364 -51662242 -60814070 -68709105 -51573610 -23038425 -7020711 -2377037 3097411
3287 3097411 4351864 -8993009 -26656501 -29871049 -20028129 -11020880 -2178142 15563766
3279 15563766 34554418 39813042 37856804 45450928 53597343 39125884 13641859 18349669
3271 18349669 57268624 79063398 50925150 11603050 14450106 48657420 62245169
3264 62245169 43533325 29717659 41253729 57054284 59052166 56186138 52937576 35729845
3256 35729845 7737732 -783707 20973051 41535558 36203886 26311236 37802935 50616058
3248 50616058 30880437 -6926090 -17454341 3969828 15338872 -2582298 -16243330
$$ packed form
3303A0733384l8471681l4192349r809042o97309j4500215j7822930P192511K9171267
3295f8396364J6734122r151828p895035J7135495K8535185J6017714M643674N474448
3287C097411J254453j3344873j7663492l214548R842920R007249Q842738J7741908
3279A5563766J8990652N258624j956238P594124Q146415j4471459k5484025M707810
3271A8349669L8918955K1794774k8138248l9322100K847056L4207314J3587749
3264F2245169j8711844j3815666J1536070J5800555J997882k866028l248562j7207731
3256C5729845k7992113q521439K1756758K0562507n331672r892650J1491699J2813123
3248E0616058j9735621l7806527j0528251K1424169J1369044j7921170j3661032
$$ plain form
3241 -16243330 5023430 40349663 48943089 25721567 -4517 -6389634 3664343
3234 3664343 19264472 35435620 50490764 61170317 62026670 47586803 19851947 -6137797
3226 -6137797 -13802027 -3659663 10569725 24812271 47060079 72910708 79134695 54490520
3218 54490520 21423736 11525938 29553507 54946606 68817254 65454709 46392030
3211 46392030 18980573 -3836994 -14517749 -17265406 -15783277 -5225044 12746044
3204 12746044 19804926 2373784 -26354418 -42602930 -41247707 -31746976 -16353207 4462362
3196 4462362 13692472 -6433801 -41771398 -57428325 -45004124 -32618436 -42426460 -64147364
3188 -64147364 -78836721 -82460506 -74311384 -49131810 -17968818 -11631602 -40472670 -70994121
$$ packed form
3241a6243330K1266760L5326233Q593426k3221522k5726084o385117J0053977
3234C664343J5600129J6171148J5055144J0679553Q56353j4439867k7734856k5989744
3226f137797p664230J0142364J4229388J4242546K2247808K5850629O223987k4644175
3218E4490520l3066784r897798J8027569K5393099J3870648l362545j9062679
3211D6392030k7411457k2817567j0680755k747657J482129J0558233J7971088
3204A2746044P058882j7431142k8728202j6248512J355223R500731J5393769K0815569
3196D462362R230110k0126273l5337597j5656927J2424201J2385688r808024k1720904
3188f4147364j4689357l623785Q149122K5179574L1162992O337216k8841068l0521451
$$ plain form
3180 -70994121 -67616982 -40544902 -24287165 -23704934 -15605349 3315866 7413035 -15643852
3172 -15643852 -46262475 -64470090 -70351214 -63395609 -33476735 10279858 32343189
3165 32343189 18473952 5080663 28355870 64074263 58773743 11301834 -22419322
3158 -22419322 -9792414 18418952 24804362 20898892 36913887 66405785 76901702
3151 76901702 57935389 25285370 -8899331 -36322704 -34851995 8998980 62048202
3144 62048202 69528716 25216005 -19022692 -22491075 1453022 23592641 40024159
3137 40024159 52613209 45322598 13135597 -12611988 -3959733 17728346 11286206 -23026476
3129 -23026476 -47581550 -42607594 -21809226 604546 22722068 37204061 35102090
$$ packed form
3180g0994121L377139K7072080J6257737N82231Q099585J8921215M097169k3056887
3172a5643852l0618623j8207615n881124O955605K9918874M3756593K2063331
3165C2343189j3869237j3393289K3275207L5718393n300520m7471909l3721156
3158b2419322J2626908K8211366O385410l905470J6014995K9491898J0495917
3151G6901702j8966313l2650019l4184701k7423373J470709M3850975N3049222
3144F2048202P480514m4312711m4238697l468383K3944097K2139619J6431518
3137D0024159J2589050p290611l2187001k5747585Q652255K1688079o442140l4312682
3129b3026476k4555074M973956K0798368K2413772K2117522J4481993k101971
$$ plain form
3122 35102090 27810763 33485775 42382105 29517385 1458441 -8155232 5689298 9543630
3114 9543630 -11476047 -28856085 -21682231 -12440264 -25643760 -45856603 -48194132 -40605646
3106 -40605646 -40419907 -33409076 3614521 54078140 74721282 52249903 15853160 -2388717
3098 -2388717 6639555 34764638 59903569 51526259 3331208 -44192151 -44119291 -2534065
3090 -2534065 32748158 38075699 32020331 27587292 9093062 -30055077 -64282729 -71891183
3082 -71891183 -65384636 -64265994 -62981181 -49707669 -35327336 -37123178 -49317360 -55643611
3074 -55643611 -58885678 -71687556 -86344101 -80077911 -47722646 -7317788 24383591
3067 24383591 41682456 39033544 14350696 -15585275 -26348364 -18120917 -16403026 -33534688
$$ packed form
3122C5102090p291327N675012Q896330j2864720k8058944r613673J3844530L854332
3114I543630k1019677j7380038P173854R241967j3203496k0212843k337529P588486
3106d0605646J85739P010831L7023597N0463619K0643142k2471379l6396743j8241877
3098b388717R028272K8125083K5138931q377310m8195051m7523359P2860M1585226
3090b534065L5282223N327541o055368m433039j8494230l9148139l4227652p608454
3082g1891183O506547J118642J284813J3273512J4380333j795842j2194182o326251
3074e5643611l242067j2801878j4656545O266190L2355265M0404858L1701379
3067B4383591J7298865k648912k4682848k9935971j0763089Q227447J717891j7131662
$$ plain form
3059 -33534688 -49450533 -41571412 -16518248 1954049 3713881 -3442051 -10087432 -10517511
3051 -10517511 1492113 26719201 52123975 60556995 48817450 28390303 11207333
3044 11207333 2671923 4290249 12811014 19173370 17681155 13890873 15529989 20631991
3036 20631991 23765234 26246746 27901882 19224570 540270 -1984988 31922758 73842508
3028 73842508 71936637 24924158 -8071053 11308307 47726294 48839670 20811044
3021 20811044 6930718 15378487 16937436 3597329 -1328992 7075049 4572032 -10967693
3013 -10967693 -2790308 46291965 93920101 87418246 31501652 -21410131 -34959038
3006 -34959038 -18260810 -256916 2410516 -7801531 -20181960 -29350871 -38622546 -46911550
$$ packed form
3059c3534688j5915845P879121K5053164J8472297J759832p155932o645381m30079
3051a0517511J2009624K5227088K5404774Q433020j1739545k0427147j7182970
3044A1207333q535410J618326Q520765O362356j492215l790282J639116N102002
3036B0631991L133243K481512J655136q677312j8684300k525258L3907746M1919750
3028G3842508j905871m7012479l2995211J9379360L6417987J113376k8028626
3021B0811044j3880326Q447769J558949j3340107m926321Q404041k503017j5539725
3013a0967693Q177385M9082273M7628136o501855n5916594n2911783j3548907
3006c4959038J6698228J8003894K667432j0212047j2380429r168911r271675q289004
$$ plain form
2998 -46911550 -39782327 -8927917 25111759 33233912 19535014 14657336 25556282 26759607
2990 26759607 10859187 7864691 33248796 54374771 39039893 5634096 -10298774
2983 -10298774 -12089093 -24445903 -41740548 -38069381 -15702026 -128834 5036833 15903077
2975 15903077 26379854 12227137 -22142350 -42877030 -38314882 -32960535 -42467496 -51410773
2967 -51410773 -45563093 -31767556 -15614695 6117772 19828753 -747078 -47802898
2960 -47802898 -72940059 -50469549 -15618264 -12735340 -33290310 -37794843 -19023501
2953 -19023501 -6719660 -16645565 -27570012 -13102756 24728460 61002427 76702465
2946 76702465 76233221 77204775 83848472 78005326 46257675 7958764 -3291267 16054888
$$ packed form
2998d6911550P129223L0854410L4039676Q122153j3698898m877678J0898946J203325
2990B6759607j5900420k994496K5384105K1125975j5334878l3405797j5932870
2983a0298774j790319j2356810j7294645L671167K2367355J5573192N165667J0866244
2975A5903077J0476777j4152717l4369487k0734680M562148N354347r506961q943277
2967e1410773N847680J3795537J6152861K1732467J3710981k0575831m7055820
2960d7802898k5137161K2470510L4851285K882924k0554970m504533J8771342
2953a9023501J2303841r925905j0924447J4467256L7831216L6273967J5700038
2946G6702465m69244R71554O643697n843146l1747651l8298911j1250031J9346155
$$ plain form
2938 16054888 35721955 32913806 13510713 -10022656 -33344122 -45787702 -32301227
2931 -32301227 -3869429 3432652 -21347170 -41479290 -22231484 20882021 48025482
2924 48025482 47827993 36972040 24579968 7173190 -10383558 -15565613 -5729079 12761725
2916 12761725 34606074 49563109 40200861 4786538 -30287332 -40079320 -30256053 -19062979
2908 -19062979 -7582504 9938852 24048333 24739240 22046089 24303009 13461823 -24390253
2900 -24390253 -59855869 -52415423 -13446136 5729037 -12833800 -35119434 -33565156
2893 -33565156 -20422319 -11504093 1329754 21451219 27026998 5267631 -19294802
2886 -19294802 -16920570 6222994 22495093 22064860 15473952 11286862 14203573 34105173
$$ packed form
2938A6054888J9667067k808149j9403093k3533369k3321466j2443580J3486475
2931c2301227K8431798P302081k4779822k0132120J9247806M3113505K7143461
2924D8025482j97489j0855953j2392072j7406778j7556748n182055R836534J8490804
2916A2761725K1844349J4957035r362248l5414323l5073870r791988R823267J1193074
2908a9062979J1480475J7521356J4109481O90907k693151K256920j0841186l7852076
2900b4390253l5465616P440446L8969287J9175173j8562837k2285634J554278
2893c3565156J3142837Q918226J2833847K0121465N575779k1759367k4562433
2886a9294802K374232K3143564J6272099m30233o590908m187090K916711J9901600
$$ plain form
2878 34105173 72543629 106248815 107454692 79264043 49999152 32152108 9773178
2871 9773178 -26203758 -53148641 -46772956 -22506688 -19481559 -42583901 -49550387 -11447105
2863 -11447105 39115913 49844667 23348770 9998928 29106477 44373723 31630760
2856 31630760 22302557 46699227 74627355 58872850 10405219 -21475618 -26761704
2849 -26761704 -37079065 -58124708 -58642930 -31748145 -10428529 -7759845 4076246 33296472
2841 33296472 40285759 3096351 -35505120 -29198962 550794 3140519 -17532641 -12209943
2833 -12209943 31939973 70884311 68678185 39829367 15462067 1497105 -12204780
2826 -12204780 -24800547 -26928853 -20322912 -20196705 -38567936 -69472155 -90891498 -83981087
$$ packed form
2878C4105173L8438456L3705186J205877k8190649k9264891j7847044k2378930
2871I773178l5976936k6944883O375685K4266268L025129k3102342o966486L8103282
2863a1447105N0563018J0728754k6495897j3349842J9107549J5267246j2742963
2856C1630760r328203K4396670K7928128j5754505m8467631l1880837n286086
2849b6761704j0317361k1045643n18222K6894785K1319616K668684J1836091K9220226
2841C3296472O989287l7189408l8601471O306158K9749756K589725k0673160N322698
2833a2209943M4149916L8944338k206126k8848818k4367300j3964962j3701885
2826a2204780j2595767k128306O605941J26207j8371231l0904219k1419343O910411
$$ plain form
2818 -83981087 -52768053 -20280993 -3683559 -1889492 -9133877 -24969525 -42948762
2811 -42948762 -47034238 -34159433 -26110708 -41593124 -68226168 -80748370 -76128329 -69377802
2803 -69377802 -63002780 -44995479 -14881249 10633233 19736220 15942753 6711328 -1337255
2795 -1337255 3127464 27344642 57683460 68560006 51626425 22397480 -2466921
2788 -2466921 -18523791 -23947242 -15893376 -1773684 2498914 -7819015 -22169341 -34525645
2780 -34525645 -51191682 -72484501 -83913354 -76228157 -59889988 -48031749 -38445135
2773 -38445135 -26321015 -22709456 -41491946 -72704872 -86681928 -66999610 -28233263
2766 -28233263 904918 4401618 -10686872 -22444103 -12353440 17137828 42675735
$$ packed form
2818h3981087L1213034L2487060J6597434J794067p244385j5835648j7979237
2811d2948762m085476J2874805Q048725j5482416k6633044j2522202M620041O750527
2803f9377802O375022J8007301L0114230K5514482R102987l793467r231425q048583
2795a337255M464719K4217178L0338818J0876546j6933581k9228945k4864401
2788b466921j6056870n423451Q053866J4119692M272598j0317929j4350326j2356304
2780c4525645j6666037k1292819j1428853P685197J6338169J1858239R586614
2773c8445135J2124120L611559j8782490l1212926j3977056J9682318L8766347
2766b8233263K9138181L496700j5088490j1757231J0090663K9491268K5537907
$$ plain form
2759 42675735 44063366 27640293 17994482 27478266 44916760 55974123 60340922 60785799
2751 60785799 49349714 20630792 -9040314 -15548381 573447 15003160 15668786 16322261
2743 16322261 25575898 26362768 5342492 -17182967 -14385532 2173040 -3112178 -34471502
2735 -34471502 -57688659 -52246150 -35780365 -24904638 -7001662 26231486 47723994
2728 47723994 30552957 -4682548 -13664900 9766026 29828582 23958489 8052537
2721 8052537 2393920 3706950 2673169 3631176 10944611 14592636 6189309 -3995968
2713 -3995968 -2167441 6709330 8028509 3144332 9462203 34406517 61468803 66719714
2705 66719714 43938760 10534640 -9291493 -6079581 9448967 21369880 25481348
$$ packed form
2759D2675735J387631j6423073r645811R483784J7438494J1057363M366799M44877
2751F0785799j1436085k8718922k9671106o508067J6121828J4429713O65626O53475
2743A6322261R253637P86870k1020276k2525459K797435J6558572n285218l1359324
2735c4471502k3217157N442509J6465785J0875727J7902976L3233148K1492508
2728D7723994j7171037l5235505q982352K3430926K0062556n870093j5905952
2721H052537n658617J313030j033781R58007P313435L648025q403327j0185277
2713c995968J828527Q876771J319179m884177O317871K4944314K7062286N250911
2705F6719714k2780954l3404120j9826133L211912J5528548J1920913M111468
$$ plain form
2698 25481348 27655958 29408168 25009431 14717748 10393812 20287908 34602358 36222914
2690 36222914 24647152 20053354 40012593 76800500 101541761 89384546 39858067
2683 39858067 -23298349 -68436704 -75752693 -49423643 -13876457 5702793 2848764
2676 2848764 -10223114 -20215728 -24925035 -28289906 -31963867 -35015027 -33933394 -20542944
2668 -20542944 7755767 31065244 19096054 -26086296 -58813913 -44074669 -6269096
2661 -6269096 6606390 -6804862 -8544735 6228452 -4001546 -54974773 -101738670
2654 -101738670 -103735609 -81401353 -70279378 -55722601 -2385843 74153228 117844553
2647 117844553 106430290 69669553 37040905 11331673 -4441295 2210851 25363717
$$ packed form
2698B5481348K174610J752210m398737j0291683m323936R894096J4314450J620556
2690C6222914j1575762m593798J9959239L6787907K4741261j2157215m9526479
2683C9858067o3156416m5138355p315989K6329050L5547186J9579250k854029
2676B848764j3071878r992614m709307l364871l673961l051160J081633J3390450
2668b0542944K8298711K3309477j1969190m5182350l2727617J4739244L7805573
2661f269096J2875486j3411252j739873J4773187j0229998n0973227m6763897
2654a01738670j996939K2334256J1121975J4556777N3336758P6539071M3691325
2647A17844553j1414263l6760737l2628648k5709232j5772968O652146K3152866
$$ plain form
2640 25363717 39423455 36810639 36450969 46782850 52002061 43922867 34653908 26580620
2632 26580620 4024432 -30071821 -43791279 -23659543 -1042913 -6146205 -23293221
2625 -23293221 -19975864 3624802 24720179 37112431 46647976 42378158 8532907 -40473344
2617 -40473344 -69523067 -66706839 -51121832 -38592853 -26870854 -15507222 -12230617
2610 -12230617 -13314292 -2366405 22193702 39657242 37246183 28825190 31913409 43699303
2602 43699303 53842266 64338468 77458896 76567430 43989976 -5093863 -32023043
2595 -32023043 -23808217 -10208502 -18714325 -32976914 -19159566 19122296 43179081
2588 43179081 35670022 20972719 17975112 6895255 -29930595 -61615152 -44353430
$$ packed form
2640B5363717J4059738k612816l59670J0331881N219211q079194r268959q073288
2632B6580620k2556188l4096253j3719458K0131736K2616630n103292j7147016
2625b3293221L317357K3600666K1095377J2392252R535545m269818l3845251m9006251
2617d0473344k9049723K816228J5585007J2528979J1721999J1363632L276605
2610a2230617j083675J0947887K4560107J7463540k411059q420993L088219J1785894
2602D3699303J0142963J0496202J3120428q91466l2577454m9083839k6929180
2595c2023043Q214826J3599715q505823j4262589J3817348L8281862K4056785
2588D3179081p509059j4697303k997607j1079857l6825850l1684557J7261722
$$ plain form
2581 -44353430 7570009 31656319 3154630 -30466754 -17784536 29282870 62200593
2574 62200593 62625878 50148422 39956068 28524843 17972248 21882927 38687256 42810103
2566 42810103 16387794 -22591214 -37103617 -12217296 29410557 53235573 48137120
2559 48137120 32148601 25438945 26280297 19516807 1078367 -18472679 -31896201 -41703821
2551 -41703821 -47015109 -39386188 -17639194 5916872 20481303 26411576 24637808 10590291
2543 10590291 -12625063 -28096397 -23334742 -5142436 12513233 24493077 28700988
2536 28700988 17083239 -12167290 -39961235 -38999250 -1987566 49274740 82272029
2529 82272029 80394832 56566066 39729903 40735115 37546110 8727245 -27009246 -31286474
$$ packed form
2581d4353430N1923439K4086310k8501689l3621384J2682218M7067406L2917723
2574F2200593M25285j2477456j0192354j1431225j0552595L910679J6804329M122847
2566D2810103k6422309l8979008j4512403K4886321M1627853K3825016n098453
2559D8137120j5988519o709656Q41352o763490j8438440j9551046j3423522r807620
2551d1703821n311288P628921K1746994K3556066J4564431N930273j773768j4047517
2543A0590291k3215354j5471334M761655J8192306J7655669J1979844M207911
2536B8700988j1617749k9250529k7793945R61985L7011684N1262306L2997289
2529H2272029j877197k3828766j6836163J005212l189005k8818865l5736491m277228
$$ plain form
2521 -31286474 -3368596 18245341 18420690 28785274 68109570 99293800 80707033
2514 80707033 30407735 -1295523 -1730480 4041801 6104825 15453724 25097688 14371509
2506 14371509 -6364543 -1959400 28199457 41356503 16880242 -10986012 -8699500
2499 -8699500 4358604 -9992188 -48076154 -72141503 -65763795 -50057056 -47329009 -53419480
2491 -53419480 -50855613 -34559827 -17746008 -16741497 -32224684 -46648492 -44075709 -30516474
2483 -30516474 -26462728 -40155911 -58525419 -65162043 -56735955 -41231515 -31415826 -39982863
2475 -39982863 -67012877 -89765696 -79010635 -30374305 30972147 77771973 100089006
2468 100089006 98583251 78031918 52967695 40903485 39865655 27817967 -4864506
$$ packed form
2521c1286474K7917878K1613937J75349J0364584L9324296L1184230j8586767
2514H0707033n0299298l1703258m34957N772281K063024R348899R643964j0726179
2506A4371509k0736052M405143L0158857J3157046k4476261k7866254K286512
2499h699500J3058104j4350792l8083966k4065349O377708J5706739K728047o090471
2491e3419480K563867J6295786J6813819J004511j5483187j4423808K572783J3559235
2483c0516474M053746j3693183j8369508o636624Q426088J5504440R815689q567037
2475c9982863k7030014k2752819J0755061M8636330O1346452M6799826K2317033
2468A00089006j505755k0551333k5064223j2064210j037830j2047688l2682473
$$ plain form
2461 -4864506 -36543877 -41569274 -25876620 -19247429 -35009652 -51024050 -35289235 14436525
2453 14436525 62597200 71682126 43425266 13095727 997085 -10557074 -38253729
2446 -38253729 -58303203 -36453940 13848069 40426506 20907572 -12540652 -24543703
2439 -24543703 -18631919 -14199804 -13686444 -14342012 -26999024 -57612319 -87160720 -92818740
2431 -92818740 -76354629 -53182894 -28325858 -3457448 7191960 -6991306 -29023351
2424 -29023351 -29933804 -6031811 16780068 13927508 -15098003 -49912751 -63897022 -43049030
2416 -43049030 -2059060 25730502 24228604 10436276 5860941 8738568 9158062 13100256
2408 13100256 28849562 43711941 40049850 24440557 14193223 3643699 -24596606
$$ packed form
2461d864506l1679371n025397J5692654O629191j5762223j6014398J5734815M9725760
2453A4436525M8160675R084926k8256860l0329539j2098642j1554159k7696655
2446c8253729k0049474K1849263N0302009K6578437j9518934l3448224j2003051
2439b4543703N911784M432115N13360o55568j2657012l0613295k9548401n658020
2431i2818740J6464111K3171735K4857036K4868410J0649408j4183266k2032045
2424b9023351r10453K3901993K2811879k852560k9025511l4814748j3984271K0847992
2416d3049030M0989970K7789562j501898j3792328m575335K877627M19494L942194
2408A3100256J5749306J4862379l662091j5609293j0247334j0549524k8240305
$$ plain form
2401 -24596606 -57970749 -59040148 -20123114 18560559 20992382 864863 -4931356 10109319
2393 10109319 19811252 8879205 -6050884 -3361208 13232305 23345117 21087047 22621571
2385 22621571 39668375 58017161 54053352 26868729 -535506 -11363055 -11394540 -13293467
2377 -13293467 -20842069 -33772547 -50894825 -60446725 -46107735 -14887937 -374256
2370 -374256 -21544860 -55026575 -67195886 -57218605 -45169284 -33450227 -10404235 16901687
2362 16901687 26872528 19659980 18823766 33068757 43481439 34416266 12183571 -12516176
2354 -12516176 -35130568 -43383839 -21320691 19197838 36854574 9397196 -36444820
2347 -36444820 -62259690 -65664922 -68024918 -71415420 -57773673 -25169941 3776471 13015098
$$ packed form
2401b4596606l3374143j069399L8917034L8683673K431823k0127519n796219J5040675
2393A0109319R701933j0932047j4930089K689676J6593513J0112812k258070J534524
2385B2621571J7046804J8348786l963809k7184623k7404235j0827549l1485j898927
2377a3293467p548602j2930478j7122278r551900J4338990L1219798J4513681
2370c74256k1170604l3481715j2169311R977281J2049321J1719057K3045992K7305922
2362A6901687R970841p212548q36214J4244991J0412682r065173k2232695k4699747
2354a2516176k2614392q253271K2063148M0518529J7656736k7457378m5842016
2347c6444820k5814870l405232k359996l390502J3641747L2603732K8946412R238627
$$ plain form
2339 13015098 10080358 5987265 -1587168 -14035889 -17462563 -202073 22954578 23305900
2331 23305900 -3112097 -25833173 -17692613 10165552 25523137 19921257 15806442 27077307
2323 27077307 35036644 17550924 -14297500 -29655683 -20627714 -9526799 -13256412 -21088182
2315 -21088182 -15226452 1943781 12279109 5294265 -12588886 -28369906 -34694808 -32676964
2307 -32676964 -26987380 -19592274 -8828982 5522148 19927515 32227313 44312866
2300 44312866 55271954 57299144 45719498 29511359 23985694 34491136 52838188
2293 52838188 66397006 64676288 41794893 1419915 -42184538 -74025333 -87580108
2286 -87580108 -82613496 -62352030 -37282570 -19797741 -6591441 20221065 62344050
$$ packed form
2339A3015098k934740m093093p574433j2448721l426674J7260490K3156651L51322
2331B3305900k6417997k2721076Q140560K7858165J5357585n601880m114815J1270865
2323B7077307P959337j7485720l1848424j5358183R027969J1100915l729613p831770
2315b1088182N861730J7170233J0335328o984844j7883151j5781020o324902K017844
2307c2676964N689584P395106J0763292J4351130J4405367J2299798J2085553
2300D4312866J0959088K027190j1579646j6208139n525665J0505442J8347052
2293E2838188J3558818j720718k2881395m0374978m3604453l1840795j3554775
2286h7580108M966612K0261466K5069460J7484829J3206300K6812506M2122985
$$ plain form
2279 62344050 90846206 80919034 48065637 26270636 19833236 5092716 -23639190
2272 -23639190 -41076523 -29641816 -4331021 11968365 17266443 22843888 33130306
2265 33130306 44812913 54668339 60060189 60680152 63172929 73275208 82731342 78260363
2257 78260363 64637246 62485570 80019579 102394180 111251959 98974342 63858607
2250 63858607 12042476 -32926794 -44804674 -25487504 -1904887 11386059 23868282
2243 23868282 39971042 46811047 40570341 36480882 39010546 30838738 8664365 47847
2235 47847 20245405 38842007 19655217 -25705234 -55317655 -53193319 -36748858 -19417491
2227 -19417491 675918 18577271 20606053 8473004 1914613 12272919 29621526
$$ packed form
2279F2344050K8502156r927172l2853397k1795001o437400j4740520k8731906
2272b3639190j7437333J1434707K5310795J6299386N298078N577445J0286418
2265C3130306J1682607R855426N391850O19963K492777J0102279R456134m470979
2257G8260363j3623117k151676J7534009K2374601Q857779j2277617l5115735
2250F3858607n1816131m4969270j1877880J9317170K3582617J3290946J2482223
2243B3868282J6102760O840005o240706m089459K529664q171808k2174373q616518
2235D7847K0197558J8596602j9186790m5360451k9612421K124336J6444461J7331367
2227a9417491K0093409J7901353K028782j2133049o558391J0358306J7348607
$$ plain form
2220 29621526 37766732 29016616 6316487 -16488295 -21434292 -7446987 1197561 -18050879
2212 -18050879 -56836017 -88551359 -102301775 -107042431 -108557927 -101224732 -80455537 -49643153
2204 -49643153 -18967037 -6406967 -26835880 -66062258 -82766307 -57130538 -20872258
2197 -20872258 -13343024 -25143672 -19129317 6248916 16983461 3399823 -4838448 8155188
2189 8155188 17458781 935033 -22871728 -22085522 6019079 38726486 56297483 51242991
2181 51242991 25063316 -9989806 -37263338 -52111831 -60846244 -62629162 -51048078
2174 -51048078 -34296190 -29195284 -31681000 -21454197 -1947299 -2023171 -25011912 -32284659
2166 -32284659 -239748 39073446 43210082 17052463 -7749090 -26032257 -51703662
$$ packed form
2220B9621526Q145206q750116k2700129k2804782m945997J3987305Q644548j9248440
2212a8050879l8785138l1715342j3750416m740656j515496P333195K0769195L0812384
2204d9643153L0676116J2560070k0428913l9226378j6704049K5635769L6258280
2197b0872258P529234j1800648O014355K5378233J0734545j3583638q238271J2993636
2189H155188R303593j6523748k3806761P86206K8104601L2707407J7570997n054492
2181E1242991k6179675l5053122k7273532j4848493q734413j782918J1581084
2174e1048078J6751888N100906k485716J0226803J9506898p5872k2988741p272747
2166c2284659L2044911L9313194M136636k6157619k4801553j8283167k5671405
$$ plain form
2159 -51703662 -73660001 -63488941 -23887998 9047240 14595676 6731905 1980490 -1360450
2151 -1360450 -5691164 -3313723 7665025 17907205 23584813 28961333 29449376 14655284
2143 14655284 -8334413 -20159253 -23536287 -44059458 -85015738 -109892382 -89187247
2136 -89187247 -41672660 -7519333 38826 -7121695 -23724178 -51376042 -77550528
2129 -77550528 -84683421 -77521839 -74708048 -73832593 -51879554 -4255635 42167231 62717495
2121 62717495 59442028 44533136 23688356 7923476 16153483 45435861 59786906
2114 59786906 34774034 -2018256 -4549933 27474477 50689813 40869549 17702766
2107 17702766 1673114 -16098181 -43813100 -62542966 -57584893 -51503019 -72246867
$$ packed form
2159e1703662k1956339J0171060L9600943L2935238N548436p863771m751415l340940
2151a360450m330714K377441J0978748J0242180N677608N376520M88043j4794092
2143A4655284k2989697j1824840l377034k0523171m0956280k4876644K0705135
2136h9187247M7514587L4153327P558159p160521j6602483k7651864k6174486
2129g7550528p132893P161582K813791Q75455K1953039M7623919M6422866K0550264
2121F2717495l275467j4908892k0844780j5764880Q230007K9282378J4351045
2114E9786906k5012872l6792290k531677L2024410K3215336r820264k3166783
2107A7702766j6029652j7771295k7714919j8729866M958073O081874k0743848
$$ plain form
2100 -72246867 -103357822 -101810785 -59489406 -11871415 14585194 28209515 38683111
2093 38683111 34884311 14657816 5361739 26806840 54717737 52264754 25932280 17696361
2085 17696361 44822905 78465226 87096008 74083817 60949587 55165672 49895242 40111273
2077 40111273 22791158 -7684287 -48118634 -79219178 -87051804 -85470770 -97344547
2070 -97344547 -115982595 -108980305 -66807309 -24893161 -21394087 -48284694 -64452829
2063 -64452829 -49389806 -22873127 -13176032 -26169835 -49341571 -67518853 -66462909
2056 -66462909 -36864309 13171740 59786834 87372188 101595706 110878369 109447236
2049 109447236 92979442 77058261 78267695 84598556 69749905 36172668 17814785
$$ packed form
2100g2246867l1110955J547037M2321379M7617991K6456609J3624321J0473596
2093C8683111l798800k0226495r296077K1445101K7910897k452983k6332474q235919
2085A7696361K7126544L3642321Q630782j3012191j3134230n783915n270430r783969
2077D0111273j7320115l0475445m0434347l1100544p832626J581034j1873777
2070i7344547j8638048P002290M2172996M1914148L499074k6890607j6168135
2063f4452829J5063023K6516679R697095j2993803k3171736j8177282J055944
2056f6462909K9598600N0036049M6615094K7585354J4223518R282663j431133
2049A09447236j6467794j5921181J209434O330861j4848651l3577237j8357883
$$ plain form
2042 17814785 32951529 57902436 61123238 44268075 31177096 29396069 24156524 5831856
2034 5831856 -15911117 -26405025 -20378713 -866575 23732850 39786996 38236643 28135451
2026 28135451 28550698 41328945 44113834 20436226 -13174294 -24260451 -3721884 27236736
2018 27236736 48271638 60585202 71439708 75537756 65113424 46946008 33058352
2011 33058352 21123274 1323418 -20657470 -26315784 -11222252 8562702 20258892
2004 20258892 26481320 28733780 19721176 2703347 -2006558 13752085 27393046 15577153
1996 15577153 -11238605 -25291805 -20056221 -8635675 5024575 24424696 36682626
1989 36682626 23754236 -992302 -962757 29501440 49877122 27978164 -16607685 -43488411
$$ packed form
2042A7814785J5136744K4950907L220802j6855163j3090979j781027n239545j8324668
2034E831856k1742973j0493908O026312J9512138K4599425J6054146j550353j0101192
2026B8135451M15247J2778247K784889k3677608l3610520j1086157K0538567L0958620
2018B7236736K1034902J2313564J0854506M098048j0424332j8167416j3887656
2011C3058352j1935078j9799856k1980888n658314J5093532J9784954J1696190
2004B0258892O222428K252460r012604j7017829m709905J5758643J3640961j1815893
1996A5577153k6815758j4053200N235584J1420546J3660250J9400121J2257930
1989C6682626j2928390k4746538K9545L0464197K0375682k1898958m4585849k6880726
$$ plain form
1981 -43488411 -43959630 -38357530 -36806595 -31035866 -20633217 -21313634 -40485741 -59973456
1973 -59973456 -52911972 -14793980 26467441 34591206 2842530 -35442418 -43033097 -22198648
1965 -22198648 -7716661 -18445943 -37244785 -44062597 -44029616 -47874418 -46654887 -28246692
1957 -28246692 -3630635 7274430 5456091 4552651 1667059 -16173386 -39980908 -42357309
1949 -42357309 -17123142 10284435 19385775 17531899 15203039 2232273 -31694884 -68532725
1941 -68532725 -77294573 -53551368 -25088189 -17755851 -28993042 -36581916 -23079806 9967751
1933 9967751 42796155 50718376 26161868 -9133941 -22380212 -4485531 21424593
1926 21424593 30421908 23409893 14962943 6070249 -11649054 -29588647 -24671309 5320385
$$ packed form
1981d3488411m71219N602100J550935N770729J0402649o80417j9172107j9487715
1973e9973456P061484L8117992M1261421Q123765l1748676l8284948p590679K0834449
1965b2198648J4481987j0729282j8798842o817812L2981l844802J219531J8408195
1957b8246692K4616057J0905065j818339r03440k885592j7840445k3807522k376401
1949d2357309K5234167K7407577R101340j853876k328860j2970766l3927157l6837841
1941f8532725q761848K3743205K8463179P332338j1237191p588874J3502110L3047557
1933I967751L2828404P922221k4556508l5295809j3246271J7894681K5910124
1926B1424593Q997315p012015q446950q892694j7719303j7939593M917338K9991694
$$ plain form
1918 5320385 30173166 23660124 -5039515 -30362908 -44267656 -52248205 -50103176 -29899994
1910 -29899994 -1748923 15817824 24096250 38294001 55374140 54885389 34252668 16001584
1902 16001584 13581781 15872124 13338961 12859487 16115744 10729687 -3051644 -4358633
1894 -4358633 11669898 16327124 -10645220 -46026950 -57213391 -50330484 -53881048 -71207930
1886 -71207930 -82592871 -83606498 -87170733 -92441332 -83970922 -61243521 -39939637 -22900322
1878 -22900322 2288132 33737963 50159624 41903614 24390698 13674224 8654993
1871 8654993 4072746 2226276 4155367 4795379 2856439 1938003 -276670 -7885680 -10898736
1862 -10898736 6032948 34246508 42490829 18677046 -8815705 -7375412 15178575
$$ packed form
1918E320385K4852781o513042k8699639k5323393j3904748p980549K145029K0203182
1910b9899994K8151071J7566747Q278426J4197751J7080139m88751k0632721j8251084
1902A6001584k419803K290343k533163m79474L256257n386057j3781331j306989
1894d358633J6028531M657226k6972344l5381730j1186441O882907l550564j7326882
1886g1207930j1384941j013627l564235n270599Q470410K2727401K1303884J7039315
1878b2900322K5188454L1449831J6421661q256010j7512916j0716474n019231
1871H654993m582247j846470J929091O40012j938940r18436k214673p609010l013056
1862a0898736J6931684K8213560Q244321k3813783k7492751J440293K2553987
$$ plain form
1855 15178575 20482370 -9243635 -44744418 -39498212 18419225 89307598 119960053
1848 119960053 96456361 50789121 16014893 -7771493 -34089842 -57280626 -61188584
1841 -61188584 -48902760 -38249320 -31880096 -16376320 9071183 26625592 26226974 18011649
1833 18011649 13255193 9800800 1941266 -7787709 -9565832 9017930 52562161 99136845
1825 99136845 104860020 52021216 -15145705 -33005040 4268857 40767532 34784446
1818 34784446 5807277 -4125614 14922766 41629254 55417747 49405993 27398776
1811 27398776 3228583 -7227582 -1696188 10096664 23436233 38342855 44940893
1804 44940893 31702115 8557715 -2633124 -1055756 -3142536 -6760657 5586914 23442043
$$ packed form
1855A5178575N303795k9726005l5500783N246206N7917437P0888373L0652455
1848A19960053k3503692m5667240l4774228k3786386k6318349k3190784l907958
1841f1188584J2285824J0653440O369224J5503776K5447503J7554409l98618q215325
1833A8011649m756456l454393p859534r728975j778123J8583762M3544231M6574684
1825I9136845N723175n2838804o7166921j7859335L7273897L6498675n983086
1818C4784446k8977169r932891J9048380K6706488J3788493o011754k2007217
1811B7398776k4170193j0456165N531394J1792852J3339569J4906622O598038
1804D4940893j3238778k3144400j1190839J577368k086780l618121J2347571J7855129
$$ plain form
1796 23442043 9485890 -40919958 -79937762 -68871137 -26460997 6663881 18917228
1789 18917228 17966415 3255819 -19392638 -22692464 7882359 44341267 51470873 33447049
1781 33447049 16588786 6445830 -5815079 -13670551 -7534655 -1843699 -14041235 -28328623
1773 -28328623 -16316836 15100330 32780450 28834680 26889888 37161377 39245643 15632210
1765 15632210 -23599790 -55219610 -62879730 -42080292 -3369781 29776827 40777048
1758 40777048 33421206 15390136 -15854707 -53098451 -66204321 -38236432 648034
1751 648034 8754810 -8753417 -12668537 6645904 18003389 2476117 -20152938 -26400004
1743 -26400004 -19715378 -15692814 -20653565 -33589797 -49988833 -58407713 -50119866 -33382037
$$ packed form
1796B3442043j3956153n0405848l9017804J1066625M2410140L3124878J2253347
1789A8917228r50813j4710596k2648457l299826L0574823L6458908P129606j8023824
1781C3447049j6858263j0142956j2260909p855472O135896N690956j2197536j4287388
1773b8328623J2011787L1417166J7680120l945770j944792J0271489K084266k3613433
1765A5632210l9232000l1619820p660120K0799438L8710511L3146608J1000221
1758D0777048p355842j8031070l1244843l7243744j3105870K7967889L8884466
1751F48034Q106776j7508227l915120J9314441J1357485j5527272k2629055o247066
1743b6400004O684626M022564m960751j2936232j6399036q418880Q287847J6737829
$$ plain form
1735 -33382037 -22128203 -14651320 -2724681 5104675 -6001080 -27890620 -36265472 -23949539
1727 -23949539 -3021228 20674706 47141627 61524978 46497457 15946548 5062409
1720 5062409 23452520 46731553 57464049 64710654 77216147 85245157 78014534 57932425
1712 57932425 32682448 11863162 10532804 34586210 64380175 74186145 64086182
1705 64086182 52559319 47224420 46238276 54661697 71101282 73633390 50191210 24463283
1697 24463283 18033946 12185593 -12179183 -29485280 -16299568 -3608636 -14010219
1690 -14010219 6578255 96946384 163634919 93921301 -27865039 13413415 242272715
1683 242272715 410816061 329950202 127392365 41613528 86454504 94670620 14282892
$$ packed form
1735c3382037J1253834P476883J1926639P829356j1105755k1889540q374852J2315933
1727b3949539K0928311K3695934K6466921J4383351j5027521l0550909j0884139
1720E062409J8390111K3279033J0732496P246605J2505493Q029010p230623k0082109
1712E7932425k5249977k0819286j330358K4053406K9793965R805970j0099963
1705F4086182j1526863n334899r86144Q423421J6439585K532108k3442180k5727927
1697B4463283o429337n848353k4364776j7306097J3185712J2690932j0401583
1690a4010219K0588474R0368129O6688535o9713618j21786340M1278454K28859300
1683B42272715J68543346q0865859k02557837q5778837M4840976Q216116q0387728
$$ plain form
1676 14282892 -36809790 4275104 50603430 29382591 -8837744 -2761740 14676415
1669 14676415 -6916475 -40065765 -31479707 9616257 36671506 38212378 36069876 42792291
1661 42792291 58126935 80834060 97600461 88573476 63138513 57688512 81657659
1654 81657659 102760904 101253061 95487993 93681724 69046281 14445741 -23357613 -5809852
1646 -5809852 35028350 39831590 3141923 -31380588 -38772283 -32990945 -28112610 -19325478
1638 -19325478 -4708045 4116992 -548977 -12505397 -23685386 -33140606 -41851813 -46862455
1630 -46862455 -42188574 -24200282 390945 14152110 6293314 -11273052 -17971760 -12323807
1622 -12323807 -9110044 -10844454 -3450421 17485708 37791078 45943994 42209825 24165099
$$ packed form
1676A4282892n1092682M1084894M6328326k1220839l8220335O076004J7438155
1669A4676415k1592890l3149290Q586058M1095964K7055249J540872k142502O722415
1661D2792291J5334644K2707125J6766401r026985k5434963n450001K3969147
1654H1657659K1103245j507843n765068j806269k4635443n4600540l7803354J7547761
1646e809852M0838202M803240l6689667l4522511p391695N781338M878335Q787132
1638a9325478J4617433Q825037m665969j1956420j1179989r455220q711207n010642
1630d6862455M673881J7988292K4591227J3761165p858796j7566366o698708N647953
1622a2323807L213763j734410P394033K0936129K0305370Q152916l734169j8044726
$$ plain form
1614 24165099 -11619137 -47836581 -54067976 -27492033 -1239295 393557 -9045484 -7902188
1606 -7902188 -239044 -245075 -2889192 6882050 26682139 37375865 26347669 -50774
1598 -50774 -21499614 -17714626 12042751 42080848 46080097 28470022 13560207 8787692
1590 8787692 3742395 1458999 16584764 38822273 35029125 -782766 -33577530 -37081744
1582 -37081744 -24266340 -13787297 -2105332 11745849 10224704 -9022772 -17386471
1575 -17386471 -516556 13462409 1156329 -13384185 876089 28051015 33024968
1568 33024968 20307729 22209136 44027248 62560151 68164281 69036754 61927650 36514777
1560 36514777 4210816 -11742496 -11144560 -10918923 -10557868 3938448 26146182 32654178
$$ packed form
1614B4165099l5784236l6217444o231395K6575943K6252738J632852r439041J143296
1606g902188P663144o031k644117R771242J9800089J0693726j1028196k6398443
1598e0774k1448840L784988K9757377L0038097L999249j7610075j4909815m772515
1590H787692n045297k283396J5125765K2237509l793148l5811891l2794764l504214
1582c7081744J2815404J0479043J1681965J3851181j521145j9247476q363699
1575a7386471J6869915J3978965j2306080j4540514J4260274K7174926M973953
1568C3024968j2717239J901407K1818112J8532903N604130Q72473p109104k5412873
1560C6514777l2303961j5953312N97936K25637L61055J4496316K2207734O507996
$$ plain form
1552 32654178 20338362 10893042 17197802 29806451 35594547 28044736 4499075 -24791165
1544 -24791165 -33797816 -10236458 23780087 44494602 60857499 83922165 84990853
1537 84990853 32900034 -39049521 -59358019 -14712043 31108762 24834653 -17364077
1530 -17364077 -53631841 -73200207 -85020098 -86161789 -70320827 -45722721 -24236152
1523 -24236152 -10063952 -9295617 -27727693 -50677800 -52029933 -33488355 -26187745 -42069065
1515 -42069065 -54938428 -44562376 -26822586 -19597946 -9715938 19513048 52424418
1508 52424418 61354212 46266798 28968120 20523654 15799580 9663731 712683 -12031074
1500 -12031074 -24057260 -28656346 -32750701 -51270882 -77702605 -84361231 -64415468 -46228002
$$ packed form
1552C2654178j2315816r445320O304760J2608649N788096p549811k3545661k9290240
1544b4791165r006651K3561358L4016545K0714515J6362897K3064666J068688
1537H4990853n2090819p1949555k0308498M4645976M5820805o274109m2198730
1530a7364077l6267764j9568366j1819891j141691J5840962K4598106K1486569
1523b4236152J4172200P68335j8432076k2950107j352133J8541578P300610j5881320
1515d2069065j2869363J0376052J7739790P224640R882008K9228986L2911370
1508E2424418Q929794j5087414j7298678q444466m724074o135849q951048j2743757
1500a2031074j2026186m599086m094355j8520181k6431723o658626J9945763J8187466
$$ plain form
1492 -46228002 -47565792 -44098325 -9631026 37155199 58023517 49106468 36340087 30007733
1484 30007733 18483644 1195300 -5808392 1239172 6829725 2446761 -2041014 1918225
1476 1918225 8131406 7139948 -1378786 -10598230 -11964068 505220 22889189 41005610
1468 41005610 44638505 37209517 25511929 9706534 -7767899 -15446643 -7943847 2436795
1460 2436795 2774743 -1506519 1298228 8146008 7385126 -3749617 -23461512 -56245314
1452 -56245314 -99653310 -128594413 -116337073 -70767117 -30647379 -23155213 -38555232
1445 -38555232 -47976368 -34506511 -4969673 21116327 32834973 39155542 53062404
1438 53062404 65642068 52443509 11403513 -25565703 -31879265 -18765004 -12452330
$$ packed form
1492d6228002j337790L467467L4467299M6786225K0868318q917049j2766381o332354
1484C0007733j1524089j7288344p003692P047564N590553m382964m487775L959239
1476A918225O213181r91458q518734r219444j365838J2469288K2383969J8116421
1468D1005610L632895p428988j1697588j5805395j7474433p678744P502796J0380642
1460B436795L37948m281262K804747O847780p60882j1134743j9711895l2783802
1452e6245314m3407996k8941103J2257340M5569956M0119738P492166j5400019
1445c8555232r421136J3469857K9536838K6086000J1718646O320569J3906862
1438E3062404J2579664j3198559m1039996l6969216o313562J3114261O312674
$$ plain form
1431 -12452330 -17535413 -23802175 -33021464 -53751236 -79786505 -96501756 -99825332 -89817896
1423 -89817896 -59464037 -13448812 16796843 6348680 -24914356 -36440771 -19934683
1416 -19934683 2324563 21138084 44726901 64629474 58472461 30167708 9249449
1409 9249449 3887287 -8137749 -33022606 -44403848 -27706048 -3995136 9444705
1402 9444705 26719758 56703716 71793217 46639122 4969286 -8172519 11932024
1395 11932024 29223955 21759550 5364540 771226 4297595 1024853 -10227534 -17697178
1387 -17697178 -16096900 -16080141 -32633127 -65514734 -93953816 -94196552 -61892232 -14817890
1379 -14817890 23480579 39683335 37426117 34920611 47905212 67097343 65045736 37424212
$$ packed form
1431a2452330n083083o266762r219289k0729772k6035269j6715251l323576J0007436
1423h9817896L0353859M6015225L0245655j0448163l1263036j1526415J6506088
1416a9934683K2259246J8813521K3588817J9902573o157013k8304753k0918259
1409I249449n362162j2025036k4884857j1381242J6697800K3710912J3439841
1402I444705J7275053K9983958J5089501k5154095m1669836j3141805K0104543
1395A1932024J7291931p464405j6395010m593314L526369l272742j1252387p469644
1387a7697178J600278J6759j6552986l2881607k8439082k42736L2304320M7074342
1379a4817890L8298469J6202756k257218k505506J2984601J9192131k051607k7621524
$$ plain form
1371 37424212 19274931 37274283 63679729 52688618 11743753 -7233227 11922414
1364 11922414 25666168 49387 -40929781 -58985728 -54012514 -44223051 -28701595
1357 -28701595 -4267691 8405399 -6838974 -28136230 -27283471 -16579419 -25145608 -43958204
1349 -43958204 -38415498 -8150111 11174484 6618884 3857063 15517781 16935781 -7206472
1341 -7206472 -29354437 -21028733 -1573478 -10389236 -44097373 -57537884 -28731371 8267380
1333 8267380 9493676 -20263670 -36120640 -12700214 27514280 48610132 43035980 26543060
1325 26543060 9281982 -5974502 -6792349 19915958 60946406 83936437 76617970 56283191
1317 56283191 35767821 8007778 -24968245 -38398758 -20914169 1040410 -98638
$$ packed form
1371C7424212j8149281J7999352K6405446j0991111m0944865j8976980J9155641
1364A1922414J3743754k5616781m0979168j8055947M973214R789463J5521456
1357b8701595K4433904J2673090j5244373k1297256Q52759J0704052q566189j8812596
1349d3958204N542706L0265387J9324595m555600k761821J1660718J418000k4142253
1341g206472k2147965Q325704J9455255q815758l3708137j3440511K8806513L6998751
1333H267380J226296k9757346j5856970K3420426M0214494K1095852n574152j6492920
1325B6543060j7261078j5256484q17847K6708307M1030448K2990031p318467k0334779
1317E6283191k0515370k7760043l2976023j3430513J7484589K1954579j139048
$$ plain form
1310 -98638 -12648119 -9107863 8088671 15190444 9072277 8527812 20108322 32268759
1302 32268759 39454755 43798897 36358346 6844832 -27280813 -31539679 -615044 31615935
1294 31615935 36018671 20134400 8143533 9138439 15201635 14843499 -1044613 -33624337
1286 -33624337 -68306253 -82632264 -68373756 -39037015 -13547551 489591 7879634
1279 7879634 17242559 29480261 31634955 11802877 -15418198 -17120662 11682315 32777770
1271 32777770 17541173 -8755067 -7381145 10883375 6808745 -16965294 -19219298 6539866
1263 6539866 16746173 -10543586 -38526242 -30008293 -1247048 11299828 4438694 -1969879
1255 -1969879 -2121705 -1498742 2157575 8674833 4800167 -12997363 -24316791 -15601815
$$ packed form
1310i8638j2549481L540256J7196534P101773o118167n44465J1580510J2160437
1302C2268759P185996M344142p440551k9513514l4125645m258866L0924635L2230979
1294C1615935M402736j5884271j1990867R94906O063196l58136j5888112l2579724
1286c3624337l4681916j4326011J4258508K9336741K5489464J4037142P390043
1279G879634R362925J2237702K154694j9832078k7221075j702464K8802977K1095455
1271C2777770j5236597k6296240J373922J8264520m074630k3774039k254004K5759164
1263F539866J0206307k7289759k7982656Q517949K8761245J2546876o861134o408573
1255a969879j51826O22963L656317O517258l874666j7797530j1319428Q714976
$$ plain form
1247 -15601815 -3850579 -5932322 -7752775 7306916 22048031 12353469 -8071380 -9033462
1239 -9033462 2966499 -4099005 -28562639 -32521380 -4274697 20116484 14186131 2431025
1231 2431025 18215370 48170104 52007768 23697809 -2138050 -4359252 -2840131 -18618705
1223 -18618705 -33371402 -16420891 20403816 30777474 2121136 -19805824 3517159
1216 3517159 42707677 40852802 -4035455 -40411737 -40113402 -25850452 -16586410 4366529
1208 4366529 46178247 78949054 75356549 50795636 31734385 13844668 -15805861
1201 -15805861 -42525090 -47135330 -43051685 -51736712 -59931406 -42073588 -10432491 428352
1193 428352 -10086809 -11656995 2202531 6997925 -3285851 -3051735 19179529 39669757
$$ packed form
1247a5601815J1751236k081743j820453J5059691J4741115r694562k0424849r62082
1239i033462J1999961p065504k4463634l958741K8246683K4391181n930353j1755106
1231B431025J5784345K9954734L837664k8309959k5835859k221202J519121j5778574
1223a8618705j4752697J6950511L6824707J0373658k8656338k1926960K3322983
1216C517159L9190518j854875m4888257l6376282K98335J4262950R264042K0952939
1208D366529M1811718L2770807l592505k4560913j9061251j7889717k9650529
1201a5805861k6719229m610240M083645q685027q194694J7857818L1641097J0860843
1193D28352j0515161j570186J3859526M795394j0283776K34116K2231264K0490228
$$ plain form
1185 39669757 37431982 22458141 12734028 8727217 2581014 -8375198 -24860374 -42918514
1177 -42918514 -46064291 -22808625 8467823 18786811 11369529 13523486 26294476 21256751
1169 21256751 -6175764 -23246077 -15502447 -14069141 -42495625 -73373490 -69788710 -40892213
1161 -40892213 -21403103 -17323044 -7607468 14073830 32907068 40758038 41645484 34285874
1153 34285874 14673633 -6388291 -10252253 5550427 26325388 39888066 42893877
1146 42893877 33634150 14506593 -2735185 -8152954 -5310865 -735916 9088149 26546292
1138 26546292 39386665 35965508 25646146 25038445 29924303 20533075 -8154105 -39662797
1130 -39662797 -58415944 -62723579 -56894769 -46798786 -43593156 -56398148 -78315472 -90938251
$$ packed form
1185C9669757k237775j4973841r724113m006811o146203j0956212j6485176j8058140
1177d2918514l145777K3255666L1276448J0318988p417282K153957J2770990n037725
1169B1256751k7432515j7070313P743630J433306k8426484l0877865L584780K8896497
1161d0892213J9489110M080059R715576K1681298J8833238P850970Q87446p359610
1153C4285874j9612241k1061924l863962J5802680K0774961J3562678L005811
1146D2893877r259727j9127557j7241778n417769K842089M574949R824065J7458143
1138B6546292J2840373l421157j0319362o07701M885858r391228k8687180l1508692
1130c9662797j8753147m307635N828810J0095983L205630j2804992k1917324j2622779
$$ plain form
1122 -90938251 -84594165 -66300952 -49777706 -45623823 -56073606 -69049397 -64025804 -37041932
1114 -37041932 -13346307 -18946832 -44495563 -56067662 -39710297 -15308032 -4998489
1107 -4998489 -8423925 -14828845 -20106720 -21437684 -10533342 14430836 39266223 47319921
1099 47319921 36847900 17870438 -216730 -9650006 -2097031 21185207 40642483
1092 40642483 33914626 3031641 -23128344 -18202163 15099503 50819018 66262269
1085 66262269 57735691 35302273 11197498 -6089909 -13978494 -15734986 -14835445 -9556468
1077 -9556468 386925 2926805 -17466804 -54273455 -76358821 -63509583 -33857593 -20115073
1069 -20115073 -26947948 -31365575 -20538788 -6666187 -3144909 -7517462 -13274434 -19869429
$$ packed form
1122i0938251O344086J8293213J6523246M153883j0449783j2975791N023593K6983872
1114c7041932K3695625n600525k5548731j1572099J6357365K4402265J0309543
1107d998489l425436o404920n277875j330964J0904342K4964178K4835387Q053698
1099D7319921j0472021j8977462j8087168r433276P552975K3282238J9457276
1092D0642483o727857l0882985k6159985M926181L3301666L5719515J5443251
1085F6262269q526578k2433418k4104775j7287407p888585j756492Q99541N278977
1077i556468R943393K539880k0393609l6806651k2085366J2849238K9651990J3742520
1069b0115073o832875m417627J0826787J3872601L521278m372553n756972o594995
$$ plain form
1061 -19869429 -24950444 -23826990 -22332475 -32800566 -51587442 -59214645 -49464993 -38488149
1053 -38488149 -36833157 -33252527 -16440250 7914346 32081207 55201985 65637444
1046 65637444 42263290 -7674919 -39222500 -23592419 11693040 23900769 13906507
1039 13906507 11281520 19616069 15751252 -5164616 -20573770 -14834083 5929117 29154148
1031 29154148 40503903 23075031 -18366834 -43927613 -24627846 8546415 2454266
1024 2454266 -39361347 -63368278 -49279866 -31855050 -31154993 -19615343 17814093 45302609
1016 45302609 34419259 15774444 28192378 51263857 38676865 -3818460 -25614756
1009 -25614756 -6987147 19910068 25415881 15523053 4511526 -8236301 -20824431
$$ packed form
1061a9869429n081015J123454J494515j0468091j8786876p627203R749652J0976844
1053c8488149J654992L580630J6812277K4354596K4166861K3120778J0435459
1046F5637444k3374154m9938209l1547581J5630081L5285459J2207729r994262
1039A3906507k624987Q334549l864817k0915868j5409154N739687K0763200K3225031
1031B9154148J1349755j7428872m1441865k5560779J9299767L3174261o092149
1024B454266m1815613k4006931J4088412J7424816P00057J1539650L7429436K7488516
1016D5302609j0883350j8644815J2417934K3071479j2586992m2495325k1796296
1009b5614756J8627609K6897215N505813r892828j1011527j2747827j2588130
$$ plain form
1002 -20824431 -17630194 6565544 29834207 27361551 2850853 -16002962 -8227687 20800109
994 20800109 46830443 50733859 36591361 23989762 21606288 18638461 9779635 14284008
986 14284008 50692525 99492116 115261428 79629490 22170354 -18069785 -32944026
979 -32944026 -36419983 -34049212 -21476769 -4711264 1048619 -4441682 -1611133 20818397
971 20818397 45754426 48460880 29928033 14773483 18100898 30313947 37937733 43427466
963 43427466 54820143 68520901 75801564 78221864 82780704 87592501 86319788 81967940
955 81967940 81551354 81495887 74776035 68127377 71286780 70542641 39350284 -16756531 -51172303
946 -51172303 -29892086 22148829 48071863 23672421 -22463800 -48298066 -40222741
$$ packed form
1002b0824431L194237K4195738K3268663k472656k4510698j8853815P775275K9027796
994B0800109K6030334L903416j4142498j2601599k383474k967827q858826M504373
986A4284008L6408517M8799591J5769312l5631938n7459136m0240139j4874241
979c2944026l475957K370771J2572443J6765505N759883n490301K830549K2429530
971B0818397K4936029K706454j8532847j5154550L327415J2213049P623786N489733
963D3427466J1392677J3700758P280663K420300M558840M811797j272713m351848
955H1967940m16586n5467o719852o648658L159403p44139l1192357n6106815l4415772
946e1172303K1280217N2040915K5923034k4399442m6136221k5834266Q075325
$$ plain form
939 -40222741 -14592649 7717015 19392825 23794975 23125306 15989410 5935987 2995954
931 2995954 10033027 15130682 7449502 -6072604 -12109451 -12055081 -15828109 -20712971 -16621274
922 -16621274 -9426401 -15944028 -34548817 -44529193 -38991630 -34733578 -42525575 -50644186
914 -50644186 -46706826 -34386909 -20449005 -6987997 -2091327 -11518503 -14294844 17891936
906 17891936 64446048 61565113 -9047884 -77583194 -71790982 -13262831 18599127 -5130292
898 -5130292 -43854736 -63246205 -71981008 -80420542 -76538517 -57747854 -42714866 -33205636
890 -33205636 -3154501 51751465 88621738 71219051 23907009 -339666 10488896
883 10488896 22442132 12371205 -3516681 -2770509 8156046 6472660 -13895021 -38220635
$$ packed form
939d0222741K5630092K2309664J1675810M402150o69669p135896j0053423k940033
931B995954P037073N097655p681180j3522106o036847N4370l773028m884862M091697
922a6621274P194873o517627j8604789r980376N537563M258052p791997q118611
914e0644186L937360J2319917J3937904J3461008M896670r427176k776341L2186780
906A7891936M6554112k880935p0612997o8535310N792212N8528151L1861958k3729419
898e130292l8724444j9391469q734803q439534L882025J8790663J5032988R509230
890c3205636L0051135N4905966L6870273j7402687m7312042k4246675J0828562
883A0488896J1953236j0070927j5887886P46172J0926555j683386k0367681k4325614
$$ plain form
875 -38220635 -53952207 -61401793 -61060810 -47953663 -27960861 -23429533 -43453133 -59274392
867 -59274392 -35893961 14120909 38911427 16139804 -17262748 -18421262 8170159
860 8170159 31625192 41184416 44002631 39363539 26775053 22214386 34304403 40351561
852 40351561 20064921 -2784050 8027814 40373467 49988379 31977008 26660359 49509274
844 49509274 64799148 45024793 13250634 3058598 10800097 13220962 5793347 -1980637
836 -1980637 -9554669 -20334690 -27602492 -23898913 -13885014 -5246002 2473918 11426607
828 11426607 19468404 25685563 29554942 24765327 10555036 5176758 23783847 46263729
820 46263729 38048437 2550041 -23291533 -28091932 -36980798 -54059022 -44998133 -1694952
$$ packed form
875c8220635j5731572p449586L40983J3107147J9992802M531328k0023600j5821259
867e9274392K3380431N0014870K4790518k2771623l3402552j158514K6591421
860H170159K3455033R559224K818215m639092j2588486m560667J2090017O047158
852D0351561k0286640k2848971J0811864L2345653R614912j8011371n316649K2848915
844D9509274J5289874j9774355l1774159j0192036P741499K420865p427615p773984
836a980637p574032j0780021p267802L703579J0013899Q639012P719920Q952689
828A1426607Q041797O217159L869379m789615j4210291n378278J8607089K2479882
820D6263729q215292l5498396k5841574m800399q888866j7078224R060889M3303181
$$ plain form
812 -1694952 25025305 -3343431 -48159579 -47610301 -8965506 3771799 -37978971 -93918551
804 -93918551 -111967893 -82302674 -32649985 2319385 5536573 -7908928 -3787229 27683097
796 27683097 52901884 39623258 5132256 -7825603 9058313 25748550 23712710
789 23712710 17255235 23723710 39558145 51118009 50449392 38133030 24556238 25075669
781 25075669 40430205 49553044 36133987 10789524 -9282539 -26261568 -45404959
774 -45404959 -51191760 -30119290 -3823175 -5516995 -31337672 -48256383 -43796850 -33368053
766 -33368053 -23413389 -5549407 12229483 6863775 -21106716 -43964251 -47888337 -44877945
758 -44877945 -38915624 -17402678 13141643 20244331 -7708445 -38779559 -40258310 -17044087
$$ packed form
812a694952K6720257k8368736m4816148N49278L8644795J2737305m1750770n5939580
804i3918551j8049342K9665219M9652689L4969370L217188j3445501M121699L1470326
796B7683097K5218787j3278626l4491002j2957859J6883916J6690237k035840
789B3712710o457475O468475J5834435J1559864o68617j2316362j3576792N19431
781B5075669J5354536R122839j3419057k5344463k0072063j6979029j9143391
774d5404959n786801K1072470K6296115j693820k5820677j6918711M459533J0428797
766c3368053R954664J7863982J7778890n365708k7970491k2857535l924086L010392
758d4877945N962321K1512946L0544321P102688k7952776l1071114j478751K3214223
$$ plain form
750 -17044087 9862605 34981599 57250055 62593561 42699561 13927181 -3574736
743 -3574736 -10632757 -16299297 -18665121 -17103504 -25103829 -48596489 -66539993 -56659227
735 -56659227 -29846250 -16651133 -26887691 -42138032 -42219932 -22392605 8312752 29476898
727 29476898 18843704 -21410053 -54583865 -45968811 -6321365 20384302 10976283 -15221463
719 -15221463 -30318498 -31976142 -33797564 -38283071 -36247239 -27521175 -25572481 -37033252
711 -37033252 -47557696 -37989199 -10225907 14664132 24154861 26660751 31769841 33607874
703 33607874 25382140 16694741 19440715 26373233 22656766 11015329 4600551 1344487
695 1344487 -10570236 -25142535 -22614052 -1840698 16555815 21431280 20514215 17079013
$$ packed form
750a7044087K6906692K5118994K2268456N343506j9894000k8772380j7501917
743c574736p058021n666540k365824J561617q000325k3492660j7943504R880766
735e6659227K6812977J3195117j0236558j5250341q1900J9827327L0705357K1164146
727B9476898j0633194m0253757l3173812Q615054L9647446K6705667r408019k6197746
719a5221463j5097035j657644j821422m485507K035832Q726064J948694j1460771
711c7033252j0524444R568497K7763292K4890039R490729K505890N109090J838033
703C3607874q225734q687399K745974O932518l716467j1641437o414778l256064
695A344487j1914723j4572299K528483K0773354J8396513M875465r17065l435202
$$ plain form
687 17079013 5407584 -6813422 -2648996 10095006 1586372 -31918610 -55839912 -48322071
679 -48322071 -29949541 -23718270 -20500195 -9509780 -8219968 -28206166 -40874395 -16939387
671 -16939387 21701793 30565464 7199796 -14193937 -21743960 -36551052 -67292574 -93966094
663 -93966094 -100363047 -90236036 -68523898 -36846379 -10453430 -10062180 -31520527 -48588427
655 -48588427 -48710601 -42113398 -35908025 -26825202 -20729002 -29629437 -45050005 -43795304
647 -43795304 -26565414 -21517500 -40333304 -58851218 -53019319 -28936302 -5838634 6502628
639 6502628 2792547 -19305585 -42467596 -37255180 -2604020 24511037 16359400 -11654737
631 -11654737 -31648178 -42505188 -55061886 -60725438 -44642692 -16249307 2084262
$$ packed form
687A7079013j1671429j2221006M164426J2744002q508634l3504982k3921302P517841
679d8322071J8372530O231271L218075J0990415J289812j9986198j2668229K3935008
671a6939387L8641180Q863671k3365668k1393733p550023j4807092l0741522k6673520
663i3966094o396953J0127011K1712138L1677519K6392949L91250k1458347j7067900
655d8588427j22174O597203O205373R082823O096200q900435j5420568J254701
647d3795304J7229890N047914j8815804j8517914N831899K4083017K3097668J2341262
639F502628l710081k2098132k3162011N212416L4651160K7115057q151637k8014137
631a1654737j9993441j0857010j2556698n663552J6082746K8393385J8333569
$$ plain form
624 2084262 8484951 17653106 29567198 27422410 5174753 -24199711 -47508038 -60709135
616 -60709135 -61695005 -51448939 -40590226 -37666266 -33266254 -13731572 11976812 20434219
608 20434219 9626156 3625581 15150304 26058284 18048399 3740199 7884470 29019733
600 29019733 42045964 36709080 32078769 45894869 66603144 70550732 57935442 52725773
592 52725773 66132784 78945470 70077285 48143592 38729763 49054728 63752867 71091119
584 71091119 72504241 66800321 48946117 30409573 36035594 67576525 92134216 84585525
576 84585525 62342316 56089841 62795156 55696280 30432277 9766396 4897635 3186901
568 3186901 -1696887 2566004 18885270 27685860 18437009 12240281 32220202 66703871
$$ packed form
624B084262O400689R168155J1914092k144788k2247657k9374464k3308327j3201097
616f0709135r85870J0246066J0858713K923960M400012J9534682K5708384Q457407
608B0434219j0808063o000575J1524723J0907980q009885j4308200M144271K1135263
600B9019733J3026231n336884m630311J3816100K0708275L947588j2615290n209669
592E2725773J3407011J2812686q868185k1933693r413829J0324965J4698139P338252
584G1091119J413122n703920j7854204j8536544N626021L1540931K4557691p548691
576H4585525k2243209o252475O705315p098876k5264003k0665881m868761j710734
568C186901m883788M262891J6319266Q800590r248851o196728J9979921L4483669
$$ plain form
560 66703871 83693979 72285520 48315729 24894344 266144 -24227117 -35808269
553 -35808269 -29294047 -21158211 -32963178 -65083456 -94189308 -95867625 -66783220 -25806145
545 -25806145 4507816 16824251 19389418 20858117 22091773 24140498 33125719 48233533
537 48233533 53493566 34934184 1493855 -25511940 -40612396 -54060400 -63664158 -50033175
529 -50033175 -9791579 27857459 35835234 25137956 24431454 34663370 30593494 4588898
521 4588898 -19389129 -22029929 -14445743 -15474999 -22924077 -22945746 -12910768 1924614
513 1924614 22157980 45615472 54220627 31740048 -7523819 -28225727 -14674453 14334110
505 14334110 33510813 36696433 29903069 17165207 4548512 4631687 22594809 44654342
$$ packed form
560F6703871J6990108j1408459k3969791k3421385k4628200k4493261j1581152
553c5808269O514222Q135836j1804967l2120278k9105852j678317K9084405M0977075
545b5806145L0313961J2316435K565167J468699J233656K048725Q985221J5107814
537D8233533N260033j8559382l3440329k7005795j5100456j3448004r603758J3630983
529e0033175M0241596L7649038P977775j0697278p06502J0231916m069876k6004596
521D588898k3978027k640800P584186j029256p449078k1669J0034978J4835382
513A924614K0233366K3457492Q605155k2480579l9263867k0701908J3551274K9008563
505A4334110J9176703L185620o793364j2737862j2616695Q3175J7963122K2059533
$$ plain form
497 44654342 52257724 43343618 29776232 18882451 9276022 2092592 2848305 9637425
489 9637425 10370533 -2470747 -20983566 -31616500 -31605791 -29504022 -30958462 -30333054 -18964218
480 -18964218 1331364 16762033 14433854 -4547863 -25784440 -34907978 -29452077 -18094951
472 -18094951 -10102591 -7164832 -5420933 -3118814 -3157016 -7435219 -12101132 -11913119 -7647319
463 -7647319 -4645248 -4562190 -4335642 -4509147 -11550812 -27108962 -40223268 -37293534 -18419464
454 -18419464 1272488 5806108 -9485976 -37269492 -64327126 -79355893 -79642150 -70881143
446 -70881143 -59171710 -45857812 -32032850 -22301200 -18539378 -15092108 -7678455 -2620349
438 -2620349 -7770011 -17610130 -19207769 -12290527 -9911431 -15804222 -14795327 5241292
$$ packed form
497D4654342P603382q914106j3567386j0893781r606429p183430P55713O789120
489I637425P33108j2841280j8512819j0632934J0709K101769j454440O25408J1368836
480a8964218K0295582J5430669k328179j8981717k1236577r123538N455901J1357126
472a8094951P992360K937759J743899K302119l8202m278203m665913J88013M265800
463g647319L002071Q3058K26548j73505p041665j5558150j3114306K929734J8874070
454a8419464J9691952M533620j5292084k7783516k7057634j5028767k86257Q761007
446g0881143J1709433J3313898J3824962R731650L761822L447270P413653N058106
438b620349n149662r840119j597639O917242K379096n892791J008895K0036619
$$ plain form
430 5241292 31760419 40336319 25267132 5222555 -2647242 -3034159 -10370672 -24144540
422 -24144540 -28570936 -17642425 -7902339 -17009583 -37526431 -45803148 -34125407 -18245051
414 -18245051 -11937220 -12419473 -16981632 -32987658 -56755532 -61563595 -29644957 15183217
406 15183217 31473880 11128630 -16896947 -29299844 -28677917 -21924727 -7606966 7926354
398 7926354 8054252 -8315235 -18977847 -8133151 14220589 32236870 43380595 46031264
390 46031264 29604966 -6068408 -39133725 -50755684 -46760627 -39801308 -29071781 -16039636
382 -16039636 -18880786 -44650872 -63802791 -43663371 2647295 32036839 29797526 19616848
374 19616848 17820058 13064573 -2409738 -14479117 -13127175 -9716227 -13322595 -13188096
$$ packed form
430E241292K6519127Q575900j5069187k0044577p869797l86917p336513j3773868
422b4144540m426396J0928511R740086r107244k0516848q276717J1677741J5880356
414a8245051O307831m82253m562159j6006026k3767874m808063L1918638M4828174
406A5183217J6290663k0345250k8025577j2402897O21927O753190J4317761J5533320
398G926354J27898j6369487j0662612J0844696K2353740J8016281J1143725K650669
390D6031264j6426298l5673374l3065317j1621959L995057O959319J0729527J3032145
382a6039636k841150k5770086j9151919K0139420M6310666K9389544k239313j0180678
374A9616848j796790m755485j5474311j2069379J351942L410948l606368J34499
$$ plain form
366 -13188096 -1347866 8307764 3260663 -2645372 9910413 31487903 34590397 13985079
358 13985079 -6164581 -7214763 461836 -4523104 -25709805 -46772033 -52607793 -44895787
350 -44895787 -36748985 -35625535 -34989199 -25446655 -11931515 -12165866 -34184743 -61561742
342 -61561742 -68484366 -47983936 -19074636 -5508502 -11998763 -22766798 -20222743 -2121240
334 -2121240 19620352 34370596 42743861 48993938 48173965 29498572 -5369639 -35392846
326 -35392846 -39698968 -22402356 -9994192 -21070070 -44180959 -51426145 -31329353 -566814
318 -566814 17761149 18615773 12549480 7778926 6402674 14020796 37524322 70141187
310 70141187 91582558 89167446 68963962 41539637 9995247 -19213296 -28396315 -8728838
$$ packed form
366a3188096J1840230R655630n047101n906035J2555785K1577490L102494k0605318
358A3985079k0149660j050182P676599m984940k1186701k1062228n835760P712006
350d4895787Q146802J123450O36336R542544J3515140k34351k2018877k7376999
342f1561742o922624K0500430K8909300J3566134o490261j0768035K544055J8101503
334b121240K1741592J4750244Q373265O250077q19973j8675393l4868211l0023207
326c5392846m306122J7296612J2408164j1075878k3110889p245186K0096792L0762539
318e66814J8327963Q54624o066293m770554j376252P618122K3503526L2616865
310G0141187K1441371k415112k0203484k7424325l1544390k9208543r183019J9667477
$$ plain form
302 -8728838 19267934 24041113 1479896 -20202412 -16624363 4247461 14735255 273593
294 273593 -25825689 -37184792 -21870620 4108775 13252967 -2596285 -24734659 -34079687
286 -34079687 -34326359 -39811177 -50836744 -54802670 -44947183 -23944988 4531546 32117968
278 32117968 40552941 20712946 -5615249 -5120231 23515422 46587322 41111027 22761051
270 22761051 18710509 31307653 42547954 41481593 32696586 24882371 22013281 21401345
262 21401345 14591129 -3549370 -23254937 -27007499 -12566197 2244402 3418711 -2360405
254 -2360405 -2082097 4137791 7720956 6487312 5000694 6504679 11292731 16188636 11878356
245 11878356 -8117790 -30979851 -31804214 -6197156 19439794 22367487 12919425 12878239
$$ packed form
302h728838K7996772M773179k2561217k1682308L578049K0871824J0487794j4461662
294B73593k6099282j1359103J5314172K5979395R144192j5849252k2138374r345028
286c4079687k46672n484818j1025567l965926R855487K1002195K8476534K7586422
278C2117968Q434973j9839995k6328195M95018K8635653K3071900n476295j8349976
270B2761051m050542J2597144J1240301j066361q785007p814215k869090o11936
262B1401345o810216j8140499j9705567l752562J4441302J4810599J174309n779116
254b360405K78308O219888L583165j233644j486618J503985M788052M895905m310280
245A1878356j9996146k2862061q24363K5607058K5636950K927693r448062m1186
$$ plain form
237 12878239 18772744 10263247 -11794843 -21450279 -4354344 22646201 35605671 31191362
229 31191362 21573916 14216450 8521372 6229701 12722208 26282629 33729702 23162246
221 23162246 446022 -13474851 -6396425 8750931 9596406 -6328608 -19694084 -17750867
213 -17750867 -10789104 -13836525 -23833277 -25104259 -10238394 13386833 32373676 35618454
205 35618454 19996783 -5312774 -25472202 -35826986 -44319918 -54705341 -58350108 -49340406
197 -49340406 -36132438 -28887890 -25460642 -19322979 -10629482 755592 21278513 50106744
189 50106744 70836668 71168531 60994237 56595476 57570607 55425510 53374522 57549562
181 57549562 58097795 41861991 17704235 5616705 4380803 -5298371 -26213047 -38462355
$$ packed form
237A2878239N894505q509497k2058090r655436J7095935K7000545J2959470m414309
229C1191362r617446p357466n695078k291671O492507J3560421P447073j0567456
221B3162246k2716224j3920873P078426J5147356Q45475j5925014j3365476J943217
213a7750867O961763l047421r996752j270982J4865865K3625227J8986843L244778
205C5618454j5621671k5309557k0159428j0354784q492932j0385423l644767R009702
197d9340406J3207968P244548L427248O137663Q693497J1385074K0522921K8828231
189E0106744K0729924L31863j0174294m398761R75131k145097k050988M175040
181E7549562N48233j6235804k4157756j2087530j235902r679174k0914676j2249308
$$ plain form
173 -38462355 -31008870 -15764323 -4535938 5721722 16500009 17269583 2800230 -14738455
165 -14738455 -21467463 -17352079 -8992052 87406 5447768 1507162 -8041522 -12560947
157 -12560947 -12688979 -21539824 -41324970 -54826860 -49322578 -34289247 -25298202 -24288492
149 -24288492 -26510756 -32939113 -42546061 -43902421 -28761711 -6285440 7569068 7413072
141 7413072 -3193244 -19570977 -31300777 -21717580 13036115 51969476 69563855 62044310
133 62044310 43224085 24432528 12399021 16537887 39250253 63915748 70517776 60493252
125 60493252 49469178 39070988 16430495 -17534864 -40982706 -39586217 -24793007
118 -24793007 -14327553 -9208989 -1648725 6512616 7922119 5182935 7389211 13468098
$$ packed form
173c8462355P453485J5244547J1228385J0257660J0778287P69574j4469353j7538685
165a4738455o729008M115384Q360027R079458N360362l940606r548684m519425
157a2560947j28032q850845j9785146j3501890N504282J5033331Q991045J009710
149b4288492k222264o428357r606948j356360J5140710K2476271J3854508j55996
141G413072j0606316j6377733j1729800R583197L4753695L8933361J7594379p519545
133F2044310j8820225j8791557j2033507M138866K2712366K4665495O602028j0024524
125F0493252j1024074j0398190k2640493l3965359k3447842J396489J4793210
118b4793007J0465454N118564P560264Q161341J409503k739184K206276O078887
$$ plain form
110 13468098 12004182 -1480722 -18011760 -28434469 -33589642 -37252051 -38038823 -35021756
102 -35021756 -33983925 -39189630 -44062425 -40284845 -32665950 -32782758 -39209985 -38593334 -28444028
93 -28444028 -22618485 -27511172 -29340244 -16630044 -268054 4236841 1396185 4127804
85 4127804 8835680 4267774 -3250870 872453 9467003 1161577 -21775977 -32984963
77 -32984963 -24657360 -19832068 -30696714 -34754761 -11127866 24803949 45168420 47294754
69 47294754 44353834 36370680 16562459 -6472904 -18722285 -23624908 -31460397 -35645134
61 -35645134 -24910855 -10548481 -12881440 -24600942 -17280262 14250918 42333775 46629744
53 46629744 37782265 32429500 28522353 18114060 5696180 -112911 332639 3834476
$$ packed form
110A3468098j463916j3484904j6531038j0422709n155173l662409p86772L017067
102c5021756J037831n205705m872795L777580P618895j16808o427227O16651J0149306
93b8444028N825543m892687j829072J2710200J6361990M504895k840656K731619
85D127804M707876m567906p518644M123323Q594550q305426k2937554j1208986
77c2984963Q327603M825292j0864646m058047K3626895L5931815K0364471K126334
69D7294754k940920p983154j9808221k3035363j2249381m902623p835489m184737
61c5645134J0734279J4362374k332959j1719502P320680L1531180K8082857M295969
53D6629744q847479n352765l907147j0408293j2417880n809091M45550L501837
$$ plain form
45 3834476 11100712 17941145 13031926 -4320178 -15959907 -6997817 12860365 22547403
37 22547403 17230239 9931627 9720130 11113274 5979857 -3330485 -6817338 303075 10430855
28 10430855 10784523 -1649935 -15540058 -18859496 -12864945 -6363226 -1210092 5836191
20 5836191 9866588 803259 -18077200 -28053899 -17480917 3370114 15498654 10553222
12 10553222 -7614653 -31018921 -50510231 -58794552 -57366415 -54067705 -49179354 -33095554
4 -33095554 -4650952 18263440 17592803 -1450881
0 -1450881
$$ packed form
45C834476P266236O840433m909219j7352104j1639729Q962090J9858182R687038
37B2547403n317164p298612k11497J393144n133417r310342l486853P120413J0127780
28A0430855L53668j2434458j3890123l319438N994551O501719N153134P046283
20E836191M030397r063329j8880459r976699J0572982K0851031J2128540m945432
12A0553222j8167875k3404268j9491310q284321J428137L298710M888351J6083800
4c3095554K8444602K2914392o70637j9043684
0a450881
$$ Imaginary data points
##PAGE= N=2
##DATA TABLE= (X++(I..I)), XYDATA
$$ plain form
65535 10932034 6704195 1205138 887857 1882219 3343469 12105682 30552247 47519308
65527 47519308 47513042 26846370 -3628750 -30016844 -43953592 -40763311 -19588507 8033979
65519 8033979 18904743 761567 -29064473 -41587512 -31795412 -20326661 -18616243
65512 -18616243 -13335349 6139802 26468979 32929011 35148749 48231871 61146849
65505 61146849 50205464 18444301 -5132538 -6652768 -3335429 -12749720 -27678420
65498 -27678420 -31744191 -24030713 -16600634 -17218889 -23030864 -24873433 -13933941 8456670
65490 8456670 26086449 22203721 -109866 -21758394 -31695212 -34800793 -35622623 -30195584
65482 -30195584 -18569329 -10524751 -11630704 -15742834 -17917506 -22899018 -33438783 -40920947
$$ packed form
65535A0932034m227839n499057l17281R94362J461250Q762213J8446565J6967061
65527D7519308o266k0666672l0475120k6388094j3936748L190281K1174804K7622486
65519H033979J0870764j8143176k9826040j2523039R792100J1468751J710418
65512a8616243N280894J9475151K0329177O460032K219738J3083122J2914978
65505F1146849j0941385l1761163k3576839j520230L317339r414291j4928700
65498b7678420m065771P713478P430079o18255n811975j842569J0939492K2390611
65490H456670J7629779l882728k2313587k1648528r936818l105581q21830N427039
65482c0195584J1626255Q044578j105953m112130k174672m981512j0539765p482164
$$ plain form
65474 -40920947 -35575613 -18148081 3650089 22127350 30376125 26307994 17924661 12937545
65466 12937545 3273876 -23336167 -54898079 -60521318 -32522444 -1522771 3173544
65459 3173544 -11512197 -21881038 -22024058 -19964639 -16548453 -10578341 -12247474 -28875602
65451 -28875602 -47032008 -50352169 -45647804 -48860501 -54372126 -43963014 -20157413 -3312329
65443 -3312329 2049184 10036452 21570229 18964825 -208209 -10332638 7824203 39243258
65435 39243258 54939688 46588194 29778745 23098347 32008577 45157025 43379501 22011141
65427 22011141 3165993 10915331 35687464 43760468 23668579 -1011560 -10601415
65420 -10601415 -13488510 -19502022 -17931173 -2846755 4574320 -13455191 -36494523 -31852091
$$ packed form
65474d0920947N345334J7427532K1798170J8477261Q248775m068131q383333m987116
65466A2937545r663669k6610043l1561912n623239K7998874L0999673M696315
65459C173544j4685741j0368841j43020K059419L416186N970112j669133j6628128
65451b8875602j8156406l320161M704365l212697n511625J0409112K3805601J6845084
65443c312329N361513P987268J1533777k605404j9173034j0124429J8156841L1419055
65435C9243258J5696430q351494j6809449o680398Q910230J3148448j777524k1368360
65427B2011141j8845148P749338K4772133Q073004k0091889k4680139r589855
65420a0601415k887095o013512J570849J5084418P421075j8029511k3039332M642432
$$ plain form
65412 -31852091 -4041862 12695585 5579627 -3939746 1467979 13586063 21140620 27054615
65404 27054615 32931245 28184641 7832784 -14285192 -21515980 -11983752 6816121 26919957
65396 26919957 36139734 22325997 -6608470 -22024721 -8992272 10819314 7284317
65389 7284317 -17420439 -35512560 -34135339 -26831451 -25150409 -21940937 -10995656 -5035627
65381 -5035627 -19798982 -48966226 -67751232 -58919118 -27506800 7556950 29348783
65374 29348783 32067400 21281234 7088805 -4951656 -15867890 -26069277 -30114554
65367 -30114554 -22333433 -5451056 10229236 15621741 9025805 -4311037 -16401771
65360 -16401771 -22714286 -26729656 -35443039 -47687261 -51643531 -39528095 -21116141 -15182754
$$ packed form
65412c1852091K7810229J6737447p115958r519373N407725J2118084P554557N913995
65404B7054615N876630m746604k0351857k2117976p230788R532228J8799873K0103836
65396B6919957R219777j3813737k8934467j5416251J3032449J9811586l534997
65389G284317k4704756j8092121J377221P303888J681042L209472J0945281N960029
65381e035627j4763355k9167244j8785006Q832114L1412318L5063750K1791833
65374B9348783K718617j0786166j4192429j2040461j0916234j0201387m045277
65367c0114554P781121J6882377J5680292N392505o595936j3336842j2090734
65360a6401771o312515m015370q713383j2244222l956270J2115436J8411954N933387
$$ plain form
65352 -15182754 -28610526 -50612199 -66409390 -68936767 -57606250 -35226297 -9330782
65345 -9330782 10804731 21950708 26485913 24010856 12094884 -3640169 -11980929 -12719540
65337 -12719540 -17967814 -30611953 -36824805 -31484723 -34321410 -60399560 -86275359 -72650940
65329 -72650940 -19113167 29773161 37796202 13396652 -14485934 -32628723 -41586498
65322 -41586498 -38960326 -25736966 -16664160 -23478621 -34981609 -32156694 -17122675 -8100685
65314 -8100685 -9410482 -7123817 4263603 10614164 193895 -18252732 -28375105 -27030685
65306 -27030685 -23812968 -26313431 -33171513 -38855266 -40956371 -43187234 -50339836 -58579651
65298 -58579651 -55919001 -38316191 -19007112 -11881337 -11711815 -4734699 6529808 8176406
$$ packed form
65352a5182754j3427772k2001673j5797191k527377J1330517K2379953K5895515
65345i330782K0135513J1145977M535205k475057j1915972j5735053q340760p38611
65337a2719540n248274j2644139o212852N340082k836687k6078150k5875799J3624419
65329g2650940N3537773M8886328Q023041k4399550k7882586j8142789q957775
65322d1586498K626172J3223360R072806o814461j1502988K824915J5034019R021990
65314h100685j309797K286665J1387420O350561j0420269j8446627j0122373J344420
65306b7030685L217717k500463o858082n683753k101105k230863p152602q239815
65298e8579651K660650J7602810J9309079P125775J69522O977116J1264507J646598
$$ plain form
65290 8176406 2850811 8686892 24648056 22755610 -9759242 -42624698 -39857705 -10675401
65282 -10675401 2748853 -18362567 -50966988 -66881927 -62363806 -46213625 -22787264
65275 -22787264 424587 6785665 -10534515 -33751450 -40643888 -33249673 -30679786 -36942455
65267 -36942455 -34225555 -11823055 15058521 26167717 24317957 27442321 38093267
65260 38093267 39514386 25077866 12964499 19085944 28788423 14275767 -24856364
65253 -24856364 -57883164 -60800273 -40371871 -16767359 -530199 4851763 -4909108
65246 -4909108 -25910695 -41389310 -40689816 -33764929 -33506111 -34402135 -25744551 -16584951
65238 -16584951 -25575782 -49140105 -61899026 -51276173 -32580970 -24532921 -25963749
$$ packed form
65290H176406n325595N836081J5961164j892446l2514852l2865456K766993K9182304
65282a0675401J3424254k1111420l2604421j5914939M518121J6150181K3426361
65275b2787264K3211851O361078j7320180k3216935o892438P394215K569887o262669
65267c6942455K716900K2402500K6881576J1109196j849760L124364J0650946
65260C8093267J421119j4436520j2113367O121445R702479j4512656l9132131
65253b4856364l3026800k917109K0428402K3604512J6237160N381962r760871
65246d909108k1001587j5478615O99494O924887K58818q96024Q657584R159600
65238a6584951q990831k3564323j2758921J0622853J8695203Q048049j430828
$$ plain form
65231 -25963749 -23424913 -9073779 15122492 40682230 55936909 55103437 45105486 33837679
65223 33837679 15439484 -16736527 -46151022 -46079825 -20098659 -3317296 -12489813 -20816005
65215 -20816005 -536617 32332379 41309255 22141345 3421249 887693 -562667
65208 -562667 -15917651 -33481771 -29602125 350754 33310527 39050148 10196262 -27361722
65200 -27361722 -40781111 -28780781 -21577375 -37495984 -57364603 -54697704 -33900107
65193 -33900107 -19601546 -21862740 -32900119 -46055351 -54878141 -44971706 -13733718
65186 -13733718 10704439 -117897 -31635408 -44419921 -30849253 -18543611 -19639001
65179 -19639001 -18200305 -13253804 -28323911 -61352051 -69336358 -29985376 18937451
$$ packed form
65231b5963749K538836J4351134K4196271K5559738J5254679q33472r997951j1267807
65223C3837679j8398195l2176011k9414495P1197K5981166J6781363r172517q326192
65215b0816005K0279388L2868996Q976876j9167910j8720096k533556j450360
65208e62667j5354984j7564120L879646K9952879L2959773N739621k8853886l7557984
65200b7361722j3419389J2000330P203406j5918609j9868619K666899K0797597
65193c3900107J4298561k261194j1037379j3155232q822790R906435L1237988
65186a3733718K4438157j0822336l1517511j2784513J3570668J2305642j095390
65179a9639001J438696M946501j5070107l3028140p984307L9350982M8922827
$$ plain form
65172 18937451 33557975 23742591 23074648 29942238 22324869 7314759 6369731 6921240
65164 6921240 -17613944 -46513737 -28826865 31891988 68154123 44403229 9005999
65157 9005999 17100150 47237402 42017884 1102646 -21671569 -3292387 19713760
65150 19713760 13752231 -6047570 -10684267 -2908845 -1897161 -5502214 2390612 18047078
65142 18047078 20527090 6624940 -2840083 2970064 7983024 -1582785 -11384713 -2892502
65134 -2892502 9579772 -7394395 -56197281 -97181096 -96595781 -65647575 -39209446
65127 -39209446 -32185115 -33563077 -31472532 -24384962 -13320744 -1089217 3672665 -2287818
65119 -2287818 -5251562 8524902 27881093 29626769 15279535 10052772 20366171 19671560
$$ packed form
65172A8937451J4620524r815384o67943O867590p617369j5010110r45028N51509
65164F921240k4535184k8899793J7686872O0718853L6262135k3750894l5397230
65157I005999Q094151L0137252n219518m0915238k2774215J8379182K3006147
65150A9713760n961529j9799801m636697P775422J011684l605053P892826J5656466
65142A8047078K480012j3902150r465023N810147N012960r565809r801928Q492211
65134b892502J2472274j6974167m8802886m0983815N85315L0948206K6438129
65127c9209446P024331j377962K090545P087570J1064218J2231527M761882n960483
65119b287818k963744J3776464J9356191J745676j4347234n226763J0313399o94611
$$ plain form
65111 19671560 -9182196 -41487731 -42748228 -17508321 -1739285 -14301718 -38637827
65104 -38637827 -50027534 -41552899 -23613925 -14474688 -30225643 -67125710 -94598468
65097 -94598468 -84105931 -45913373 -17685929 -14357265 -12516344 7958923 32450548
65090 32450548 38355346 31052906 29305285 30765967 20857363 7640619 15977958 45520601
65082 45520601 64335215 53034660 29364577 16379566 10632103 714692 -3440474
65075 -3440474 14204856 42639191 52753279 36795396 15967141 7621014 5400088
65068 5400088 -3551929 -19033941 -32313672 -37514732 -32780171 -20151617 -7746020 -2626347
65060 -2626347 -605791 6014845 11848052 4689829 -11493855 -18552994 -13100677 -13536527
$$ packed form
65111A9671560k8853756l2305535j260497K5239907J5769036j2562433k4336109
65104c8637827j1389707Q474635J7938974R139237j5750955l6900067k7472758
65097i4598468J0492537L8192558K8227444L328664J840921K0475267K4491625
65090C2450548N904798p302440j747621J460682r908604j3216744Q337339K9542643
65082D5520601J8814614j1300555k3670083j2985011n747463r917411m155166
65075c440474J7645330K8434335J0114088j5957883k0828255q346127k220926
65068E400088q952017j5482012j3279731n201060M734561J2628554J2405597N119673
65060b626347K020556O620636N833207p158223j6183684p059139N452317m35850
$$ plain form
65052 -13536527 -29991470 -46471722 -44510659 -27576323 -9543027 4211827 10157233
65045 10157233 -1362730 -29378700 -52563907 -56035932 -54840980 -69608957 -90736539
65038 -90736539 -90786273 -64420276 -32323737 -11821984 -6893864 -20148021 -47391450 -63834009
65030 -63834009 -44897449 -2620969 25008853 23080749 11313809 4540295 -6827204
65023 -6827204 -27743996 -40694281 -32788134 -15866931 -3347821 9847951 26496814
65016 26496814 28807936 3492195 -31975678 -51145544 -53448148 -54571434 -52984139 -31542458
65008 -31542458 10544149 49199646 61760709 48469037 26718797 13205191 11199662
65001 11199662 9591734 -2718328 -19763479 -25081680 -17825282 -17128383 -32874212 -49057164
$$ packed form
65052a3536527j6454943j6480252J961063J6934336J8033296J3754854N945406
65045A0157233j1519963k8015970k3185207l472025J194952j4767977k1127582
65038i0736539m9734K6365997L2096539K0501753M928120j3254157k7243429j6442559
65030f3834009J8936560M2276480K7629822j928104j1766940o773514j1367499
65023f827204k0916792j2950285P906147J6921203J2519110J3195772J6648863
65016B6496814K311122k5315741l5467873j9169866k302604j123286J587295K1441681
65008c1542458M2086607L8655497J2561063j3291672k1750240j3513606k005529
65001A1199662j607928j2310062j7045151n318201P256398O96899j5745829j6182952
$$ plain form
64993 -49057164 -49075105 -42144302 -48267459 -68883964 -88328167 -93501817 -77357238 -36363019
64985 -36363019 17208280 53050209 53685460 37437556 30408083 27847194 8671042 -22100970
64977 -22100970 -36900180 -29005257 -20979978 -25611072 -27129632 -10856646 12408815 24230736
64969 24230736 23067411 19099480 17796554 18496536 19023387 14400991 -164618 -19823624
64961 -19823624 -31096609 -24962527 -3125736 25675002 46651538 42849731 12766005
64954 12766005 -20909728 -36624351 -42214344 -57740665 -76710475 -72783255 -45779529
64947 -45779529 -29585871 -44082671 -66823072 -67942537 -50639896 -39127696 -43824931
64940 -43824931 -56423037 -66289223 -65334195 -47005915 -15217118 13184895 25460612
$$ packed form
64993d9057164j7941O930803o123157k0616505j9444203n173650J6144579M0994219
64985c6363019N3571299L5841929O35251j6247904p029473k560889j9176152l0772012
64977b2100970j4799210P894923Q025279m631094j518560J6272986K3265461J1821921
64969B4230736j163325l967931j302926O99982N26851m622396j4565609j9659006
64961a9823624j1272985O134082K1836791K8800738K0976536l801807l0083726
64954A2766005l3675733j5714623n589993j5526321j8969810L927220K7003726
64947d5779529J6193658j4496800k2740401j119465J7302641J1512200m697235
64940d3824931j2598106r866186R55028J8328280L1788797K8402013J2275717
$$ plain form
64933 25460612 25009447 20282884 13632049 7791848 8609061 12242857 4842776 -14515661
64925 -14515661 -25872498 -14995892 7142321 23407351 32550811 38408068 34720300
64918 34720300 18773937 5014807 5566705 10349211 5966737 372878 6529014 15098990
64910 15098990 9914308 54818 6237093 20751469 13888454 -17673073 -40591415 -31458658
64902 -31458658 -5535310 13727782 27921871 47082566 59784933 45524211 9525321
64895 9525321 -18322025 -21748355 -18636380 -35698827 -71818422 -96303185 -82835638
$$ packed form
64933B5460612m51165m726563o650835n840201Q17213L633796p400081j9358437
64925a4515661j1356837J0876606K2138213J6265030R143460N857257l687768
64918C4720300j5946363j3759130N51898M782506m382474n593859O156136Q569976
64910A5098990n184682r859490O182275J4514376o863015l1561527k2918342R132757
64902c1458658K5923348J9263092J4194089J9160695J2702367j4260722l5998890
64895I525321k7847346l426330L111975j7062447l6119595k4484763J3467547
$$ [...]
##END NTUPLES=NMR SPECTRUM
##END=
