##TITLE=31Pdec_LR-698-R3-EA2
 CDCl3, 24 sc
 31.1.2020
##JCAMPDX= 6.0         $$ Bruker NMR JCAMP-DX V2.0
##DATA TYPE= NMR SPECTRUM
##DATA CLASS= NTUPLES
##ORIGIN= UXNMR, Bruker Analytische Messtechnik GmbH
##OWNER= root
$$ XWIN-NMR		Version 3.5
$$ Fri Jan 31 14:56:45 2020 Russian Standard Time (UT+4h)  she@DPX200
##.OBSERVE FREQUENCY= 81.013821
##.OBSERVE NUCLEUS= ^31P
##.ACQUISITION MODE= SIMULTANEOUS
##.ACQUISITION SCHEME= undefined
##.AVERAGES= 24
##.DIGITISER RES= 17
##SPECTROMETER/DATA SYSTEM= spect
##.PULSE SEQUENCE= zgpg30
##.SOLVENT NAME= CDCl3
##.SHIFT REFERENCE= (INTERNAL, CDCl3, 0, 182.463)
##AUDIT TRAIL= $$ (NUMBER, WHEN, WHO, WHERE, WHAT)
$$ ##TITLE= Audit trail, XWIN-NMR		Version 3.5
$$ ##JCAMPDX= 5.01
$$ ##ORIGIN= Bruker BioSpin GmbH
$$ ##OWNER= she
$$ F:/spectra/data/she/nmr/P31/1/pdata/1/auditp.txt
$$ ##AUDIT TRAIL=  $$ (NUMBER, WHEN, WHO, WHERE, WHAT)
(   1,<2020-01-31 14:55:44.79 +0400>,<she>,<DPX200>,
      <created by zg, POWCHK disabled, PULCHK disabled
       configuration hash MD5:
       00 E9 B6 7A A2 85 ED C7 34 08 36 98 17 FE 4E 26
       data hash MD5: 32K
       DF 42 E4 50 7A 7F BB E9 6D 3A 25 FC 65 ED 1B AA>)
(   2,<2020-01-31 14:55:47.35 +0400>,<she>,<DPX200>,
      <Start of raw data processing
       efp BC_mod = 2 LB = 1 FT_mod = 6 PKNL = 1 PHC0 = -1677.882 PHC1 = 60.00131 SI = 64K 
       data hash MD5: 64K
       0E C5 A1 11 0A 78 17 F8 49 15 1D 73 E2 15 76 CA>)
(   3,<2020-01-31 14:56:02.60 +0400>,<she>,<DPX200>,
      <pk PHC0 = 24.75009 PHC1 = 0 
       data hash MD5: 64K
       A2 85 B5 F4 F9 72 1E 0F 71 BB 38 76 0C CF 71 8F>)
(   4,<2020-01-31 14:56:05.90 +0400>,<she>,<DPX200>,
      <abs ABSG = 5 
       data hash MD5: 64K
       10 B4 1B F9 52 FB A7 FF 17 6C C1 73 92 A8 83 1E>)
$$ ##END=
$$ 
$$ hash MD5
$$ B5 27 CA 3B 4C D4 04 79 F8 E3 27 98 2F A6 19 5D
##$RELAX= 
##$RELAX= 
##$RELAX= 
##$RELAX= 
##$RELAX= 
##$RELAX= 
##$RELAX= 
##$RELAX= 
$$ Bruker specific parameters
$$ --------------------------
##$DU= <F:/spectra>
##$EXPNO= 1
##$NAME= <P31>
##$PROCNO= 1
##$TYPE= <nmr>
##$USER= <she>
##$AMP= (0..31)
100 100 100 100 100 100 100 100 100 100 100 100 100 100 100 100 100 100 
100 100 100 100 100 100 100 100 100 100 100 100 100 100 
##$AQSEQ= 0
##$AQ_mod= 1
##$AUNM= <au_zg>
##$AUTOPOS= <>
##$BF1= 81.014009
##$BF2= 200.13
##$BF3= 200.13
##$BF4= 200.13
##$BF5= 200.13
##$BF6= 200.13
##$BF7= 200.13
##$BF8= 200.13
##$BYTORDA= 1
##$CFDGTYP= 0
##$CFRGTYP= 5
##$CHEMSTR= <none>
##$CNST= (0..31)
1 1 145 1 1 1 1 1 1 1 1 1 1 1 1 1 1 1 1 1 1 1 1 1 1 1 1 1 1 1 1 1 
##$CPDPRG= <waltz16>
##$CPDPRG1= <>
##$CPDPRG2= <waltz16>
##$CPDPRG3= <>
##$CPDPRG4= <mlev>
##$CPDPRG5= <mlev>
##$CPDPRG6= <mlev>
##$CPDPRG7= <mlev>
##$CPDPRG8= <mlev>
##$CPDPRGB= <>
##$CPDPRGT= <>
##$D= (0..31)
0 1 0 0 0 0 0 0 0 0 0 0.03 2e-05 3e-06 0 0 0 0 0 0 0 0 0 0 0 0 0 0 0 0 
0 0 
##$DATE= 1580468144
##$DBL= (0..7)
120 120 120 11 120 120 24 19 
##$DBP= (0..7)
150 150 150 150 150 150 150 150 
##$DBP07= 0
##$DBPNAM0= <>
##$DBPNAM1= <>
##$DBPNAM2= <>
$$ [...]
##$SUBNAM3= <"">
##$SUBNAM4= <"">
##$SUBNAM5= <"">
##$SUBNAM6= <"">
##$SUBNAM7= <"">
##$SUBNAM8= <"">
##$SUBNAM9= <"">
##$SW= 369.568048894756
##$SWIBOX= (0..15)
0 1 3 0 0 0 0 0 0 0 0 0 0 0 0 0 
##$SW_h= 29940.119760479
##$TD= 32768
##$TD0= 1
##$TE= 0
##$TE2= 300
##$TE3= 300
##$TEG= 300
##$TL= (0..7)
0 120 53 12 22 120 120 120 
##$TP= (0..7)
150 150 150 150 150 150 150 150 
##$TP07= 0
##$TPNAME0= <>
##$TPNAME1= <>
##$TPNAME2= <>
##$TPNAME3= <>
##$TPNAME4= <>
##$TPNAME5= <>
##$TPNAME6= <>
##$TPNAME7= <>
##$TPOAL= (0..7)
0.5 0.5 0.5 0.5 0.5 0.5 0.5 0.5 
##$TPOFFS= (0..7)
0 0 0 0 0 0 0 0 
##$TUNHIN= 0
##$TUNHOUT= 0
##$TUNXOUT= 0
##$USERA1= <user>
##$USERA2= <user>
##$USERA3= <user>
##$USERA4= <user>
##$USERA5= <user>
##$V9= 5
##$VALIST= <valist>
##$VCLIST= <CCCCCCCCCCCCCCC>
##$VD= 0
##$VDLIST= <DDDDDDDDDDDDDDD>
##$VPLIST= <PPPPPPPPPPPPPPP>
##$VTLIST= <TTTTTTTTTTTTTTT>
##$WBST= 1024
##$WBSW= 4
##$XGAIN= (0..3)
0 0 0 0 
##$XL= 0
##$YL= 0
##$YMAX_a= 9036
##$YMIN_a= -21028
##$ZGOPTNS= <>
##$ZL1= 120
##$ZL2= 120
##$ZL3= 120
##$ZL4= 120
##$ABSF1= 182.463
##$ABSF2= -187.1042
##$ABSG= 5
##$ABSL= 3
##$ALPHA= 0
##$AQORDER= 0
##$ASSFAC= 0
##$ASSFACI= 0
##$ASSFACX= 0
##$ASSWID= 0
##$AUNMP= <proc_1d>
##$AZFE= 0.1
##$AZFW= 0.5
##$BCFW= 0
##$BC_mod= 2
##$BYTORDP= 0
##$COROFFS= 0
##$CY= -3
##$DATMOD= 1
##$DC= 0
##$DFILT= <>
##$DTYPP= 0
##$F1P= 0
##$F2P= 0
##$FCOR= 1
##$FTSIZE= 65536
##$FT_mod= 6
##$GAMMA= 0
##$GB= 0
##$INTBC= 1
##$INTSCL= 5.30512e-09
##$ISEN= 30
##$LB= 1
##$LEV0= 0
##$LPBIN= 0
##$MAXI= 10000
##$MC2= 0
##$MEAN= 0
##$ME_mod= 0
##$MI= 50
##$NCOEF= 0
##$NC_proc= -7
##$NLEV= 6
##$NOISF1= 182.463
##$NOISF2= 159.3651
##$NSP= 0
##$NTH_PI= 0
##$NZP= 0
##$OFFSET= 182.463
##$PC= 4
##$PHC0= -1653.132
##$PHC1= 60.00131
##$PH_mod= 1
##$PKNL= yes
##$PPARMOD= 0
##$PSCAL= 0
##$PSIGN= 0
##$REVERSE= no
##$SF= 81.0140089999434
##$SI= 65536
##$SIGF1= 159.3651
##$SIGF2= -187.1042
##$SINO= 113.3802
##$SIOLD= 16384
##$SREGLST= <1H.CDCl3>
##$SSB= 0
##$STSI= 65536
##$STSR= 0
##$SW_p= 29940.119760479
##$SYMM= 0
##$S_DEV= 0
##$TDeff= 32768
##$TDoff= 0
##$TI= <>
##$TILT= no
##$TM1= 0
##$TM2= 0
##$TOPLEV= 0
##$USERP1= <user>
##$USERP2= <user>
##$USERP3= <user>
##$USERP4= <user>
##$USERP5= <user>
##$WDW= 1
##$XDIM= 65536
##$YMAX_p= 542686215
##$YMIN_p= -60379449
$$ End of Bruker specific parameters
$$ ---------------------------------
##NTUPLES= NMR SPECTRUM
##VAR_NAME=  FREQUENCY,     SPECTRUM/REAL,   SPECTRUM/IMAG
##SYMBOL=    X,             R,               I
##VAR_TYPE=  INDEPENDENT,   DEPENDENT,       DEPENDENT
##VAR_FORM=  AFFN,          ASDF,            ASDF
##VAR_DIM=   65536,         65536,           65536
##UNITS=     HZ,            ARBITRARY UNITS, ARBITRARY UNITS
##FACTOR=    0.456856943014862, 1,           1
##FIRST=     14782.0589164792, 0,            0
##LAST=      -15158.0608439998, 0,           0
##MIN=       -15158.0608439998, -60379449,   0
##MAX=       14782.0589164792, 542686215,    0
$$ Real data points
##PAGE= N=1
##DATA TABLE= (X++(R..R)), XYDATA
$$ [...]
45306e944353L030934L567807L784796K517221o91911l221561k354647P57169
45298A445455K624236J853279j43835j791668k413361j513689O21807K011722
45290B693946P87483k157509l922589k793589N16637M031079N443852L004244
45282G603554k378278o569004n992542j670429K448695M403364M930999M097411
45274F873770Q96398l370651n074872l164926r45983j045587j595344L7451K484248
45265d905496K762822J410031J223474K009214J026862j375912j253285K446691
45257C344401N094281K627633k647734n531482m675047k494568l73461K038605
45249b617372L767525K988193O40145k21555P78823P99068j122656k151232l38062
$$ y = [-5944353, -2913419, 654388, 4439184, 6956405, 6264494, 3042933, 688286, 1445455, 4069691, 5922970, 5779135, 3987467, 1574106, 60417, 682224, 2693946, 3481429, 1323920, -2598669, -5392258, -4875621, -844542, 4599310, 7603554, 5225276, -1343728, -7336270, -9006699, -6558004, -2154640, 2776359, 6873770, 7770168, 4399517, -675355, -3840281, -4786264, -5831851, -7427195, -7389744, -4905496, -2142674, -732643, 490831, 2500045, 3526907, 2150995, 897710, 3344401, 8438682, 11066315, 8418581, 2887099, -1787948, -4282516, -4655977, -2617372, 1150153, 4138346, 4778491, 4556936, 5335759, 6134827, 5012171, 2860939, 2522877]
45240B522877K255978L023753K149709M92532k298519n002375m063350P99198
45232a20197L961840J402683k690609k377896L00229p34056m230708l131206K706208
45223d913712N029736P56431k584456M47440M032878J433409l196490k129296
45215a124060K496241K618847j736057k983163N33097K080685j233695l558842
45207b906947p40779K832600K283749Q1853N19843J976856O05112k194900j907802
45198E49585J718232M473046L633045K89308l065050m212779k014382J677837
45190C048842K727813k6174k538389j434416Q09712L61754j281860j69692K689904
45181D187494K681055m81140k157218m53277J231447N10493n55516l46789r67429
$$ y = [2522877, 4778855, 7802608, 9952317, 10444849, 8146330, 3143955, -919395, -120197, 3841643, 5244326, 2553717, 175821, 476050, -258006, -4488714, -7619920, -4913712, 116024, 872455, -1712001, -1264561, 2768317, 4201726, 1005236, -1124060, 1372181, 3991028, 2254971, -728192, -195095, 1885590, 651895, -2906947, -3647726, -815126, 1468623, 1550476, 2070319, 4047175, 4652287, 2457387, 549585, 2267817, 6740863, 10373908, 10663216, 7598166, 3385387, 1371005, 3048842, 5776655, 5750481, 3212092, 1777676, 2587388, 2949142, 1667282, 1497590, 4187494, 6868549, 6387409, 4230191, 3776914, 5008361, 5518854, 4963338, 4616549, 3649120]
45172C649120l657940n142896k293818K508778M416253K570652J56894n70101
45164A636942j10928N55234J115628J013048k98097k135679l163476k944426j836622
45155f168376j67884J246830R44272j128052k466269r34830J970422K923164J261886
45146b518837n52130o70254K49776R18315R57889K77097j009729j610093q1261
45137d039227K545993L274994J198009j030352j057884j37038o82851k212484
45129b140840k256191n24057N52744l27355j288545j22859K384769L392223J608618
45120A278507j277146k755287k187677r27597j92120M19308J907561L862378M417050
45111D544977K483050o87864k683900k234545l3588K034504K060201m93898l645910
$$ y = [3649120, -8820, -5151716, -7445534, -4936756, -520503, 2050149, 2207043, 1636942, 1526014, 2081248, 3196876, 4209924, 3911827, 1776148, -1387328, -4331754, -6168376, -6336260, -5089430, -4145158, -5273210, -7739479, -8674309, -6703887, -3780723, -2518837, -3070967, -3741221, -3491445, -2573130, -1615241, -1338144, -2347873, -3957966, -4039227, -1493234, 1781760, 2979769, 1949417, 891533, 754495, 71644, -2140840, -4397031, -4921088, -4368344, -4695699, -5984244, -6107103, -3722334, -330111, 1278507, 1361, -2753926, -4941603, -5869200, -6061320, -5642012, -3734451, 127927, 4544977, 7028027, 6340163, 3656263, 1421718, 1388130, 3422634, 5482835, 4988937, 1343027]
45102A343027m106942r66665K639052L195575J382864O77650J754222J454753
45094G373536j729036m406158k939216R70588K547757O17619j384790r32418M27856
45085E45738L95010m00729O8965J636663J931828m37346m018132n886077m376576
45076a0540656n50590K913807M377991M333141L482098J098587k953229n712484
45068c551335l749549J505713M377226K152306j410264j738255M23289J488513
45060e02356J052749J427422K589843K034797m76081k167965j864867j486966
45052F06576j840848q05765K285109M035023J750481j850988k189615O11039K310545
45043D911557Q47129j529586k370592j910180j158201q1175J018934P19145j225932
$$ y = [1343027, -2763915, -3730580, -1091528, 2104047, 3486911, 4164561, 5918783, 7373536, 5644500, 1238342, -1700874, -730286, 1817471, 2435090, 1050300, 117882, 545738, 940748, 540019, 608984, 2245647, 4177475, 3740129, -278003, -6164080, -10540656, -11091246, -8177439, -3799448, 533693, 4015791, 5114378, 2161149, -3551335, -7300884, -5795171, -1417945, 734361, -675903, -2414158, -1990869, -502356, 550393, 1977815, 4567658, 6602455, 6126374, 3958409, 2093542, 606576, -1234272, -2040037, 245072, 4280095, 6030576, 4179588, 1989973, 2601012, 4911557, 5758686, 4229100, 1858508, -51672, -1209873, -1291048, -272114, 447031, -778901]
45034g78901k540645j217794J489393K623912J357925l83738p56549R0880R05873
45025G90356Q25592k11892j556508k148812j506562m43303j9460P3961R52813
45016c243815K335189K379985L71836j745036j630937M68135K127718J628475
45008B691550n31390k552287k878757j332318M56248M33223j148431j474660R24847
44999e411975L343715K347449r10968k082012k05686R37890q70000k630173j240556
44990f722316J216632R82762j019830p79083J931824K876860p9364l738680m185897
44981i517092j512562J662061L855382M989997M782418K947520L61527j349370
44973F219881j301794j33339L84835j109307l610493m149946j589456J061652
$$ y = [-778901, -3319546, -4537340, -3047947, -424035, 933890, 550152, -206397, -115517, 790356, 1615948, 1404056, -152452, -2301264, -3807826, -4251129, -4270589, -4196628, -3243815, -908626, 1471359, 1843195, 98159, -1532778, -1064643, 1063075, 2691550, 2160160, -392127, -3270884, -4603202, -4146954, -3713731, -4862162, -6336822, -5411975, -2068260, 279189, -631779, -2713791, -2919477, -1981587, -2851587, -5481760, -6722316, -5505684, -4522922, -5542752, -6321835, -4390011, -1513151, -1592515, -5331195, -9517092, -11029654, -9367593, -5512211, -522214, 4260204, 7207724, 7569251, 6219881, 4918087, 4784748, 5169583, 4060276, 449783, -3700163, -5289619, -4227967]
44965d227967M05872k203518k433056M96414K835551K324097J078997J077002
44957f46608Q72107p91124j813561l70001J331921M96106j440158j194340R46169
44948b609489J940648J020094J66761K85535L38586j03187m59012q11962j263829
44939a495855n12322J981531L567044J657046j603328j924848N20790J481460
44931C671518n38488k501067k400922j875175k064364j418476N85869J679782
44923d861323Q20556K11793J196671J792200N94691m36277L98885J517946J195852
44914B430994L67906k00187j810931m038359l186976J663522N102584K561409
44906B889962k475954l668828j092846N79287N10941J532481L164950K122252
$$ y = [-4227967, -3822095, -6025613, -8458669, -7962255, -5126704, -2802607, -1723610, -646608, 225499, -565625, -2379186, -2749187, -1417266, -921160, -2361318, -3555658, -2609489, -668841, 351253, 518014, 803549, 1142135, 1038948, 579936, -232026, -1495855, -2008177, -26646, 3540398, 5197444, 3594116, 1669268, 2190058, 3671518, 3133030, 631963, -1768959, -3644134, -5708498, -7126974, -6541105, -4861323, -4040767, -3828974, -2632303, -840103, -245412, -681689, -282804, 1235142, 2430994, 2798900, 2598713, 787782, -3250577, -6437553, -4774031, 328553, 2889962, 414008, -3254820, -4347666, -3768379, -3257438, -1724957, 1439993, 3562245]
44898C562245n60609j99830L065565L656160l3495k716656j265147L01224j367807
44889D441650k726197q9650K939708J155729l113182l403694O44134L204558J555329
44880D608385q69646j057242m29583r75053j966776k290157k389941k183786k61002
44871g814801K950389M060337J036903l402355m954706k863716J31609J857463
44863h998877K539364K921941K535379N46362k443713m235749l036395L57465
44855i814223K994252K972805J590516J311250K257343K357760P82664p83995
44847C668372q71095m20670j135160k858044l831785k861985k99423K520383M067847
44838b021560L518209J621854J07766l36435o83519j574189j894680n35980J433532
$$ y = [3562245, 3001636, 2801806, 5867371, 9523531, 9490036, 6773380, 5508233, 5809457, 4441650, 1715453, 1625803, 4565511, 5721240, 2608058, -795636, -151502, 3053056, 4608385, 3738739, 2681497, 2251914, 1276861, -689915, -2980072, -5370013, -7553799, -7814801, -4864412, -804075, 232828, -3169527, -8124233, -10987949, -10856340, -8998877, -6459513, -3537572, -1002193, -455831, -2899544, -7135293, -10171688, -9814223, -6819971, -3847166, -2256650, -945400, 1311943, 3669703, 4452367, 3668372, 2797277, 2376607, 1241447, -1616597, -5448382, -8310367, -8609790, -6089407, -2021560, 1496649, 3118503, 3226269, 2889834, 2206315, 632126, -1262554, -1798534, -365002]
44829c65002K024490J257673J023450K006681K561828J231200j103267k496302
44821F140751k300526j290520k72624L55295K61171m15874o13823M85590J827349
44812D176789J229796j798732m918584n335429k822126K59855J665506J373124
44804f169801R82545J481421K040156J282997m59777j114982K48224J478092m7743
44795b78868l205467l817894k91954L699681L831068O14507j928564j745728k28303
44786c351522J024150J871452K011430O68193j351676j851154m46164P46259N55683
44777a23349L72657J080893J126780m17118j418928J22553K484797K648175P73511
44768F649971o08248n91983j38321N17183J473647J118407j923193n242246m898774
$$ y = [-365002, 1659488, 2917161, 3940611, 5947292, 8509120, 9740320, 8637053, 6140751, 3840225, 2549705, 2277081, 2632376, 2893547, 2477673, 1863850, 2349440, 4176789, 5406585, 3607853, -1310731, -6646160, -9468286, -9208431, -7542925, -6169801, -5187256, -3705835, -1665679, -382682, -842459, -1957441, -1709217, -231125, -278868, -3484335, -7302229, -7594183, -3894502, -63434, 551073, -1377491, -3123219, -3351522, -2327372, -455920, 1555510, 2223703, 872027, -979127, -1425291, -679032, -123349, 249308, 1330201, 2456981, 2039863, 620935, 743488, 3228285, 5876460, 6649971, 6041723, 5449740, 5311419, 5828602, 7302249, 8420656, 6497463, 1255217, -3643557]
44759c643557j355001P66716m54643j637882J66819K946758L237402J097442j024409
44750I9645j974318j868435m77274J701089K495982Q69754q19520n9013J697200
44741A665110J172396j427953k569752o85948J788908K182291P90303n31945r43566
44732A439844p58561m28895k81723m17982m63500j14560J59681j40992m39823
44723a446511Q7086R33077R51670L23569J60955L16577m44747j878107j963598
44714b960029N4180K192382K440867J445956J094280J510108J103359p44769k484495
44705C651839k243888j74780J573613J253216m38447j279019m99802K26284n36538
44696A532478j576350q69757J048972J739904O76637r225Q82527J654347N40411
$$ y = [-3643557, -4998558, -4231842, -4686485, -6324367, -6157548, -3210790, 26612, 1124054, 99645, -1874673, -3743108, -4220382, -2519293, -23311, 846443, 26923, -32090, 1665110, 2837506, 1409553, -1160199, -1846147, -57239, 2125052, 2915355, 2383410, 1439844, 681283, 252388, -29335, -447317, -910817, -1025377, -865696, -1006688, -1446511, -1359425, -426348, 525322, 848891, 1009846, 1326423, 881676, -996431, -2960029, -2905849, -713467, 1727400, 3173356, 4267636, 5777744, 6881103, 6136334, 3651839, 1407951, 1233171, 2806784, 4060000, 3621553, 2342534, 1842732, 2069016, 1532478, -43872, -913629, 135343, 1875247, 2551884, 2542659, 3425186, 5079533, 5619944]
44687E619944j490146k431164k241786k190914k139016o39629K313070M434845
44679A235204L652217N43147k223154k518483o43122J239441J483920N78755L8664
44670C386589J32946j60370r89433j026653K79674J368307P08804q89870j555628
44661A254366r77372j06972R27137K486302L312070J238096l267962o326293m791433
44652f252061M9087M209352N465139M650968L219323J388609r74029l033336l470001
44643E253051j912293N21155J966057J256917q33955k023165j072325K81532o07746
44634B829228l153063l581616l10260K977946K102238j431334k484510J60713
44626b890658K437020J683345K20196L35419J04454k357139m168133j871328K193083
$$ y = [5619944, 4129798, 1698634, -543152, -2734066, -4873082, -5512711, -3199641, 1235204, 4887421, 5430568, 3207414, 688931, 45809, 1285250, 2769170, 3347925, 3386589, 3519535, 3359165, 2369732, 1343079, 1622753, 2991060, 3699864, 2809994, 1254366, 276994, 170022, 1097159, 3583461, 6895531, 8133627, 4865665, -1460628, -6252061, -6202974, -1993622, 3471517, 8122485, 11341808, 12730417, 11756388, 8723052, 5253051, 3340758, 3861913, 5827970, 7084887, 6250932, 4227767, 3155442, 3436974, 2829228, -323835, -3905451, -4215711, -1237765, 864473, -566861, -3051371, -2890658, -453638, 1229707, 1449903, 1785322, 1889776, -467363, -4635496, -6506824, -4313741]
44617d313741L045728J160407J533741M876911N975683K255280j910072k216431
44609A0407506o34103q94211k109930j452904R5170k34336j358660n3402K676127
44600F441257K285696j897734m823431k799602J433090K873560P30355j689140
44592B554051j871047n69693J3069j112492k905463l386716j553526J548010L760153
44583c523654L761672J947389k22402j368905j140993m39567k97097m54799R9024
44574a639332J177655J415158N07757l15525n05130p46623p61774N98978K046378
44565A777542L15709l963274n031587k23699M624507L104623j830081k415579
44557c641839J652662L270150j10418k780131p72085K136619J753331P6971K17823
$$ y = [-4313741, -1268013, -107606, 1426135, 6303046, 12278729, 14534009, 12623937, 10407506, 9773403, 8879192, 6769262, 5316358, 5411528, 5177192, 3818532, 3765130, 6441257, 8726953, 6829219, 2005788, -793814, 639276, 3512836, 4243191, 2554051, 683004, 113311, 126380, -986112, -3891575, -7278291, -8831817, -7283807, -3523654, 238018, 2185407, 1963005, 594100, -546893, -986460, -1283557, -1738356, -1639332, -461677, 953481, 1461238, 1145713, 640583, -106040, -867814, -268836, 1777542, 2093251, -1870023, -6901610, -7125309, -2500802, 603821, -1226260, -3641839, -1989177, 1280973, 1170555, -1609576, -2381661, -245042, 1508289, 1585260, 1803083]
44548A803083M32721j676934l649163k280097L97868O86280l22296N60452K110817
44539a937269R25957j654648j192585K068310L312705J162906m77324M39615R36193
44530C583860j014807k501377n90198K724645L641532J764420n77878j858276
44522E171921j717914j9470J979893J518477k021161n094955m306725j196444
44514e686378K24968n22284l69882J668384K667202O69563j788792j194109J896244
44505b435084L788907K664589K27988j393045j979933j966836j155613J1281k13269
44496b451015k343737l796984j869855K229382M825094M737251L909207L211667
44488H451010J205077j967445l165181r13801J550063O60101k414746l981911
$$ y = [1803083, 2235804, 558870, -3090293, -5370390, -4972522, -4286242, -4608538, -4048086, -1937269, -1011312, -2665960, -3858545, -1790235, 1522470, 2685376, 2208052, 2647667, 3583860, 2569053, 67676, -522522, 2202123, 5843655, 7608075, 7030197, 5171921, 3454007, 3434537, 5414430, 6932907, 4911746, -183209, -4489934, -5686378, -5461410, -5983694, -6353576, -4685192, -2017990, -1348427, -3137219, -4331328, -2435084, 1353823, 4018412, 4246400, 2853355, 873422, -1093414, -2249027, -2237746, -2451015, -4794752, -8591736, -10461591, -8232209, -3407115, 1330136, 5239343, 8451010, 9656087, 7688642, 4523461, 3609660, 5159723, 5819824, 3405078, -576833]
44480e76833l046564j222250O87870K477329K419358o29279l814075l039145J098634
44471e644955M047951L897812L009517K671064Q55771k989983n242222l050262
44463b445307J039833K447801N91478j144688k34720K383834L805141J939525
44455H382897k322834n102910l247935J362867L414266R94122j801813p62484
44447I16176K633877L889305J870948o56051j776221k399460l420264l685809
44439b627499j931924P29707J626835k24815k471376j946594J046825K587463
44431c211378N53604j733493j01441L733725M249952N89118k121860r69074O01444
44422A590597o44968k196165p79336J525759J108497o32534n4270J892814J425604
$$ y = [-576833, -3623397, -4845647, -4157777, -1680448, 738910, 109631, -3704444, -6743589, -5644955, -1597004, 2300808, 5310325, 7981389, 8837160, 5847177, 604955, -2445307, -1405474, 1042327, 1633805, 489117, 254397, 2638231, 6443372, 8382897, 6060063, 957153, -2290782, -927915, 2486351, 3480473, 1678660, 916176, 3550053, 7439358, 9310306, 8654255, 6878034, 4478574, 1058310, -2627499, -4559423, -3829716, -2202881, -2427696, -4899072, -6845666, -5798841, -3211378, -2657774, -4391267, -4492708, -758983, 3490969, 4080087, 1958227, 989153, 1590597, 945629, -1250536, -2029872, -504113, 604384, -28150, -82420, 1810394, 3235998]
44413C235998j015617j497407K34484L92148j688902k007906R86406L185723J239888
44404C064815k200004k625913J59500K841171L186520J438789j010693k389760
44396B464425j551745L85786R93498l62k55483J275161K455670J338214q97676
44387F207488j975115j527253o29845j62627q32118k848572m502553l327788J67218
44378i431165K474218K086996J548760K673472L020903L2883m085501n158519
44370f837953k819578l4589J620907K637012K711381J076729p55932k91646J759805
44361i33864J970303o11461k884554k257975j3780J243917J247327J452751K184665
44352A397329K126933L18496k315551l601746k367048p7477N88221p16493j259477
$$ y = [3235998, 2220381, 722974, 957458, 1349606, -339296, -2347202, -1360796, 1824927, 3064815, 864811, -1761102, -1601602, 1239569, 4426089, 5864878, 4854185, 2464425, 912680, 1298466, 2291964, 2291602, 2036119, 3311280, 5766950, 7105164, 6207488, 4232373, 2705120, 2075275, 1912648, 1080530, -1768042, -6270595, -9598383, -9431165, -6956947, -4869951, -3321191, -647719, 2373184, 2406067, -1679434, -6837953, -9657531, -9692120, -8071213, -5434201, -2722820, -1646091, -2402023, -2693669, -933864, 1036439, 424978, -2459576, -4717551, -4731331, -3487414, -2240087, -787336, 1397329, 3524262, 3842758, 1527207, -2074539, -4441587, -4519064, -3930843, -4647336, -5906813]
44343e906813P34447K893471J824780j620662l124484q11747K486736L432542
44335i1730K075146N50299Q834J04280P0112o60703j762988j621726P48208L182943
44325B602675K141670k111170m661462k078377K714135M064281P27153l126485
44317B72420l390969k33291L050046L531104R35304k177601k591877Q0533K596755
44308B072424K072631j37934o26683P72523Q91337j376127l007960j645981O78384
44299c07386J071211M14300J113353K096227L61112l059781l426721M05157L429292
44290B096764J542479k537776l591117j208490J056318J739030K221905K465744
44282C784857P05549k330351l219903r97675J120901N72063j179385j575736l15449
$$ y = [-5906813, -5172366, -2278895, -454115, -2074777, -5199261, -6011008, -3524272, -91730, 1983416, 2533715, 2542549, 2646829, 2716941, 2056238, 293250, -1328476, -580268, 2602675, 4744345, 2633175, -2028287, -4106664, -1392529, 2671752, 3398905, 272420, -3118549, -3351840, -301794, 3229310, 4164614, 1987013, -604864, -524331, 2072424, 4145055, 4007121, 3380438, 4152961, 5044298, 3668171, 660211, -985770, -307386, 763825, 1178125, 2291478, 4387705, 4748817, 1689036, -1737685, -1332528, 2096764, 3639243, 1101467, -2489650, -3698140, -2641822, -902792, 1319113, 3784857, 4490406, 2160055, -1059848, -2057523, -936622, -364559, -1543944, -3119680, -3435129]
44273c435129J726528L943535M756219K110178k736448n042007k594297J095624
44265a75797K109994J311889J137330P84688j196211k638226j118217Q25055o30918
44256D09587l506346k731068J077789K249196l87733j534652J444027M064528
44248A085328K253633j440289k798410k273941k371969k632073j399556M17965
44240i159312J189231J574652K351701J984564k01948j313607P83342L126914
44232C35537J926315j197700j873517M1962J118380O43180J000325K297069J874461
44223F166012m88145j763983r41080n66315j738234j861014O18061K914313J862692
44214D202307j513863l807013l610520j962019P095J757064K608435K088795P56999
$$ y = [-3435129, -1708601, 2234934, 6991153, 9101331, 6364883, 1322876, -1271421, -175797, 1934197, 3246086, 4383416, 5168104, 3971893, 1333667, 215450, 1040505, 409587, -3096759, -5827827, -4750038, -2500842, -2888575, -4423227, -2979200, 1085328, 3338961, 1898672, -899738, -3173679, -5545648, -8177721, -9577277, -9159312, -7970081, -6395429, -4043728, -2059164, -2261112, -3574719, -2791377, 335537, 2261852, 1064152, -809365, -767403, 350977, 994157, 1994482, 4291551, 6166012, 5677867, 3913884, 2972804, 2406489, 668255, -1192759, -574698, 2339615, 4202307, 2688444, -1118569, -4729089, -6691108, -6684013, -4926949, -2318514, -229719, 527280]
44205E27280k17019j10538Q89745J838939J833411J179397J071070J418418M44236
44196H874939k146558l494961j547527J074223N37336k169169k731656l76149
44188a979522J353031Q21295M61206J658098K228569P93068p72371j415179l005241
44179A42954n630927n292392j13273M955226M210822p61522l752527k544966j14397
44170h901002J370208K775584M474872M984723L710108J802318o8547k060246
44162H088018l343925k738049j106163m52296p92087n93259L9342l54962j330140
44153b583521q33012J054116J934415J084248L59058N10358L4011j269246j113320
44144h22893J168532K571725Q13166j849204j870160M32524J766347P25513q57158
$$ y = [527280, 310261, 199723, 1089468, 2928407, 4761818, 5941215, 7012285, 8430703, 8874939, 6728381, 3233420, 1685893, 2760116, 3297452, 1128283, -1603373, -1979522, -626491, 194804, 656010, 2314108, 4542677, 5335745, 4563374, 3148195, 142954, -5487973, -10780365, -10893638, -5938412, -1727590, -2489112, -6241639, -8786605, -8901002, -7530794, -4755210, -280338, 4704385, 8414493, 10216811, 10148264, 8088018, 4744093, 2006044, 899881, 447585, -344502, -937761, -898419, -1253381, -2583521, -3416533, -2362417, -428002, 656246, 1015304, 1525662, 1559673, 290427, -822893, 345639, 2917364, 3730530, 1881326, 11166, 443690, 2210037, 2935550, 2078392]
44135B078392r60558L26382J533855J466623J91502q61800k79517J261146J288340
44126F044365j154142l583157k894743N32817L095864K267043o19902k279471
44118A408674j409181L8765l54534k086717k342166j95982J580481M07200k008983
44109d962443k044925L03479J603195P20879N76702K859829M599624K576065j474493
44100D757912l138700j264491J271754J810839L15207j893335l407948l015752
44092d564514p63830J382419J593309N05477o1275M1824k79824p79474k14894
44083c140782Q93410N21122j371175k127276k43118K165006K236260K41652j076460
44074a901361k71137J239353J286084l87848j881185j278013J090824K738510
$$ y = [2078392, 1117834, 1444216, 2978071, 4444694, 4636196, 3774396, 3494879, 4756025, 6044365, 4890223, 1307066, -1587677, -1054860, 2041004, 4308047, 3688145, 1408674, -507, 38258, -316276, -2402993, -4745159, -4941141, -3360660, -2953460, -4962443, -7007368, -6703889, -5100694, -4379815, -3803113, -943284, 3656340, 6232405, 4757912, 1619212, 354721, 1626475, 3437314, 3752521, 1859186, -1548762, -4564514, -5328344, -3945925, -2352616, -1847139, -1908414, -1866590, -2146414, -2925888, -3140782, -2247372, -1726250, -3097425, -5224701, -5467819, -3302813, -1066553, -824901, -1901361, -2172498, -933145, 352939, -34909, -1916094, -3194107, -2103283, 635227]
44066F35227J700662j103789k807758j840280M57945J600307P02035q77791j280367
44057b813809j32766J284975J715208J308817Q81152K90566j210954k961758k819354
44048d457923L1212L426156M510198K849236L45558j056089p35231M29056L93447
44039E735620k109970n006280m310582K17240L315494R40128l493619l584507
44031h296476P74836L532587J784561m15929Q85216L599036L688666J431479p7263
44022F906713j37334m09537j189844j201916l72881Q6894q9549l09987p87410
44013B495149j755972j782051M30932K981423K457212j124654l848649l064078
44005c210688n57987M96717l04753r03178J58356K291122L685119K792444k19108
$$ y = [635227, 2335889, 1232100, -1575658, -3415938, -2957993, -1357686, -655651, -1533442, -2813809, -2946575, -1661600, 53608, 1362425, 2243577, 2534143, 1323189, -1638569, -4457923, -4426711, -1000555, 3509643, 6358879, 6704437, 5648348, 4913117, 5342173, 5735620, 3625650, -1380630, -5691212, -5473972, -2158478, -1218350, -4711969, -8296476, -7521640, -3989053, -2204492, -2620421, -1735205, 1863831, 5552497, 6983976, 6906713, 6769379, 6359842, 5169998, 3968082, 3595201, 3682095, 3592546, 3282559, 2495149, 739177, -1042874, -611942, 2369481, 4826693, 3702039, -146610, -3210688, -3768675, -3271958, -3576711, -4479889, -4321533, -2030411, 1654708, 4447152, 4228044]
43996D228044l051795l382177j780319j099289k267074k511148N81285M681027
43988d601446M986679P26100l226423k365067J754130L833547J855972q42240
43980B121252r22092K04349r11444l840061m256371j61957M728317N513135K212367
43971D687495q25629p81088O42448K66466k250961m044182k437922J758138M530527
43962A545292K806373j612635l588883r45392K435318J683727k297204m140888
43954d114292j704246J166493O87050j442003j268674J111902K041462K42383
43946c279925j417681p39344M55459l81322k192386j921539O49817K534452K031132
43937d261337Q95049J101040J824513J402337M50014N98329J247750M22944j475056
$$ y = [4228044, 1176249, -2205928, -3986247, -5085536, -7352610, -9863758, -9282473, -4601446, 385233, 1111333, -2115090, -4480157, -2726027, 1107520, 2963492, 2121252, 1199160, 1403509, 492065, -3347996, -7604367, -7766324, -3038007, 2475128, 4687495, 3861866, 3080778, 3723226, 3989692, 1738731, -2305451, -4743373, -2985235, 1545292, 4351665, 2739030, -849853, -1795245, 640073, 2323800, 26596, -4114292, -5818538, -4652045, -3964995, -5406998, -6675672, -5563770, -3522308, -3279925, -4697606, -5436950, -4981491, -5362813, -7555199, -9476738, -8826921, -6292469, -4261337, -3366288, -2265248, -440735, 961602, 1411616, 2009945, 3257695, 3680639, 2205583]
43928B205583j802866N099J288634M76681m40571L30273R77358p03113k882234
43919e45156k115280R94529K423073Q10961q70603l52943Q09773N85317j41830
43910A597841L88277J618190J812028R35285K94368K57882J82161n0535l6889
43901F998608L6369l66450j070844j402663j139207n12616J89088L79308o04147
43892B507446k161912k293237n1151K551898K497100o18725m021215m695295k087028
43883h372119J822257M302263L956930J757049q6688n19618l56239m34372k83839
43874A785624N39228J020743K2033j672432k153429r48290N41609J079633Q96331
43865A111050Q14246R52093O25384p28163k518004l049006j311862J272411K066778
$$ y = [2205583, 402717, 407816, 1696450, 2173131, 1732560, 2062833, 3040191, 2337078, -545156, -2660436, -1665907, 757166, 1568127, 697524, 344581, 1154354, 1739671, 1597841, 1986118, 3604308, 5416336, 6351621, 6645989, 6903871, 7086032, 7035497, 6998608, 7034977, 6668527, 5597683, 4195020, 3055813, 2543197, 2732285, 3111593, 2507446, 345534, -1947703, -1998854, 553044, 3050144, 2431419, -1589796, -6285091, -8372119, -6549862, -2247599, 1709331, 3466380, 3379692, 2860074, 2503835, 2069463, 1785624, 2324852, 3345595, 3367628, 1695196, -458233, -1406523, -864914, 214719, 1111050, 1925296, 2877389, 3502773, 2774610, 256606, -2792400, -4104262, -2831851, -765073]
43856g65073N13516j137880r53247M00386J317339J435112R51466l76085j931330
43847e45796j789864M22875J990039P71161j298058j149501N63463Q74841m46837
43838f07677j007080k55819Q6737j78657M03427J195802m7539k381909k034418
43829d827133J162286K564843J01669k000348j01734K704687J680973j830246
43821e45003k820986m96076J446951J244734P47541Q89056J58496j703818k441388
43812c520493r56683Q28647J107995P26401J236095K261120K109677J0938k925639
43803H78058m398221k791279Q10617L214875K775976J220147M06195p67275l606588
43794b257495n650158l363446J905514M830440L239551M74791r5704Q46907J235983
$$ y = [-765073, -251557, -1389437, -2342684, -1942298, -624959, 810153, 1761619, 1385534, -545796, -2335660, -1912785, 77254, 848415, -449643, -1599144, -1035681, -160840, -607677, -1614757, -1870576, -1783839, -1962496, -1559069, -363267, -410806, -2792715, -4827133, -3664847, -1100004, -998335, -2998683, -3100417, -395730, 1285243, -545003, -3365989, -3862065, -2415114, -1170380, -422839, 466217, 624713, -1079105, -3520493, -4477176, -3648529, -2540534, -1814133, -578038, 1683082, 3792759, 3803697, 878058, -3520163, -6311442, -5500825, -2285950, 490026, 1710173, 2116368, 1349093, -2257495, -7907653, -11271099, -9365585, -4535145, -1295594, -820803, -916507, -69600, 1166383]
43785A166383Q93424M60566o6710j87144J047329K524460J575178j562230l013820
43776B837436r38937J340639M04219k075810k236532L13767K867283L662157K586062
43767H760284k00442l235786l270146P15883M546338L537274j011767l668005
43759F173633k294764J53105P25106m68716k232587l677422l397819o14912K522758
43750c111618K900211Q89685k94217L44564P78851L41169P24002J806646R05586
43741E284879k188592l701113j691053O21277K03575q84036M27405K459947J598022
43732B130311j264805j942138J55370R90424j722460m949112m582026o73978L175804
43723h682610M179437K744273J149919Q13566J064605N50337o96783j514906j535161
$$ y = [1166383, 2059807, 2520373, 2453663, 2266519, 3313848, 5838308, 7413486, 5851256, 2837436, 1898499, 3239138, 3643357, 1567547, -668985, -355218, 2512065, 6174222, 8760284, 8559842, 5324056, 2053910, 2769793, 7316131, 10853405, 9841638, 6173633, 3878869, 4031974, 4757080, 4288364, 2055777, -1621645, -5019464, -5634376, -3111618, -211407, 678278, 384061, 728625, 1507476, 1848645, 2572647, 4379293, 5284879, 3096287, -604826, -2295879, -1674602, -1471027, -2355063, -1927658, 532289, 2130311, 865506, -1076632, -921262, 69162, -1653298, -6602410, -11184436, -11858414, -8682610, -4503173, -1758900, -608981, 204585, 1269190, 1819527, 1122744, -392162, -1927323]
43714a927323j193134r333K649141M752647K901744k113515m683294j931362J640042
43705H5613P98067k383611k214120J219310K564421L75966q44595J217945K801527
43696C620523Q10563j925490j634931L70813N73822r77504j682764r03371J34476
43687a613863J121502K068951J682318m16256j570256L40665K818404K053253
43679F484718j015136k212622q99421m87499k073232k441777K34438L040281K824094
43670C453844N96491r67311j529472k025145k019816r27089p2890p77745j665428
43661e934561n14144K103534L455139K306741j40416k258605k866615r70375K847098
43652a972204N280494L313494j504314m321758k904575J00578J310729M42790
$$ y = [-1927323, -3120457, -3129790, -480649, 4271998, 7173742, 5060227, 376933, -1554429, 85613, 883680, -1499931, -3714051, -2494741, 69680, 445646, -398949, 818996, 3620523, 4431086, 2505596, 870665, 1241478, 1815300, 837796, -844968, -1748339, -1613863, -492361, 1576590, 3258908, 2842652, 1272396, 1613061, 4431465, 6484718, 5469582, 3256960, 2357539, 1870040, -203192, -2644969, -2410531, 629750, 3453844, 4050335, 3083024, 1553552, -471593, -2491409, -3418498, -3491388, -4269133, -5934561, -6448705, -4345171, -890032, 1416709, 1276293, -982312, -3848927, -4819302, -1972204, 3308290, 6621784, 5117470, 795712, -2108863, -2008285, -697556, -254766]
43644b54766r86400k233883k874977j834253R01151K906353J993578l63884n61681
43635c308762K145795M287958K663312j280278l050854p63199K395478K273065
43627E362515p41850k429856j039854J05759j735632l477378q07771L714733L142769
43618B093435k773830n637011o24811N552156M354442j835154l923109q6566K823558
43609e6890J135475j033846m93612q4167j743778j852389J664880L856379L82415
43600A774467m300001l195115K276521M740692K136703p52227j142510j373648
43592A64882k684118k598999k59904J300220L92187n53633M31514J772849J869013
43583a65989J561063J109088j001667l968844l887605L4559K880189J187090j508339
$$ y = [-254766, -1241166, -3475049, -6350026, -8184279, -7283128, -4376775, -2383197, -2747081, -3308762, -1162967, 3124991, 5788303, 4508025, 1457171, 693972, 3089450, 5362515, 4620665, 2190809, 1150955, 1256714, -478918, -3956296, -4764067, -1049334, 2093435, -680395, -6317406, -6942217, -1390061, 2964381, 1129227, -2793882, -2880448, -56890, 1078585, 44739, -448873, -533040, -2276818, -4129207, -2464327, 1392052, 1774467, -2525534, -5720649, -3444128, 1296564, 3433267, 2681040, 1538530, 164882, -2519236, -5118235, -5378139, -4077919, -3685732, -4239365, -3807851, -2035002, -165989, 1395074, 2504162, 1502495, -2466349, -6353954, -6319395, -3439206, -2252116, -3760455]
43574c760455n82323K129978J973368m08871o72934J270814J261459j487402k853749
43565c130115q28183J300228N82711j231364j254193J97165J245897J617317J770604
43556B70067J145059m08366j261073l05546Q17453o772j867622j787305J148912
43547b255193M375585M723838J681166k356702m457361l635070j263371O74194
43539b512914J260548N16945j248052k950809k632434M33608L994660M938655
43531A800207K948125L75691j147500j936184k299578j771385n99200K11403P02777
43522a715644J626562K123754M51549k444449l154775p60200J469491R18231q45444
43513b330925j396928j257811j657857j307143J109450L300828K129408j168720
$$ y = [-3760455, -4342778, -2212800, -239432, -648303, -1321237, -50423, 1211036, -276366, -3130115, -3958298, -2658070, -2075359, -3306723, -4560916, -4363751, -3117854, -1500537, 270067, 1415126, 1006760, -254313, -559859, 257594, 250822, -1616800, -3404105, -2255193, 2120392, 6844230, 8525396, 6168694, 1711333, -1923737, -3187108, -2512914, -1252366, -735421, -1983473, -4934282, -7566716, -7133108, -3138448, 1800207, 4748332, 5124023, 3976523, 2040339, -259239, -2030624, -2629824, -2418421, -1715644, -89082, 2034672, 2486221, 41772, -3113003, -3873203, -2403712, -1485481, -2330925, -3727853, -4985664, -6643521, -7950664, -6841214, -3540386, -1410978, -2579698]
43505b579698k300811N0368K916814L531062J975864m85812k600234k628089K11764
43496a908772L515840L843030J361067n98346p70909j274185l092006m048093
43488b972374k703379p12526N44618K201753M482467M575978J143555k109080
43480D451012j336800J270770P50220k621725l646010n04218K277733O94694l013821
43471a678145m032860j567927J050774J307332m6080r34717m30340P75377J337755
43462d218831O65560l48123m36149K26196L68421j00588K64505J878556K882867
43453A182414J722696m04532j244941o24765j84880o39570j071247p30331K7751
43444a967405N99542O68949j0444j168233j568711l48991J356698J569685J44178
$$ y = [-2579698, -4880509, -4830141, -1913327, 1617735, 3593599, 3107787, 507553, -2120536, -1908772, 1607068, 5450098, 6811165, 6212819, 5441910, 4167725, 1075719, -2972374, -5675753, -6388279, -5843661, -3641908, 840559, 5416537, 6560092, 4451012, 3114212, 4384982, 5135202, 2513477, -1132533, -1636751, 640982, 1335676, -1678145, -5711005, -7278932, -6228158, -4920826, -4966906, -5901623, -6331963, -5556586, -4218831, -3553271, -3901394, -4337543, -4111347, -3742926, -3843514, -3579009, -1700453, 1182414, 2905110, 2500578, 1255637, 630872, 445992, -193578, -1264825, -1995156, -1967405, -1367863, -698914, -709358, -1877591, -3446302, -3795293, -2438595, -868910, -724732]
43435g24732j257691j769036j990066j875330k54765K586833M020909K406306
43427A142428k84877j025834K44518J123795M56763n81394q44937o57531o81455
43418a108524r36749j249494j396916o89992J211588K942714K500211J15441j570148
43409a81869r72466L93196M74995l00200l77218k26703j571488l639018l074706
43400i475477J154062N101317M430787L72046j811753r8887J814365M44033k267250
43391c36757k330211L7170J295799O06189O10872K016583J976474n59810k226397
43382A089912o83948J210443L42071j012800P31883L434322K244278j647110k030716
43373C678335K047359L925841k90497n217596m244525P52726K963263O66075j881628
$$ y = [-724732, -1982423, -3751459, -5741525, -7616855, -7871620, -5284787, -1263878, 1142428, 857551, -168283, 76235, 1200030, 1656793, 1075399, 230462, -427069, -1108524, -2045273, -3294767, -4691683, -5381675, -4170087, -1227373, 1272838, 1388279, -181869, -1154335, -761139, -286144, -586344, -963562, -1190265, -2761753, -6400771, -9475477, -8321415, -3220098, 1210689, 1582735, -229018, -327905, 1486460, 1930493, -336757, -2666968, -2629798, -1333999, -727810, -116938, 1899645, 3876119, 3316309, 1089912, 405964, 1616407, 1958478, 945678, 1677561, 5111883, 7356161, 5709051, 3678335, 5725694, 9651535, 9361038, 4143442, -101083, 651643, 3614906, 4280981, 2399353]
43364B399353j891341r27047o32343m03774n8543q78783k699432k995352m11568
43355h498830K917110L941388K167139l75817j502965o04146J076853J568220
43347F88952K48722j383225j708454j018020m77762r0286P32908J535799J607202
43338A35836J462888J523847M89980k397509m629226l238117L81838K135141J322895
43329b812427Q99208J536057L69297l016674m402432j363647K538084L321420
43321b931114K380629K748806L146561O99436k958656l725849j762905q03449
43313c206541j429610n79690K030474K649328O4480j767748o1882K316914J790369
43304A806094k50639l43736J265182J657237K58946r75991j401370k176447l294514
$$ y = [2399353, 508012, -419035, -1051378, -1455152, -1513695, -2392478, -5091910, -8087262, -8498830, -5581720, -1640332, 526807, 150990, -1351975, -1956121, -879268, 688952, 937674, -445551, -2154005, -3172025, -3649787, -3740073, -3007165, -1471366, 135836, 1598724, 3122571, 3612551, 1215042, -3414184, -6652301, -6270463, -4135322, -2812427, -1913219, -377162, -7865, -3024539, -7426971, -8790618, -6252534, -2931114, -550485, 2198321, 5344882, 6044318, 3085662, -640187, -2403092, -3206541, -4636151, -5215841, -3185367, -536039, -471559, -2239307, -2301189, 15725, 1806094, 1555455, 1211719, 2476901, 4134138, 4393084, 3417093, 2015723, -160724, -3455238]
43295c455238l194087j441387N75336J622373J381173j92025k122750j960959
43287h787564J139705L728616J980038k079131k557703J540816M373894K014630
43279A353301j621684j082709K382278L574882J623435K09872Q48660J255589
43271H543624K66367n63112p92671j899961l317140k244701J137654K805492J150729
43262E086281m94065n3839m50151l455642m767170o20815M583691L904749j315761
43253B417278l503479p64097R62652j547942l785448j778568J415953J687540
43245d896111P25781J754090K829395L85441l455564l502250r2533J234667j225801
43236f242885k648121L62003M309372M266306R49456j309906j230991j233226
$$ y = [-3455238, -6649325, -8090712, -7515376, -5893003, -4511830, -4703855, -6826605, -8787564, -7647859, -3919243, -1939205, -4018336, -6576039, -5035223, -661329, 1353301, -268383, -1351092, 1031186, 4606068, 6229503, 6439375, 7288035, 8543624, 8809991, 8246879, 7454208, 5554247, 2237107, -7594, 1130060, 3935552, 5086281, 4592216, 4538377, 4088226, 632584, -4134586, -4755401, -171710, 3733039, 2417278, -1086201, -1850298, -887646, -2435588, -6221036, -7999604, -6583651, -4896111, -4170330, -2416240, 413155, 798596, -2656968, -6159218, -6251751, -5017084, -6242885, -8891006, -8529003, -4219631, 46675, 996131, -313775, -1544766, -2777992]
43228b777992k383963k631777p39986J159697P63203o47034r1893K245038K820549
43219b284158j7086l087681k487542J077328L513535K944145J228597R9707r59712
43210B7133k141508j803011N59336K346845J292999r80872j400682L4241R53990
43201a111529P86768J079155J947921J388293j237603l596856l371425j059255
43193e174531J182467K080663J782558J042348P01248J132603J634430J077126
43185E458912n52383j988656k192459j246451J83289J337312J450943M73466m15244
43176B508729k14536K20013n19016j615281p48236J969612L233549J142950j551962
43167D425822j072117J790863K486502r16390m818139m755369j145013J595476
$$ y = [-2777992, -5161955, -7793732, -8533718, -7374021, -6610818, -7257852, -7349745, -5104707, -2284158, -2301244, -5388925, -7876467, -6799139, -3285604, -341459, 887138, 986845, 27133, -2114375, -3917386, -3358050, -1011205, 281794, -699078, -2099760, -2065519, -1111529, -324761, 754394, 2702315, 4090608, 2853005, -743851, -4115276, -5174531, -3992064, -1911401, -128843, 913505, 1614753, 2747356, 4381786, 5458912, 4906529, 2917873, 725414, -521037, -337748, 999564, 2450507, 2923973, 2508729, 2294193, 2514206, 1995190, 379909, -368327, 1601285, 4834834, 5977784, 4425822, 3353705, 5144568, 7631070, 6714680, 1896541, -2858828, -4003841, -2408365]
43159b408365R29475j034346j085772Q39643K491498K975930L263018L450613
43151I421694K179784n71471k510580k165637j002294q06358q39044L16783J696109
43142E718986J318545m27425j432410j223589r63910n78660J078436L106781K744753
43133I341507m63624l333034l058336n05194J554517J601274j70839k619874l799253
43124a452856k120161J443335L793081L291723J397051j2277j003231k149832
43116C186833k684921j763039k28070M43824O4132m82870m08001P85739L014223
43107A927850M776912M048774Q43311k471205l956645l586387j762510J131648
43099I51748L109043J703919j826001k737084N75786L500247J704418k414352
$$ y = [-2408365, -1478890, -2513236, -3599008, -2759365, -267867, 2708063, 5971081, 9421694, 11601478, 11030007, 8519427, 6353790, 5351496, 4545138, 3706094, 4022877, 5718986, 7037531, 6610106, 5177696, 3954107, 2990197, 2411537, 3489973, 6596754, 9341507, 8877883, 5544849, 2486513, 1981319, 3535836, 5137110, 4966271, 2346397, -1452856, -3573017, -2129682, 1663399, 4955122, 6352173, 6339896, 5336665, 3186833, 501912, -1261127, -1489197, -1045373, -981241, -1464111, -1872112, -1086373, 1927850, 6704762, 10753536, 11596847, 9125642, 5168997, 1582610, -179900, 951748, 4060791, 5764710, 3938709, 1201625, 1777411, 5277658, 6982076, 4567724]
43091D567724l570187j264173Q48066J353310J851888K319113R20440j475413
43083E550768j574981P67952J898817M72448m01072J019162J690736r00724l950462
43074D572644l635520j289647r90055k728943k511802J076331M521043M450876
43066C464927J878690r8597n40285p32283j360122j623463r27709J12328P80456
43057I53942J353001K315590L002430K010962r04663m066016n273054l561042
43049d168850K84493M037092M958098K027359k170044l487934j187297R44847
43041A237764r9886k292566k098082k66402l44275k327541k239388J346274M521032
43032b563070L568457j3537k230216j741244L6550J830975L000999K676316Q22430
$$ y = [4567724, 997537, -266636, 581430, 1934740, 3786628, 6105741, 7026181, 5550768, 3975787, 4743739, 6642556, 7115004, 6713932, 7733094, 9423830, 8523106, 4572644, 937124, -352523, -1342578, -4071521, -6583323, -5506992, -985949, 3464927, 5343617, 5245020, 4704735, 3972452, 2612330, 988867, 61158, 173486, 953942, 2306943, 4622533, 7624963, 9635925, 8731262, 4665246, -607808, -4168850, -3884357, 152735, 5110833, 7138192, 4968148, 1480214, 292917, 1237764, 1137878, -1154688, -3252770, -3519172, -3863447, -6190988, -8430376, -7084102, -2563070, 1005387, 991850, -1238366, -2979610, -2943060, -1112085, 1888914, 4565230, 5387660]
43023E387660q92907j226606j145701j663006j491686O93507L012529K422612
43015E096402n75893k319445j175934M32600j30485k191444l134354j655841J276594
43006d377800L512369L183747L23905k445944k113279J192240L995288L465103
42998F735629N29919j731867j757688n24688M19350P93467J407781K689355L616896
42989A2178154K462528r13469l942223l747620p89870J290271R8293k590478l425035
42980F20551j835933j90877k09058j056788j110277k1370J437716K300871J674094
42971A608929o05352k850264k469381P52902L524437K807985j83119j679187m32613
42962D74337J236048J357022N90262m3612r53238k064820j648611Q08831K613938
$$ y = [5387660, 4494753, 3268147, 2122446, 459440, -1032246, -338739, 2673790, 5096402, 4520509, 2201064, 1025130, 1457730, 1327245, -864199, -3998553, -5654394, -4377800, -865431, 2318316, 2642221, 196277, -1917002, -724762, 3270526, 6735629, 7265548, 5533681, 3775993, 3251305, 3670655, 4464122, 5871903, 8561258, 12178154, 14640682, 13727213, 9784990, 6037370, 5247500, 6537771, 6636064, 4045586, 620551, -1215382, -1406259, -1615317, -2672105, -3782382, -3803752, -2366036, -65165, 1608929, 1003577, -1846687, -4316068, -3563166, -38729, 2769256, 2586137, 906950, 474337, 1710385, 3067407, 3657669, 3614057, 2660819, 595999, -1052612, -243781, 2370157]
42953B370157J330540j319651j866839k39142O71459o4165l73143Q25861J923858
42944C258935J627204P04689j85871j608177l141447k792136j47484K207405K010328
42935A933446O6614j632971k377937j998112o7190K488525L311690J937124Q86437
42926D547626J662323K291991R97838n94138o37845m98478j655897k102244M1263
42917D052439J966362K19078k759288j867127K058039L165134N8855k174151n52071
42908D167270J616735J440652J210364K923013L481360P9676l776496k959913
42900H182661J264504L162607R33880j700007j685539m1874J046405R55998j2934
42891A2105701j258621j546115k09376J435400J824423J596446K015467J970787
$$ y = [2370157, 3700697, 2381046, 514207, 275065, 946524, 882359, 509216, 1335077, 3258935, 4886139, 5590828, 5404957, 3796780, 655333, -2136803, -2284287, -76882, 1933446, 2000060, 367089, -2010848, -4008960, -4076150, -1587625, 1724065, 3661189, 4547626, 6209949, 8501940, 9499778, 8905640, 8267795, 7769317, 6113420, 4011176, 4052439, 6018801, 6237879, 3478591, 1611464, 3669503, 6834637, 6893492, 4719341, 4167270, 5784005, 7224657, 8435021, 11358034, 14839394, 14919070, 11142574, 8182661, 9447165, 12609772, 13543652, 11843645, 10158106, 10116232, 11162637, 12118635, 12105701, 10847080, 9300965, 9091589, 10526989, 12351412, 13947858, 15963325, 17934112]
42883A7934112l27994l261574l137904M4392J899286p3588k920654k878554o96359
42874F581163L15650n03781j011186l77058k21316j342368j952612n24281J266509
42865B230720M17872k939745m905865k479876K401315M978852L290080m2635j642475
42856A308243j046939J54358R45528J225712R04232K55258J89069P27934L25751
42847D989146j647248k987295j437605J533636K357000M05670j306626o34993
42839A271685J154109J992199J691910R66080j01157j260390j461224m11261N10105
42830D352056J59468o29810l93460P85314J556486J093907k63934j554236j719677
42821C386114k74637J966250L408063L247937J889437j00676k199887l085872
$$ y = [17934112, 17606118, 14344544, 11206640, 11251032, 13150318, 13076730, 10156076, 7277522, 6581163, 6896813, 6393032, 5381846, 5004788, 4783472, 3441104, 1488492, 964211, 2230720, 2648592, -291153, -5197018, -7676894, -5275579, -296727, 2993353, 2950718, 1308243, 261304, 415662, 1361190, 2586902, 3491134, 3746392, 3935461, 4663395, 4989146, 3341898, 354603, -1083002, 450634, 2807634, 3213304, 1906678, 1271685, 2425794, 4417993, 6109903, 7075983, 6974826, 5714436, 4253212, 3841951, 4352056, 4511524, 3881714, 3488254, 4273568, 5830054, 6923961, 6660027, 5105791, 3386114, 3111477, 5077727, 8485790, 11733727, 13623164, 13522488, 11322601, 8236729]
42813H236729j414158J825098L385526J383864k297093m275945l373430j109030
42805B361561N78280J102875J236802J875378K462627J124679k390967m754883
42797C596352k605602K140022L925158J241605j187880K25480K461479J157666
42789A0954280k098922k438133L71265J810725j15659k306776j816176L68600
42781D729204J864404J943691R32750p23163j824719j178746L95627J020186P59523
42772G918757J015380J167775o36208l180681k890390K32077J925130O20896J89730
42763F362466K891091M540196J213286l251752k245464L452649O546624L482057
42755B2991153j757216m263455l462655r17212K305299M414557L184489m02667
$$ y = [8236729, 6822571, 8647669, 12033195, 13417059, 11119966, 6844021, 3470591, 2361561, 2939841, 4042716, 5279518, 7154896, 9617523, 10742202, 8351235, 3596352, 990750, 3130772, 7055930, 8297535, 7109655, 7335135, 9796614, 10954280, 8855358, 6417225, 6788490, 8599215, 8483556, 6176780, 4360604, 4729204, 6593608, 8537299, 9470049, 8746886, 6922167, 5743421, 6139048, 7159234, 7918757, 8934137, 10101912, 9465704, 6285023, 3394633, 3626710, 5551840, 6172736, 6362466, 9253557, 13793753, 15007039, 11755287, 9509823, 12962472, 19509096, 22991153, 21233937, 16970482, 13507827, 12590615, 14895914, 19310471, 22494960, 22092293]
42747B2092293k109051j14207K248312J560481p58637j179455P17017K640213
42739B5096966L423301L540158L067210J985802J682333L389865N579452N522023
42731E3287110L355768K169790L839730O979090R415566J0657283J1307453J1941483
42723A12953273J3461225J6975564K2284910K7718722L2446395L7762140M4856081
42716C08458310N2111329N5805647N3009817M2895333K6053922M351857j8284024
42709E24402191l6553792m6757050m9246364m7419934m4152194l9632578l2976672
42702B27663607k5240199j9427832j7082135j6268075j4315533j1590081j0472517
42695A13267235j0970250j0177723p058840m946324o875924j0354511j0087502
$$ y = [22092293, 19983242, 19869035, 22117347, 23677828, 22919191, 21739736, 22456753, 25096966, 28520267, 32060425, 35127635, 37113437, 38795770, 42185635, 47765087, 53287110, 56642878, 58812668, 62652398, 69631488, 79047054, 89704337, 101011790, 112953273, 126414498, 143390062, 165674972, 193393694, 225840089, 263602229, 308458310, 360569639, 416375286, 469385103, 512280436, 538334358, 542686215, 524402191, 487848399, 441091349, 391844985, 344425051, 300272857, 260640279, 227663607, 202423408, 182995576, 165913441, 149645366, 135329833, 123739752, 113267235, 102296985, 92119262, 85060422, 80114098, 73238174, 62883663, 52796161]
42688E2796161n314290r26836o79708k602998k904299j602672j360624k350645
42680C5054089j867779R10153K973109J574007j943703m180745m120873l517993
42672B4880265l585407l572634k856144k324558k561452k222992M1149K903046
42664A0701273L618846J828822j3581m46649r47943k758627l904760j795332K418724
42655H700773M844460L860312J498997k08150j486540k810373l385559k869844
42647H144076k293810j966558p30558J314155J885032J83562j119959R360J450361
42638F875661N66375j055726l62013J586968J307583r85640j819105n89195j35760
42629E389148r19507m1735K676627L088841m31598l503824k277025Q73977J855977
$$ y = [52796161, 47481871, 46555035, 45875327, 43272329, 40368030, 38765358, 37404734, 35054089, 33186310, 34096463, 37069572, 38643579, 36699876, 32519131, 28398258, 24880265, 21294858, 17722224, 14866080, 12541522, 9980070, 7757078, 7798227, 10701273, 14320119, 16148941, 16135360, 15688711, 14740768, 11982141, 8077381, 6282049, 8700773, 13545233, 17405545, 18904542, 18696392, 17209852, 14399479, 11013920, 8144076, 5850266, 3883708, 3153150, 4467305, 6352337, 6535899, 5415940, 5425300, 6875661, 7442036, 6386310, 6024297, 7611265, 8918848, 7933208, 6114103, 5524908, 5389148, 4469641, 4427906, 7104533, 10193374, 9761776, 6257952, 3980927, 4854904, 6710881]
42620F710881J216747J751685K873191K031679l64985j908852k487910l446702
42612F375734l896678k147604L27620P66358J13583J495568M045925L282082j544522
42603H818066n109744k908540K913777O585500N162356M45463l578887l980206
42595H347785j061790J926666K270826P43057k03146n7269J02480K52218P37094
42586A3057921J79770k306281l914659j540346K324044K207177j846370m130106
42578D031150k478881j287764l058947l403134J300333O628305O069818P67453
42570H568333k408665o54689K090452J598804j765970m717369m672154j660543
42562c621801J641751K433802J312578J403842L012438K454523j616044m579696
$$ y = [6710881, 7927628, 9679313, 12552504, 14584183, 14219198, 12310346, 9822436, 6375734, 2479056, 331452, 659072, 1425430, 1539013, 3034581, 7080506, 10362588, 8818066, 3708322, 799782, 3713559, 10299059, 15461415, 15906878, 12327991, 8347785, 7285995, 9212661, 11483487, 12226544, 12023398, 11966129, 12068609, 12320827, 13057921, 13237691, 10931410, 7016751, 5476405, 7800449, 10007626, 8161256, 4031150, 1552269, 264505, -2794442, -6197576, -4897243, 1731062, 7800880, 8568333, 6159668, 5504979, 7595431, 9194235, 7428265, 2710896, -1961258, -3621801, -1980050, 453752, 1766330, 3170172, 6182610, 8637133, 7021089, 2441393]
42554B441393k296250K067499K414932j239276l213704o26984L409273M892523
42546G849406L093004m71683l691237m445152k577704r97934j998121l410279
42538f649700j717463K131944L980678K765884J262209Q53901R7386j248420j288959
42529A87460O6411M53212n13301j64058K383481M063219K427999p89736k617245
42520E497442k646050k052098j162563J28709J208691J446220Q91826k16257j335340
42511A760580j280528J26219P41793j049056l011241j827046J516301K977982
42503d4996J723753P54361J232258J034230l28352m23945J039006Q78312j800364
42494D064263l289419j232421J531145J796890N29794k05994p78366j555243j006137
$$ y = [2441393, 145143, 2212642, 4627574, 3388298, 174594, -452390, 2956883, 7849406, 10942410, 10470727, 6779490, 2334338, -243366, -1241300, -3239421, -6649700, -8367163, -6235219, -2254541, 511343, 1773552, 2627453, 2724839, 1476419, 187460, 253871, 707083, 193782, 29724, 2413205, 6476424, 8904423, 8114687, 5497442, 2851392, 799294, -363269, -234560, 974131, 2420351, 3312177, 3095920, 1760580, 480052, 606271, 1348064, 299008, -2712233, -4539279, -3022978, -44996, 1678757, 2433118, 3665376, 4699606, 4371254, 3947309, 4986315, 5864627, 4064263, 774844, -457577, 1073568, 2870458, 3400252, 3194258, 2415892, 860649, -145488]
42485a45488P20402M52888k505387l832689q44715K678786K587998R20518J347458
42476A379771K182290r2054l554328l554211n10697J289168J061474J420678K065590
42467A687681P0285l726362m783981j863479J404529K521603K641504K536231
42459D88011J120588j020380j326801L84242J483465J238184J608853K612326
42451F588488J624606j467034l131004j887663o68438j539166k378265j117270
42443c975746P25038J306282J573291K414583K189865J24233r79981J128258L753968
42434H259791K632793j766903m665277l150026O12866K356007M29567k551050
42426B157768k529934J058877L990634K580631q53732j078934K144526L648787
$$ y = [-145488, 574914, 1027802, -1477585, -5310274, -6154989, -3476203, -888205, 32313, 1379771, 3562061, 3470007, -84321, -3638532, -4149229, -2860061, -1798587, -377909, 1687681, 1757966, -1968396, -6752377, -8615856, -7211327, -4689724, -2048220, 488011, 1608599, 588219, -738582, -354340, 1129125, 2367309, 3976162, 6588488, 8213094, 6746060, 3615056, 1727393, 1058955, -480211, -2858476, -3975746, -3250708, -1944426, -371135, 2043448, 4233313, 4357546, 3377565, 4505823, 8259791, 10892584, 9125681, 4460404, 1310378, 1923244, 4279251, 4708818, 2157768, -372166, 686711, 4677345, 7257976, 6404244, 5325310, 7469836, 11118623]
42418A1118623Q94838k464534k846476j742099j573795j000696J679152L956549
42410H021562K460509j463351l778378l555319k721940j684504M76550K471680
42402B26809J815878q57843k310612j526004n53927m58867R7217J715215K894372
42393A042238K700471K146476J973814J329993l92429k281980l281110l261343
42385b3870k262565l14045J562909J889135Q29575K29450J036260K147277K301230
42376G395356J619552O59796o35935k225107l286916l065727j720561M7096J499634
42367B87188J889622R62875l53925p52821k40133l3348o30442j193539j138349
42358a202872r60233r10902l37619O24402J48073k703826n311402l771268J779816
$$ y = [11118623, 12013461, 9548927, 6702451, 4960352, 3386557, 2385861, 4065013, 8021562, 10482071, 9018720, 5240342, 1685023, -1036917, -2721421, -2244871, 226809, 2042687, 1184844, -1125768, -2651772, -3205699, -3664566, -3567349, -1852134, 1042238, 3742709, 5889185, 7862999, 9192992, 8800563, 6518583, 3237473, -23870, -2286435, -2600480, -1037571, 851564, 1681139, 1910589, 2946849, 5094126, 7395356, 9014908, 9674704, 9038769, 6813662, 3526746, 461019, -1259542, -1212446, 287188, 2176810, 3139685, 2785760, 2032939, 1792806, 1759458, 1129016, -64523, -1202872, -2163105, -3074007, -3411626, -2787224, -2639151, -5342977, -10654379, -14425647, -12645831]
42349a2645831O231780N255266N72572k375276j190406J434590K408948K158550
42341A850193K520625L162536K529280R52224J48562L02301K05232j24353L10611
42332A1857211P76851o14634l241994m049553k262201q39355j604624k040783
42324b019082N12855L942778L940370L40146k269375l56797M245027O376014L040864
42315A7752800l224549o442848l409182K406761M737603K028810j469681k250704
42307A0129010j605311j781641j929321o09452P91840M85237l40176L4889K41012
42298E416087j656799l906664l323436l99707J774241K467449L127324L391585
42290F890080J749771n15308o86967M21942l39542k384169j803704J446750K379323
$$ y = [-12645831, -6414051, -1158785, -586213, -2961489, -4151895, -2717305, -308357, 1850193, 4370818, 7533354, 10062634, 11014858, 11163420, 11465721, 11670953, 11546600, 11857211, 12634062, 12019428, 8777434, 4727881, 2465680, 1626325, 21701, -2019082, -1506227, 2436551, 6376921, 6717067, 4447692, 4090895, 8335922, 14711936, 17752800, 14528251, 8085403, 4676221, 7082982, 11820585, 13849395, 12379714, 10129010, 8523699, 6742058, 4812737, 4203285, 4995125, 5480362, 5140186, 5175075, 5416087, 3759288, -147376, -3470812, -3870519, -2096278, 371171, 3498495, 6890080, 8639851, 8124543, 7437576, 7859518, 7519976, 5135807, 3332103, 4778853, 7158176]
42281G158176j132576m497542l277823N10059K316575J610125P96543M17348o56607
42272C244278j947009j780895j34632J456696K031506J457313j98888j923151
42264B205218j939890l21845L70427j124032k370600q94593J726218K182950L49781
42255A83634j057631p38858J40448N54716O14530K91449m68508o40251O31533
42246d88938J982955J329667p45341j484480j6465J386166P45261q74386j064979
42237G69460P12641K568421K323898j80464k715353k841875o75248J337378J749551
42228C048409J682247K077996J507377j036279k995423j306065K257733K738704
42220G974699p80095l714342l009235j439508k209647l031025M2931N095023N967513
$$ y = [7158176, 6025600, 1528058, -1749765, -1239706, 1076869, 2686994, 3483537, 3900885, 3244278, 1297269, -483626, -618258, 838438, 2869944, 4327257, 4128369, 2205218, 265328, -56517, 313910, -810122, -3180722, -4075315, -2349097, -166147, 183634, -873997, -1612855, -1472407, -917691, -303161, -11712, -480220, -1120471, -488938, 1494017, 2823684, 2078343, 593863, 577398, 1963564, 2708825, 1834439, 769460, 1482101, 4050522, 6374420, 6193956, 3478603, 636728, -38520, 1298858, 3048409, 4730656, 6808652, 8316029, 7279750, 4284327, 2978262, 5235995, 7974699, 7194604, 3480262, 471027, -968481, -3178128, -6209153, -6166222, -1071199, 4896314]
42211D896314J283962l206183k762776L31075J579667J184587J929153K825495
42203H061294M20388m110674n014691o91507K852372N42368l972012l650891J575844
42194c987509N174030L646296K92134j135312j350217k219828k781838j420478
42186c782722Q29379J927303J812147J432749N68201j170709k703229k912701
42178c999582k325603j583516J7449K455650L444824J583010p23651n36665R22074
42169g46010M33877j433091j021856J865904K661417j137496n604425n486893
42161a0468573j137337K560108K716719R96465J23889M81369Q04963N51670M32834
42152b937893J076427J895067J527225m45560k298008j436736K363459N484818
$$ y = [4896314, 6180276, 2974093, 211317, 542392, 2122059, 3306646, 5235799, 8061294, 8481682, 4371008, -643683, -1335190, 1517182, 2059550, -1912462, -5563353, -3987509, 1186521, 4832817, 5124951, 3989639, 2639422, 419594, -2362244, -3782722, -2953343, -1026040, 786107, 2218856, 2787057, 1616348, -1086881, -3999582, -6325185, -7908701, -7891252, -5435602, -1990778, -407768, -1131419, -1668084, -746010, -312133, -1745224, -2767080, -901176, 1760241, 622745, -4981680, -10468573, -11605910, -9045802, -6329083, -5332618, -5208729, -4727360, -3922397, -3370727, -2937893, -1861466, 33601, 1560826, 1115266, -1182742, -2619478, -256019, 5228799]
42144E228799L695056k579961p518364n955357M05934M841983L805462P45800
42136B669352M27132K163233J830119j043368k508361o90868J192106j6732k708667
42127A313946l419536j872720l57879J27729L94066Q94850J408218J939221K061023
42118B488918O49108j813334k358493N75669L962900L776023M70203k177364k540354
42109C033276k023935j352262J27064J560334Q77503j484850k524970j008766
42101b796606J186696K495714L155656K784841J86196l299198l911379o98257
42093h96337K535826K343743j81689k104300k610019k318852j407275m58293o11850
42084e709046j123340K92435L011251L148800j4348j648895J033543L339589L38510
$$ y = [5228799, 8923855, 6343894, -1174470, -7129827, -6723893, -1881910, 1923552, 2669352, 3096484, 5259717, 7089836, 6046468, 3538107, 2847239, 4039345, 4022613, 1313946, -2105590, -3978310, -4336189, -4208460, -3814394, -2919544, -1511326, 427895, 2488918, 3138026, 1324692, -1033801, -458132, 3504768, 7280791, 7750994, 5573630, 3033276, 1009341, -342921, -215857, 1344477, 2221980, 737130, -1787840, -2796606, -1609910, 885804, 4041460, 6826301, 7012497, 3713299, -198080, -896337, 1639489, 3983232, 3801543, 1697243, -912776, -3231628, -4638903, -5097196, -5709046, -6832386, -6539951, -3528700, -379900, -394248, -2043143, -1009600, 2329989, 2668499]
42075B668499m392777l800283J537978M718222L614857K657854L273319J111970
42067A1389639m662737p403275l014155K557072J842678k976404m111745j77044
42059f555971K945175J922595j66440j53492R49230J418547J708186J966837O95190
42050D729857j965918l027959j098198R00965N0892k018812j842302N26343K111272
42041a633860J845204J413620J464464K93580k671895m632764k613534K182539
42033d352646N077982L109988j591727m208624k499936J195204L182948K403743
42025B316932M11458j336852k331205j831933O36157L298393L142107o4564k957414
42016A283079l012699j572189q79314n13603Q92059K468882K528611J659697J470033
$$ y = [2668499, -1724278, -5524561, -3986583, 731639, 4346496, 7004350, 10277669, 11389639, 6726902, -676373, -3690528, -1133456, 709222, -2267182, -6378927, -6555971, -3610796, -1688201, -1854641, -2008133, -1058903, 359644, 2067830, 4034667, 4729857, 2763939, -264020, -1362218, -461253, -410361, -2429173, -4271475, -3745132, -1633860, 211344, 1624964, 3089428, 3383008, 711113, -3921651, -6535185, -4352646, 725336, 3835324, 2243597, -1965027, -4464963, -3269759, -86811, 2316932, 2728390, 1391538, -939667, -2771600, -2135443, 1162950, 4305057, 4240493, 1283079, -1729620, -3301809, -4181123, -4694726, -3802667, -1333785, 1194826, 2854523, 4324556]
42007D324556J512358N40433l73521N48892K011381J329617p07794r20960M92107
41998H757069K6979k675299l504418p00239J825058O07432k116036k404908l56301
41989e40663J393248J832698J041969j520312m789063n040254q46916L452510
41981e016783L179137j05358j523930j48080J158306J240399J167653P04292q30325
41972a74689j429938P44683K577569j38553m778333m427308J280590M851242K173902
41963F79165j806995j744909J91842m27365k378596j688141J047581J920674L65397
41954c841347n48324M22502J294790O67737n89152j416480j540480n77387J351924
41945d776217K455070J170044r88327q76056J916129M277764L498675L07668k400623
$$ y = [4324556, 5836914, 6377347, 6003826, 6552718, 8564099, 9893716, 9185922, 8264962, 8757069, 8784048, 6108749, 2604331, 1904092, 3729150, 4336582, 2220546, -184362, -540663, 852585, 2685283, 3727252, 2206940, -2582123, -7622377, -8469293, -5016783, -1837646, -1943004, -3466934, -3615014, -2456708, -1216309, -48656, 655636, -174689, -1604627, -859944, 1717625, 1579072, -3199261, -7626569, -6345979, -1494737, 679165, -1127830, -2872739, -2680897, -3108262, -5486858, -7174999, -6127418, -4206744, -3841347, -4389671, -3967169, -2672379, -2004642, -2593794, -4010274, -5550754, -6128141, -4776217, -2321147, -1151103, -2139430, -3015486, -1099357, 3178407, 6677082, 6984750, 4584127]
41936D584127k670003j007911M43010K03414p83374k84869K015379L657225K594112
41927H751110l3709j596059j375712p47619o98516q07506m68874K20465Q52088
41918D095668J074652N37231q48299k442861l042592j824711N91244K190226J563933
41909A894491K6119K00055J871885J649111j503365l334375l54265L775284K869709
41900G094649k336397n305009l706082j578487r03032J332567N246284N196132
41892E040625o22871m953467k078121K569249R74830m303456m521009Q35479L723750
41883c334991Q79483j896335o4862L266653L848706K319544O49033j661499m456104
41874d50372m873292j961949N87414k77107k242254j433560J791625M003671L586489
$$ y = [4584127, 1914124, 906213, 1349223, 1552637, 769263, 484394, 2499773, 6156998, 8751110, 8717401, 7121342, 5745630, 4998011, 4299495, 3491989, 3023115, 3243580, 4095668, 5170320, 5707551, 4859252, 2416391, -626201, -2450912, -1859668, 330558, 1894491, 1920610, 2120665, 3992550, 5641661, 4138296, 803921, 449656, 4224940, 7094649, 4758252, -546757, -4252839, -5831326, -6734358, -5401791, -155507, 5040625, 4417754, -535713, -2613834, -44585, 930245, -3373211, -7894220, -7058741, -3334991, -2455508, -4351843, -4416705, -1150052, 2698654, 5018198, 5667231, 4005732, -450372, -5323664, -7285613, -6698199, -6975306, -9217560, -10651120, -8859495, -4855824, -1269335]
41865a269335J691158j46058j099869r73685n36299p42985r37067L23742K259582
41856a430816K369895O61624J47416J743639K106482j152646n105530n316660
41848e976596j905223J179327J594327O15815M27763J549110K739549K342045
41840B566117J98536j496221o07022J592583J765892l56454j230932Q28986K549246
41831E810731O46321k951850l950235j775849M45876P64280P0208n48882j247857
41822b737257k126103k593747k262866j186554N34558K316775K906896J789061
41814c359237J25892o81960n41199M2262R85539J935966J913922Q09859q6890
41805A144154j08550j98550q23502q38695K06269Q06134K64007L57210K013372
$$ y = [-1269335, 421823, 275765, -824104, -1797789, -2334088, -3077073, -4014140, -3690398, -1430816, 939079, 1600703, 1748119, 3491758, 5598240, 4445594, -659936, -5976596, -7881819, -6702492, -5108165, -4492350, -4064587, -2515477, 224072, 2566117, 2764653, 1268432, 661410, 2253993, 4019885, 3663431, 2432499, 3261485, 5810731, 6457052, 3505202, -445033, -2220882, -1775006, -1010726, -940518, -1489400, -2737257, -4863360, -7457107, -9719973, -10906527, -10371969, -8055194, -5148298, -3359237, -3233345, -3915305, -4456504, -4414242, -3428703, -1492737, 421185, 1231044, 1144154, 1035604, 837054, 13552, -825143, -618874, 187260, 451267, 808477, 2821849]
41796B821849K740787L23319k962622l276125r08608N46527k51586j314017j223723
41787c504199m68206Q57446K956070L879746J115898l657667n280183k014927
41779f116022J760890J764037m45707o39810J542402K612095Q49014j290266q76250
41770h39617J501961K669436J019904j474784j870330k31624L79708j647497l720573
41761d213416k436920J430792L799420K767252N29483n59760j024849k107943
41753a815941l000810k223041k15668J402712K092889K076693P68847k232514
41745c146833m969800m347432j52865L912003M277417J523743o94169p3121K107514
41736a563543K996088J379785j412799l149496k724163q33113Q76027J268689
$$ y = [2821849, 5562636, 5885955, 2923333, -352792, -1261400, -714873, -966459, -2280476, -3504199, -3972405, -3114959, -158889, 3720857, 4836755, 1179088, -4101095, -6116022, -4355132, -2591095, -3036802, -3676612, -2134210, 477885, 1326899, 36633, -839617, 662344, 3331780, 4351684, 2876900, 1006570, 774946, 1154654, -492843, -4213416, -6650336, -5219544, -1420124, 1347128, 1876611, 1316851, 292002, -1815941, -4816751, -7039792, -7255460, -5852748, -3759859, -1683166, -914319, -3146833, -8116633, -12464065, -12616930, -8704927, -4427510, -2903767, -3597936, -3671057, -1563543, 1432545, 2812330, 1399531, -1749965, -4474128, -5307241, -4431214, -3162525]
41728c162525N39092l36175p77932q73473n42041P38463K809162M110931L097530
41719E603032K21151k342652k947153j796857j96987P36405P54260O06970J241549
41710A879718K183235J514458j247273l247243j528460K274589L358289K98910
41702E486223k864177k402756J59023J096575J09984q8160J461330K675176J780194
41693G413412l71363j684954j113801N33015J201764n38307l422187m227625j721571
41684c931617J291655J463558o23056j518383J73219K183829J991597k8906j451317
41675d49421p41658J085746J447082q97470l781995l589091J73192L730678L572017
41666E49080O05023j690437j777900p94810J07440R78120K053308L147540L747967
$$ y = [-3162525, -2623433, -2959608, -3737540, -4611013, -5153054, -4414591, -1605429, 2505502, 5603032, 5824183, 3481531, 534378, -1262479, -1459466, -723061, 31199, 638169, 1879718, 4062953, 5577411, 4330138, 1082895, -445565, 1829024, 5187313, 5486223, 2622046, 219290, 378313, 1474888, 1584872, 1496712, 2958042, 5633218, 7413412, 7042049, 5357095, 4243294, 4776309, 5978073, 5439766, 2017579, -2210046, -3931617, -2639962, -1176404, -1799460, -3317843, -3144624, -960795, 1030802, 1001896, -449421, -1191079, -105333, 1341749, 444279, -3337716, -6926807, -6753615, -3022937, 549080, 1154103, -536334, -2314234, -3109044, -3001604, -2023484, 29824, 3177364, 6925331]
41657F925331K911439J82657k648826k686940r3620J305769n88724k939143k676298
41648c08355j319253j477331j526676J320953M766418M005714k74438k359875
41640B827157k11066J933078P25699j735425k258229r28460P60068K156564K143299
41631E412685n13865l874103l869052l37937K106385J031745n12015P1533N45059
41622F0435j294347k854414j019476K400049L773465L193979K666648J543949
41614H470288j631796m889079n043154k631029n06961Q53918K428282K762671
41606a86860p7394l680877l497475K69354K747832J737678L90297J558841L621168
41597B882564L599368J250407j592794l309433k912291m52981J965979J741477
$$ y = [6925331, 9836770, 10019427, 7370601, 4683661, 4590041, 5895810, 5307086, 2367943, -308355, -1627608, -3104939, -4631615, -3310662, 1455756, 5461470, 5187032, 2827157, 2616091, 4549169, 5274868, 3539443, 1281214, 352754, 1112822, 3269386, 5412685, 4898820, 1024717, -2844335, -3182272, -1075887, -44142, -556157, -484624, 60435, -1233912, -4088326, -5107802, -2707753, 1065712, 4259691, 6926339, 8470288, 6838492, 1949413, -3093741, -5724770, -6231731, -5377813, -2949531, -186860, -264254, -3945131, -7442606, -7173252, -4425420, -2687742, -2297445, -738604, 2882564, 6481932, 7732339, 6139545, 2830112, -82179, -535160, 1430819, 3172296]
41589C172296o91202j886372R2911L090319L867146K093179J49799k1101J100153
41580A0967128J397182l85295k874324l520374k120350j289947k402680l173511
41572c402171j266573J793483L055088K587400K179659J342400j289407l780497
41564A219382k879193J88779Q63281j488870k564968m26076J435694L52727j174930
41555d474174l27976J197203P45313n17817k24971P10892J65320j003842p41960
41546d472012J97497j0792k05831J854151M644703M343815Q63384j758007j357320
41537D099588k30950q01451k076475j974054o93524l8938p95839j984759j970539
41528f466941j8754K482440K850141M46566j709257o75415K021424K563415Q12071
$$ y = [3172296, 2481094, 594722, 687633, 3777952, 7645098, 9738277, 9888076, 9866975, 10967128, 12364310, 11979015, 9104691, 5584317, 3463967, 2174020, -228660, -3402171, -4668744, -2875261, 179827, 2767227, 4946886, 6289286, 4999879, 1219382, -1659811, -1471032, -607751, -2096621, -4661589, -5087665, -3651971, -3299244, -4474174, -4802150, -3604947, -2859634, -3377451, -3602422, -2891530, -2726210, -3730052, -4472012, -4274515, -4285307, -4491138, -2636987, 2007716, 6351531, 7214915, 5456908, 4099588, 3868638, 3067187, 990712, -983342, -1676866, -1715804, -2511643, -4496402, -6466941, -6485695, -4003255, -1153114, -706548, -2415805, -3091220, -1069796, 1493619, 2305690]
41519B305690L97949K425063L181331J0256m058756m473251j528164O75493K17453
41510h46936r36732p27740L95355R98060P26856K83335M99192J588528K580979
41501D560897J994795n2226j358140n52215O73442J02185j381976j259523K49316
41492B976555L88297j497105k799126j944215o69678n35902j83526J723490L367055
41483H25845K355187l63117j959687j737459r48449Q6558J620246K300961Q05773
41474B985858r52122J1917K530047K355014r96156k965005j115821R51539l10129
41465B495142k520380j692908P50048M25443k291836k623385O48223L069244J791838
41456E1429L7703J471110L983504L042715j008126l331981j718903O48990L45787
$$ y = [2305690, 2703639, 5128702, 8310033, 8320289, 4261533, -211718, -1739882, -1064389, -846936, -1783668, -2511408, -2116053, -1117993, -391137, -107802, 391390, 1979918, 4560897, 6555692, 6503466, 5145326, 4593111, 5266553, 5368738, 3986762, 2727239, 2976555, 3364852, 1867747, -931379, -2875594, -3545272, -4081174, -4264700, -2541210, 825845, 3181032, 2817915, 858228, -879231, -1827680, -1741122, -120876, 2180085, 2985858, 2033736, 2045653, 4575700, 6930714, 5934558, 2969553, 1853732, 2805271, 2495142, -25238, -1718146, -968098, -542655, -2834491, -5457876, -4809653, -1740409, 51429, 89132, 1560242, 5543746, 8586461, 7578335, 4246354, 2527451, 3176441, 3522228]
41447C522228j641575k250777j099702l51222p62371n70248J306718L201997L119982
41438D475030J687811R10167Q62293j75597k322468l175126j295476J193078J155923
41429C315635j395048l422019k788022n08833J044627R52717K40966K14127Q38420
41420a507430Q33837n96290k353803k413862l16788K130423K976399K056025L95462
41411A203973j128761j741980o39036J785723L467735K867711J025400N9080K30937
41402G130782M6518j151803k335502k410452j253047P07433K508506K533858J47566
41393E923859k523507k379398N49240K557939Q00370k990543m552718k134633
41385d749391J688624L137634J381942q65180q90012N53636M98125j558851k353326
$$ y = [3522228, 1880653, -370124, -1469826, -1821048, -2583419, -3153667, -1846949, 1355048, 4475030, 6162841, 7073008, 7935301, 7759704, 5437236, 2262110, 966634, 2159712, 3315635, 1920587, -1501432, -4289454, -4798287, -3753660, -2800943, -2559977, -2345850, -1507430, -673593, -1269883, -3623686, -6037548, -6354336, -4223913, -1247514, 808511, 1203973, 75212, -1666768, -2305804, -520081, 2947654, 5815365, 6840765, 6899845, 7130782, 7177300, 6025497, 3689995, 1279543, 26496, 733929, 3242435, 5776293, 5923859, 3400352, 1020954, 1570194, 4128133, 4928503, 1937960, -2614758, -4749391, -3060767, 76867, 1458809, 593629, -296383, 257253, 755378, -803473, -3156799]
41376c156799L53820L711853L271332n68681l070988k079802o17816j324603k026638
41367e508322L21382L899944M054520J77621l168531k552664K0606P25442m12776
41358b442778m0487L027405N536568L990001o07665l920938l525733j144231M06030
41349A278172N84865N61595Q10794P78430K19895m82211j031476j311330j147125
41340B61609p04369n33463n70681j7372J039790J211158J26178m27467O08251
41331I93634J189678q66515l836489m015999j076938J644114K115857J692019
41323b160639J832269J912666J333461J026000J434927J230025m76542k349647
41315C782520k579748j098893Q02160J802908J086581r23715k129305q27481J686446
$$ y = [-3156799, -2802979, 908874, 4180206, 3611525, 540537, -1539265, -2157081, -3481684, -5508322, -5186940, -1286996, 2767524, 2945145, -223386, -2776050, -2755444, -2030002, -2442778, -2483265, 544140, 6080708, 10070709, 9463044, 5542106, 2016373, 872142, 1278172, 1863037, 2424632, 3235426, 4013856, 4233751, 3751540, 2720064, 1408734, 261609, -442760, -976223, -1546904, -1564276, -524486, 686672, 812850, 385383, 993634, 2183312, 1316797, -2519692, -6535691, -7612629, -5968515, -3852658, -2160639, -328370, 1584296, 2917757, 3943757, 5378684, 6608709, 6132167, 3782520, 1202772, 103879, 906039, 2708947, 3795528, 2871813, 742508, -84973, 1601473]
41306A601473K625486J694432R32031O26082j164572m303044n500624l103162
41298f591898L95934K374322L257522L709933K325290j089002l333539k306678
41290a258116o81340j392273k312205R8521M069756M599819J178469j702920j626449
41281I73262r00229j413508j460147N12219K609536K291469J60538j105869k33188
41272A434083J643165K497385J217289j242775k424978j201692L45930l94990
41264A873417k445061k223466J160253M265175L929160J200654p78710r66597
41256F014825o74264p92331p65560k06041k5876j311600l534236m566517k917489
41247h779089K56468K172033J621225J38648m83272m90773r01043j238428k64468
$$ y = [1601473, 4226959, 5921391, 6853422, 7479504, 6314932, 2011888, -3488736, -6591898, -6195964, -3821642, -564120, 3145813, 5471103, 4382101, 1048562, -1258116, -1939456, -3331729, -5643934, -5545413, -1475657, 3124162, 4302631, 2599711, 973262, 73033, -1340475, -2800622, -2288403, 321133, 2612602, 2773140, 1667271, 1434083, 3077248, 5574633, 6791922, 5549147, 3124169, 1922477, 2268407, 1873417, -571644, -2795110, -1634857, 2630318, 6559478, 7760132, 6981422, 6014825, 5340561, 4548230, 3782670, 3576629, 3550753, 2239153, -1295083, -5861600, -8779089, -8522621, -6350588, -4729363, -4590715, -5073987, -5564760, -6465803, -7704231, -7968699]
41238g968699J735358L162572L318575K861657K238597J146000m10593j752160
41230D331307k343175k154314j365846l85847K57167O58762J476572K527362K550972
41221E552960J219004L0553M4780J74265p92771j933921j714903m36612O90236
41212B833591J590323K489420K427109P80268j028147j537164j542575k124270
41204C888555k185638p43009K75764r89889k311739m99978K729774K752885o03011
41195B313714k624856r60303J441741J536798m8482j638723k817277k832560o45395
41186f275343K084053J984936o54040j596798O90198K545305J396693j14863O74766
41177G34907J574212j68786k400155j545731J104054J484325m92672j096181Q91831
$$ y = [-7968699, -6233341, -3070769, 247806, 3109463, 5348060, 6494060, 6083467, 4331307, 1988132, -166182, -1532028, -1917875, -1660708, -1001946, 474626, 3001988, 5552960, 6771964, 6802517, 6847297, 7021562, 6228791, 4294870, 2579967, 2143355, 2833591, 4423914, 6913334, 9340443, 10120711, 9092564, 7555400, 6012825, 3888555, 1702917, 959908, 1235672, 245783, -2065956, -2565934, 163840, 2916725, 2313714, -311142, -1271445, 170296, 1707094, 1658612, 19889, -2797388, -5629948, -6275343, -4191290, -2206354, -2860394, -4457192, -3766994, -1221689, 175004, 60141, 734907, 2309119, 2140333, -259822, -1805553, -701499, 782826, 290154, -806027, 85804]
41168H5804K445843J342145o75076r42064L69444J005994R554q93036M53859L228925
41158F431392L737076L04705l256130k098353K326471L623019j76856l508313
41150G383011j816532J640144J381770j905332l477384k221228q94267l41858
41142b51676J110126L055957K934926Q81270Q1891J421578J853385n10185l169955
41133G407317k935298k73628J853066J744883Q4218j470743j712818o76250M52987
41124D473734P10343M18250J96992k55936j144825j331935N6699J554123J024469
41115E701914j008859j909910o94969Q64513J049263J88969m98276n15043j29958
41106C047644J74729K07657N25907J664610K398873M97498l475707n279158k300973
$$ y = [85804, 2531647, 3873792, 3198716, 2256652, 2626096, 3632090, 3641644, 2748608, 3202467, 6431392, 10168468, 10473173, 7217043, 5118690, 7445161, 11068180, 10891324, 7383011, 5566479, 7206623, 8588393, 6683061, 3205677, 984449, 90182, -251676, 858450, 3914407, 6849333, 7730603, 7812494, 9234072, 11087457, 10577272, 7407317, 4472019, 4198391, 6051457, 7796340, 7880558, 6409815, 4696997, 4020747, 4473734, 5184077, 5602327, 5799319, 5543383, 4398558, 3066623, 3123322, 4677445, 5701914, 4693055, 2783145, 2088176, 2952689, 4001952, 4190921, 3692645, 3177602, 3047644, 3222373, 3430030, 3955937, 5620547, 8019420, 8516918, 5041211, -237947, -2538920]
41097b538920K129503K835385k03831k481018j665839K86025J512608K562129
41089B436042L584692K986273L05276k527779m079646m879136m958645k957919
41081a0090842P43363K860457J332335j538563k217785m88319J195215J453880
41073f750259R35301M46128J36072J87114Q31958J768959K361457K155378Q93768
41064B965876j176710k653064j802496J172047L662943L363613P71432j746664
41056D556977k719726k570551k261025j845569o67585J230881K441715J636062
41048a98821m49887j659204j304523q28199r42656k87483J596635K421167Q02732
41039h50239n52349J127529L321690J479665l248285m880229j669519J220313
$$ y = [-2538920, -409417, 2425968, 2222137, -258881, -1924720, -1638695, -126087, 2436042, 6020734, 9007007, 9312283, 6784504, 2704858, -2174278, -7132923, -10090842, -9347479, -6487022, -5154687, -6693250, -8911035, -9399354, -8204139, -6750259, -5814958, -5368830, -5232758, -5045644, -4213686, -2444727, -83270, 2072108, 2965876, 1789166, -863898, -2666394, -1494347, 2168596, 5532209, 6303641, 4556977, 1837251, -733300, -2994325, -4839894, -5507479, -4276598, -1834883, -198821, -648708, -2307912, -3612435, -4440634, -5383290, -5670773, -4074138, -1652971, -850239, -1402588, -275059, 3046631, 4526296, 1278011, -3602218, -5271737, -4051424]
41031d051424k2556k205351j052075J711781J786925k50263k20227K250131K888542
41022H35483j59490k958129j466871K482317L699262P50689k354990j898808N61647
41013e08890P97638j722628k977137m33489L026671L359731J225535M05382J719418
41004D892231K301357O60911j312744j937768j887337j869064j348668n87032
40996a088114q21774j414792j89427K217456K174730r74941k800273k72472L432823
40987B63216L877535J580668m45502j954665l685955l364503Q58242M894077K935697
40978D958810l318179n950320k062875K399598K017780p26628r04354Q70497P20156
40969a995515j303407j625891M43245J684195N46424o07449n1885L11847j220818
$$ y = [-4051424, -4073980, -6279331, -7331406, -5619625, -3832700, -4082963, -4303190, -2053059, 835483, 675993, -2282136, -3749007, -1266690, 2432572, 3183261, 828271, -1070537, -508890, 288748, -1433880, -4411017, -4844506, -1817835, 1541896, 2767431, 3172813, 4892231, 7193588, 7854499, 6541755, 4603987, 2716650, 847586, -501082, -1088114, -1909888, -3324680, -3514107, -1296651, 878079, -96862, -2897135, -3169607, 263216, 4140751, 5721419, 5275917, 3321252, -364703, -3729206, -2870964, 2023113, 4958810, 1640631, -4309689, -6372564, -3972966, -1955186, -2681814, -3586168, -2715671, -1995515, -3298922, -4924813, -4481568, -2797373, -2250949, -2858398, -2910283, -2598436, -3819254]
40960c819254k344131l9592L975587M845368J408934k139820k281346n35957K8051
40951i02160l17818N01520J988641J819930J06063o19933L73617J024177P9773
40942D053810j271130j967295k431848k614754j506781M20188J058555Q8765j90974
40933d361464J256664K325174J359280j12318j41905O29529P34386M11130M60103
40924B560579O44432Q18576J367450J265195j275781m739432m697014n16427K515088
40915b057334R28904j472220k01246K158861N55857l444947l913411j63643K665916
40906d943263K120902J121109J857205K885100L057579K991162J879348j818641
40898I150501n691876n014842l86082K024097k48969k351043n25735J783048L53063
$$ y = [-3819254, -6163385, -6202977, -2227390, 2617978, 4026912, 1887092, -394254, -930211, -902160, -1219978, -718458, 1270183, 3090113, 3196176, 2576243, 2949860, 3974037, 4053810, 2782680, 815385, -1616463, -4231217, -5737998, -5317810, -4259255, -4170490, -4361464, -3104800, -779626, 579654, 467336, 325431, 954960, 1689346, 2100476, 2560579, 3205011, 4023587, 5391037, 6656232, 5380451, 641019, -4055995, -4572422, -2057334, -1128430, -2600650, -2801896, -643035, -87178, -3532125, -7445536, -7609179, -4943263, -2822361, -1701252, 155953, 3041053, 6098632, 9089794, 10969142, 9150501, 3458625, -1556217, -1942299, 81798, -167171, -2518214, -3043949, -1260901, -907838]
40889i07838k412075j730529J509159K460459o355k446459k655800j860342j297672
40880i347452l89176J161629K140306J465820l35301j558804o93331J985286L874070
40871a696953K530791q66087k525972j080228R65448J644849K045557K754043
40863C771448J643489j796725l486157k64387M314031M468748O59314j624890
40855G684871o06645j09778k258093l828350j933406J134556J622917l49947k181338
40846h25213l059373l662244l228909l66365L624802N232692L105237j58514j424908
40837g62795p07723l34109j386141k382170j536532P11919K134019J373656n78637
40828c468513j788219j601094q14082p459J181681K763489L413160J937877o05545
$$ y = [-907838, -3319913, -5050442, -3541283, -1080824, -1087179, -3533638, -6189438, -8049780, -9347452, -9736628, -8574999, -6434693, -4968873, -5304174, -6862978, -7556309, -5571023, -1696953, 833838, -32249, -2558221, -3638449, -2673001, -1028152, 1017405, 3771448, 5414937, 3618212, 132055, -132332, 4181699, 8650447, 9309761, 7684871, 7078226, 6968448, 4710355, 882005, -1051401, 83155, 1706072, 1356125, -825213, -3884586, -7546830, -10775739, -11142104, -7517302, -2284610, 820627, 662113, -762795, -1470518, -1804627, -3190768, -5572938, -7109470, -6397551, -4263532, -2889876, -3468513, -5256732, -6857826, -7671908, -7679367, -6497686, -3734197, -321037, 1616840, 1011295]
40819A011295j657179m00260J065339P32142m08078j59254J088706Q63627j116940
40810A019398k040574l74580J619374J598727Q51527J616570K717995J337162
40802H345599j938420l563352k380666r37412r22843o94914J301491L409436K932116
40793E551035j78478l289683l891222j833932M55914K31581k026497k389153J219573
40784f150862N016825L982627o66822l095788j606625m05333j696681j954242
40776f576901J200536L908304K125176j519737j894234O70108J774474L29050
40768A6776o54401K33010J042763M49442l73022k62958M13914R46581Q00563o36954
40758A975714k830500l501901j341792J807413L430626L334057K150964n62979
$$ y = [1011295, -645884, -1046144, 19195, 751337, 343259, 184005, 1272711, 2136338, 1019398, -1021176, -1395756, 223618, 1822345, 2673872, 4290442, 7008437, 8345599, 6407179, 2843827, 463161, -474251, -1397094, -2092008, -790517, 2618919, 5551035, 5372557, 2082874, -1808348, -3642280, -3186366, -2954785, -4981282, -7370435, -6150862, -1134037, 2848590, 2181768, -914020, -2520645, -2925978, -4622659, -6576901, -5376365, -1468061, 657115, -862622, -2756856, -2086748, -312274, 16776, -637625, -404615, 638148, 1087590, 714568, 451610, 865524, 1812105, 2612668, 1975714, -854786, -4356687, -5698479, -3891066, -460440, 2873617, 5024581, 4461602]
40750D461602l876660m186459m44624K259576m60091m457829k575753L632604
40742e647634N430445L38767m061818j998479K410774K922807N87793J13765J558753
40733A655173J479532n33462j877198j821469j783397j855697j003882K16888
40725e523512O30546J071450K607174L297686O46820l401075m192536j262946
40717f126393P56060p94691k683950j149478K166810K918782P08601p04758N86222
40708d322795K028931J016306j089493j515080n94166o96468j614668p04881J954953
40699e537361K454497r21486l989501k231149K488623M759694L456954K075621
40691B555892J981672N90776k889507m900926k913235N68590J947402J312167
$$ y = [4461602, 584942, -3601517, -4046141, -1786565, -2246656, -6704485, -9280238, -5647634, -217189, 121578, -3940240, -5938719, -3527945, -605138, -17345, 96420, 1655173, 3134705, 2601243, 724045, -1097424, -2880821, -4736518, -5740400, -5523512, -4892966, -3821516, -1214342, 2083344, 2730164, -670911, -4863447, -6126393, -5370333, -6165024, -8848974, -9998452, -7831642, -4912860, -4204259, -4909017, -4322795, -2293864, -1277558, -2367051, -3882131, -4476297, -5172765, -6787433, -7492314, -5537361, -3082864, -4004350, -7993851, -10225000, -7736377, -2976683, 480271, 2555892, 4537564, 5128340, 2238833, -2662093, -5575328, -5006738, -3059336, -1747169]
40683a747169P04859N29542N44165J837297M540232N552203K083730l618620o331603
40674D094636m202084m08640J219376k7952k193813k977086j581613N83209J400859
40665d093108Q31464Q98697K160125K388826L73231j418447n12661J384990J101964
40656C115081p56966j017258N62305J033344n40530j563698m15578R73141N06940
40647A896781q45708r83528J02652Q27553N96821L80499J084863K179620K011859
40638G251412l32106l334808m178899k299000m49114q66069j928629q00945J928026
40629e010132L071172J601084l58606j032128o36831L40812J636127K014239N64655
40620B190392q38502L56945K740228K207902j528988l861584k068989R46638J731282
$$ y = [-1747169, -1042310, -512768, 31397, 1868694, 6408926, 11961129, 14044859, 10426239, 4094636, -107448, -516088, 703288, 675336, -1518477, -4495563, -6077176, -5493967, -4093108, -3261644, -2362947, -202822, 2186004, 2559235, 1140788, 628127, 2013117, 3115081, 2358115, 1340857, 1903162, 2936506, 2395976, 832278, 416700, 1389841, 1896781, 1051073, 67545, 170197, 997750, 1594571, 1975070, 3059933, 5239553, 7251412, 6919306, 3584498, -594401, -2893401, -3342515, -4208584, -6137213, -6938158, -5010132, -1938960, -337876, -696482, -1728610, -2365441, -2024629, -388502, 1625737, 2190392, 1351890, 1708835, 4449063, 6656965, 5127977, 1266393, -802596, 144042, 1875324]
40611A875324J079969J097659J190943K84342j95885Q20915J090217j100021k780067
40602C363396n63341L070748K960454n01508j894865N54606K402690K51090l387726
40593F255544m552163l116835j236839K06063J143421R82368P6719K80806J962865
40584B001949K720999J119731p05831n11252M63680J84081k79926R28662K175429
40575H097522O24127k276415k307579M88860J161628k409364n629077l735352
40567e985650J261023L709719K159050J92670L90358J308409Q98470k86393p47742
40558B899914p45789j464605k533340k233250j03179K041803K216557O30152p81005
40549g2742q80158m96690q31209j575334j459172k01458J139106J648668J372038
$$ y = [1875324, 2955293, 4052952, 5243895, 5528237, 5332352, 6153267, 7243484, 6143463, 3363396, 2800055, 5870803, 8831257, 8329749, 6434884, 6989490, 9392180, 9643270, 6255544, 1703381, -1413454, -2650293, -2444230, -1300809, -318441, -241722, 39084, 2001949, 4722948, 5842679, 5136848, 4625596, 5089276, 5273357, 4993431, 5922093, 8097522, 8721649, 6445234, 4137655, 4626515, 5788143, 3378779, -2250298, -5985650, -4724627, -1014908, 1144142, 1336812, 1727170, 3035579, 3934049, 3647656, 2899914, 2154125, 689520, -1843820, -4077070, -4180249, -2138446, 78111, 708263, -72742, -952900, -1449590, -2280799, -3856133, -5315305, -5516763, -4377657, -2728989, -1356951]
40540a356951O58248j90430n43725O675N48086j91861j471619j061529J072895
40531b530211J900397k49792k600370j709894J407628K971459K043123R77085
40523B209425Q28654J63067j233745j339346K46156J008622k23243j121833j58263
40514C79494K73966j903014l938064j925184K763377M916864K682307o09575j777739
40505H62432j206170l44353O97977J751541J654254L50170l15662M77288P61704
40496D689181j228473l862369l983022j144760J901233K657864J277202n07737
40488b00881j522356j687801j151802K13781K120630L147438J766853j473471
40480A212391l760468k963716j21152J991087K008152N47622j340726k563133
$$ y = [-1356951, -698703, -889133, -1432858, -1426183, -878097, -1069958, -2541577, -3603106, -2530211, -629814, -879606, -3479976, -5189870, -3782242, -810783, 1232340, 2209425, 3038079, 3201146, 1967401, 628055, 874211, 1882833, 1659590, 537757, 379494, 653460, -1249554, -5187618, -7112802, -4349425, 567439, 3249746, 2640171, 862432, -343738, -688091, 9886, 1761427, 3415681, 3765851, 3450189, 3927477, 4689181, 3460708, -401661, -4384683, -5529443, -3628210, -970346, 306856, -200881, -1723237, -3411038, -4562840, -4349059, -2228429, 919009, 2685862, 1212391, -2548077, -5511793, -5632945, -3641858, -1633706, -1086084, -2426810, -4989943]
40472d989943j721805J285259L934739L797499K186563K234584L545080K375697
40464A2647673k166295n967856n629027k813820o78781O29144K012755K156037
40456A89830k5004k095393j379210L21509l42031k108346r45113K549417L197618
40447f36723m20191l059434n09996M275579N819332L435890N28727q35817j074914
40438G522453n24029P50602J420013K27223j579776j769370o86886o82831k132834
40429B544565k733280j209002P08382R35226k46932j240698j418428j145601n92315
40420d398083J98755O27958M3766j221574k053300j707697l10166J540123L074807
40411d205411L437994K267407M71865k47206O63766J494238P9734l120031m851108
$$ y = [-4989943, -6711748, -5426489, -1491750, 2305749, 4492312, 6726896, 10271976, 12647673, 10481378, 4513522, -1115505, -3929325, -4608106, -3978962, -1966207, 189830, 164826, -1930567, -3309777, -2988268, -3330299, -5438645, -6383758, -3834341, -636723, -1056914, -4116348, -4626344, -350765, 5468567, 8904457, 9433184, 8597367, 7522453, 6998424, 7749026, 9169039, 9396262, 7816486, 6047116, 5360230, 4677399, 2544565, -188715, -1397717, -689335, 245891, -1041, -1241739, -2660167, -3805768, -4398083, -4199328, -3571370, -3527604, -4749178, -6802478, -8510175, -8820341, -7280218, -4205411, -767417, 1499990, 1971855, 1724649, 2388415, 3882653, 3962387, 842356, -4008752]
40402d008752k764225J489867L953335K713465n72110l123517l564317k045452
40394g921706N14326K742952L544744L076691K211639J077969o02384j900706
40386B743525j364956L75660Q66915n92756j884808j546659q15652q12013m15219
40377c445963J007885J483157k73592j974153j354965j95454q93216j402941J430717
40368e618525N112943M032425j448186m581971k019544J868573K510550J377095
40360A233360J590950K215854R06806j471037k782203l127509k942424q28286
40352e204489L033520M694101J949546j189261l94401J719144L1170l935348m195980
40343c491998m36262J403994r37904k701851n01897K408801K167420J63151n43901
$$ y = [-4008752, -6772977, -5283110, -1329775, 1383690, 811580, -2311937, -5876254, -7921706, -7407380, -4664428, -1119684, 1957007, 4168646, 5246615, 4644231, 2743525, 1378569, 1754229, 2621144, 2028388, 143580, -1403079, -2218731, -3030744, -3445963, -2438078, -954921, -1228513, -3202666, -4557631, -4753085, -5646301, -7049242, -5618525, -505582, 3526843, 2078657, -2503314, -4522858, -2654285, -143735, 1233360, 2824310, 5040164, 5946970, 4475933, 1693730, -1433779, -4376203, -5204489, -2170969, 2523132, 4472678, 3283417, 2889016, 4608160, 4639330, 703982, -3491998, -3928260, -2524266, -3462170, -6164021, -6665918, -4257117, -2089697, -1926546, -2470447]
40334b470447k03969k27925K00412J757590K345432L76540j894875j687705j5833
40325a820780N83881M44086J361323K526478J518561j538590l924308l887771
40317d737120j921789O65558K339722J669939p84249k184379j015401O87544Q10914
40308d469261N54251J492712J795287o26089l226882j961229J809177K845157
40300a786877L26239r34376J441151L607922K063216q61739j369631j60438j20806
40291B204661r33053k88925J245085Q98416j394809k727978k035206j562069k623562
40282g217440l112463r92702K159409L400244K674172K299224K894256K501399
40274D606099R5023k446820k992310j862452m18094J251479L076039L009826n17753
$$ y = [-2470447, -2674416, -2902341, -2701929, -944339, 1401093, 1777633, -117242, -1804947, -1820780, -1236899, -792813, 568510, 3094988, 4613549, 3074959, -849349, -4737120, -6658909, -5993351, -3653629, -1983690, -2767939, -4952318, -5967719, -5280175, -4469261, -3915010, -2422298, -627011, -1253100, -4479982, -6441211, -4632034, -1786877, -1460638, -2395014, -953863, 2654059, 4717275, 3855536, 2485905, 2325467, 2204661, 1271608, 982683, 2227768, 3126184, 1731375, -996603, -3031809, -4593878, -7217440, -10329903, -11322605, -9163196, -5762952, -3088780, -789556, 2104700, 4606099, 4701122, 2254302, -738008, -2600460, -3018554, -1767075, 1308964, 4318790, 3801037]
40265C801037m704053m618056k8427L579213K393393p08935j052048R47153J366656
40256I75933o59040k040674q97754R64210J115514n83122k529148k948947j042835
40247g645863J723458K222544l65645k355781j43630M137549N164594J978306
40239D715532j221060j847229j775542k392201j726872J058733K642820M33263
40231a12556k764171k731580j19377J164244K30935j96560J103428J988788P19681
40222g17168j375671k048885r98625M18421J125777J161091J183385J577731J872630
40213B198686J226692k99470j526579j621547j095040p97383o57118j36491O40013
40204b068237R67711N02607l09226n88991J25186J046042O72721j048281j875377
$$ y = [3801037, -903016, -5521072, -5549499, -1970286, 423107, -285828, -1337876, -390723, 975933, 316893, -1723781, -2621535, -1657325, -541811, -1124933, -3654081, -6603028, -7645863, -5922405, -3699861, -4065506, -6421287, -6564917, -2427368, 2737226, 4715532, 3494472, 1647243, -128299, -2520500, -4247372, -3188639, -545819, -112556, -2876727, -5608307, -5727684, -4563440, -4332505, -4529065, -3425637, -1436849, -717168, -2092839, -4141724, -5140349, -4721928, -3596151, -2435060, -1251675, 326056, 2198686, 3425378, 3125908, 1599329, -22218, -1117258, -1914641, -2571759, -2708250, -2068237, -1100526, -597919, -907145, -1496136, -1370950, -324908, 347813, -700468, -2575845]
40195b575845J2267L153801M497500L361268J519252o5353j776688k906049k093658
40186C126495n80919j350845m010746m329269o17311L087213K626241o78615k770373
40177e498129k431426j198882o2520P87114P75684J01194K97650J528675J559074
40168d141566m71805j985342j043973O08963J267420K368054M491220M341826
40160E434797K81864l068909j403912J651201J87731l662151k982743J978415
40152a583707L846754K29439k908288j625760M86103O1927m12135J289603K135727
40143A519663k63991k432675q47134J776857J371211l41788P18481L459487L350640
40134H310751q1474k814444k540433q35545M27493J051193J082193M14885l25802
$$ y = [-2575845, -2563578, 590223, 5087723, 8448991, 9968243, 9902890, 8126202, 5220153, 3126495, 2545576, 1194731, -2816015, -7145284, -7762595, -4675382, -2049141, -2727756, -5498129, -7929555, -9128437, -9190957, -8403843, -7628159, -7526965, -7229315, -5700640, -4141566, -4613371, -6598713, -7642686, -7033723, -5766303, -3398249, 1092971, 5434797, 5716661, 2647752, 1243840, 2895041, 3082772, -579379, -3562122, -1583707, 2263047, 2492486, -415802, -2041562, -1555459, -1493532, -1905667, -616064, 1519663, 1255672, -1177003, -2024137, -247280, 1123931, 782143, 1500624, 4960111, 8310751, 8229277, 5414833, 2874400, 2038855, 2466348, 3517541, 4599734, 5014619, 4688817]
40125D688817n86893q29345j069606j08431J958052K607661N43301j813932k021343
40116C368281j317351j710805k040197n32149J115806K84868j868132k417459
40108e117138j623329j568422j525898N59956L278591L458288J724846J174851
$$ y = [4688817, 4101924, 3272579, 2202973, 2094542, 4052594, 6660255, 7203556, 5389624, 3368281, 2050930, 340125, -1700072, -2232221, -1116415, -831547, -2699679, -5117138, -6740467, -8308889, -9834787, -9274831, -5996240, -2537952, -813106, 361745]
$$ [...]
##END NTUPLES=NMR SPECTRUM
##END=
