##TITLE=31Pdec_LR-698-R2-CHCl3-1M
 CDCl3, 124 sc
 30.1.2020
##JCAMPDX= 6.0         $$ Bruker NMR JCAMP-DX V2.0
##DATA TYPE= NMR SPECTRUM
##DATA CLASS= NTUPLES
##ORIGIN= UXNMR, Bruker Analytische Messtechnik GmbH
##OWNER= root
$$ XWIN-NMR		Version 3.5
$$ Thu Jan 30 16:03:38 2020 Russian Standard Time (UT+4h)  she@DPX200
##.OBSERVE FREQUENCY= 81.013821
##.OBSERVE NUCLEUS= ^31P
##.ACQUISITION MODE= SIMULTANEOUS
##.ACQUISITION SCHEME= undefined
##.AVERAGES= 124
##.DIGITISER RES= 17
##SPECTROMETER/DATA SYSTEM= spect
##.PULSE SEQUENCE= zgpg30
##.SOLVENT NAME= DMSO
##.SHIFT REFERENCE= (INTERNAL, DMSO, 0, 182.463)
##AUDIT TRAIL= $$ (NUMBER, WHEN, WHO, WHERE, WHAT)
$$ ##TITLE= Audit trail, XWIN-NMR		Version 3.5
$$ ##JCAMPDX= 5.01
$$ ##ORIGIN= Bruker BioSpin GmbH
$$ ##OWNER= she
$$ F:/spectra/data/she/nmr/P31/1/pdata/1/auditp.txt
$$ ##AUDIT TRAIL=  $$ (NUMBER, WHEN, WHO, WHERE, WHAT)
(   1,<2020-01-30 15:59:47.14 +0400>,<she>,<DPX200>,
      <continue with go, POWCHK disabled, PULCHK disabled
       configuration hash MD5:
       00 E9 B6 7A A2 85 ED C7 34 08 36 98 17 FE 4E 26
       data hash MD5: 32K
       2A 35 EE 31 56 B8 B5 89 18 C7 B5 9E 3C A9 1D 3B>)
(   2,<2020-01-30 16:02:10.48 +0400>,<she>,<DPX200>,
      <Start of raw data processing
       efp BC_mod = 2 LB = 1 FT_mod = 6 PKNL = 1 PHC0 = -1631.244 PHC1 = -5.598706 SI = 64K 
       data hash MD5: 64K
       34 A5 6A 01 7F C8 71 88 00 60 94 0B 21 0C B7 9A>)
(   3,<2020-01-30 16:02:54.57 +0400>,<she>,<DPX200>,
      <pk PHC0 = -74.24166 PHC1 = 190.8 
       data hash MD5: 64K
       8C F4 78 54 41 28 69 B0 16 4A 7B DF F9 43 47 FA>)
(   4,<2020-01-30 16:02:58.20 +0400>,<she>,<DPX200>,
      <abs ABSG = 5 
       data hash MD5: 64K
       48 21 DE 35 DF 89 35 B3 34 FB 97 E4 70 BF 57 42>)
$$ ##END=
$$ 
$$ hash MD5
$$ 1C 52 B3 2D BE 05 7D 45 AB 88 5F A6 36 D4 11 E2
##$RELAX= 
##$RELAX= 
##$RELAX= 
##$RELAX= 
##$RELAX= 
##$RELAX= 
##$RELAX= 
##$RELAX= 
$$ Bruker specific parameters
$$ --------------------------
##$DU= <F:/spectra>
##$EXPNO= 1
##$NAME= <P31>
##$PROCNO= 1
##$TYPE= <nmr>
##$USER= <she>
##$AMP= (0..31)
100 100 100 100 100 100 100 100 100 100 100 100 100 100 100 100 100 100 
100 100 100 100 100 100 100 100 100 100 100 100 100 100 
##$AQSEQ= 0
##$AQ_mod= 1
##$AUNM= <au_zg>
##$AUTOPOS= <>
##$BF1= 81.014009
##$BF2= 200.13
##$BF3= 200.13
##$BF4= 200.13
##$BF5= 200.13
##$BF6= 200.13
##$BF7= 200.13
##$BF8= 200.13
##$BYTORDA= 1
##$CFDGTYP= 0
##$CFRGTYP= 5
##$CHEMSTR= <none>
##$CNST= (0..31)
1 1 145 1 1 1 1 1 1 1 1 1 1 1 1 1 1 1 1 1 1 1 1 1 1 1 1 1 1 1 1 1 
##$CPDPRG= <waltz16>
##$CPDPRG1= <>
##$CPDPRG2= <waltz16>
##$CPDPRG3= <>
##$CPDPRG4= <mlev>
##$CPDPRG5= <mlev>
##$CPDPRG6= <mlev>
##$CPDPRG7= <mlev>
##$CPDPRG8= <mlev>
##$CPDPRGB= <>
##$CPDPRGT= <>
##$D= (0..31)
0 1 0 0 0 0 0 0 0 0 0 0.03 2e-05 3e-06 0 0 0 0 0 0 0 0 0 0 0 0 0 0 0 0 
0 0 
##$DATE= 1580385410
##$DBL= (0..7)
120 120 120 11 120 120 24 19 
##$DBP= (0..7)
150 150 150 150 150 150 150 150 
##$DBP07= 0
##$DBPNAM0= <>
##$DBPNAM1= <>
$$ [...]
##$SUBNAM3= <"">
##$SUBNAM4= <"">
##$SUBNAM5= <"">
##$SUBNAM6= <"">
##$SUBNAM7= <"">
##$SUBNAM8= <"">
##$SUBNAM9= <"">
##$SW= 369.568048894756
##$SWIBOX= (0..15)
0 1 3 0 0 0 0 0 0 0 0 0 0 0 0 0 
##$SW_h= 29940.119760479
##$TD= 32768
##$TD0= 1
##$TE= 0
##$TE2= 300
##$TE3= 300
##$TEG= 300
##$TL= (0..7)
0 120 53 12 22 120 120 120 
##$TP= (0..7)
150 150 150 150 150 150 150 150 
##$TP07= 0
##$TPNAME0= <>
##$TPNAME1= <>
##$TPNAME2= <>
##$TPNAME3= <>
##$TPNAME4= <>
##$TPNAME5= <>
##$TPNAME6= <>
##$TPNAME7= <>
##$TPOAL= (0..7)
0.5 0.5 0.5 0.5 0.5 0.5 0.5 0.5 
##$TPOFFS= (0..7)
0 0 0 0 0 0 0 0 
##$TUNHIN= 0
##$TUNHOUT= 0
##$TUNXOUT= 0
##$USERA1= <user>
##$USERA2= <user>
##$USERA3= <user>
##$USERA4= <user>
##$USERA5= <user>
##$V9= 5
##$VALIST= <valist>
##$VCLIST= <CCCCCCCCCCCCCCC>
##$VD= 0
##$VDLIST= <DDDDDDDDDDDDDDD>
##$VPLIST= <PPPPPPPPPPPPPPP>
##$VTLIST= <TTTTTTTTTTTTTTT>
##$WBST= 1024
##$WBSW= 4
##$XGAIN= (0..3)
0 0 0 0 
##$XL= 0
##$YL= 0
##$YMAX_a= 50785
##$YMIN_a= -35058
##$ZGOPTNS= <>
##$ZL1= 120
##$ZL2= 120
##$ZL3= 120
##$ZL4= 120
##$ABSF1= 182.463
##$ABSF2= -187.1042
##$ABSG= 5
##$ABSL= 3
##$ALPHA= 0
##$AQORDER= 0
##$ASSFAC= 0
##$ASSFACI= 0
##$ASSFACX= 0
##$ASSWID= 0
##$AUNMP= <proc_1d>
##$AZFE= 0.1
##$AZFW= 0.5
##$BCFW= 0
##$BC_mod= 2
##$BYTORDP= 0
##$COROFFS= 0
##$CY= -3
##$DATMOD= 1
##$DC= 0
##$DFILT= <>
##$DTYPP= 0
##$F1P= 0
##$F2P= 0
##$FCOR= 1
##$FTSIZE= 65536
##$FT_mod= 6
##$GAMMA= 0
##$GB= 0
##$INTBC= 1
##$INTSCL= 5.30512e-09
##$ISEN= 30
##$LB= 1
##$LEV0= 0
##$LPBIN= 0
##$MAXI= 10000
##$MC2= 0
##$MEAN= 0
##$ME_mod= 0
##$MI= 50
##$NCOEF= 0
##$NC_proc= -7
##$NLEV= 6
##$NOISF1= 182.463
##$NOISF2= 159.3651
##$NSP= 0
##$NTH_PI= 0
##$NZP= 0
##$OFFSET= 182.463
##$PC= 4
##$PHC0= -1705.486
##$PHC1= 185.2013
##$PH_mod= 1
##$PKNL= yes
##$PPARMOD= 0
##$PSCAL= 0
##$PSIGN= 0
##$REVERSE= no
##$SF= 81.0140089999434
##$SI= 65536
##$SIGF1= 159.3651
##$SIGF2= -187.1042
##$SINO= 113.3802
##$SIOLD= 16384
##$SREGLST= <1H.CDCl3>
##$SSB= 0
##$STSI= 65536
##$STSR= 0
##$SW_p= 29940.119760479
##$SYMM= 0
##$S_DEV= 0
##$TDeff= 32768
##$TDoff= 0
##$TI= <>
##$TILT= no
##$TM1= 0
##$TM2= 0
##$TOPLEV= 0
##$USERP1= <user>
##$USERP2= <user>
##$USERP3= <user>
##$USERP4= <user>
##$USERP5= <user>
##$WDW= 1
##$XDIM= 65536
##$YMAX_p= 323782224
##$YMIN_p= -55928898
$$ End of Bruker specific parameters
$$ ---------------------------------
##NTUPLES= NMR SPECTRUM
##VAR_NAME=  FREQUENCY,     SPECTRUM/REAL,   SPECTRUM/IMAG
##SYMBOL=    X,             R,               I
##VAR_TYPE=  INDEPENDENT,   DEPENDENT,       DEPENDENT
##VAR_FORM=  AFFN,          ASDF,            ASDF
##VAR_DIM=   65536,         65536,           65536
##UNITS=     HZ,            ARBITRARY UNITS, ARBITRARY UNITS
##FACTOR=    0.456856943014862, 1,           1
##FIRST=     14782.0589164792, 0,            0
##LAST=      -15158.0608439998, 0,           0
##MIN=       -15158.0608439998, -55928898,   0
##MAX=       14782.0589164792, 323782224,    0
$$ Real data points
##PAGE= N=1
##DATA TABLE= (X++(R..R)), XYDATA
$$ [...]
$$ plain form
44882 8223533 18738667 21454626 17112963 13135713 14480616 17254331 14793978 7887692
44874 7887692 3559598 4698906 7287912 8343326 9814303 12675860 13761537 11836158
44866 11836158 11141700 14745406 18944743 18652636 14658250 11245881 9616273 7836650
44858 7836650 5006268 1734542 -1701498 -4598816 -4907031 -1490990 4293972 10570867
44850 10570867 15890437 17462784 12686328 4184564 -1338638 -1566294 -899160 -1906686
44842 -1906686 -849053 4145555 7263898 3677693 -1795622 -2191791 357124 -605883
44834 -605883 -3793712 -2589440 2671997 4970364 2688463 1421294 2688954 639074
44826 639074 -7288515 -15289479 -18588955 -20034989 -22817000 -23824602 -19922068 -15010209
$$ packed form
44882H223533J0515134K715959m341663l977250J344903K773715k460353o906286
44874G887692m328094J139308K589006J055414J470977K861557J085677j925379
44866A1836158o94458L603706M199337k92107l994386l412369j629608j779623
44858G836650k830382l271726l436040k897318l08215L416041N784962O276895
44850A0570867N319570J572347m776456q501764n523202k27656O67134j007526
44842a906686J057633M994608L118343l586205n473315l96169K548915r63007
44834f05883l187829J204272N261437K298367k281901j267169J267660k049880
44826F39074p927589q000964l299476j446034k782011j007602L902534M911859
$$ plain form
44818 -15010209 -14509376 -16843902 -16397265 -12029217 -7114128 -3316722 245542 2827655
44810 2827655 2011936 -2206694 -6860311 -9455145 -9325910 -6258132 -702377 4843275
44802 4843275 7229539 5757646 2522615 86424 -35050 2346155 5609746 6905847
44794 6905847 4921244 1696597 445147 1894276 3616095 2656062 -1392481 -5346006
44786 -5346006 -5040055 -498806 2403175 -1836533 -11021891 -17761187 -19148528 -19277731
44778 -19277731 -21365274 -23156366 -22717519 -22760416 -24615291 -23296070 -14994908 -5520368
44770 -5520368 -3526450 -7339258 -6838179 1364641 8724292 7108558 -436875 -5044470
44762 -5044470 -3145359 1890977 5582400 5567315 1366840 -5148198 -10206420 -11948161
$$ packed form
44818a5010209N00833k334526M46637M368048M915089L797406L562264K582113
44810B827655q15719m218630m653617k594834J29235L067778N555755N545652
44802D843275K386264j471893l235031k436191j21474K381205L263591J296101
44794F905847j984603l224647j251450J449129J721819r60033m048543l953525
44786e346006L05951M541249K901981m239708r185358o739296j387341j29203
44778a9277731k087543j791092M38847m2897j854875J319221Q301162R474540
44770e520368J993918l812808N01079Q202820P359651j615734p545433m607595
44762e044470J899111N036336L691423j5085m200475o515038n058222j741741
$$ plain form
44754 -11948161 -12740099 -15307005 -17905061 -16188836 -9210638 -790167 5159837 8354520
44746 8354520 10559648 12033242 10900227 5902532 -967776 -5353612 -4563016 -246457
44738 -246457 3765457 5648654 6155144 5670412 3331791 -286872 -2122469 64075 4736398
44729 4736398 8316407 8813024 6896002 4850978 5403947 9690658 14852662 15432127 9295600
44720 9295600 1084365 -2229770 1501022 8411065 13376266 13977401 10901927 7179576
44712 7179576 6967419 12624014 22030419 29803782 31592527 27129671 20085428 15458097
44704 15458097 15324975 15941151 11339127 1850450 -3839715 1138435 12017170 17921132
44696 17921132 15828209 12404231 11544602 8072353 -2141681 -12578259 -13643311 -6378270
$$ packed form
44754a1948161p91938k566906k598056J716225O978198Q420471N950004L194683
44746H354520K205128J473594j133015m997695o870308m385836P90596M316559
44738b46457M011914J883197N06490m84732k338621l618663j835597K186544M672323
44729D736398L580009M96617j917022k045024N52969M286711N162004N79465o136527
44720I295600q211235l314135L730792O910043M965201O01135l075474l722351
44712G179576k12157N656595R406405P773363J788745m462856p044243m627331
44704A5458097j33122O16176m602024r488677n690165M978150J0878735N903962
44696A7921132k092923l423978q59629l472249j0214034j0436578j065052P265041
$$ plain form
44688 -6378270 -1074225 -2938726 -6181109 -3858710 2321542 5409034 2634455 -2407523
44680 -2407523 -5146347 -4215749 -933799 2465417 3679732 1395804 -3575698 -8940332
44672 -8940332 -12884157 -14608563 -13077777 -7073395 2181470 9744832 10820025 6217845
44664 6217845 1669231 661335 528111 -2026174 -4093048 319771 11060370 20862452
44656 20862452 24791384 25703592 27598913 28236448 23068967 13540978 6004171 3474693
44648 3474693 3445130 3582846 4671006 7073189 8595189 7553827 4985308 2564406 839775
44639 839775 79658 -63410 -2185367 -8924631 -18154109 -23933387 -23571269 -20190546 -16888798
44630 -16888798 -12547315 -5825791 827771 4617810 6536616 8411313 8838105 6209892
$$ packed form
44688f378270N304045j864501l242383K322399O180252L087492k774579n041978
44680b407523k738824R30598L281950L399216J214315k283928m971502n364634
44672h940332l943825j724406J530786O004382R254865P563362J075193m602180
44664F217845m548614j007896j33224k554285k066874M412819J0740599R802082
44656B0862452L928932R12208J895321O37535n167481r527989p536807k529478
44648C474693k9563J37716J088160K402183J522000j041362k568519k420902j724631
44639H39775p60117j43068k121957o739264r229478n779278L62118L380723L301748
44630a6888798M341483O721524O653562L790039J918806J874697M26792k628213
$$ plain form
44622 6209892 3300823 4198110 8199438 11096546 11265379 10218987 8418230 5408356
44614 5408356 3464492 5927688 11647182 15866728 17064768 17916299 18727350 15728232
44606 15728232 8151039 1418354 -396589 -586308 -3765848 -7831650 -7701198 -4453073
44598 -4453073 -4028034 -7369024 -8702130 -5275059 -2506372 -5556507 -10608488 -10291883
44590 -10291883 -5285156 -3764574 -9032831 -14431311 -13597572 -9935980 -10220901 -12828282
44582 -12828282 -10336860 -2863689 276940 -5156693 -11042203 -9785893 -7307723 -14007579
44574 -14007579 -26890236 -31846712 -23885788 -14235856 -13621184 -17985246 -17576647 -12950980
44566 -12950980 -12395107 -16544275 -15792126 -4802855 8145755 11009111 3213366 -4019981
$$ packed form
44622F209892k909069Q97287M001328K897108J68833j046392j800757l009874
44614E408356j943864K463196N719494M219546J198040Q51531Q11051k999118
44606A5728232p577193o732685j814943j89719l179540m065802J30452L248125
44598d453073M25039l340990j333106L427071K768687l050135n051981L16605
44590a0291883N006727J520582n268257n398480Q33739L661592k84921k607381
44582a2828282K491422P473171L140629n433633n885510J256310K478170o699856
44574a4007579j2882657m956476P960924R649932O14672m364062M08599M625667
44566a2950980N55873m149168P52149J0989271J2948610K863356p795745p233347
$$ plain form
44558 -4019981 -1759773 6453380 10135097 5097213 -2077724 -2924519 2820474 8409904
44550 8409904 9120861 6245125 2801118 -69967 -1262017 1322637 7064953 10872643
44542 10872643 8431718 1556025 -4362697 -6721556 -6950343 -6832236 -6528186 -5733338 -4372283
44533 -4372283 -2077497 1771652 7758899 16231706 25515358 30205449 24977612 12098309
44525 12098309 1390964 -597278 1793990 423664 -5139189 -8364574 -5811033 -415086
44517 -415086 4514488 8598067 11237054 10776633 8387899 8326430 12542404 18293497 21893304
44508 21893304 21503169 16339325 7624647 489650 -394524 2229017 1549382 -2034287
44500 -2034287 -608944 7343002 11511270 4853883 -3303224 965232 15412626 23560963
$$ packed form
44558d019981K260208Q213153L681717n037884p174937q46795N744993N589430
44550H409904P10957k875736l444007k871085j192050K584654N742316L807690
44542A0872643k440925o875693n918722k358859k28787J18107L04050P94848J361055
44533d372283K294786L849149N987247Q472807R283652M690091n227837j2879303
44525A2098309j0707345j988242K391268j370326n562853l225385K553541N395947
44517d15086M929574M083579K638987m60421k388734o1469M215974N751093L599807
44508B1893304l90135n163844q714678p134997q84174K623541o79635l583669
44500b034287J425343P951946M168268o657387q157107M268456J4447394Q148337
$$ plain form
44492 23560963 16951133 5093454 778470 4540460 8664105 9655194 9856323 10402484
44484 10402484 9591111 7616285 7527837 10674374 14819565 17626466 19017609 19070029 16517990
44475 16517990 11410383 7226052 7579568 11400049 13792056 11761246 6902685 2043971
44467 2043971 -2231924 -6429977 -9994330 -12563378 -15332819 -18255832 -17718427 -11110682
44459 -11110682 -2817088 -578784 -5230865 -9308507 -7826513 -4963442 -6162050 -8551332
44451 -8551332 -5385400 2682066 7662710 5336573 118397 -2407196 -2458837 -3146547 -4812287
44442 -4812287 -5566050 -4930658 -3896577 -2688417 -735293 2099330 5849341 10835249
44434 10835249 16168760 19073089 17536392 12974872 8666163 5995951 3699758 570579
$$ packed form
44492B3560963o609830j1857679m314984L761990M123645R91089K01129N46161
44484A0402484q11373j974826q8448L146537M145191K806901J391143N2420k552039
44475A6517990n107607m184331L53516L820481K392007k030810m858561m858714
44467B043971m275895m198053l564353k569048k769441k923013N37405O607745
44459a1110682Q293594K238304m652081m077642J481994K863071j198608k389282
44451h551332L165932Q067466M980644k326137n218176k525593n1641o87710j665740
44442d812287p53763O35392J034081J208160J953124K834623L750011M985908
44434A0835249N333511K904329j536697m561520m308709k670212k296193l129179
$$ plain form
44426 570579 -2442571 -3053314 113596 6011544 11376190 12721814 8916117 2019668
44418 2019668 -4521580 -8398941 -9269261 -7762682 -4325834 777517 6402524 9939036
44410 9939036 8918773 3963454 -743093 -1419228 967628 1770439 -1533700 -5968190
44402 -5968190 -6547130 -2466955 1599662 912714 -3513235 -5971800 -3209991 1483679
44394 1483679 3223957 2734687 4697081 9230399 10391778 5462810 499683 1979271
44386 1979271 6924390 7509830 2924695 -599505 -630678 -1375261 -4575188 -5583111 -1729281
44377 -1729281 2412637 2466505 803194 630029 -556269 -5211851 -8541137 -4904805 2058054
44368 2058054 4291870 2311189 4075735 11004816 14687848 9852503 1864635 -2845098
$$ packed form
44426E70579l013150o10743L166910N897948N364646J345624l805697o896449
44418B019668o541248l877361q70320J506579L436848N103351N625007L536512
44410I939036j020263m955319m706547o76135K386856Q02811l304139m434490
44402e968190n78940M080175M066617o86948m425949k458565K761809M693670
44394A483679J740278m89270J962394M533318J161379m928968m963127J479588
44386A979271M945119N85440m585135l524200l1173p44583l199927j007923L853830
44377a729281M141918N3868j663311j73165j186298m655582l329286L636332O962859
44368B058054K233816j980681J764546O929081L683032m835345p987868m709733
$$ plain form
44360 -2845098 -6215299 -12591644 -19077884 -18651145 -9731628 3137697 15568224 24723308
44352 24723308 26906422 20383488 10027145 3086706 63180 -4426667 -10913324 -11789159
44344 -11789159 -2041811 11978999 19533952 18371155 15531108 16428689 18231825 15231939
44336 15231939 7193349 -16664 -846123 4449792 10404047 11857567 9076223 7093004
44328 7093004 9326016 12686385 10810822 1922020 -8870481 -15710952 -17883756 -17925321
44320 -17925321 -16296713 -11186974 -2950945 4533061 7874846 7647824 7025995 8288265
44312 8288265 11290815 14343164 16158710 17505428 20277104 23723994 23152881 15451723
44304 15451723 5099437 251394 2092400 2952915 -2653350 -10024718 -11496478 -7702875
$$ packed form
44360b845098l370201o376345o486240M26739Q919517J2869325J2430527R155084
44352B4723308K183114o522934j0356343o940439l023526m489847o486657q75835
44344a1789159R747348J4020810P554953j162797k840047Q97581J803136k999886
44336A5231939q038590p210013q29459N295915N954255J453520k781344j983219
44328G093004K233012L360369j875563q888802j0792501o840471k172804m1565
44320a7925321J628608N109739Q236029P484006L341785k27022o21829J262270
44312H288265L002550L052349J815546J346718K771676L446890n71113p701158
44304A5451723j0352286m848043J841006Q60515n606265p371368j471760L793603
$$ plain form
44296 -7702875 -5905105 -9235244 -13684236 -15193888 -13901524 -10869189 -6123463 -1363838
44288 -1363838 226649 -1375025 -2938816 -4034524 -8079299 -14805034 -17104660 -9980348
44280 -9980348 1172015 6374933 2943425 -3105380 -5758373 -4231079 -241650 5028764
44272 5028764 10227805 13164636 12037085 6343380 -2562299 -10574858 -12771364 -8883384
44264 -8883384 -4655117 -4511453 -5367275 -2117701 3175331 3818159 -663834 -3238859 -37283
44255 -37283 4496553 5840524 6514793 10428884 14692612 12584939 2615783 -9818717
44247 -9818717 -18758162 -22424071 -22802846 -23315040 -25906373 -28249221 -25157272 -14799191
44239 -14799191 -1963677 6588078 7956153 2910195 -6318332 -14820389 -15494966 -6140695
$$ packed form
44296g702875J797770l330139m448992j509652J292364L032335M745726M759625
44288a363838J590487j601674j563791j095708m044775o725735k299626P124312
44280i980348J1152363N202918l431508o048805k652993J527294L989429N270414
44272E028764N199041K936831j127551n693705q905679q012559k196506L887980
44264h883384M228267J43664q55822L249574N293032O42828m481993k575025L201576
44255c7283M533836J343971O74269L914091M263728k107673r969156j2434500
44247i818717q939445l665909l78775n12194k591333k342848L091949J0358081
44239a4799191J2835514Q551755J368075n045958r228527q502057o74577R354271
$$ plain form
44231 -6140695 5839848 11005217 8946642 6820609 8194308 9595208 8260009 6728618
44223 6728618 7669843 9513517 10009897 9959784 10671771 11122005 10065471 8021367 5397494
44214 5397494 1883889 -904453 -265061 2400691 2095736 -1543262 -2073288 3636009 8653895
44205 8653895 5314266 -3030829 -6596141 -2659344 2816204 5226783 5312304 3687016
44197 3687016 -805818 -6414626 -9230787 -9934412 -12963623 -17458840 -16562622 -8550553
44189 -8550553 -1067790 32803 -1037751 1527619 4989391 3690761 -313636 -831311
44181 -831311 1389349 214214 -4361501 -5419560 -993488 1763529 -2313218 -7950720
44173 -7950720 -7093994 -594389 3233318 -116533 -6211920 -7889273 -3384044 2832493
$$ packed form
44231f140695J1980543N165369k058575k126033J373699J400900j335199j531391
44223F728618R41225J843674M96380n0113P11987M50234j056534k044104k623873
44214E397494l513605k788342O39392K665752l04955l638998n30026N709297N017886
44205H653895l339629q345095l565312L936797N475548K410579Q5521j625288
44197C687016m492834n608808k816161p03625l029211m495217Q96218Q012069
44189h550553P482763J100593j070554K565370L461772j298630m004397n17675
44181h31311K220660j175135m575715j058059M426072K757017m076747n637502
44173g950720Q56726O499605L827707l349851o095387j677353M505229O216537
$$ plain form
44165 2832493 5751624 4832991 3161328 2828594 2926670 2094963 539394 -1681585 -5678014
44156 -5678014 -10764389 -13000702 -9876433 -4534555 -1916677 -2432818 -3071483 -2873686 -3035948
44147 -3035948 -3446002 -4011548 -7433915 -14614527 -19104991 -13897024 -3291816 888312
44139 888312 -3788229 -6852334 -1752754 3727153 328304 -7781540 -9642769 -3429447
44131 -3429447 3235814 5330372 4166105 1263498 -3165566 -6280426 -4446119 829802
44123 829802 4598237 5699891 6785951 7997417 6689850 3161449 737577 10138
44115 10138 -1624359 -4704902 -7122390 -8395937 -9339232 -8338676 -3688979 1468489 2947356
44106 2947356 3002744 6713955 12277387 13835809 13216810 17887533 25970116 25631342 13775319
$$ packed form
44165B832493K919131r18633j671663l32734R8076q31707j555569k220979l996429
44156e678014n086375k236313L124269N341878K617878n16141o38665J97797j62262
44147c035948m10054n65546l422367p180612m490464N207967J0605208M180128
44139H88312m676541l064105N099580N479907l398849q109844j861229O213322
44131c429447O665261K094558j164267k902607m429064l114860J834307N275921
44123H29802L768435J101654J086060J211466j307567l528401k423872p27439
44115A0138j634497l080543k417488j273547r43295J000556M649697N157468J478867
44106B947356N5388L711211N563432J558422o18999M670723Q082583l38774j1856023
$$ plain form
44097 13775319 3352017 4960408 11876368 12443809 8092801 8011616 12757516 15103028
44089 15103028 12990184 10195915 6809108 232407 -5779755 -4228489 2835440 5597584
44081 5597584 1360138 -1704800 2033060 7836948 9714583 8946241 8908038 8521883 6250382
44072 6250382 5046365 7720548 11403312 11878999 10568519 12320853 17840965 22230427
44064 22230427 20482125 12293788 2399700 -2855934 -1167686 2771475 2523282 -1428170
44056 -1428170 -2056664 3937500 10845091 11820468 8060017 6102598 8558577 11748930
44048 11748930 11535425 8173263 5514823 7083638 12200923 15262310 11017971 1912461
44040 1912461 -2573763 3656845 15578939 22176405 17742523 6054524 -4704198 -8576193
$$ packed form
44097A3775319j0423302J608391O915960N67441m351008q1185M745900K345512
44089A5103028k112844k794269l386807o576701o012162J551266P063929K762144
44081E597584m237446l064938L737860N803888J877635p68342l8203l86155k271501
44072F250382j204017K674183L682764M75687j310480J752334N520112M389462
44064B2230427j748302q188337r894088n255634J688248L939161k48193l951452
44056a428170o28494N994164O907591R75377l760451j957419K455979L190353
44048A1748930k13505l362162k658440J568815N117285L061387m244339r105510
44040A912461m486224O230608J1922094O597466m433882j1687999j0758722l871995
$$ plain form
44032 -8576193 -4989481 1668383 5827356 5706503 4167018 4288914 5940660 7383450
44024 7383450 7653003 6083304 2264310 -2008764 -3771072 -3401550 -4362562 -6573298 -4999613
44015 -4999613 1782474 7109596 5767409 3113998 7442709 16917376 22767866 23349156
44007 23349156 25055888 29162668 28547994 20753065 14312084 16190943 21057446 20416271
43999 20416271 15822452 14107806 14136948 8825882 -1109089 -6071060 -2033654 3323689
43991 3323689 3040932 1420810 5668781 12685327 12567193 3285959 -6130752 -7840635
43983 -7840635 -3916619 -568983 577056 1606620 3218677 5476473 10534085 18786349
43975 18786349 24173377 20438030 12463227 13678516 28748598 45463832 49417642 41502694
$$ packed form
44032h576193L586712O657864M158973j20853j539485J21896J651746J442790
44024G383450K69553j569699l818994m273074j762308L69522r61012k210736J573685
44015d999613O782087N327122j342187k653411M328711R474667N850490N81290
44007B3349156J706732M106780o14674p794929o440981J878859M866503o41175
43999B0416271m593819j714646K9142n311066r934971m961971M037406N357343
43991C323689k82757j620122M247971P016546j18134r281234r416711j709883
43983g840635L924016L347636J146039J029564J612057K257796N057612Q252264
43975A8786349N387028l735347p974803J215289J5070082J6715234L953810p914948
$$ plain form
43967 41502694 33463084 29909843 24754933 15298699 8778498 10087500 11770493 4254874
43959 4254874 -9213461 -16803730 -14824726 -10921200 -10385310 -8788505 -1927057 4893550
43951 4893550 4117003 -2340380 -6008322 -4398982 -3378365 -6888037 -10959061 -10298221
43943 -10298221 -5992225 -3504411 -5955147 -11845841 -16934801 -16407439 -8256068 2739190
43935 2739190 7209238 879530 -9859804 -15322075 -13362058 -9040380 -5760477 -2349249
43927 -2349249 1547128 3320637 2475455 2971259 7608755 13318272 14818192 10828515
43919 10828515 4579779 6392 -1030769 328068 579974 -2426239 -5541463 -2933605
43911 -2933605 6065123 14832463 16925224 12731412 7080645 3809688 4838796 10481221
$$ packed form
43967D1502694q039610l553241n154910r456234o520201J309002J682993p515619
43959D254874j3468335p590269J979004L903526N35890J596805O861448O820607
43951D893550p76547o457383l667942J609340J020617l509672m071024O60840
43943a0298221M305996K487814k450736n890694n088960N27362Q151371J0995258
43935B739190M470048o329708j0739334n462271J960017M321678L279903L411228
43927b349249L896377J773509q45182M95804M637496N709517J499920l989677
43919A0828515o248736m573387j037161J358837K51906l006213l115224K607858
43911b933605Q998728Q767340K092761m193812n650767l270957J029108N642425
$$ plain form
43903 10481221 17196355 18672185 13342394 7926227 9184607 14835850 17306500 13985058
43895 13985058 8462450 3660980 -165757 -1537598 1730442 7440505 9798095 6506634
43887 6506634 990370 -2909328 -4269520 -3014670 643374 3905579 3163697 -764654
43879 -764654 -3229753 -2196208 243453 3027235 7393788 12096918 13358133 11518406
43871 11518406 11614814 14461381 13392025 4262608 -6652892 -10129738 -5489500 522417
43863 522417 3002504 1659125 -2813260 -8931402 -12119446 -8018986 1247004 8012165
43855 8012165 6962615 -201819 -7440030 -9308445 -4223881 4385959 10543944 11228136
43847 11228136 8563930 5334335 861410 -5983562 -12186208 -13068489 -8504632 -3200087
$$ packed form
43903A0481221O715134J475830n329791n416167J258380N651243K470650l321442
43895A3985058n522608m801470l826737j371841L268040N710063K357590l291461
43887F506634n516264l899698j360192J254850L658044L262205p41882l928351
43879g64654k465099J033545K439661K783782M366553M703130J261215j839727
43871A1518406R6408K846567j069356r129417j0915500l476846M640238O011917
43863E22417K480087j343379m472385o118142l188044M100460R265990O765161
43855H012165j049550p164434p238211j868415N084564Q609840O157985O84192
43847A1228136k664206l229595m472925o844972o202646q82281M563857N304545
$$ plain form
43839 -3200087 -956244 -1271725 -1487161 -233715 1330705 949223 -1358226 -1744367 2904404
43830 2904404 8989431 9414640 4016816 1019373 4966975 9282912 6014892 -2346586
43822 -2346586 -7414336 -7130825 -6083895 -6541475 -6809749 -6652487 -6841398 -4571322 3282457
43813 3282457 13138971 18006348 16844801 13595167 8738652 659551 -5800301 -2787022
43805 -2787022 7505135 13662895 11191315 7381110 6895569 3830820 -5945517 -14734764
43797 -14734764 -13292545 -3723648 5317850 9795365 9866926 5240864 -1364781 -2527958
43789 -2527958 3862318 8713040 4384732 -2577305 -1070255 7391153 12234514 10952893
43781 10952893 10704211 14313100 16629301 15455921 15110231 17059996 16679705 11980066
$$ packed form
43839c200087K243843l15481k15436J253446J564420l81482k307449l86141M648771
43830B904404O085027M25209n397824k997443L947602M315937l268020q361478
43822b346586n067750K83511J046930m57580k68274J57262j88911K270076P853779
43813C282457R856514M867377j161547l249634m856515q079101o459852L013279
43805b787022J0292157O157760k471580l810205m85541l064749r776337q789247
43797a4734764J442219R568897R041498M477515P1561m626062o605645j163177
43789b527958O390276M850722m328308o962037J507050Q461408M843361j281621
43781A0952893k48682L608889K316201j173380l45690J949765l80291m699639
$$ plain form
43773 11980066 7063901 4246512 729082 -4096142 -5780561 -2617805 583068 -177236
43765 -177236 -3229252 -6358596 -10086332 -12938937 -10544316 -3216627 2268311 2564293
43757 2564293 2818594 7369779 12178733 12226263 10388625 12346123 17422452 21144965 23079845
43748 23079845 25524204 27285471 24908376 18087676 9120147 -253694 -7098425 -6516844
43740 -6516844 1565788 8592048 6873406 -161712 -3703899 -2150241 -414690 266515
43732 266515 2840160 6324018 6736620 6074710 10668631 19163230 21895161 15628617 9962448
43723 9962448 13895110 23244668 27431303 23333341 16418630 12233428 12462122 16214315
43715 16214315 19824349 17911636 9713598 2229364 2185650 6943965 8782003 6575460
$$ packed form
43773A1980066m916165k817389l517430m825224j684419L162756L200873p60304
43765a77236l052016l129344l727736k852605K394621P327689N484938K95982
43757B564293K54301M551185M808954M7530j837638J957498N076329L722513J934880
43748B3079845K444359J761267k377095o820700q967529r373841o844731N81581
43740f516844Q082632P026260j718642p035118l542187J553658J735551O81205
43732B66515K573645L483858M12602o61910M593921Q494599K731931o266544n666169
43723I962448L932662R349558M186635m097962o914711m185202K28694L752193
43715A6214315L610034j912713q198038p484234m3714M758315J838038k206543
$$ plain form
43707 6575460 6532906 10757804 12021099 3975260 -7666795 -9986220 1288916 15471097
43699 15471097 18885609 10450185 1547701 1296752 6895149 10171615 8569459 5311502
43691 5311502 2634062 1057194 3087632 10322028 17269148 15696742 6354868 -987826
43683 -987826 -1132981 769232 37975 220472 4405403 7104292 2997486 -2668640 -1889443
43674 -1889443 2683217 2508971 -1900368 -2256065 2332953 3426222 -1912945 -5803662
43666 -5803662 -2963500 889855 -268165 -2685798 -700550 2655140 1459359 -1913223
43658 -1913223 -683888 4050457 4142793 -2845953 -9872367 -10816771 -7955783 -6496205 -6875330
43649 -6875330 -5883024 -2099129 3085260 7991391 11383587 11511173 6835684 -1652303
$$ packed form
43707F575460m2554M224898J263295q045839j1642055k319425J1275136J4182181
43699A5471097L414512q435424q902484k50949N598397L276466j602156l257957
43691E311502k677440j576868K030438P234396O947120j572406r341874p342694
43683i87826j45155J902213p31257J82497M184931K698889m106806n666126P79197
43674a889443M572660j74246m409339l55697M589018J093269n339167l890717
43666e803662K840162L853355j158020k417633J985248L355690j195781l372582
43658a913223J229335M734345R2336o988746p026414r44404K860988J459578l79125
43649f875330R92306L783895N184389M906131L392196J27586m675489q487987
$$ plain form
43641 -1652303 -9643423 -11949280 -6710563 2394993 9024998 10079560 8090960 7285593
43633 7285593 8850035 11440828 14683807 19646619 26357731 33148939 38594049 42571923
43625 42571923 45599583 48510105 52272823 56588701 59516410 60582233 63357533 71921620
43617 71921620 84806903 95780711 101591899 105799279 113018260 121863331 126106586 121313156
43609 121313156 107989807 89537620 70041778 53588650 42483351 35109813 27715717
43602 27715717 19389250 13369595 12195899 13651549 13707087 11920523 10957836 11494424 11169469
43593 11169469 9043863 7358895 7287060 6675854 4851136 6049631 13383192 21671107
43585 21671107 22185861 14218585 5975997 2959547 1609573 -2741488 -7456322 -7002638
$$ packed form
43641a652303p991120k305857N238717R105556O630005J054562j988600q05367
43633G285593J564442K590793L242979M962812O711112O791208N445110L977874
43625D2571923L027660K910522L762718M315878K927709J065823K775300Q564087
43617G1921620J2885283J0973808N811188M207380P218981Q845071M243255m793430
43609A21313156j3323349j8452187j9495842j6453128j1105299p373538p394096
43602B7715717q326467o019655j173696J455650N5538j786564r62687N36588l24955
43593A1169469k125606j684968p1835o11206j824718J198495P333561Q287915
43585B1671107N14754p967276q242588l016450j349974m351061m714834M53684
$$ plain form
43577 -7002638 -1786113 2834480 3912462 2234132 -1573797 -6580911 -8473347 -3178694
43569 -3178694 6238706 12150297 12613163 12973684 15543757 14477082 5183057 -6707324
43561 -6707324 -11811171 -9079120 -5084747 -3150648 -184068 5307482 8855488 6611380
43553 6611380 1448360 -1351095 -1308699 -1571437 -2681102 -2199522 4750 747150 -1183101
43544 -1183101 -2691653 -1345926 669474 461798 -345464 1915298 6852958 10704412
43536 10704412 12540833 14913920 17497208 15316731 6354810 -3097213 -5029282 510492
43528 510492 6505149 8617732 9215288 11563290 14244595 13306982 7682484 635125 -3333132
43519 -3333132 -2321134 1407979 3449680 1615319 -1781731 -2620910 551539 5358115
$$ packed form
43577g002638N216525M620593J077982j678330l807929n007114j892436N294653
43569c178694R417400N911591M62866L60521K570073j066675r294025j1890381
43561f707324n103847K732051L994373J934099K966580N491550L548006k244108
43553F611380n163020k799455M2396k62738j109665M81580K204272P42400j930251
43544a183101j508552J345727K015400k07676q07262K260762M937660L851454
43536A0704412J836421K373087K583288k180477q961921r452023j932069N539774
43528E10492N994657K112583N97556K348002K681305r37613n624498p047359l968257
43519c333132J011998L729113K041701j834361l397050q39179L172449M806576
$$ plain form
43511 5358115 7884497 5483622 -888098 -5935624 -4146124 3177938 7846931 4983159
43503 4983159 142572 1239319 5950666 4254697 -6795506 -18257384 -20830711 -14330643
43495 -14330643 -3275094 9567141 20701514 23784752 16887870 7737569 4914648 6725753
43487 6725753 5470469 171433 -2784793 -723910 2090141 3705230 8932685 20640976
43479 20640976 32658412 36576839 32036057 25372801 20482930 15989406 10329693 4601243
43471 4601243 -305641 -5242414 -9601741 -9708986 -3391622 5354274 9616885 7577634
43463 7577634 4182604 3739059 4297134 2596062 1817251 8496151 21257580 28830379
43455 28830379 23055891 9750881 1738291 3524062 8202825 8340004 3981767 -825432
$$ packed form
43511E358115K526382k400875o371720n047526J789500P324062M668993k863772
43503D983159m840587J096747M711347j695969j1050203j1461878k573327O500068
43495a4330643J1055549J2842235J1134373L083238o896882r150301k822921J811105
43487F725753j255284n299036k956226K060883K814051J615089N227455J1708291
43479B0640976J2017436L918427m540782o663256m889871m493524n659713n728450
43471D601243m906884m936773m359327j07245O317364Q745896M262611k039251
43463G577634l395030m43545N58075j701072p78811O678900J2761429P572799
43455B8830379n774488j3305010q012590J785771M678763J37179m358237m807199
$$ plain form
43447 -825432 -3867660 -4621205 -2486513 1567315 4238278 3735128 2453161 3199822 4628803
43438 4628803 3398377 -552383 -4204618 -6212474 -7891548 -9156894 -6984351 259697
43430 259697 9046445 13300103 10104905 1915928 -5751220 -7914179 -3190601 4571349
43422 4571349 8645638 5870589 580272 -196930 4694380 9789263 11244583 11678526
43414 11678526 14335991 16510388 13677211 7951174 6419985 11126030 16615799 18841730
43406 18841730 20626251 25203643 29694662 29945056 28126352 29665995 34429400 36722662
43398 36722662 33738909 28776306 25340174 22599490 18324604 12955824 8960303 8301546
43390 8301546 11374759 16127465 17716555 11919244 139515 -11173829 -16930714 -16967360
$$ packed form
43447h25432l042228p53545K134692M053828K670963n03150j281967P46661J428981
43438D628803j230426l950760l652235k007856j679074j265346K172543P244048
43430B59697Q786748M253658l195198q188977p667148k162959M723578P761950
43422D571349M074289k775049n290317p77202M891310N094883J455320M33943
43414A1678526K657465K174397k833177n726037j531189M706045N489769K225931
43406A8841730J784521M577392M491019K50394j818704J539643M763405K293262
43398C6722662k983753m962603l436132k740684m274886n368780l995521o58757
43390H301546L073213M752706J589090n797311j1779729j1313344n756885l6646
$$ plain form
43382 -16967360 -12989437 -5759809 2658100 7336914 4910351 -1776555 -6640131 -7461358
43374 -7461358 -7163360 -7976632 -7457785 -2244807 5784394 10006049 6714250 438022 -943774
43365 -943774 3837147 7586225 4346197 -2198601 -3634209 1663308 6725660 5908158
43357 5908158 1776461 -34544 1039071 1095848 -1460570 -3675355 -2706147 128850 1396680
43348 1396680 442741 495602 4376765 10264434 13509152 12623129 11003919 11431996 11475884
43339 11475884 7153044 -609779 -6623664 -7738838 -5228776 -1481791 2300581 5527261
43331 5527261 8801065 14517964 22973277 28572620 24988579 14338379 5826314 4294223
43323 4294223 5780423 5953488 6481092 9805885 13603660 14954533 15305324 16813872 18018145
$$ packed form
43382a6967360L977923P229628Q417909M678814k426563o686906m863576q21227
43374g461358K97998q13272N18847N212978Q029201M221655l291799o276228j381796
43365i43774M780921L749078l240028o544798j435608N297517N062352q17502
43357E908158m131697j811005J073615N6777k556418k214785R69208K834997J267830
43348A396680r53939N2861L881163N887669L244718q86023j619210M28077M3888
43339A1475884m322840p762823o013885j115174K510062L746985L782372L226680
43331E527261L273804N716899Q455313N599343l584041j0650200q512065j532091
43323D294223J486200J73065N27604L324793L797775J350873L50791J508548J204273
$$ plain form
43314 18018145 17399257 16649358 15730743 9862923 -2465795 -13197704 -13688827 -6353099
43306 -6353099 140787 3651903 7716174 10895064 7837905 745560 -1135830 4474876
43298 4474876 9347649 8375166 7119682 11041124 16183245 17052806 16212018 18296145 20239887
43289 20239887 16028067 7856511 4452281 9495897 18044453 23631286 23864304 20266901
43281 20266901 17238163 19499001 26029155 28876785 23030916 14479614 12096599 14767744
43273 14767744 15323976 15248526 23907586 41081416 51931068 45775296 30947828 22672119
43265 22672119 22870439 22026014 17017800 15258808 20295178 23803039 16875479 2851453
43257 2851453 -6740263 -5730596 1943824 9128535 12583270 13424126 14061558 16105412
$$ packed form
43314A8018145o18888p49899r18615n867820j2328718j0731909m91123P335728
43306f353099O493886L511116M064271L178890l057159p092345j881390N610706
43298D474876M872773r72483j255484L921442N142121Q69561q40788K084127J943742
43289B0239887m211820q171556l404230N043616Q548556N586833K33018l597403
43281B0266901l028738K260838O530154K847630n845869q551302k383015K671145
43273A4767744N56232p5450Q659060J7173830J0849652o155772j4827468q275709
43265B2672119J98320q44425n008214j758992N036370L507861o927560j4024026
43257B851453r591716J009667P674420P184711L454735Q40856O37432K043854
$$ plain form
43249 16105412 19798246 24177256 27635926 28494461 25605681 19363680 12102159 6397141
43241 6397141 2729735 -237363 -3160685 -5205496 -5752449 -5184202 -3841812 -2342547
43233 -2342547 -3155656 -8709777 -16520278 -19599234 -14661986 -7389338 -5818090 -10071905
43225 -10071905 -12718569 -8747083 -1158125 3725983 3040287 -1251306 -4770159 -3677724
43217 -3677724 2252108 8874669 12122192 12983726 15253555 18952890 20096435 17134067
43209 17134067 12972159 9782534 6852282 4916844 6750708 10921629 11348856 7206017
43201 7206017 6799610 15533557 25835371 27004062 20607484 16663231 17346118 15364642
43193 15364642 8233457 2691910 2259854 1250325 -3610254 -5278186 2251322 12205451
$$ packed form
43249A6105412L692834M379010L458670Q58535k888780o242001p261521n705018
43241F397141l667406k967098k923322k044811n46953N68247J342390J499265
43233b342547q13109n554121p810501l078956M937248P272648J571248m253815
43225a0071905k646664L971486P588958M884108o85696m291593l518853J092435
43217c677724N929832O622561L247523Q61534K269829L699335J143545k962368
43209A7134067m161908l189625k930252j935438J833864M170921M27227m142839
43201G206017m06407Q733947J0301814J168691o396578l944253O82887j981476
43193A5364642p131185n541547m32056j009529m860579j667932P529508R954129
$$ plain form
43185 12205451 13960959 8977828 8065561 15043596 22867810 26010126 27159952 28950103
43177 28950103 27442577 19361093 10311020 9064564 15681581 21139791 18833362 11813223
43169 11813223 7278818 7473627 8582041 6599243 1277701 -5107470 -9832718 -10020226
43161 -10020226 -3944830 5878934 13079729 13704775 10814825 9801457 10332617 7245328
43153 7245328 -506492 -6920931 -7075019 -3596932 -1399873 264669 5308038 12434607
43145 12434607 15366060 11911390 7573485 8065809 12207821 15066151 15230828 15431115
43137 15431115 17295420 19002492 18316551 15564425 13130526 13660086 18796333 27481377
43129 27481377 34844767 35279281 28547780 21104511 18982898 20767227 20755303 18149519
$$ packed form
43185A2205451J755508m983131r12267O978035P824214L142316J149826J790151
43177B8950103j507526q081484r050073j246456O617017N458210k306429p020139
43169A1813223m534405J94809J108414j982798n321542o385171m725248j87508
43161a0020226O075396R823764P200795O25046k889950j013368N31160l087289
43153G245328p751820o414439j54088L478087K197059J664542N043369P126569
43145A2434607K931453l454670m337905M92324M142012K858330J64677K00287
43137A5431115J864305J707072o85941k752126k433899N29560N136247Q685044
43129B7481377P363390M34514o731501p443269k121613J784329j1924k605784
$$ plain form
43121 18149519 18527323 25114521 33251992 36628829 35473246 34439522 34876123 34144167
43113 34144167 31548728 29963465 31382279 35014757 39852678 44819503 46497153 42298390
43105 42298390 37188316 41371387 58308177 79996897 97643430 112144496 129321142
43098 129321142 149042895 165249387 174388607 177538233 174947169 164479242 146439730
43091 146439730 125547505 106763781 91975280 81141034 73712654 68258547 62979907
43084 62979907 57088190 50448928 42938476 35880414 32056932 31521233 29790536 23987788
43076 23987788 18243210 17968983 21169503 22076551 21755832 26406774 34438213 34982499 23368762
43067 23368762 9544373 4898164 7791920 9937840 11219713 17852641 28370795 32695236
$$ packed form
43121A8149519L77804O587198Q137471L376837j155583j033724M36601p31956
43113C4144167k595439j585263J418814L632478M837921M966825J677650m198763
43105D2298390n110074M183071J6936790K1688720J7646533J4501066J7176646
43098A29321142J9721753J6206492R139220L149626k591064j0467927j8039512
43091A46439730k0892225j8783724j4788501j0834246p428380n454107n278640
43084F2979907n891717o639262p510452p058062l823482n35699j730697n802748
43076B3987788n744578k74227L200520R07048l20719M650942Q031439N44286j1613737
43067B3368762j3824389m646209K893756K145920J281873O632928J0518154M324441
$$ plain form
43059 32695236 26911808 19614817 19294417 22573333 20894401 14228362 11115966 16371372
43051 16371372 24894934 28827976 26316089 20655476 13850208 5239167 -3508657 -6077288
43043 -6077288 2416241 17697434 28042940 25482329 13933707 4717524 5045546 12436695
43035 12436695 19240431 20133004 15335929 9150006 6447463 8913014 13399339 14834314
43027 14834314 11572990 6957673 4805081 4557057 2455006 -2981959 -8484486 -9699204
43019 -9699204 -6381253 -2977282 -3979610 -8983440 -12499851 -8922565 1905671 13973798
43011 13973798 20341711 19464038 16165352 16147138 19964409 23096461 21672620 16801938
43003 16801938 12522993 10544208 8663534 4442654 -1221302 -5352795 -6854276 -7471792
$$ packed form
43059C2695236n783428p296991l20400L278916j678932o666039l112396N255406
43051A6371372Q523562L933042k511887n660613o805268q611041q747824k568631
43043f077288Q493529J5281193J0345506k560611j1548622r216183L28022P391149
43035A2436695O803736Q92573m797075o185923k702543K465551M486325J434975
43027A4834314l261324m615317k152592k48024k102051n436965n502527j214718
43019i699204L317951L403971j002328n003830l516411L577286J0828236J2068127
43011A3973798O367913q77673l298686j8214L817271L132052j423841m870682
43003A6801938m278945j978785j880674m220880n663956m131493j501481o17516
$$ plain form
42995 -7471792 -8504441 -8212964 -4164546 2384311 6679528 6005486 3312084 3500240 7194699
42986 7194699 10643311 11383379 10992895 11576513 12684384 13513589 15302801 18643781 20461197
42977 20461197 17324250 11042124 7534007 10004282 15952662 20947455 22634853 21015580
42969 21015580 17726577 15327733 14402886 11457632 3512801 -5016925 -5338466 3655017
42961 3655017 11723094 9942763 2652720 878218 6666106 11261376 8799138 4535628
42953 4535628 6477966 14032566 19506054 18392436 13749989 10667123 9829116 8028152
42945 8028152 3674276 -47529 1542970 8524624 15201422 16272667 13051627 11564346
42937 11564346 15007694 20485427 23358277 22258260 18754501 14222445 8923405 3417980
$$ packed form
42995g471792j032649K91477M048418O548857M295217o74042k693402J88156L694459
42986G194699L448612P40068l90484N83618J107871Q29205J789212L340980J817416
42977B0461197l136947o282126l508117K470275N948380M994793J687398j619273
42969B1015580l289003k398844r24847k945254p944831q529726l21541Q993483
42961C655017Q068077j780331p290043j774502N787888M595270k462238m263510
42953D535628J942338P554600N473488j113618m642447l082866q38007j800964
42945H028152m353876l721805J590499O981654O676798J071245l221040j487281
42937A1564346L443348N477733K872850j100017l503759m532056n299040n505425
$$ plain form
42929 3417980 -405492 88687 6064051 14514295 19000524 16020682 10482728 10927890
42921 10927890 17986162 21884918 14799148 2225272 -2982066 3666671 14079314 19267635
42913 19267635 19561531 20750192 24791485 28925258 31812239 35566627 41288077 46259392
42905 46259392 47195535 44105847 39338473 34507187 30472584 29282251 33070786 40139765
42897 40139765 44514189 41727775 34380006 29760209 31673753 36365185 37211775 31983866
42889 31983866 24526128 20544173 22887939 29741970 35710109 35348737 27725645 17942167
42881 17942167 12859402 14679654 19331427 21440443 20248246 19900656 23565269 27787654
42873 27787654 24634830 11160052 -4956146 -12956202 -11883718 -10729726 -14057395 -13981111
$$ packed form
42929C417980l823472M94179N975364Q450244M486229k979842n537954M45162
42921A0927890P058272L898756p085770j2573876n207338O648737J0412643N188321
42913A9267635K93896J188661M041293M133773K886981L754388N721450M971315
42905D6259392R36143l089688m767374m831286m034603j190333L788535P068979
42897D0139765M374424k786414p347769m619797J913544M691432Q46590n227909
42889C1983866p457738l981955K343766O854031N968139l61372p623092r783478
42881A7942167n082765J820252M651773K109016j192197l47590L664613M222385
42873B7787654l152824j3474778j6116198q000056J072484J153992l327669P6284
$$ plain form
42865 -13981111 -1976808 16417625 27227807 26593648 24591008 29516156 37153446 39235567
42857 39235567 35147026 30025753 26675416 24734511 23794104 22494607 18261492 12410376
42849 12410376 11377790 17990323 25889184 28203503 27156454 28414595 30659885 29291230
42841 29291230 26668534 28535969 32342611 30123015 22735169 19832142 24148311 27400027
42833 27400027 25273279 24977134 32005005 39667239 39544250 34036157 30114024 27536424
42825 27536424 22419687 17243874 17777443 23149227 27381259 28505357 28717994 27805679
42817 27805679 23826818 18509149 14991351 11922028 6508742 1443148 1655001 5848157
42809 5848157 8622420 9684691 13309769 19341914 22352162 19790789 14229620 8046737
$$ packed form
42865a3981111J2004303J8394433J0810182o34159k002640M925148P637290K082121
42857C9235567m088541n121273l350337j940905r40407j299497m233115n851116
42849A2410376j032586O612533P898861K314319j047049J258141K245290j368655
42841B9291230k622696J867435L806642k219596p387846k903027M316169L251716
42833B7400027k126748k96145P027871P662234j22989n508093l922133k577600
42825B7536424n116737n175813N33569N371784M232032J124098K12637r12315
42817B7805679l978861n317669l517798l069323n413286n065594K11853M193156
42809E848157K774263J062271L625078O032145L010248k561373n561169o182883
$$ plain form
42801 8046737 2779628 2526685 9770169 18409024 19873098 16254090 17754096 26185391
42793 26185391 31585922 27891621 21241640 18149364 15610513 9398925 3457201 3415969
42785 3415969 7383306 10365523 12186882 14299640 14272119 10542493 7744861 10161816
42777 10161816 14353857 15449457 16166806 21354058 27284041 25675146 16752210 9494526
42769 9494526 8954351 11085200 10943219 9143380 8441301 9222373 10362167 11181733 11665839
42760 11665839 12989326 16853243 21765997 22468490 16942499 11116707 11350081 14848705
42752 14848705 14165365 9615579 9492300 17446184 26939670 30378041 27839017 24109154
42744 24109154 22007751 21800403 23607685 27129924 30792142 33151436 34143451 34568986
$$ packed form
42801H046737n267109k52943P243484Q638855J464074l619008J500006Q431295
42793B6185391N400531l694301o649981l092276k538851o211588n941724m1232
42785C415969L967337K982217J821359K112758k7521l729626k797632K416955
42777A0161816M192041J095600P17349N187252N929983j608895q922936p257684
42769I494526n40175K130849j41981j799839p02079P81072J139794Q19566M84106
42760A1665839J323487L863917M912754P02493n525991n825792K33374L498624
42752A4848705o83340m549786j23279P953884R493486L438371k539024l729863
42744B4109154k101403k07348J807282L522239L662218K359294R92015M25535
$$ plain form
42736 34568986 35715395 38857307 43016583 44161732 39335900 30788505 23468065 19785885
42728 19785885 19599881 22952920 28552357 31635550 28697396 23264574 21758979 24691006
42720 24691006 27526044 28978973 31460957 33566249 30168561 21875803 16941687 20331120
42712 20331120 26814839 28578193 24701484 19522341 16125236 15358993 17796469 22916344
42704 22916344 28412693 32303201 33462220 29850010 20586095 10504003 7075555 10917061
42696 10917061 14976588 15370602 16580128 22379666 28281870 28319363 23895598 20070989
42688 20070989 17711486 15506169 15623816 20343828 25831379 26199890 22208422 19788789
42680 19788789 21201649 23387039 23979205 23491282 22605154 22530398 26591386 35758218 44159789
$$ packed form
42736C4568986J146409L141912M159276J145149m825832q547395p320440l682180
42728A9785885j86004L353039N599437L083193k938154n432822j505595K932027
42720B4691006K835038J452929K481984K105292l397688q292758m934116L389433
42712B0331120O483719J763354l876709n179143l397105p66243K437476N119875
42704B2916344N496349L890508J159019l612210r263915j0082092l428448L841506
42696A0917061M059527L94014J209526N799538N902204L7493m423765l824609
42688B0070989k359503k205317J17647M720012N487551L68511l991468k419633
42680A9788789J412860K185390N92166m87923q86128p4756M060988R166832Q401571
$$ plain form
42671 44159789 45621178 43595864 47127666 57027077 64404725 64660523 64428891 70637759
42663 70637759 80131720 85977695 88354761 92063074 96476340 95368157 86373997 74929053
42655 74929053 67833873 66616555 68056939 68478168 66745256 64751936 64966433 66359431
42647 66359431 64381755 57422776 51166666 51953598 56570962 54528264 42033182 27853520
42639 27853520 21643324 21754129 20510420 17489590 19020135 25320494 27716315 21925769
42631 21925769 15915748 18312683 24805591 24133183 14786107 7200520 9007447 15536070
42623 15536070 17594479 13454327 9668996 12712265 22193156 30984468 31657113 24708026
42615 24708026 19593993 24171574 33960916 36950285 29361488 20596618 20244901 25861514
$$ packed form
42671D4159789J461389k025314L531802R899411P377648K55798k31632O208868
42663G0637759R493961N845975K377066L708313M413266j108183q994160j1444944
42655G4929053p095180j217318J440384M21229j732912j993320K14497J392998
42647F6359431j977676o958979o256110P86932M617364k042698j2495082j4179662
42639B7853520o210196J10805j243709l020830J530545O300359K395821n790546
42631B1925769o010021K396935O492908o72408r347076p585587J806927O528623
42623A5536070K058409m140152l785331L043269R480891Q791312O72645o949087
42615B4708026n114033M577581R789342K989369p588797q764870l51717N616613
$$ plain form
42607 25861514 27651610 21048221 10003408 568860 -4121294 -3723823 532174 6758235
42599 6758235 13738460 20850148 26533882 29243950 30430648 33259113 37359989 38824653
42591 38824653 37048863 37091792 42558573 50279436 55024301 55471170 52566636 46597226
42583 46597226 39535008 35512142 34753610 32041757 25915239 23427589 29104280 34976892
42575 34976892 30573420 18685448 11012660 10552163 9527493 4751118 3516263 11162651
42567 11162651 22428137 29618221 31823663 31687646 29766048 26790144 25759223 26977247
42559 26977247 25806185 19798766 13605448 12352896 14269922 14469440 12365168 10585154
42551 10585154 9617374 8325543 7416769 7935730 8183408 6091443 2960609 1412842 1622242
$$ packed form
42607B5861514J790096o603389j1044813r434548m690154L97471M255997O226061
42599F758235O980225P111688N683734K710068J186698K828465M100876J464664
42591C8824653j775790M2929N466781P720863M744865M46869k904534n969410
42583D6597226p062218m022866p58532k711853o126518k487650N676691N872612
42575C4976892m403472j1887972p672788m60497j024670m776375j234855P646388
42567A1162651J1265486P190084K205442j36017j921598k975904j030921J218024
42559B6977247j171062o007419o193318j252552J917026J99518k104272j780014
42551A0585154r67780j291831r08774N18961K47678k091965l130834j547767K09400
$$ plain form
42542 1622242 2836385 6050432 11282448 14849146 14106314 12820386 16498836 23618894
42534 23618894 27114884 24337311 20013746 18722999 19748938 20791227 21719206 22357370
42526 22357370 21016147 18095739 17146975 18904890 18090689 10950243 3212046 4373470
42518 4373470 14546538 23169889 22368521 16108114 12994925 14838439 17361037 18960214
42510 18960214 22078318 26270502 26478727 20400835 12681056 8742340 8256169 8142498
42502 8142498 8640133 11835481 16206454 17678337 15754591 14116229 14552344 14334083 11231049
42493 11231049 8080641 10075239 18900742 31017797 40673845 43568176 38814716 29224544
42485 29224544 20030793 16143118 18887859 24430286 26474989 22519777 17100582 16530345
$$ packed form
42542A622242J214143L214047N232016L566698p42832j285928L678450P120058
42534B3618894L495990k777573m323565j290747J025939J042289R27979O38164
42526B2357370j341223k920408r48764J757915q14201p140446p738197J161424
42518D373470J0173068Q623351q01368o260407l113189J843514K522598J599177
42510A8960214L118104M192184K08225o077892p719779l938716m86171j13671
42502H142498M97635L195348M370973J471883j923746j638362M36115k18261l103034
42493A1231049l150408J994598Q825503J2117055R656048K894331m753460r590172
42485B9224544r193751l887675K744741N542427K044703l955212n419195n70237
$$ plain form
42477 16530345 20852912 24616547 25829961 28822066 35712790 40746707 38463699 33455025
42469 33455025 35110303 44489957 53438479 56573695 57263757 60090010 63424441 62859518
42461 62859518 58306746 54380341 55333630 61373493 68943789 74102955 76444745 78928666
42453 78928666 82922880 86078898 87652280 92190874 102630475 112336934 111123891 99002343
42445 99002343 87365724 85720235 93265502 104550138 116874773 129619876 141800309
42438 141800309 153481936 165984438 179024509 191408262 205081309 223476239 244950295
42431 244950295 263306283 275957928 285917264 294806895 300681550 304304005 309799876 315995888
42423 315995888 314681784 301642697 282625418 264291731 246450315 227864058 211821811
$$ packed form
42477A6530345M322567L763635J213414K992105O890724N033917k283008n008674
42469C3455025J655278R379654Q948522L135216O90062K826253L334431n64923
42461F2859518m552772l926405R53289O039863P570296N159166K341790K483921
42453G8928666L994214L156018J573382M538594J0439601R706459j213043j2121548
42445I9002343j1636619j645489P545267J1284636J2324635J2745103J2180433
42438A41800309J1681627J2502502J3040071J2383753J3673047J8394930K1474056
42431B44950295J8355988J2651645R959336Q889631N874655L622455N495871O196012
42423C15995888j314104j3039087j9017279j8333687j7841416j8586257j6042247
$$ plain form
42416 211821811 199503843 184976782 164329556 143752795 130671587 122293203 111391975
42409 111391975 98730038 90643852 87897177 86212589 85313043 88101025 92287525 91944847
42401 91944847 87202477 84259850 85383766 86063074 82607662 76336278 70100957 66280965
42393 66280965 67475337 73251446 77249269 73687281 65437412 59291777 55400220 49243876
42385 49243876 42092002 39915979 42393805 43253816 42529443 47726652 59933484 69402490
42377 69402490 69999430 68565268 73225652 80334853 81110878 75534111 70959881 70028573
42369 70028573 68275321 63262647 59317777 61569913 69039965 75183456 73822316 64412290
42361 64412290 52562735 45315553 45537107 50944579 57266647 60756100 59466153 55492179
$$ packed form
42416B11821811j2317968j4527061k0647226k0576761j3081208q378384j0901228
42409A11391975j2661937q086186k746675j684588q99546K787982M186500l42678
42401I1944847m742370k942627J123916O79308l455412o271384o235321l819992
42393F6280965J194372N776109L997823l561988q249869o145635l891557o156344
42385D9243876p151874k176023K477826Q60011p24373N197209J2206832R469006
42377F9402490N96940j434162M660384P109201P76025n576767m574230r31308
42369G0028573j753252n012674l944870K252136P470052O143491j361140r410026
42361F4412290j1849555p247182K21554N407472O322068L489453j289947l973974
$$ plain form
42353 55492179 55059765 62492514 74203883 82166432 82970277 79950823 77516994 78061171
42345 78061171 83587101 94769703 108309044 120469393 132928649 149295541 166671407
42338 166671407 178516753 186504466 200690963 225214146 252170444 273459610 290488971
42331 290488971 306964304 319752374 323782224 320290181 313292711 302326076 285155881
42324 285155881 263796002 241593800 217919879 191994468 168642993 153512811 144731985
42317 144731985 135393305 122593795 108804349 96647283 87828795 84651003 86266129
42310 86266129 85488447 76241267 63190291 57084523 60451782 64361781 60345630 49893243
42302 49893243 40658343 37932531 41476303 47110603 50321385 51421220 57366873 74564505
$$ packed form
42353E5492179m32414P432749J1711369P962549Q03845l019454k433829N44177
42345G8061171N525930J1182602J3539341J2160349J2459256J6366892J7375866
42338A66671407J1845346P987713J4186497K4523183K6956298K1289166J7029361
42331B90488971J6475333J2788070M029850l492043o997470j0966635j7170195
42324B85155881k1359879k2202202k3673921k5925411k3351475j5130182q780826
42317A44731985r338680j2799510j3789446j2157066q818488l177792J615126
42310H6266129p77682r247180j3050976o105768L367259L909999m016151j0452387
42302D9893243r234900k725812L543772N634300L210782J099835N945653J7197632
$$ plain form
42294 74564505 98990837 117136784 118450831 104683112 86291955 72076798 63289341
42287 63289341 56012361 47793194 41277900 40010481 41183660 36769942 24126062 11260766
42279 11260766 7528950 12617242 19460429 24277508 27286098 26784536 21301032 16752301
42271 16752301 21908024 34779151 42253750 37130073 27937187 26608240 32843914 37390351
42263 37390351 36087411 32719816 30062967 26307940 21364873 19923093 24819238 31375129
42255 31375129 32335321 26870335 21177914 20146807 21471350 19715737 14307471 10487941
42247 10487941 12273113 17532826 21711745 23945418 26681607 30780317 34430636 36475211
42239 36475211 37309110 36146549 30987905 22753206 16456732 16067692 20153785 24691905
$$ packed form
42294G4564505K4426332J8145947J314047j3767719j8391157j4215157q787457
42287F3289341p276980q219167o515294j267419J173179m413718j2643880j2865296
42279A1260766l731816N088292O843187M817079L008590n01562n483504m548731
42271A6752301N155723J2871127P474599n123677r192886j328947O235674M546437
42263C7390351j302940l367595k656849l755027m943067j441780M896145O555891
42255C1375129R60192n464986n692421j031107J324543j755613n408266l819530
42247A0487941J785172N259713M178919K233673K736189M098710L650319K044575
42239C6475211Q33899j162561n158644q234699o296474l89040M086093M538120
$$ plain form
42231 24691905 28499055 33312097 39284453 43118934 41375207 34391245 26471094 22783358
42223 22783358 25820862 33657571 41208297 44168845 42774072 41557560 44553012 50500095
42215 50500095 53547634 49265833 39405883 30023964 25503652 25499927 27287090 29357714
42207 29357714 31992205 35164941 36868368 34258583 27512290 22300186 25502149 36296096
42199 36296096 44222838 40300621 28705681 22179221 25715770 30746051 27637208 18191984
42191 18191984 11327842 10455400 10888241 8250831 4031092 1910697 2093488 1336139 -2110908
42182 -2110908 -4978566 -2101082 5962120 11045047 6964917 -799129 -1020286 7783987
42174 7783987 15013066 12927016 6101331 2305668 2106850 3392923 8290313 17130055
$$ packed form
42231B4691905L807150M813042N972356L834481j743727o983962p920151l687736
42223B2783358L037504P836709P550726K960548j394773j216512K995452N947083
42215E0500095L047539m281801r859950r381919m520312l725J787163K070624
42207B9357714K634491L172736J703427k609785o746293n212104L201963J0793947
42199C6296096P926742l922217j1594940o526460L536549N030281l108843r445224
42191A8191984o864142q72442M32841k637410m219739k120395J82791p57349l447047
42182b110908k867658K877484Q063202N082927m080130p764046k21157Q804273
42174G783987P229079k086050o825685l795663j98818J286073M897390Q839742
$$ plain form
42166 17130055 21873627 15676875 4874385 1118547 4683635 6666981 5719011 9778645
42158 9778645 20231780 27166081 24601938 19688374 21074189 26888632 30425396 30508852
42150 30508852 29852079 28977130 27811562 28340467 30109786 27934326 19883189 13245370
42142 13245370 16510277 28738925 42341444 53118960 62132085 70886737 80483800 92671253
42134 92671253 105672291 111527498 104274878 89202607 77261303 71200189 64273036 52722660
42126 52722660 41917922 37827538 38975276 40689277 42356640 45607493 48264423 45364889
42118 45364889 35934435 25111714 18913685 19101842 23526531 29068995 32887411 32812845
42110 32812845 29284491 26530067 28909518 35084836 38327542 34348249 26544583 21261500
$$ packed form
42166A7130055M743572o196752j0802490l755838L565088J983346r47970M059634
42158I778645J0453135O934301k564143m913564J385815N814443L536764Q3456
42150C0508852o56773q74949j165568N28905J769319k175460q051137o637819
42142A3245370L264907J2228648J3602519J0777516R013125Q754652R597063J2187453
42134I2671253J3001038N855207p252620j5072271j1941304o061114o927153j1550376
42126E2722660j0804738m090384J147738J714001J667363L250853K656930k899534
42118D5364889r430454j0822721o198029J88157M424689N542464L818416p4566
42110C2812845l528354k754424K379451O175318L242706l979293p803666n283083
$$ plain form
42102 21261500 20427439 22195405 25985371 31268174 32806850 24565873 10000332 1571304
42094 1571304 6199560 16497329 20909260 17935156 14746608 15303055 16783641 16625940
42086 16625940 16262373 16675116 15612755 11683769 7568254 6307684 6618628 4904002
42078 4904002 1154261 -98125 4277537 11113228 14399905 13098355 12135387 14322628
42070 14322628 15232796 10094604 2822861 1971912 8342740 13461038 11765340 7493792
42062 7493792 6357520 6977608 5743865 4795206 8423402 14741194 17786898 16402977
42054 16402977 14724281 14509888 13095948 9319108 5858899 4500055 3999698 4350520
42046 4350520 8582424 17591285 26540417 29587454 26366729 21233068 17466604 14841250
$$ packed form
42102B1261500q34061J767966L789966N282803J538676q240977j4565541q429028
42094A571304M628256J0297769M411931k974104l188548N56447J480586j57701
42086A6625940l63567M12743j062361l928986m115515j260570L10944j714626
42078D904002l749741j252386M375662O835691L286677j301550r62968K187241
42070A4322628R10168n138192p271743q50949O370828N118298j695698m271548
42062G493792j136272O20088j233743r48659L628196O317792L045704j383921
42054A6402977j678696k14393j413940l776840l460209j358844n00357L50822
42046D350520M231904R008861Q949132L047037l220725n133661l766464k625354
$$ plain form
42038 14841250 12290619 10162217 8975885 7953150 6543423 6184492 7832282 8081339
42030 8081339 2065732 -7553773 -9183446 4463588 24238625 33012549 26298160 16823893
42022 16823893 16682900 22963584 25524077 21675305 16182145 11694866 7021385 2446596
42014 2446596 -163361 -1260798 -1936592 73862 7101878 15845791 20694047 21303215
42006 21303215 21047457 19604410 13952364 5986203 1893985 3523169 6948208 9921798
41998 9921798 13678754 16619693 14179777 7344695 3653843 6164384 8478810 5249589
41990 5249589 1031730 2830104 9168388 13336390 13867920 14744725 17048714 17148649 13142546
41981 13142546 7758989 4242928 3500532 5850029 11669156 18964090 23185329 21166402
$$ packed form
42038A4841250k550631k128402j186332j022735j409727l58931J647790K49057
42030H081339o015607r619505j629673J3647034J9775037Q773924o714389r474267
42022A6823893j40993O280684K560493l848772n493160m487279m673481m574789
42014B446596k609957j097437o75794K010454P028016Q743913M848256O09168
42006B1303215k55758j443047n652046p966161m092218J629184L425039K973590
41998I921798L756956K940939k439916o835082l690852K510541K314426l229221
41990E249589m217859J798374O338284M168002N31530Q76805K303989R9935m006103
41981A3142546n383557l516061p42396K349497N819127P294934M221239k018927
$$ plain form
41973 21166402 13934400 5044091 -2491609 -7316267 -9426758 -9723299 -9252610 -8445898
41965 -8445898 -7271404 -5818969 -4222639 -2486052 -1176833 -1801409 -5161906 -9112894
41957 -9112894 -9286657 -3336046 5875096 12807202 15383886 16834369 20015942 22049356
41949 22049356 18086032 9493145 3454576 3392578 4827823 3373513 1734252 4201460
41941 4201460 8474909 9196074 7099607 7864501 12581854 15545098 11667105 953924
41933 953924 -13744528 -27582066 -33151705 -26526441 -14604545 -8909463 -10555796 -9305229
41925 -9305229 230080 10747555 15142260 17549354 23535877 27233948 19218933 3162064
41917 3162064 -6573410 -3214831 6249032 13706387 19321490 25572526 30089239 29551161
$$ packed form
41973B1166402p232002q890309p535700m824658k110491k96541M70689Q06712
41965h445898J174494J452435J596330J736587J309219o24576l360497l950988
41957i112894j73763N950611R211142O932106K576684J450483L181573K033414
41949B2049356l963324q592887o038569o1998J435245j454310j639261K467208
41941D201460M273449P21165k096467P64894M717353K963244l877993j0713181
41933I53924j4698452j3837538n569639O625264J1921896N695082j646333J250567
41925i305229R535309J0517475M394705K407094N986523L698071q015015j6056869
41917C162064r735474L358579R463863P457355N615103O251036M516713n38078
$$ plain form
41909 29551161 25788314 23018401 21530103 17861038 10012954 231986 -6523958 -6200662
41901 -6200662 400134 6779480 6357324 -243741 -6016962 -6179444 -2651797 957351
41893 957351 4426227 8283497 10214872 8544480 6729275 9400933 15128352 17997667
41885 17997667 15842616 11641354 6533127 -2196931 -13683506 -20172061 -16198238 -6963672
41877 -6963672 -1698929 -1415660 244225 5669790 10531357 12765795 16125162 21741413
41869 21741413 23541632 17274799 8465673 5127227 6543454 5991866 1999151 -158471
41861 -158471 2742488 8022324 12225604 14648130 15322079 14294712 13291035 13724183 13192281
41852 13192281 8680186 2913858 1976685 6297118 9903016 9690243 9488058 13079460
$$ packed form
41909B9551161l762847k769913j488298l669065p848084r780968o755944L23296
41901f200662O600796O379346m22156o601065n773221j62482L527647L609148
41893I57351L468876L857270J931375j670392j815205K671658N727419K869315
41885A7997667k155051m201262n108227q730058j1486575o488555L973823R234566
41877f963672N264743K83269J659885N425565M861567K234438L359367N616251
41869B1741413J800219o266833q809126l338446J416227n51588l992715k157622
41861a58471K900959N279836M203280K422526O73949j027367j003677M33148n31902
41852A3192281m512095n766328r37173M320433L605898k12773k02185L591402
$$ plain form
41844 13079460 18757453 23070947 24912815 23820105 19370368 14299857 12798264 13795378
41836 13795378 12264510 9462977 13904023 27592192 39383788 39204619 32321821 30835712
41828 30835712 35853308 38001978 33226728 27869881 27533360 29636733 29392716 26558341
41820 26558341 23386626 20724010 18982829 19694428 23639531 29050093 32645624 31584462
41812 31584462 25410361 17868551 15080960 19215453 25490562 28012128 26350732 23509038
41804 23509038 20836372 19459350 23179948 33429539 43373361 44032892 35534085 25819503
41796 25819503 19278891 14174202 10720931 12458761 17741352 18859186 13277113 7695766
41788 7695766 6629729 5228990 -364011 -3410426 3694843 15332048 18499174 10745314
$$ packed form
41844A3079460N677993M313494J841868j092710m449737n070511j501593R97114
41836A3795378j530868k801533M441046J3688169J1791596j79169o882798j486109
41828C0835712N017596K148670m775250n356847l36521K103373k44017k834375
41820B6558341l171715k662616j741181P11599L945103N410562L595531j061162
41812C1584462o174101p541810k787591M134493O275109K521566j661396k841694
41804B3509038k672666j377022L720598J0249591R943822O59531q498807r714582
41796B5819503o540612n104689l453271J737830N282591J117834n582073n581347
41788G695766j066037j400739n593001l046415P105269J1637205L167126p753860
$$ plain form
41780 10745314 2729489 2850379 8135063 12076560 13246650 12380572 7828752 -402988
41772 -402988 -6423314 -4386307 3246034 8632914 8846079 8142847 9855293 11488017 10223612
41763 10223612 8716357 10924345 14482055 12569641 3788450 -4391090 -4213409 3525168
41755 3525168 12003918 17150342 19860486 20686061 17597636 10846480 5778629 6710208
41747 6710208 9935436 7712609 -389377 -5000823 1304020 13456132 19916624 17470353
41739 17470353 13949669 15719791 19252503 18728199 16052199 17002250 21085548 22679064
41731 22679064 20763808 19813735 20823995 19346340 14459279 12145226 15936585 20593957
41723 20593957 19862535 15250364 11866164 10010719 6695585 2142536 -1020249 -2480354
$$ packed form
41780A0745314q015825J20890N284684L941497J170090q66078m551820q231740
41772d02988o020326K037007P632341N386880K13165p03232J712446J632724j264405
41763A0223612j507255K207988L557710j912414q781191q179540J77681P738577
41755C525168Q478750N146424K710144Q25575l088425o751156n067851R31579
41747F710208L225228k222827q101986m611446O304843J2152112O460492k446271
41739A7470353l520684J770122L532712n24304k676000R50051M083298J593516
41731B2679064j915256r50073J010260j477655m887061k314053L791359M657372
41723B0593957p31422m612171l384200j855445l315134m553049l162785j460105
$$ plain form
41715 -2480354 -2748855 484258 8618436 16805823 18741489 15853054 15451655 19771204
41707 19771204 22898325 19713429 12860961 9205375 12989387 23479249 36132033 45415188
41699 45415188 49291908 51084348 54477912 57825166 56951043 52396644 49256057 50140472
41691 50140472 53003708 56120473 60326679 65239663 67677225 65607283 60417986 53997838
41683 53997838 46587716 38645111 31932271 27306242 23320020 17887863 10364538 2645494
41675 2645494 -662799 4533498 15817129 24059261 22910678 16097957 11193518 9364853
41667 9364853 7217745 5818765 9547444 16436693 18225920 11900976 4021891 1108387
41659 1108387 2106464 3272829 4600311 7581060 11032432 12912532 13454246 13981857 14824047
$$ packed form
41715b480354k68501L233113Q134178Q187387J935666k888435m01399M319549
41707A9771204L127121l184896o852468l655586L784012J0489862J2652784R283155
41699D5415188L876720J792440L393564L347254q74123m554399l140587Q84415
41691E0140472K863236L116765M206206M912984K437562k069942n189297o420148
41683E3997838p410122p942605o712840m626029l986222n432157p523325p719044
41675B645494l308293N196297J1283631Q242132j148583o812721m904439j828665
41667I364853k147108j398980L728679O889249J789227o324944p879085k913504
41659A108387R98077J166365J327482K980749L451372J880100N41714N27611Q42190
$$ plain form
41650 14824047 15505827 14773644 10859829 4888847 2464104 7007371 13111767 12768785
41642 12768785 6922179 3280447 3388366 1051019 -5417985 -9173069 -5941968 -95317
41634 -95317 3885882 7058639 9092136 5128177 -4871636 -12533933 -13244407 -13233485 -17060738
41625 -17060738 -16881459 -4334792 13416764 20872822 14097104 3456554 -1332164 460414
41617 460414 6057813 13938044 21979265 27278398 29179889 28768800 25987622 20697292
41609 20697292 15015620 11310422 10022338 12060437 19446906 30146058 36990635 36272608
41601 36272608 32804885 31891616 31709701 29096608 26967548 29283007 34206210 39235489
41593 39235489 46910868 57274404 61524587 53758630 43254604 42832541 49300581 48947520
$$ packed form
41650A4824047O81780p32183l913815n970982k424743M543267O104396l42982
41642A2768785n846606l641732J07919k337347o469004l755084L231101N846651
41634i5317L981199L172757K033497l963959r999813p662297p10474J0922l827253
41625a7060738J79279J2546667J7751556P456058o775718j0640550m788718J792578
41617D60414N597399P880231Q041221N299133J901491m11089k781178n290330
41609B0697292n681672l705198j288084K038099P386469J0699152O844577p18027
41601C6272608l467723r13269j81915k613093k129060K315459M923203N029279
41593C9235489P675379J0363536M250183p765957j0504026m22063O468040l53061
$$ plain form
41585 48947520 39810952 33727276 36293461 39839373 39288460 41039247 50414125 61588349
41577 61588349 66627940 66193186 65894252 69346080 78973856 95998503 115482083 129126415
41569 129126415 137160397 149515035 170938232 193833904 211611175 229877793 255796452
41562 255796452 283428230 299636482 300496374 292521806 280011582 260405722 232401055
41555 232401055 201167158 173453456 151932964 135678606 122982507 112582236 103994094
41548 103994094 97069705 90442285 81524370 69443675 56882879 47697337 43708193 44460199
41540 44460199 48140419 51397821 50193556 42984338 32580385 23673158 18603086 15773040
41532 15773040 12119874 7525052 6297488 12078220 21084546 24286781 18278136 9788609
$$ packed form
41585D8947520r136568o083676K566185L545912n50913J750787R374878J1174224
41577F1588349N039591m34754k98934L451828R627776J7024647J9483580J3644332
41569A29126415Q033982J2354638K1423197K2895672J7777271J8266618K5918659
41562B55796452K7631778J6208252Q59892p974568j2510224j9605860k8004667
41555B32401055l1233897k7713702k1520492j6254358j2696099j0400271q588142
41548A03994094o924389o627420q917915j2080695j2560796r185542l989144P52006
41540D4460199L680220L257402j204265p209218j0403953q907227n070072k830046
41532A5773040l653166m594822j227564N780732R006326L202235o008645q489527
$$ plain form
41524 9788609 6257803 6580882 5753782 3691152 2900774 1784075 -1597561 -2317587 5601395
41515 5601395 17900603 24109866 22192192 19659112 20190299 19255924 14284494 9395324
41507 9395324 7952582 9302160 14166655 23384534 29816799 22991822 5340100 -7228448
41499 -7228448 -5345962 3747316 10268242 14068380 16978871 15592737 10135361 9286681
41491 9286681 16557576 22042749 17895573 11934652 14097260 18752007 14497100 4491645
41483 4491645 1789623 8289117 12936923 9493015 3117424 -468233 -912021 1750042
41475 1750042 7564111 11810957 9092170 2436747 -227797 1956513 3168448 2333523
41467 2333523 4534336 10964834 16761733 19412455 20678162 19848652 13968873 5532372
$$ packed form
41524I788609l530806L23079q27100k062630p90378j116699l381636p20026P918982
41515E601395J2299208O209263j917674k533080N31187r34375m971430m889170
41507I395324j442742J349578M864495R217879O432265o824977j7651722j2568548
41499g228448J882486R093278O520926L800138K910491j386134n457376q48680
41491I286681P270895N485173m147176n960921K162608M654747m254907j0005455
41483D491645k702022O499494M647806l443908o375591l585657m43788K662063
41475A750042N814069M246846k718787o655423k664544K184310J211935q34925
41467B333523K200813O430498N796899K650722J265707q29510n879779q436501
$$ plain form
41459 5532372 1269172 2086911 2178284 -1077761 -4191061 -4866440 -4065147 -680502 7060567
41450 7060567 14687959 15415269 11456796 11268074 14606633 11814990 565503 -8549859
41442 -8549859 -7701589 -1996629 1583093 4605418 9474100 11241811 5835645 -1407436
41434 -1407436 -4070449 -4616517 -7331770 -7989760 -702452 9770038 13301094 9456122
41426 9456122 7226284 10751429 14711009 14359198 11614160 9360353 6931691 4081548
41418 4081548 3701182 6971786 9564802 6265238 -2411784 -10832753 -14654761 -14696668 -14319519
41409 -14319519 -14331723 -12171528 -6792559 -2356251 -3927223 -9725246 -11467389 -4050048
41401 -4050048 7935857 15234594 13138814 4041919 -6329406 -12388791 -10472776 -998528
$$ packed form
41459E532372m263200Q17739R1373l256045l113300o75379Q01293L384645P741069
41450G060567P627392P27310l958473j88722L338559k791643j1249487r115362
41442h549859Q48270N704960L579722L022325M868682J767711n406166p243081
41434a407436k663013n46068k715253o57990P287308J0472490L531056l844972
41426I456122k229838L525145L959580l51811k745038k253807k428662k850143
41418D081548l80366L270604K593016l299564q677022q420969l822008m1907L77149
41409a4319519j2204K160195N378969M436308j570972n798023j742143P417341
41401d050048J1985905P298737k095780r096895j0371325o059385J916015R474248
$$ plain form
41393 -998528 10737190 18052297 18346055 15050042 14022802 17578860 21869607 21136819
41385 21136819 14866288 8667458 7080093 8665665 10446658 13122535 17592457 20243879
41377 20243879 17908282 14464984 15026942 15859863 9278877 -2035587 -5972475 1943396
41369 1943396 12428438 16639000 16543784 16310170 13362999 5503145 -1239099 -760992 2796148
41360 2796148 1382584 -4759791 -9239976 -9834804 -8549226 -4945618 1897509 7248383
41352 7248383 5444153 -329490 -1255653 4501925 10200843 11459128 10786328 10233113 7543903
41343 7543903 2457248 214392 4726616 12365040 15856469 11686451 1860916 -8611911
41335 -8611911 -14221351 -11991798 -4459338 2003218 3443924 1854166 1722122 4367058
$$ packed form
41393i98528J1735718P315107K93758l296013j027240L556058M290747p32788
41385B1136819o270531o198830j587365J585572J780993K675877M469922K651422
41377B0243879k335597l443298N61958Q32921o580986j1314464l936888P915871
41369A943396J0485042M210562r5216k33614k947171p859854o742244M78107L557140
41360B796148j413564o142375m480185n94828J285578L603608O843127N350874
41352G248383j804230n773643r26163N757578N698918J258285o72800n53215k689210
41343G543903n086655k242856M512224P638424L491429m170018r825535j0472827
41335h611911n609440K229553P532460O462556J440706j589758j32044K644936
$$ plain form
41327 4367058 6680970 5159214 658726 -1866484 288473 2753748 -801862 -8777670
41319 -8777670 -11868423 -4951473 6449825 14403242 17566481 17829514 14403167 8090053
41311 8090053 6158842 14021237 24823951 26351605 17144243 7220310 3496704 3687314
41303 3687314 5236294 10407248 19157892 25167853 23619157 17180085 10586799 4675227
41295 4675227 -720013 -3301924 -1906472 612221 1702754 2619550 4754914 6659560
41287 6659560 7728967 10409357 15160597 17468737 13971728 7967578 4846962 5473314
41279 5473314 8010310 12441779 18240735 20784192 16120841 7799173 3374516 4642148
41271 4642148 6304409 4377217 1260217 1404426 5504758 10549652 13638520 14723865
$$ packed form
41327D367058K313912j521756m500488k525210K154957K465275l555610p975808
41319h777670l090753O916950J1401298P953417L163239K63033l426347o313114
41311H090053j931211P862395J0802714J527654r207362r923933l723606J90610
41303C687314J548980N170954Q750644O009961j548696o439072o593286n911572
41295D675227n395240k581911J395452K518693J090533R16796K135364J904646
41287F659560J069407K680390M751240K308140l497009o004150l120616O26352
41279E473314K536996M431469N798956K543457m663351q321668m424657J267632
41271D642148J662261j927192l117000J44209M100332N044894L088868J085345
$$ plain form
41263 14723865 16323433 20088380 23051489 19376081 7860711 -4561010 -9960530 -8180391
41255 -8180391 -4643691 -1272754 4712280 12848015 16767623 12655699 5675890 3460682
41247 3460682 5965537 6681402 2652204 -1953101 -2786062 -819308 1516871 5569883
41239 5569883 13490546 21993362 24115903 17841314 9289675 5979981 9640769 16796387
41231 16796387 23275195 26031443 23454877 17190661 12139202 11606642 13289951 12515641
41223 12515641 8373909 3990078 1725877 1115872 1093899 1428230 2023971 2996185 4954853
41214 4954853 7299341 7642902 5571258 5132900 9771535 16185589 17903767 14457878
41206 14457878 12083405 15055178 21199467 26741628 30648290 32718795 32041896 29369369
$$ packed form
41263A4723865J599568L764947K963109l675408j1515370j2421721n399520J780139
41255h180391L536700L370937N985034Q135735L919608m111924o979809k215208
41247C460682K504855P15865m029198m605305q32961J966754K336179M053012
41239E569883P920663Q502816K122541o274589q551639l309694L660788P155618
41231A6796387O478808K756248k576566o264216n051459n32560J683309p74310
41223A2515641m141732m383831k264201o10005k1973L34331N95741R72214J958668
41214D954853K344488L43561k071644m38358M638635O414054J718178l445889
41206A4457878k374473K971773O144289N542161L906662K070505o76899k672527
$$ plain form
41198 29369369 27190253 25915202 23735804 20986426 19709021 17966911 11050453 873990
41190 873990 -2837864 4591916 14932203 18041650 15485083 15891344 20575393 22274832
41182 22274832 16978134 9171727 4745987 5000548 8512392 13138830 14866763 10180592
41174 10180592 1859520 -1984131 2702864 10676143 13911255 10881337 7174708 8629052
41166 8629052 15606715 22970504 24785574 20118027 14533048 14570053 20728683 27464363
41158 27464363 29855161 28215089 26219492 26932668 31162148 37381394 42204445 42494010
41150 42494010 37887668 30447429 22189533 14642433 10276361 11368631 16410695 19968964
41142 19968964 17930217 11920931 7335046 7646306 11587782 15511232 17556094 19015653
$$ packed form
41198B9369369k179116j275051k179398k749378j277405j742110o916458j0176463
41190H73990l711854P429780J0340287L109447k556567M06261M684049J699439
41182B2274832n296698p806407m425740K54561L511844M626438J727933m686171
41174A0180592q321072l843651M686995P973279L235112l029918l706629J454344
41166H629052O977663P363789J815070m667547n584979L7005O158630O735680
41158B7464363K390798j640072j995597P13176M229480O219246M823051K89565
41150D2494010m606342p440239q257896p547100m366072J092270N042064L558269
41142A9968964k038747o009286m585885L11260L941476L923450K044862J459559
$$ plain form
41134 19015653 21755138 25318687 27784530 28757256 29272673 28921818 26364312 23522880
41126 23522880 25057934 31090091 34657375 30711264 24052482 22466945 24462867 21308518
41118 21308518 11158740 3351050 5937157 15043588 20504468 17771322 10434206 4392243
41110 4392243 3557897 8856649 17266809 22729921 21139750 14385898 8191590 6978242
41102 6978242 11514621 19244663 25389118 26080326 22334154 18999837 18582961 19071533 19384010
41093 19384010 22533837 29580769 34243982 29265939 16647027 6064615 3284109 5019313
41085 5019313 5643308 3969976 1607483 -1186014 -4912728 -8288710 -8992316 -6232823
41077 -6232823 -1142971 4743887 10450278 15354338 18430890 17709982 11403149 511969
$$ packed form
41134A9015653K739485L563549K465843R72726N15417l50855k557506k841432
41126B3522880J535054O032157L567284l946111o658782j585537J995922l154349
41118B1308518j0149778p807690K586107R106431N460880k733146p337116o041963
41110D392243q34346N298752Q410160N463112j590171o753852o194308j213348
41102F978242M536379P730042O144455O91208l746172l334317m16876M88572L12477
41093A9384010L149827P046932M663213m978043j2618912j0582412k780506J735204
41085E019313O23995j673332k362493k793497l726714l375982p03606K759493
41077f232823N089852N886858N706391M904060L076552p20908o306833j0891180
$$ plain form
41069 511969 -10655853 -17847644 -19740865 -16613273 -8934979 -71085 2752821 -4309229
41061 -4309229 -14540036 -16776520 -9208419 -917279 1685008 2642288 6910624 10464515
41053 10464515 7330898 1786473 4256769 15832708 25311820 23540766 14150835 6998771
41045 6998771 5917707 6862908 5257153 1318659 -1331907 -505604 1273519 -904795
41037 -904795 -7380178 -11442897 -7685959 -983951 -734372 -6173292 -5730022 5659419
41029 5659419 16858818 14927531 3040521 -4758729 -3047207 607891 -111535 -1741485
41021 -1741485 964981 6961856 12861711 18351067 22989206 23011492 16851810 10201899
41013 10201899 9979146 15157804 18156299 13956014 4072074 -6861572 -14407659 -15639616
$$ packed form
41069E11969j1167822p191791j893221L127592P678294Q863894K823906p062050
41061d309229j0230807k236484P568101Q291140K602287R57280M268336L553891
41053A0464515l133617n544425K470296J1575939R479112j771054r389931p152064
41045F998771j081064R45201j605755l938494k650566Q26303J779123k178314
41037i04795o475383m062719L756938O702008K49579n438920M43270J1389441
41029E659419J1199399j931287j1887010p799250J711522L655098p19426j629950
41021a741485K706466N996875N899855N489356M638139K2286o159682o649911
41013A0201899k22753N178658K998495m200285r883940j0933646p546087j231957
$$ plain form
41005 -15639616 -11630673 -8215887 -10182745 -14644105 -13996209 -5919295 3159230 5539295
40997 5539295 126338 -8188802 -14025891 -14787773 -11012102 -5827076 -2901787 -3071678
40989 -3071678 -3380945 -489155 5353099 10318295 10579938 5642162 -1253198 -5718721
40981 -5718721 -5697147 -2627096 798535 3358733 5325944 6821950 7419764 6857335 5090706
40972 5090706 2339000 71973 556101 3517546 4587339 -71140 -8063772 -12692147
40964 -12692147 -10684092 -5117861 -456153 1906659 2318533 1049550 4292 2689546
40956 2689546 9105983 13403115 10834665 5261573 4587996 8931712 9098773 -787932
40948 -787932 -13861131 -18070114 -10638348 -129647 4999029 4648668 2979835 1472342
$$ packed form
41005a5639616M008943L414786j966858m461360O47896Q076914R078525K380065
40997E539295n412957q315140n837089p61882L775671N185026K925289j69891
40989c071678l09267K891790N842254M965196K61643m937776o895360m465523
40981e718721K1574L070051L425631K560198J967211J496006N97814n62429j766629
40972E090706k751706k267027M84128K961445J069793m658479p992632m628375
40964a2692147K008055N566231M661708K362812M11874j268983j045258K685254
40956B689546O416437M297132k568450n573092o73577M343716J67061r886705
40948g87932j3073199m208983P431766J0508701N128676l50361j668833j507493
$$ plain form
40940 1472342 -380807 -1244683 117448 683129 -3778989 -11428261 -15080113 -11458515
40932 -11458515 -5239512 -1964893 -1384767 -690541 78265 118326 1577891 5676952 7793525
40923 7793525 3040258 -4302422 -4204927 5146033 13705409 12924628 6885671 5537088 11124769
40914 11124769 16992697 17732380 14803019 12015478 10122866 7519629 3477067 -1140699
40906 -1140699 -4920823 -6274884 -3788452 2128621 7929305 8953961 4291653 -1051859
40898 -1051859 -1233821 2694393 3243806 -3137668 -9402777 -6089287 5680991 15120838
40890 15120838 15555441 11039362 7838491 6153183 4147477 4086180 8349973 13265636
40882 13265636 13498391 10219424 8301848 7008353 981385 -9311005 -15924054 -14756485
$$ packed form
40940A472342j853149q63876J362131N65681m462118p649272l651852L621598
40932a1458515O219003L274619N80126O94226P68806M0061J459565M099061K116573
40923G793525m753267p342680R7495R350960Q559376p80781o038957j348583N587681
40914A1124769N867928P39683k929361k787541j892612k603237m042562m617766
40906a140699l780124j354061K486432N917073N800684J024656m662308n343512
40898a051859j81962L928214N49413o381474o265109L313490J1770278R439847
40890A5120838M34603m516079l200871j685308k005706o1297M263793M915663
40882A3265636K32755l278967j917576j293495o026968j0292390o613049J167569
$$ plain form
40874 -14756485 -11700579 -13196050 -16121822 -13039894 -4298631 1754770 204171 -4580744
40866 -4580744 -5907326 -2999452 425653 2615226 4994375 8031020 9693973 8801594
40858 8801594 7034278 5952932 4169709 -169869 -5523300 -8407156 -8027836 -6451916
40850 -6451916 -4581887 -1756852 300088 -2099092 -8138637 -11157537 -7578574 -3175814
40842 -3175814 -5244042 -11564870 -13789803 -10401308 -8507755 -11419941 -12084165 -3365127
40834 -3365127 10294899 17241859 12519949 2655461 -2844252 -1119468 3144290 4018446
40826 4018446 858037 -893196 3948335 13040118 17808286 13203425 3672610 -2678064
40818 -2678064 -3383515 -1932001 -675297 2186007 8161608 14342456 15252513 7745981
$$ packed form
40874a4756485L055906j495471k925772L081928Q741263O053401j550599m784915
40866d580744j326582K907874L425105K189573K379149L036645J662953q92379
40858H801594j767316j081346j783223m339578n353431k883856L79320J575920
40850f451916J870029K825035K056940k399180o039545l018900L578963M402760
40842c175814k068228o320828k224933L388495J893553k912186o64224Q719038
40834c365127J3660026O946960m721910r864488n499713J724784M263758Q74156
40826D018446l160409j751233M841531R091783M768168m604861r530815o350674
40818b678064p05451J451514J256704K861304N975601O180848R10057p506532
$$ plain form
40810 7745981 -5936559 -18675720 -22654516 -15388357 -2260960 8039773 10713048 7069138
40802 7069138 1230880 -3166169 -3970546 -1283807 2135738 3040580 645254 -3631534
40794 -3631534 -8476068 -12731171 -14131195 -10995592 -5172939 -575530 1338921 2063818
40786 2063818 2304754 999214 -1844206 -4930444 -8709057 -14681016 -21009414 -23408632
40778 -23408632 -21725878 -20365869 -19778617 -13567921 1244315 16306385 20875665 15572464
40770 15572464 10459523 11184446 13903426 13512133 10144809 6358213 3382660 1863576
40762 1863576 2237023 3313014 3930751 5874131 11015207 16129126 15613421 9100710 1086365
40753 1086365 -6144727 -12609011 -14785233 -8822724 -164052 752058 -4887708 -3920005
$$ packed form
40810G745981j3682540j2739161l978796P266159J3127397J0300733K673275l643910
40802G069138n838258m397049q04377K686739L419545R04842k395326m276788
40794c631534m844534m255103j400024L135603N822653M597409J914451P24897
40786B063818K40936j305540k843420l086238l778613n971959o328398k399218
40778b3408632J682754J360009N87252O210696J4812236J5062070M569280n303201
40770A5572464n112941P24923K718980l91293l367324l786596k975553j519084
40762A863576L73447J075991O17737J943380N141076N113919n15705o512711q014345
40753A086365p231092o464284k176222N962509Q658672R16110n639766R67703
$$ plain form
40745 -3920005 7099326 12963942 2466871 -12036066 -11945540 -422208 4136892 -2316120
40737 -2316120 -5641993 685358 5441984 826524 -3555662 2327652 11477521 11390257
40729 11390257 3573502 -879203 1023622 3001913 2344132 2455619 3894530 3030339
40721 3030339 22804 -345615 3141371 6258867 6711741 6641545 6302179 2039259 -6313778
40712 -6313778 -11601683 -7350609 3570930 12366068 14658177 13701164 13719419 13754026 10068684
40703 10068684 2736104 -3580701 -6043855 -7374528 -10419665 -12143404 -8193911 -1707003
40695 -1707003 -503990 -4979117 -6569211 -995961 5005284 5105333 3700470 7333583
40687 7333583 12315017 10686402 4642250 4347187 12371145 20123264 20494022 15420489
$$ packed form
40745c920005J1019331N864616j0497071j4502937R0526J1523332M559100o453012
40737b316120l325873O327351M756626m615460m382186N883314R149869q7264
40729A1390257p816755m452705J902825J978291o57781J11487J438911q64191
40721C030339l007535l68419L486986L117496M52874p0196l39366m262920q353037
40712f313778n287905M251074J0921539Q795138K292109r57013J8255L4607l685342
40703A0068684p332580o316805k463154j330673l045137j723739L949493O486908
40695a707003J203013m475127j590094N573250O001245J00049j404863L633113
40687G333583M981434j628615o044152k95063Q023958P752119L70758n073533
$$ plain form
40679 15420489 9548097 4396385 858140 363089 1392468 1099805 1536708 7097037
40671 7097037 14648322 14898820 6268069 -1744358 -3226491 -4356616 -10769070 -15549864
40663 -15549864 -9416065 3512835 10949830 10000968 8782192 11675974 13466225 9659273
40655 9659273 3566444 -457485 -4049914 -10673281 -18754986 -23196152 -21471283 -15314369
40647 -15314369 -7890807 -1465471 3057072 5746024 6642350 5256308 1772965 -2224630
40639 -2224630 -5831601 -10364762 -16319242 -19919223 -16412680 -7032751 932977 2266800
40631 2266800 -902333 -3468223 -4223389 -5843128 -9604433 -13078707 -13338207 -10641393
40623 -10641393 -7935485 -7206469 -7232194 -5410470 -1339528 2590824 4567279 6082628
$$ packed form
40679A5420489n872392n151712l538245m95051J029379k92663M36903N560329
40671G097037P551285K50498q630751q012427j482133j130125o412454m780794
40663a5549864O133799J2928900P436995r48862j218776K893782J790251l806952
40655I659273o092829m023929l592429o623367q081705m441166J724869O156914
40647a5314369P423562O425336M522543K688952Q96326j386042l483343l997595
40639b224630l606971m533161n954480l599981L506543R379929P965728J333823
40631B266800l169133k565890p55166j619739l761305l474274k59500K696814
40623a0641393K705908P29016k5725J821724M070942L930352J976455J515349
$$ plain form
40615 6082628 10033047 16574084 22278441 23824046 21805415 20095572 21063107 21944451
40607 21944451 17549460 7314709 -2374540 -5169290 -2354978 19441 297038 2234037
40599 2234037 6461996 7233040 862513 -7750930 -11454026 -9669613 -6237820 -2429477
40591 -2429477 1881024 3221705 -1895400 -9540150 -11833273 -8060268 -5429475 -7949191
40583 -7949191 -11766052 -13465784 -15336348 -18363408 -16968182 -6954543 5888047 11698773
40575 11698773 8447079 2175933 -2323487 -4813288 -4876175 -693534 6612580 12902417
40567 12902417 16532399 19162294 20120149 15790194 7156237 2030338 5038259 10014800
40559 10014800 8448747 2160557 32178 3548634 4535843 -989044 -5731876 -3030722
$$ packed form
40615F082628L950419O541037N704357J545605k018631j709843R67535Q81344
40607B1944451m394991j0234751r689249k794750K814312K374419K77597J936999
40599B234037M227959P71044o370527q613443l703096J784413L431793L808343
40591b429477M310501J340681n117105p644750k293123L773005K630793k519716
40583g949191l816861j699732j870564l027060J395226J0013639J2842590N810726
40575A1698773l251694o271146m499420k489801o2887M182641P306114O289837
40567A2902417L629982K629895R57855m329955q633957n125899L007921M976541
40559A0014800j566053o288190k128379L516456R87209n524887m742832K701154
$$ plain form
40551 -3030722 1736842 -215661 -5969119 -4499066 6057992 15228551 16066012 14179139
40543 14179139 16102653 17429507 10571747 -1184828 -6758622 -2693177 2699610 1034537
40535 1034537 -6925526 -15009632 -19019743 -18349511 -14595959 -10995899 -10478228 -12582588
40527 -12582588 -14254689 -14096488 -13361098 -12820076 -11962713 -11590246 -13479480 -16574129 -17187435
40518 -17187435 -14296864 -11054302 -9355228 -6452000 624916 10058086 17096457 18804092
40510 18804092 15128368 7793043 533525 -1777400 2727064 10336032 15126640 14233487
40502 14233487 9011518 2699383 -1736192 -2972174 -2001985 -640592 742616 2270605
40494 2270605 1906067 -2581453 -8275219 -8200971 -460478 7255352 5980858 -3723565 -12688709
$$ packed form
40551c030722M767564j952503n753458J470053J0557058R170559Q37461j886873
40543A4179139J923514J326854o857760j1756575n573794M065445N392787j665073
40535A034537p960063q084106m010111O70232L753552L600060N17671k104360
40527a2582588j672101J58201P35390N41022Q57363L72467j889234l094649o13306
40518a7187435K890571L242562J699074K903228P076916R433170P038371J707635
40510A8804092l675724p335325p259518k310925M504464P608968M790608q93153
40502A4233487n221969o312135m435575j235982R70189J361393J383208J527989
40494B270605l64538m487520n693766P4248P740493P715830j274494r704423q965144
$$ plain form
40485 -12688709 -13677322 -8120359 -2940578 -2923602 -6325167 -7421143 -3835475 -152966
40477 -152966 -1482765 -4743896 -1951764 6981635 11525525 4286320 -8446768 -15303899
40469 -15303899 -14423656 -13227276 -16682964 -22014591 -23446962 -17363815 -4952934 5902540
40461 5902540 5037230 -8016185 -20436237 -21335509 -16154531 -17073250 -23517087 -24284934
40453 -24284934 -16973965 -11033523 -10227794 -7129101 191035 1156000 -8815483 -16307522
40445 -16307522 -8735053 5311470 8915674 2501375 725331 7936350 13703691 12616708
40437 12616708 11799422 14875485 13604709 2789283 -8708580 -10904955 -7164696 -5844643
40429 -5844643 -5038170 2791637 15120020 20148600 13025894 1617841 -5291002 -7539544
$$ packed form
40485a2688709r88613N556963N179781J6976l401565j095976L585668L682509
40477a52966j329799l261131K792132Q933399M543890p239205j2733088o857131
40469a5303899Q80243J196380l455688n331627j432371O083147J2410881J0855474
40461E902540q65310j3053415j2420052q99272N180978r18719o443837p67847
40453b4284934P310969N940442Q05729L098693P320136R64965r971483p492039
40445a6307522P572469J4046523L604204o414299j776044P211019N767341j086983
40437A2616708q17286L076063j270776j0815426j1497863k196375L740259J320053
40429e844643Q06473P829807J2328383N028580p122706j1408053o908843k248542
$$ plain form
40421 -7539544 -8960692 -10006473 -8741403 -4877230 399581 5743587 8856072 7520183
40413 7520183 3269474 799582 1784118 2656123 736450 -1351882 -759910 -79798 -2976828
40404 -2976828 -6832009 -5835879 -432295 2887312 1914984 2024581 6319719 8970726 3925324
40395 3925324 -4146561 -4836365 3400017 10578368 8252066 -340161 -5569849 -2797400
40387 -2797400 4170454 8008775 3982227 -6076157 -13685529 -10659438 1105731 9758311
40379 9758311 6700313 -3419199 -10122493 -11128488 -12449437 -16390929 -18059817 -15299822
40371 -15299822 -13539514 -16092694 -16732417 -8951386 2277704 6509418 3171738 1538919
40363 1538919 5071209 5667531 -2347336 -10988443 -9014216 1224220 6144971 -812802
$$ packed form
40421g539544j421148j045781J265070L864173N276811N344006L112485j335889
40413G520183m250709k469892R84536Q72005j919673k088332N91972O80112k897030
40404b976828l855181R96130N403584L319607r72328J09597M295138K651007n045402
40395C925324q071885o89804Q236382P178351k326302q592227n229688K772449
40387b797400O967854L838321m026548j0058384p609372L026091J1765169Q652580
40379I758311l057998j0119512o703294j005995j320949l941492j668888K759995
40371a5299822J760308k553180o39723P781031J1229090M231714l337680j632819
40363A538919L532290N96322q014867q641107J974227J0238436M920751o957773
$$ plain form
40355 -812802 -11221750 -13579281 -6747264 1841160 6551167 7344537 5648072 1488491
40347 1488491 -4835716 -11226197 -14880446 -13783840 -7623773 976108 6706614 5846964
40339 5846964 1114982 -54851 6253086 15339886 18895482 14214322 6152547 5114
40331 5114 -4699080 -11517079 -20285851 -26435972 -27278759 -25669624 -25558070 -26437841 -25150505
40322 -25150505 -21465882 -17904236 -14460388 -8080789 1384549 9049199 11399670 11292963
40314 11292963 13301663 17128403 19541996 20143663 20372244 18807881 13268615 6743003
40306 6743003 4872770 6947398 5810686 -1339414 -8040739 -7308699 44023 8852987
40298 8852987 15758277 18182299 13356023 3956065 -872449 2935295 6696698 1115365
$$ packed form
40355h12802j0408948k357531O832017Q588424M710007P93370j696465m159581
40347A488491o324207o390481l654249J096606O160067Q599881N730506q59650
40339E846964m731982j169833O307937R086800L555596m681160q061775o147433
40331E114m704194o817999q768772o150121q42787J609135J11554q79771J287336
40322b5150505L684623L561646L443848O379599R465338P664650K350471j06707
40314A1292963K008700L826740K413593O01667K28581j564363n539266o525612
40306F743003j870233K074628j136712p150100o701325P32040P352722Q808964
40298H852987O905290K424022m826276r399958m828514L807744L761403n581333
$$ plain form
40290 1115365 -8228286 -7938253 2917679 11430326 10092127 4956206 1546646 -4392079
40282 -4392079 -15095453 -21313547 -15370944 -5788635 -6750274 -17330325 -23218887 -17395805
40274 -17395805 -7480621 -1910307 275262 2845599 4862507 4629907 4663657 7844559
40266 7844559 12888058 17065583 19396441 18481602 11919374 1353329 -6208809 -6135325
40258 -6135325 -1895872 548343 697707 1804227 4092432 4316736 761533 -4902912
40250 -4902912 -9853582 -11837366 -10311131 -8048732 -9454777 -14939824 -19272736 -17711236
40242 -17711236 -11084196 -3004719 3796443 5772581 -1090302 -14161169 -22676027 -20168070
40234 -20168070 -13943882 -14141137 -17598746 -13439920 -2732688 507976 -9613652 -21184842
$$ packed form
40290A115365r343651K90033J0855932Q512647j338199n135921l409560n938725
40282d392079j0703374o218094N942603R582309r61639j0580051n888562N823082
40274a7395805R915184N570314K185569K570337K016908k32600L3750L180902
40266G844559N043499M177525K330858r14839o562228j0566045p562138P3484
40258f135325M239453K444215J49364J106520K288205K24304l555203n664445
40250d902912m950670j983784J526235K262399j406045n485047m332912J561500
40242a7711236O627040Q079477O801162J976138o862883j3070867q514858K507957
40234b0168070O224188j97255l457609M158826J0707232L240664j0121628j1571190
$$ plain form
40226 -21184842 -21845228 -15616224 -14130214 -18675951 -20664829 -15613744 -7299650 55454
40218 55454 5452784 7565591 4923133 326920 -984404 1177711 1143863 -4690205 -13200593
40209 -13200593 -19013236 -20193042 -18291545 -15648322 -13910646 -13288869 -12615134 -11283267
40201 -11283267 -10335037 -10088702 -8693170 -5853699 -5587924 -10774128 -16610026 -15211508
40193 -15211508 -6600456 684285 915038 -2465264 -3549147 -1520611 1288819 3925467
40185 3925467 5718749 4678071 889264 -1847162 -1686726 -2803969 -9265069 -17622823
40177 -17622823 -21017240 -19119610 -18273560 -21685363 -24672954 -21127912 -10995790 238578
40169 238578 6857409 6616361 1606192 -3440296 -5490541 -6326390 -9415222 -13820884 -14283578
$$ packed form
40226b1184842o60386O229004J486010m545737j988878N051085Q314094P355104
40218E5454N397330K112807k642458m596213j311324K162115l3848n834068q510388
40209a3200593n812643j179806J901497K643223J737676O21777O73735J331867
40201a1283267R48230K46335J395532K839471K65775n186204n835898J398518
40193a5211508Q611052P284741K30753l380302j083883K028536K809430K636648
40185C925467J793282j040678l788807k736426J60436j117243o461100q357754
40177a7622823l394417J897630Q46050l411803k987591L545042J0132122J1234368
40169B38578O618831k41048n010169n046488k050245q35849l088832m405662m62694
$$ plain form
40160 -14283578 -8245117 99651 4321463 2167194 -3728447 -9027902 -9967337 -5078226
40152 -5078226 2848760 8311627 9007915 8551896 10892993 14172632 13776632 9881718 7039479
40143 7039479 6378284 3812444 -2060592 -5612151 -1819145 5549897 8621306 6115822
40135 6115822 3548576 3444795 1820453 -4065784 -10460815 -12950431 -12569708 -11592196 -7542520
40126 -7542520 2134526 11685821 11002959 -920919 -12686117 -13260707 -3570636 7165510
40118 7165510 12209140 10940863 5793421 578987 -268180 4065736 7801245 4259043
40110 4259043 -5286290 -12420584 -11959028 -7701528 -6248939 -8344047 -9049397 -4861192
40102 -4861192 2027278 6492392 6072711 3346983 2821933 5643369 8551244 9034348 9743995
$$ packed form
40160a4283578O038461Q344768M221812k154269n895641n299455r39435M889111
40152e078226P926986N462867O96288m56019K341097L279639l96000l894914k842239
40143G039479o61195k565840n873036l551559L793006P369042L071409k505484
40135F115822k567246j03781j624342n886237o395031k489616L80723R77512M049676
40126g542520R677046R551295o82862j1923878j1765198n74590R690071J0736146
40118G165510N043630j268277n147442n214434q47167M333916L735509l542202
40110D259043r545333p134294M61556M257500J452589k095108p05350M188205
40102d861192O888470M465114m19681k725728n25050K821436K907875M83104P09647
$$ plain form
40093 9743995 14857653 22709364 26084526 21303879 13680334 11282983 15339739 19694701
40085 19694701 18666317 12632109 6060507 2463054 1985745 2667966 3169440 3990639 5651922
40076 5651922 6508809 4540612 1309005 801054 2919246 2074798 -4396581 -10121358 -7438859
40067 -7438859 959872 4967417 1359061 -2434764 -861169 1328458 -1708109 -5765304
40059 -5765304 -2551375 6448641 10593299 4567829 -5021463 -9227855 -7008528 -3302941
40051 -3302941 -1698364 -2345060 -3860194 -4152122 -1611682 2123441 2684761 -1908287 -8949231
40042 -8949231 -15141100 -19553382 -20780076 -16008441 -6742884 -763377 -2596140 -5687282
40034 -5687282 -1374796 6649275 5802311 -7129659 -20456139 -23302565 -18290930 -13423737
$$ packed form
40093I743995N113658P851711L375162m780647p623545k397351M056756M354962
40085A9694701j028384o034208o571602l597453m77309O82221N01474Q21199J661283
40076E651922Q56887j968197l231607n07951K118192q44448o471379n724777K682499
40067g438859Q398731M007545l608356l793825J573595K189627l036567m057195
40059e765304L213929R000016M144658o025470r589292m206392K219327L705587
40051c302941J604577o46696j515134k91928K540440L735123N61320m593048p040944
40042h949231o191869m412282j226694M771635R265557N979507j832763l091142
40034e687282M312486Q024071q46964j2931970j3326480k846426N011635M867193
$$ plain form
40026 -13423737 -9296772 -2559396 3289416 749368 -9297578 -17165839 -17281844 -13677925
40018 -13677925 -10695127 -6083520 2437746 10366557 12329730 10532656 10578396 11395105
40010 11395105 6880847 -2398176 -6674747 626168 13132627 18660111 13271508 3762861
40002 3762861 -2373302 -4630589 -6727170 -10532196 -15087159 -19045043 -21216069 -19923453
39994 -19923453 -14702698 -8574202 -6071092 -8043525 -10040965 -7037239 1104241 9714126
39986 9714126 14036094 13013500 9197075 6110300 5467569 6060022 5453668 3304757 2373660
39977 2373660 5109360 9561408 10383081 4724686 -3884663 -8900219 -8128783 -6645188
39969 -6645188 -11130854 -21231400 -28195871 -24016766 -11505500 -2643023 -5739169 -16446685
$$ packed form
40026a3423737M126965O737376N848812k540048j0046946p868261j16005L603919
40018a3677925K982798M611607Q521266P928811J963173j797074M5740Q16709
40010A1395105m514258r279023m276571P300915J2506459N527484n388603r508647
40002C762861o136163k257287k096581l805026m554963l957884k171026J292616
39994a9923453N220755O128496K503110j972433j997440L003726Q141480Q609885
39986I714126M321968j022594l816425l086775o42731N92453o06354k148911r31097
39977B373660K735700M452048Q21673n658395q609349n015556P71436J483595
39969f645188m485666j0100546o964471M179105J2511266Q862477l096146j0707516
$$ [...]
##END NTUPLES=NMR SPECTRUM
##END=
