##TITLE=31Pdec_LR-698-R2-C1_K1
 CDCl3, 124 sc
 28.1.2020
##JCAMPDX= 6.0         $$ Bruker NMR JCAMP-DX V2.0
##DATA TYPE= NMR SPECTRUM
##DATA CLASS= NTUPLES
##ORIGIN= UXNMR, Bruker Analytische Messtechnik GmbH
##OWNER= root
$$ XWIN-NMR		Version 3.5
$$ Tue Jan 28 15:17:28 2020 Russian Standard Time (UT+4h)  she@DPX200
##.OBSERVE FREQUENCY= 81.013821
##.OBSERVE NUCLEUS= ^31P
##.ACQUISITION MODE= SIMULTANEOUS
##.ACQUISITION SCHEME= undefined
##.AVERAGES= 124
##.DIGITISER RES= 17
##SPECTROMETER/DATA SYSTEM= spect
##.PULSE SEQUENCE= zgpg30
##.SOLVENT NAME= CDCl3
##.SHIFT REFERENCE= (INTERNAL, CDCl3, 0, 182.463)
##AUDIT TRAIL= $$ (NUMBER, WHEN, WHO, WHERE, WHAT)
$$ ##TITLE= Audit trail, XWIN-NMR		Version 3.5
$$ ##JCAMPDX= 5.01
$$ ##ORIGIN= Bruker BioSpin GmbH
$$ ##OWNER= she
$$ F:/spectra/data/she/nmr/P31/1/pdata/1/auditp.txt
$$ ##AUDIT TRAIL=  $$ (NUMBER, WHEN, WHO, WHERE, WHAT)
(   1,<2020-01-28 14:53:49.26 +0400>,<she>,<DPX200>,
      <continue with go, POWCHK disabled, PULCHK disabled
       configuration hash MD5:
       00 E9 B6 7A A2 85 ED C7 34 08 36 98 17 FE 4E 26
       data hash MD5: 32K
       A2 7B 7D 8A 94 B1 14 77 0D 1E A5 5D 61 FC B5 B2>)
(   2,<2020-01-28 15:16:20.04 +0400>,<she>,<DPX200>,
      <Start of raw data processing
       efp BC_mod = 2 LB = 1 FT_mod = 6 PKNL = 1 PHC0 = -1702.466 PHC1 = 258.6012 SI = 64K 
       data hash MD5: 64K
       9D E9 5F F2 7D 58 A8 40 3A 19 64 31 C8 BF DA DC>)
(   3,<2020-01-28 15:16:50.04 +0400>,<she>,<DPX200>,
      <pk PHC0 = 4.573051 PHC1 = -119.5999 
       data hash MD5: 64K
       50 6D 74 5C 57 C6 23 D9 92 4D 40 3F EE F8 8A C3>)
(   4,<2020-01-28 15:16:53.73 +0400>,<she>,<DPX200>,
      <abs ABSG = 5 
       data hash MD5: 64K
       F7 17 FA BB E5 94 B3 4F 37 5B B2 19 3C D2 AB 3F>)
$$ ##END=
$$ 
$$ hash MD5
$$ 4B 9C F4 06 A8 95 95 22 A2 B3 E8 E4 EA 2A 4D CC
##$RELAX= 
##$RELAX= 
##$RELAX= 
##$RELAX= 
##$RELAX= 
##$RELAX= 
##$RELAX= 
##$RELAX= 
$$ Bruker specific parameters
$$ --------------------------
##$DU= <F:/spectra>
##$EXPNO= 1
##$NAME= <P31>
##$PROCNO= 1
##$TYPE= <nmr>
##$USER= <she>
##$AMP= (0..31)
100 100 100 100 100 100 100 100 100 100 100 100 100 100 100 100 100 100 
100 100 100 100 100 100 100 100 100 100 100 100 100 100 
##$AQSEQ= 0
##$AQ_mod= 1
##$AUNM= <au_zg>
##$AUTOPOS= <>
##$BF1= 81.014009
##$BF2= 200.13
##$BF3= 200.13
##$BF4= 200.13
##$BF5= 200.13
##$BF6= 200.13
##$BF7= 200.13
##$BF8= 200.13
##$BYTORDA= 1
##$CFDGTYP= 0
##$CFRGTYP= 5
##$CHEMSTR= <none>
##$CNST= (0..31)
1 1 145 1 1 1 1 1 1 1 1 1 1 1 1 1 1 1 1 1 1 1 1 1 1 1 1 1 1 1 1 1 
##$CPDPRG= <waltz16>
##$CPDPRG1= <>
##$CPDPRG2= <waltz16>
##$CPDPRG3= <>
##$CPDPRG4= <mlev>
##$CPDPRG5= <mlev>
##$CPDPRG6= <mlev>
##$CPDPRG7= <mlev>
##$CPDPRG8= <mlev>
##$CPDPRGB= <>
##$CPDPRGT= <>
##$D= (0..31)
0 1 0 0 0 0 0 0 0 0 0 0.03 2e-05 3e-06 0 0 0 0 0 0 0 0 0 0 0 0 0 0 0 0 
0 0 
##$DATE= 1580208652
##$DBL= (0..7)
120 120 120 11 120 120 24 19 
##$DBP= (0..7)
150 150 150 150 150 150 150 150 
##$DBP07= 0
##$DBPNAM0= <>
##$DBPNAM1= <>
$$ [...]
##$SUBNAM3= <"">
##$SUBNAM4= <"">
##$SUBNAM5= <"">
##$SUBNAM6= <"">
##$SUBNAM7= <"">
##$SUBNAM8= <"">
##$SUBNAM9= <"">
##$SW= 369.568048894756
##$SWIBOX= (0..15)
0 1 3 0 0 0 0 0 0 0 0 0 0 0 0 0 
##$SW_h= 29940.119760479
##$TD= 32768
##$TD0= 1
##$TE= 0
##$TE2= 300
##$TE3= 300
##$TEG= 300
##$TL= (0..7)
0 120 53 12 22 120 120 120 
##$TP= (0..7)
150 150 150 150 150 150 150 150 
##$TP07= 0
##$TPNAME0= <>
##$TPNAME1= <>
##$TPNAME2= <>
##$TPNAME3= <>
##$TPNAME4= <>
##$TPNAME5= <>
##$TPNAME6= <>
##$TPNAME7= <>
##$TPOAL= (0..7)
0.5 0.5 0.5 0.5 0.5 0.5 0.5 0.5 
##$TPOFFS= (0..7)
0 0 0 0 0 0 0 0 
##$TUNHIN= 0
##$TUNHOUT= 0
##$TUNXOUT= 0
##$USERA1= <user>
##$USERA2= <user>
##$USERA3= <user>
##$USERA4= <user>
##$USERA5= <user>
##$V9= 5
##$VALIST= <valist>
##$VCLIST= <CCCCCCCCCCCCCCC>
##$VD= 0
##$VDLIST= <DDDDDDDDDDDDDDD>
##$VPLIST= <PPPPPPPPPPPPPPP>
##$VTLIST= <TTTTTTTTTTTTTTT>
##$WBST= 1024
##$WBSW= 4
##$XGAIN= (0..3)
0 0 0 0 
##$XL= 0
##$YL= 0
##$YMAX_a= 31611
##$YMIN_a= -14724
##$ZGOPTNS= <>
##$ZL1= 120
##$ZL2= 120
##$ZL3= 120
##$ZL4= 120
##$ABSF1= 182.463
##$ABSF2= -187.1042
##$ABSG= 5
##$ABSL= 3
##$ALPHA= 0
##$AQORDER= 0
##$ASSFAC= 0
##$ASSFACI= 0
##$ASSFACX= 0
##$ASSWID= 0
##$AUNMP= <proc_1d>
##$AZFE= 0.1
##$AZFW= 0.5
##$BCFW= 0
##$BC_mod= 2
##$BYTORDP= 0
##$COROFFS= 0
##$CY= -3
##$DATMOD= 1
##$DC= 0
##$DFILT= <>
##$DTYPP= 0
##$F1P= 0
##$F2P= 0
##$FCOR= 1
##$FTSIZE= 65536
##$FT_mod= 6
##$GAMMA= 0
##$GB= 0
##$INTBC= 1
##$INTSCL= 5.30512e-09
##$ISEN= 30
##$LB= 1
##$LEV0= 0
##$LPBIN= 0
##$MAXI= 10000
##$MC2= 0
##$MEAN= 0
##$ME_mod= 0
##$MI= 50
##$NCOEF= 0
##$NC_proc= -8
##$NLEV= 6
##$NOISF1= 182.463
##$NOISF2= 159.3651
##$NSP= 0
##$NTH_PI= 0
##$NZP= 0
##$OFFSET= 182.463
##$PC= 4
##$PHC0= -1697.893
##$PHC1= 139.0013
##$PH_mod= 1
##$PKNL= yes
##$PPARMOD= 0
##$PSCAL= 0
##$PSIGN= 0
##$REVERSE= no
##$SF= 81.0140089999434
##$SI= 65536
##$SIGF1= 159.3651
##$SIGF2= -187.1042
##$SINO= 113.3802
##$SIOLD= 16384
##$SREGLST= <1H.CDCl3>
##$SSB= 0
##$STSI= 65536
##$STSR= 0
##$SW_p= 29940.119760479
##$SYMM= 0
##$S_DEV= 0
##$TDeff= 32768
##$TDoff= 0
##$TI= <>
##$TILT= no
##$TM1= 0
##$TM2= 0
##$TOPLEV= 0
##$USERP1= <user>
##$USERP2= <user>
##$USERP3= <user>
##$USERP4= <user>
##$USERP5= <user>
##$WDW= 1
##$XDIM= 65536
##$YMAX_p= 324718749
##$YMIN_p= -244534687
$$ End of Bruker specific parameters
$$ ---------------------------------
##NTUPLES= NMR SPECTRUM
##VAR_NAME=  FREQUENCY,     SPECTRUM/REAL,   SPECTRUM/IMAG
##SYMBOL=    X,             R,               I
##VAR_TYPE=  INDEPENDENT,   DEPENDENT,       DEPENDENT
##VAR_FORM=  AFFN,          ASDF,            ASDF
##VAR_DIM=   65536,         65536,           65536
##UNITS=     HZ,            ARBITRARY UNITS, ARBITRARY UNITS
##FACTOR=    0.456856943014862, 1,           1
##FIRST=     14782.0589164792, 0,            0
##LAST=      -15158.0608439998, 0,           0
##MIN=       -15158.0608439998, -244534687,  0
##MAX=       14782.0589164792, 324718749,    0
$$ Real data points
##PAGE= N=1
##DATA TABLE= (X++(R..R)), XYDATA
$$ [...]
4088b0855305m751490J3375459K4229651J9955931Q401486J432567K42690k850495
4080C9180494j0673200j6195466j3245168o240380l207411k597331L702463J3950772
4072D674773J4393651r56882j8329735k0959276j0226462K16118M660415P213619
4064a9313779Q463076M737745q59564l19449O084862J0107643Q378468L676107
4056B0955109l970903j4073901j7121808n938554P071672L841035r253566q374331
4048b6865247Q838859J7839923P424969k902372J640328O711016j402802q248215
4040C036459J728402J3057953L538980j6281759j9315098n717461J669622k170080
4032b0452982j533357N717913M384581n707401n675992P659249J2761113o29319
$$ plain form
4088 -20855305 -25606795 -12231336 11998315 31954246 40355732 41788299 42030989 39180494
4080 39180494 28507294 12311828 -933340 -7173720 -10381131 -12978462 -9275999 4674773
4072 4674773 19068424 18111542 -218193 -21177469 -31403931 -31187813 -26527398 -19313779
4064 -19313779 -10850703 -6112958 -6972522 -7291971 -1207109 8900534 17279002 20955109
4056 20955109 16984206 2910305 -14211503 -20150057 -13078385 -9237350 -18490916 -26865247
4048 -26865247 -18026388 -186465 7238504 4336132 5976460 12687476 11284674 3036459
4040 3036459 4764861 17822814 21361794 5080035 -14235063 -19952524 -18282902 -20452982
4032 -20452982 -21986339 -16268426 -11883845 -17591246 -23267238 -15607989 -2846876 -3476195
4024c476195j3123165o580218R132750J4698290P940081k252074j2289630k0088217
4016b6038378j8526533n966170P458349J3872032J6453331J6787045Q724774n467452
4008G296998r562979K915221J4907955J0603573o54946k106787K609690o38756
4000B5369969r780030j1901689q076385r924984j5095804r533478N353863J0554270
3992b3034268o57904j1012151n611662P177726J1643632P531404M639875M732806
3984d590542K031468l722425o491092m006003N37617N287373J0010434J0655341
3976I712171K503903j0018859j5119852q826049r61797k74323o74914P958342
3968a5701378J9823435J8235339K067506q526226j053864R120159K079005j4375357
$$ plain form
4024 -3476195 -16599360 -23179578 -14046828 651462 8591543 6339469 -5950161 -26038378
4016 -26038378 -44564911 -50531081 -43072732 -29200700 -12747369 4039676 12764450 7296998
4008 7296998 -2265981 649240 15557195 26160768 25505822 23399035 26008725 25369969
4000 25369969 15589939 3688250 -4388135 -14313119 -29408923 -38942401 -33588538 -23034268
3992 -23034268 -23692172 -34704323 -40315985 -33138259 -21494627 -13963223 -9323348 -4590542
3984 -4590542 -2559074 -6281499 -12772591 -16778594 -16240977 -10953604 -943170 9712171
3976 9712171 12216074 2197215 -12922637 -21748686 -22710483 -22984806 -23659720 -15701378
3968 -15701378 4122057 22357396 24424902 15898676 14844812 23964971 26043976 11668619
3960A1668619j6141664j230321P218397j396102q978284l53905J0810713M506999
3952F104452j3212292k0312799j1507203q53359L251451O325099J1905683J4599420
3944c699548J1408009O598257K710720k106730o051865l921004K318390L561951
3936A0818180k739255q078109n531099R63010L422191m24499o748635r587361
3928a7905577m255612P313600J4582934Q746938m708568j1424711o736736m14344
3920a4802076j190230n353668m560478K036629P959249P236392o24287r675190
3912a8973659j0812258r00635J1174021J3284439N024875k401008j401024L860524
3904a144725N240338k22860r420312j4867456q221845R442779K1870559J3043141
$$ plain form
3960 11668619 -4473045 -5703366 1515031 118929 -8859355 -9213260 1597453 6104452
3952 6104452 -7107840 -27420639 -38927842 -39781201 -36529750 -30204651 -18298968 -3699548
3944 -3699548 7708461 14306718 17017438 14910708 8858843 4937839 7256229 10818180
3936 10818180 8078925 816 -5530283 -4567273 -1145082 -1569581 -8318216 -17905577
3928 -17905577 -22161189 -14847589 -264655 8482283 3773715 -7650996 -14387732 -14802076
3920 -14802076 -15992306 -21345974 -25906452 -23869823 -15910574 -8674182 -9298469 -18973659
3912 -18973659 -29785917 -30686552 -19512531 -6228092 -1203217 -3604225 -5005249 -1144725
3904 -1144725 4095613 3872753 -5547559 -20415015 -28636860 -19194081 2676478 15719619
3896A5719619j0562913k4610170j6331556K345891J4320806J6576312J3862212
3889A1320201O936026k680187p175879l442774j223464q335054j4948485o127569
3881b5677185J4284225K6195014J8854361J928785r785060j2130850r775440p534942
3873c641092p404520q530391p011711M16179J0601717J5198490R498409j774294
3865G352787q489572m641005N247039R445433J586271j0211138j1722468j015319
3857a2447972Q399385N821420k992994o065849j776233K667198L538437K312613
3849e43995p49845n248852n805554J610822J0121685Q488348l067218j2700751
3841g895360j2764683o902621r63037L639957N760862L152596j439929j061519
$$ plain form
3896 15719619 5156706 -19453464 -35785020 -33439129 -19118323 -2542011 11320201
3889 11320201 18256227 15576040 8400161 4957387 3733923 -4601131 -19549616 -25677185
3881 -25677185 -11392960 14802054 33656415 35585200 25800140 13669290 3893850 -3641092
3873 -3641092 -11045612 -19576003 -26587714 -26171535 -15569818 -371328 9127081 7352787
3865 7352787 -1136785 -5777790 -530751 8914682 10500953 289815 -11432653 -12447972
3857 -12447972 -4048587 1772833 -1220161 -7286010 -9062243 -6395045 -2856608 -543995
3849 -543995 -1293840 -6542692 -12348246 -10737424 -615739 7872609 4805391 -7895360
3841 -7895360 -20660043 -27562664 -28525701 -24885744 -19124882 -15972286 -17412215 -18473734
3833a8473734M824525P992909L656672k410306l601082k041561k438864k821173
3825a5312614J070787O582343P239190K701043j494832k661191k523976q75505
3817e274755M666607J1224141J0472159Q7166r984908q528434K316231R417304
3809A4395511N057799m903971j0459722r162000m943535l09444M431248P064570
3801A170456N553588L474955O319176J1577198R788410j860502j3642978j5049106
3793G331197o986008J995476O450324O258227L071928l8137L11983K015066k211555
3784A8198501j3120014j9742113j3534141j461391M739252O139281J0568558J3879166
3776E667099M396213j3799814k0407111p279783R415365J4072992J2473745J4683784
$$ plain form
3833 -18473734 -13649209 -5656300 -1999628 -4409934 -8011016 -10052577 -12491441 -15312614
3825 -15312614 -14241827 -7659484 -420294 2280749 785917 -1875274 -4399250 -5274755
3817 -5274755 -608148 10615993 21088152 21175318 11190410 2661976 4978207 14395511
3809 14395511 19453310 14549339 4089617 -5072383 -10015918 -10325362 -5894114 1170456
3801 1170456 6724044 10198999 16518175 28095373 37883783 36023281 22380303 7331197
3793 7331197 345189 2340665 8790989 15049216 18121144 18083007 18394990 20410056 18198501
3784 18198501 5078487 -14663626 -28197767 -29659158 -24919906 -18780625 -8212067 5667099
3776 5667099 10063312 -3736502 -24143613 -31423396 -22008031 -7935039 4538706 19222490
3768A9222490J2242148p237540l0772225k9442513P46119K8452844K6180007L776933
3760B3168263r341234l237890P155047R166030O661403N728240K263774p976452
3752C3587181j7408777j5254673l313367O217469O553136K032236o84637O20814
3744A2349382N430870J1227856J1874661K968840r657370j4518329r767884n710784
3736D197242q714717j1588422n819423M652332R617987O566390O79306m176240
3728d585545o675470m596655J967765P399901P337128M408298J058994o071454
3720B42962j5478745j3287066Q656843L2480614L0547585K821174j9713640j4378464
3712A1891263N666420J1916412l024152k0287646j9941290k029620J5868713J7137058
$$ plain form
3768 19222490 31464638 24227098 -6545127 -35987640 -35241521 -6788677 19391330 23168263
3760 23168263 13827029 10589139 17744186 26910216 33571619 39299859 41563633 33587181
3752 33587181 16178404 923731 -2389636 3827833 10380969 12413205 11728568 12349382
3744 12349382 17780252 29008108 40882769 43851609 34194239 19675910 9908026 4197242
3736 4197242 -4517475 -16105897 -21925320 -17272988 -7655001 -1088611 -409305 -4585545
3728 -4585545 -11261015 -15857670 -13889905 -6490004 847124 5255422 6314416 242962
3720 242962 -15235783 -28522849 -19866006 12614608 43162193 45983367 26269727 11891263
3712 11891263 17557683 29474095 26449943 6162297 -13778993 -15808613 60100 17197158
3704A7197158K644308j0797283j0166955p97975M130218K781831K425707K503000
3696I920009m386097j4685253j4349077j358536Q810498P199356M728177J1597488
3688G476565J8301177J0735908o855143j8293664j7181041r409251m92858P183528
3680h534779R535673M827253r51308j860402o70937j903596k894550o50717J53960
3671b949403l566221m175951M358724J2773535R245796o71184k406038M114048
3663A6723306N823062j165412p144060o316146l281461j478526M22420Q3952n954638
3654b287503j0516668k017889J5204455K2233838J1329847m054529r727376p192706
3646A2971469l975918j256969J452750J184118j297489M80753O648468P207967
$$ plain form
3704 17197158 19841466 9044183 -1122772 -1920747 2209471 4991302 7417009 9920009
3696 9920009 5533912 -9151341 -23500418 -24858954 -16048456 -8849100 -4120923 7476565
3688 7476565 25777742 36513650 29658507 11364843 -5816198 -15225449 -15718307 -8534779
3680 -8534779 1000894 5828147 4876839 3016437 2345500 441904 -2452646 -3103363 -2949403
3671 -2949403 -6515624 -10691575 -6332851 6440684 15686480 15015296 12609258 16723306
3663 16723306 22546368 21380956 14236896 7920750 4639289 3160763 3583183 3667135 -2287503
3654 -2287503 -12804171 -14822060 382395 22616233 33946080 29891551 20164175 12971469
3646 12971469 8995551 7738582 9191332 10375450 9077961 9558714 16207182 23415149
3638B3415149k740156j3704280j4536693n373707P565144J9434449K3414094J2787827
3630E0261827n456276j2162720j462964Q177212P54768j2529129j1659299J69139
3622A6092558L239400o356347j2953164q692747l394568l879747l111999L103904
3614a5952710N905322k98662n781087j679313L734722r49971q989068m689684
3606b8700451J0448851J8244508J1225431K744610M293408Q068927K588296o624534
3598B2289046o860101j336384m866526j7953726k3415071j2926744K13717L485785
3590d1370004M508532J4362002K4309067J7641295j971020j3595232r022875j015957
3582f154192J50026M4078M430186P186267L177145m02835L508979Q578781N607869
$$ plain form
3638 23415149 20674993 6970713 -7565980 -12939687 -5374543 14059906 37474000 50261827
3630 50261827 44805551 32642831 31179867 39357079 40111847 27582718 15923419 16092558
3622 16092558 19331958 12975611 22447 -8670300 -12064868 -15944615 -19056614 -15952710
3614 -15952710 -10047388 -10346050 -16127137 -17806450 -14071728 -15021699 -24010767 -28700451
3606 -28700451 -18251600 -7092 11218339 13962949 18256357 26325284 28913580 22289046
3598 22289046 15428945 14092561 9226035 -8727691 -32142762 -45069506 -44855789 -41370004
3590 -41370004 -36861472 -22499470 1809597 19450892 17479872 3884640 -5138235 -6154192
3582 -6154192 -6004166 -5960088 -1529902 5656365 8833510 8430675 11939654 20518435 26126304
3573B6126304j846405l763206M50379L157775J076474l268154q703413j4076931
3565h47177j2926766q2558J7155499K3908739J4968888K53825p864240o929851
3557B7636359l235925l118622o945609r509925o323124o9029K004969j646084
3549a206990l879529P99366P577055P266692k449124j4912693k0160892j1306685
3541c8272800Q625170K4373986K1411204M658810n843947k740773j550037j3852770
3533c191157k5222569j6517347M168393J2482529N128505K256470J1998724J7185682
3525H289230N309303r923661j0464935p32464L840892L142162Q370679J7544594
3517B5375800J4748764m255654k1789445k0684035o350594K503743q93422n628598
$$ plain form
3573 26126304 24279899 20516693 20967072 24124847 25201321 21933167 13229754 -847177
3565 -847177 -13773943 -13856501 3298998 27207737 42176625 42430450 34566210 27636359
3557 27636359 24400434 21281812 14336203 4826278 -1496846 -1565875 439094 -1206990
3549 -1206990 -5086519 -4287153 3289902 10556594 8107470 -6805223 -26966115 -38272800
3541 -38272800 -29647630 -5273644 16137560 20796370 14952423 12211650 10661613 -3191157
3533 -3191157 -28413726 -44931073 -40762680 -28280151 -23151646 -20895176 -8896452 8289230
3525 8289230 13598533 3674872 -6790063 -7522527 -3681635 -539473 7831206 25375800
3517 25375800 40124564 35868910 14079465 -6604570 -12955164 -10451421 -11344843 -16973441
3509a6973441j486626P034057R746782O760216O748373J1540468J2539713M897596
3501D0807138m193499p138422p539401j1506176j4373689q236839J105524m32614
3493a1507978j1751264j3821466K766204K0438572J6476440n664516k0544649
3486b3608657j3818504K379715R613799O466321L829538N299553M393259n98014
3478f042990j905178L133834L785501q212081k1761058j8375627J286374J6661493
3470c1429732J4777677M956127J050372K349382J343618n21022K772673Q408458
3462C707553Q045745J157009n014032n956480k028512N507888J1799364P514292
3454B4732827q298504j9830815j2271288N771160J2211302J898986q869395q858849
$$ plain form
3509 -16973441 -18460067 -11426010 -1679228 5080988 11829361 23369829 35909542 40807138
3501 40807138 36613639 29475217 21935816 10429640 -3944049 -12180888 -11075364 -11507978
3493 -11507978 -23259242 -37080708 -34314504 -13875932 2600508 -3064008 -23608657
3486 -23608657 -37427161 -35047446 -25433647 -18967326 -15137788 -9838235 -5444976 -6042990
3478 -6042990 -7948168 -4814334 -1028833 -9240914 -31001972 -49377599 -48091225 -31429732
3470 -31429732 -16652055 -11695928 -10645556 -8296174 -6952556 -7473578 -4700905 3707553
3462 3707553 11753298 12910307 7896275 1939795 -88717 5419171 17218535 24732827
3454 24732827 16434323 -3396492 -15667780 -9896620 2314682 4213668 -4655727 -13514576
3446a3514576n827793q788268j1697865m503244R336395J6419970J0545157l1341
3438h061565j540354J0056419K1739819J5842567n966334j9631788r548741P493019
3430A0383042N909489r536735j2077494K513837Q877439m430365j4329390j613507
3422a4303684J5960298J1442231r713283k1492986j7558868j1997445p029833
3415e4693570J0299459L6862903M5668220K0748748j7546770l5236072k2917874
3408a6814956k12385J1721689J0568249O316462M294322J191540m816395q209872
3400D038654m545574R90539Q77032k572745j788032J758326k38394o852210p943330
3391a6275734k070803Q78721j097926K563631J3214141J4905431O992j4322336
$$ plain form
3446 -13514576 -19342369 -28130637 -39828502 -44331746 -34995351 -18575381 -8030224 -8061565
3438 -8061565 -9601919 454500 22194319 38036886 32070552 12438764 2890023 10383042
3430 10383042 16292531 6755796 -5321698 -2807861 6069578 1639213 -12690177 -14303684
3422 -14303684 1656614 13098845 3385562 -18107424 -35666292 -47663737 -54693570
3415 -54693570 -44394111 -7531208 38137012 58885760 41338990 6102918 -16814956
3408 -16814956 -17027341 -5305652 5262597 11579059 15873381 17064921 12248526 4038654
3400 4038654 -506920 483619 1360651 -1212094 -3000126 -1241800 -1480194 -8332404 -16275734
3391 -16275734 -18346537 -17467816 -18565742 -16002111 -2787970 12117461 12124453 -2197883
3383b197883j0842260J793655N820009L340808O958826J2137426L930469j3428317
3375G512733j8602182n645150P399643O073732k845450o258634k042770L684344
3367a0723734M935707j121112r508739p377933R068993K1471799J0247699j3602524
3359C390156j8620323K924718K3064338J7671526k640156j2808012p245690J228651
3351F965208M089268L248677J148270k315647n566267o222079m199382j62984
3343c014936N009604P481788L670514k542956l906249j739993l429340p215296
3335e686864l062892P864518R885394l504708j6596475j2496851L999385J5566177
3327d032316J5247812R121835L350493n12637k011494k166290l430948m020853
$$ plain form
3383 -2197883 -13040143 -11246488 -5426479 -2085671 4873155 17010581 20941050 7512733
3375 7512733 -11089449 -16734599 -9334956 -3261224 -6106674 -12365308 -14408078 -10723734
3367 -10723734 -5788027 -6909139 -16417878 -23795811 -14726818 6744981 16992680 3390156
3359 3390156 -15230167 -12305449 10758889 28430415 25790259 12982247 5736557 6965208
3351 6965208 11054476 14303153 15451423 13135776 7569509 1347430 -2851952 -3014936
3343 -3014936 1994668 9476456 13146970 10604014 6697765 4957772 1528432 -5686864
3335 -5686864 -8749756 -885238 9000156 5495448 -11101027 -23597878 -19598493 -4032316
3327 -4032316 11215496 20337331 23687824 23175187 21163693 18997403 15566455 11545602
3319A1545602J181342R293768Q401925n125345j8007128j7515455q431355k838106
3311b1494752j972799L04794L623491L391443J625644L251450N504456K535123
3303c231150k616475j952626L644486N252540o3512n367277m333185J428929N742764
3294a495506L978055k947541q023900n436720r3275k425466j1001082j1326659
3286c8772094J942389J3980902J0638726j618951q634878r554015r908915n035519
3278d6962355J0388892K4087248J8994187J105369o363400L791881J5370662J5809928
3270C6222412J0580547O776300J523104o704352j1788798j1942196j3116332j4517631
3262b966946o712016Q540455J3622998J017441j1651156o097294J0101204J6775140
$$ plain form
3319 11545602 12726944 22020712 30422637 25297292 7290164 -10225291 -18656646 -21494752
3311 -21494752 -23467551 -23162757 -19539266 -16147823 -14522179 -11270729 -5766273 -3231150
3303 -3231150 -5847625 -7800251 -4155765 1096775 1033263 -4334014 -8667199 -7238270 -1495506
3294 -1495506 2482549 -464992 -8488892 -13925612 -14018887 -16444353 -27445435 -38772094
3286 -38772094 -36829705 -22848803 -12210077 -13829028 -22463906 -32017921 -41926836 -46962355
3278 -46962355 -36573463 -12486215 6507972 7613341 1249941 5041822 20412484 36222412
3270 36222412 46802959 53579259 55102363 48398011 36609213 24667017 11550685 -2966946
3262 -2966946 -9678962 -1138507 12484491 13501932 1850776 -4246518 5854686 22629826
3254B2629826J0430511K935746k042548j1984679k5681660k8478988j3198932
3247d5390724O364129J1295090J066683o522739K030308J9136010K5297549J3233269
3239B6509575l109497o936002J7930L063688j901104l375855M942496J1935931
3231C1147162N886629o858014j1472112o591221m074092r048829j2611959o716651
3223b0339087L485091P518588M002609R47626L429826O635106L396321m406312
3215D669768o838761O30174R444524Q141934k835786j2440932j3429402q453009
3207b1111490k289989L524236O472721K266098p035373j1140577l655465Q794727
3199b4175112J4762984J0983504K663436m120841m882974L080834J5584533K0438213
$$ plain form
3254 22629826 33060337 35996083 33953535 21968856 -3712804 -32191792 -45390724
3247 -45390724 -39026595 -27731505 -26664822 -33187561 -31157253 -12021243 13276306 26509575
3239 26509575 23400078 16464076 16482006 19545694 17644590 14268735 19211231 31147162
3231 31147162 37033791 30175777 18703665 12112444 8038352 -1010477 -13622436 -20339087
3223 -20339087 -16853996 -9335408 -5332799 -4385173 -955347 5679759 9076080 4669768
3215 4669768 -2168993 -1538819 7905705 16047639 13211853 770921 -12658481 -21111490
3207 -21111490 -23401479 -19877243 -13404522 -11138424 -18173797 -29314374 -32969839 -24175112
3199 -24175112 -9412128 1571376 4234812 113971 -4769003 -1688169 13896364 34334577
3191C4334577R871093p449446j4897752q419865q02803l597270j2003202j2399444
3183a5364112o35061J2777081J5042618M769339p532795j0401308j932648Q961874
3175E684988J0757985P27218j0270876p552418Q939694J9810837Q188502j5249370
3167B1036560k2030035l989911J3733388Q167799q138142p788503P970177J1866670
3159B0828003m864770j7892870p822012J1151716J5348594N834234K01595K819656
3151B5604146K996434l661386r953489j0822567q100351k940382M452997Q984663
3143F560065N508206j744199m274537j958246j146544k634888j668826J778629
3135D19660K657299k04279l290642m704477l602215K703777J2276575J4678309
$$ plain form
3191 34334577 44205670 36756224 21858472 13438607 12635804 9038534 -2964668 -15364112
3183 -15364112 -15999173 -3222092 11820526 16589865 9057070 -1344238 -3276886 5684988
3175 5684988 16442973 17170191 6899315 -653103 8286591 28097428 36285930 21036560
3167 21036560 -993475 -4983386 8750002 16917801 8779659 991156 8961333 20828003
3159 20828003 15963233 -1929637 -9751649 1400067 16748661 22582895 22784490 25604146
3151 25604146 28600580 24939194 14985705 4163138 -3937213 -6877595 -2424598 6560065
3143 6560065 12068271 10324072 6049535 4091289 2944745 309857 -1358969 419660
3135 419660 3076959 2872680 -417962 -5122439 -8724654 -6020877 6255698 20934007
3127B0934007M531473p042123p697495l795253p962504j2983788j314462K0266332
3119D936187K2436407k900213k6231449k1693656k281189N088545Q02956M101193
3111a5741219J5248551J4457205l080036j6937410j2335177r95363r32757j0077591
3103c0393797j2507296k292929J1041926J7022852J4019880N822927k678089n381084
3095e345610J564582J2448227J4093300J100637j4556964j6300931l797757P464661
3087c329855Q116548N762007Q972369J1738472M484546p935684j3331074j2093166
3079B384163j3985793j7479767j0926727L810021R064892l6158m248071R993608
3071b1423832K6594429K2723373K808691r991897p791856k713863k113878m79237
$$ plain form
3127 20934007 25465480 18423357 10725862 6930609 -1031895 -14015683 -15330145 4936187
3119 4936187 27372594 24472381 -1759068 -23452724 -25733913 -20645368 -19842412 -15741219
3111 -15741219 -492668 13964537 10884501 -6052909 -18388086 -19383449 -20316206 -30393797
3103 -30393797 -42901093 -45194022 -34152096 -17129244 -3109364 2713563 35474 -5345610
3095 -5345610 -3781028 8667199 22760499 23861136 9304172 -6996759 -10794516 -3329855
3087 -3329855 4786693 10548700 19521069 31259541 35744087 27808403 14477329 2384163
3079 2384163 -11601630 -29081397 -40008124 -36198103 -27133211 -27169369 -31417440 -21423832
3071 -21423832 5170597 27893970 30702661 20710764 12918908 10205045 8091167 7611930
3063G611930L620737K719063l042310k190657Q469930J5450655Q127701n495518
3055C5271531j1389004p764910j884090K683982O115704O204518J379833m503879
3047B6113685p621906r897146j2885899j1716207l079195N877724O079100O06153
3039f523691K05604N959440O798474l670248j6452279j7892204o221881P255467
3031c0541318J1708030P966533N419330R168634J3253138R295678o85127o593434
3023A8991464n383494m963507r285205r391282K252539J6528332J8522698Q729799
3015C6001344K95655k316104o873632j4656185j4462185j773122J0018247P608147
3007A3842165l169975p438222k864556Q64803o44020k136606j60668K185173K571556
$$ plain form
3063 7611930 11232667 13951730 10909420 8718763 17188693 32639348 40767049 35271531
3055 35271531 23882527 16117617 14233527 16917509 23033213 29237731 30617564 26113685
3047 26113685 18491779 8594633 -4291266 -16007473 -19086668 -13208944 -7129844 -6523691
3039 -6523691 -6318087 -358647 6439827 2769579 -13682700 -31574904 -37796785 -30541318
3031 -30541318 -18833288 -10866755 -5447425 3721209 16974347 26270025 25584898 18991464
3023 18991464 13607970 8644463 -640742 -10032024 -7779485 8748847 27271545 36001344
3015 36001344 36296999 33980895 27107263 12451078 -2011107 -3784229 6234018 13842165
3007 13842165 10672190 3233968 369412 1234215 590195 -1546411 -1707079 478094 3049650
2998C049650K540855K143902j041107o368627r719845q780833l221323Q212446
2990a3184882K2916368K9378894J8351122q88177q367060l52496N352131l084892
2982E0121008j3533104j0548334r61262k277251j3259795j5210223j411228J2761388
2974E681199J2922430L719012k612614l126275j444145J484665M362637J484940
2966B2471849p659386j1076429J043834J7665340J6758696m859857k4538843k2300070
2958a2494866n720932K944206k659546p890793j396834Q652126Q442527o98388
2950a0822500n519654j022319L856540J946741j395373J086690N566470L947110
2942b356295j262675j12530P462032R130308j241341j2531278j1319165r84013
$$ plain form
2998 3049650 5590505 7734407 6693300 324673 -9395172 -18176005 -21397328 -13184882
2990 -13184882 9731486 39110380 57461502 56573325 48206265 47853769 53205900 50121008
2982 50121008 36587904 26039570 25078308 22801057 9541262 -5668961 -7080189 5681199
2974 5681199 18603629 22322641 19710027 16583752 15139607 16624272 20986909 22471849
2966 22471849 14812463 3736034 4779868 22445208 39203904 34344047 9805204 -12494866
2958 -12494866 -18215798 -15271592 -17931138 -25821931 -27218765 -18566639 -10124112 -10822500
2950 -10822500 -16342154 -17364473 -13507933 -11561192 -12956565 -11869875 -6303405 -2356295
2942 -2356295 -3618970 -3731500 3730532 12860840 11619499 -911779 -12230944 -13214957
2934a3214957L779588j456713n093284L072772J7149658K2925683J5502556L171702
2926D5837005m607420p055975q451126r535459p164646j273538K716271M24578
2918A0889690n427322q161746m881933J280556N395318M703328m99314o863363
2910c564786r205596m706071L628760R490719R022011K747310o378793j4109365
2902a3075811j5957307j0927469l253206K660720O907006J0099411Q730610J142276
2894a3673770n303949k185833O559956R621209O084001N762803J0430829R436482
2886B6731728q24894q321595n159792j202764n604291q862697k7886J0099614
2878F827423M152195j0950173j2378221J508960P744176l823378j4498482p880979
$$ plain form
2934 -13214957 -9435369 -10892082 -15985366 -12912594 4237064 27162747 42665303 45837005
2926 45837005 41229585 34173610 25722484 16187025 9022379 7748841 10465112 10889690
2918 10889690 5462368 -2699378 -7581311 -6300755 -905437 3797891 3298577 -3564786
2910 -3564786 -12770382 -17476453 -13847693 -4356974 4665037 7412347 1033554 -13075811
2902 -13075811 -29033118 -39960587 -43213793 -40553073 -33646067 -23546656 -14816046 -13673770
2894 -13673770 -18977719 -21163552 -14603596 -4982387 1101614 6864417 17295246 26731728
2886 26731728 25906834 17585239 12425447 11222683 5618392 -3244305 -3272191 6827423
2878 6827423 10979618 29445 -12348776 -10839816 -3095640 -6919018 -21417500 -29298479
2870b9298479N129096P185570K419264N308700J4070948J4471365L421255q526094
2862A4181625j4268676j4510724q465378M331339J4545980J0889775j755066o483011
2854a534136J088066O475586j011675j2471933j3566538m061117N322127Q038159
2846a1721461N115379j238436q836426j2921571r492879n31744Q449709J4619344
2838a6558085J8043863J7917044J2757383L426309o888079j4695435j6923794
2831b920794j2518606n290492j493481j770751L14908P878730J3575437Q990791
2823F765742k306920q795196o571850k456754r32575K783876J2205510J9553521
2815B0245354J4012066k673109j5893320j4153846j048283R834991R088077p45472
$$ plain form
2870 -29298479 -24169383 -16983813 -14564549 -9255849 4815099 19286464 22707719 14181625
2862 14181625 -87051 -14597775 -23063153 -18731814 -4185834 6703941 4948875 -1534136
2854 -1534136 -446070 6029516 5017841 -7454092 -21020630 -25081747 -19759620 -11721461
2846 -11721461 -6606082 -7844518 -16680944 -29602515 -39095394 -39627138 -31177429 -16558085
2838 -16558085 1485778 19402822 32160205 35586514 28698435 14003000 -2920794
2831 -2920794 -15439400 -20729892 -22223373 -23994124 -23679216 -15800486 -2225049 6765742
2823 6765742 4458822 -4336374 -10908224 -13364978 -14297553 -11513677 691833 20245354
2815 20245354 34257420 31584311 15690991 1537145 488862 10323853 19411930 18666458
2807A8666458r854231j1953632r701889q885586q896586l368476Q389480J6394648
2799i209814J1995789Q15004m540325k850459m596680j2226822j3081709k8517
2791c3723533J2454837P046113q325213r229240Q661690K1079614J0342674q423056
2783a16114r887963N274001J4605618P905251k224014l780212j032224j363580
2775I380763j723296K422123N436877l23246j1021983j5771575j0836127j604754
2767b4041218O156510R646111O998111r2295l939630R83878Q693715Q104249j816057
2758A0693374j0698299j0401412k722784O341375J2041638J0106978m54991j1557622
2750C348257j1926965k195783M781284K835091J208440P051561J0262646j184305
$$ plain form
2807 18666458 8812227 -3141405 -12843294 -21728880 -30625466 -33993942 -25604462 -9209814
2799 -9209814 2785975 3600979 -939346 -3789805 -8386485 -20613307 -33695016 -33723533
2791 -33723533 -21268696 -14222583 -22547796 -31777036 -23115346 -2035732 8306942 -116114
2783 -116114 -10004077 -4730076 9875542 17780793 15556779 11776567 10744343 9380763
2775 9380763 7657467 10079590 15516467 15193221 4171238 -11600337 -22436464 -24041218
2767 -24041218 -17884708 -8238597 -1240486 -1332781 -5272411 -4288533 4405182 12509431 10693374
2758 10693374 -4925 -10406337 -13129121 -6787746 5253892 15360870 14905879 3348257
2750 3348257 -8578708 -10774491 -5993207 -3158116 -1949676 5101885 15364531 14180226
2742A4180226j8005156j8471404J79876J5598140J0377005n635456j1751135m474179
2734a8002083K748762J832956j140938Q30741N075946N780524L179335O72295
2726I77538k205053p443749j1489044p725229K580033Q196588J856390p462835
2718b2715361l862416J3514645K6208026J8858206r94407j3353714j1005403l742414
2710B907162R2906K725358N440558K279672p325208j1776796l677277O911233
2702b422392P757424M097690P911146J4719174R868424m980540j2184491o389031
2694A8377404j650400n311753o304818J022266L086706p861083j4733882k339973
2686a5715533J3010167O196857j4800128j8397522K386537K0159400J5159232
$$ plain form
2742 14180226 -3824930 -22296334 -22116458 -6518318 3858687 -1776769 -13527904 -18002083
2734 -18002083 -15253321 -13420365 -14561303 -13730562 -8654616 -2874092 305243 977538
2726 977538 -1227515 -8671264 -20160308 -27885537 -25305504 -17108916 -15252526 -22715361
2718 -22715361 -26577777 -13063132 13144894 32003100 31008693 17654979 6649576 2907162
2710 2907162 3000068 5725426 11165984 13445656 6120448 -5656348 -9333625 -2422392
2702 -2422392 5335032 9432722 17343868 32063042 41931466 36950926 24766435 18377404
2694 18377404 16727004 11415251 5110433 6132699 9219405 1358322 -13375560 -15715533
2686 -15715533 -2705366 3491491 -11308637 -29706159 -27319622 -7160222 7999010
2679G999010J94673n285832k402892j090500l68666M418541Q974163R022522J0073594
2670C1534613J5244428J5256206M257640o334730n455153k584309j1777177k4542467
2662A5599051k0510447j111428J0102315K308893q304816n160129N352145O648747
2654D924331m038551j4417033j3398054j913671Q814687P770828k785484o601454
2646b1644401O485353K3001340K0739644Q4453j4861423r071442N417437J0394477
2638B0545438M962235j292795n153199p838078o536511l61375K957469j962875
2630E320309p323353l840614L172916J971792o439867j0445928n998783J32815
2622b3450713L468539N830402P188023N587411M985317J0802451J6920009J0373296
$$ plain form
2679 7999010 8193683 2907851 504959 -585541 -954207 3464334 12438497 21461019 31534613
2670 31534613 46779041 62035247 66292887 59958157 54503004 51918695 40141518 15599051
2662 15599051 -4911396 -6022824 4079491 6388384 -1916432 -7076561 -1724416 4924331
2654 4924331 885780 -13531253 -26929307 -28842978 -20028291 -12257463 -15042947 -21644401
2646 -21644401 -15159048 7842292 28581936 28666389 13804966 4733524 10150961 20545438
2638 20545438 25507673 24214878 19061679 11223601 4687090 4325715 7283184 5320309
2630 5320309 -2003044 -5843658 -2670742 -698950 -7138817 -17584745 -23583528 -23450713
2622 -23450713 -19982174 -14151772 -6963749 -1376338 3608979 14411430 31331439 41704735
2614D1704735p644084j8350445r462995P628106J2999219L232906p459048p256329
2606A5392065J15922J986669p926798k1484584k3251261p641522J2163028J7393793
2598a3252688N636218p159016p911539j141669K100585J420848M055956R646372
2590f604933R565879K008439k592064L797299J3742594J3311244J041873j0141445
2582B4128886j0620876n920401o447371j1365015j0425985P4971J1217630J2554369
2574C196208L109176j0191855j9155307j7849651o261469O739572J0393245M812152
2566b5207929J18149Q04228M41453m098601m913474K715221R990275R035279O424467
2557d690932R181597Q733850l707647j5573434q848246Q093549R561902p084977
$$ plain form
2614 41704735 34060651 15710206 6247211 13875317 26874536 30107442 22648394 15392065
2606 15392065 15507987 17494656 9567858 -11916726 -35167987 -42809509 -30646481 -13252688
2598 -13252688 -7616470 -14775486 -22687025 -23828694 -21728109 -20307261 -16251305 -6604933
2590 -6604933 2960946 4969385 2377321 6174620 19917214 33228458 34270331 24128886
2582 24128886 13508010 7587609 1140238 -10224777 -20650762 -20575791 -9358161 3196208
2574 3196208 6305384 -3886471 -23041778 -40891429 -47152898 -40413326 -30020081 -25207929
2566 -25207929 -25089780 -24285552 -23844099 -27942700 -32856174 -30140953 -20150678 -11115399 -4690932
2557 -4690932 4490665 13224515 9516868 -6056566 -14904812 -6811263 2750639 -4334338
2549d334338j6371806m875622R396610Q146125j97135N62801P742534R173125
2541I242294M421013q2432n071182j1920719j2884880l007810P839848Q691536
2533b772332L350047q7993l239977p238578l301264R581227J3351560k113022
2525G529668j6874030j0366853L837959K869571l460587M155657L637046m1179370
2517d9850939j01245807r3437941L943765J01717359J07073668L9122742j1323974
2510d001127o443271J2292115Q147927l249289P10493Q347800J042227j2392360
2502D454515j3048749j806884P796055J0085932N367886o845503j8930998j5116101
2494b8043847N370893K0159080J3804189R38872J963183J0215683N466548j0382341
$$ plain form
2549 -4334338 -20706144 -25581766 -16185156 -8039031 -8236166 -7673365 69169 9242294
2541 9242294 13663307 13580875 8509693 -3411026 -16295906 -19303716 -11463868 -2772332
2533 -2772332 577715 489722 -2750255 -9988833 -13290097 -3708870 9642690 7529668
2525 7529668 -9344362 -19711215 -15873256 -13003685 -16464272 -12308615 -8671569 -49850939
2517 -49850939 -151096746 -244534687 -240590922 -138873563 -31799895 7322847 -4001127
2510 -4001127 -10444398 1847717 9995644 6746355 7456848 15804648 16846875 4454515
2502 4454515 -8594234 -10401118 -2605063 7480869 12848755 6003252 -12927746 -28043847
2494 -28043847 -22672954 -2513874 11290315 12229187 14192370 24408053 29874601 19492260
2486A9492260j6407883p251004O89942r67392m18337J0199199J9231099J4795314
2478C9363198L824627l62055J863158P12315o605254j4302735j7179890j3087461
2470e774097j937671J0410180J3537598N240490l396999l033596J223719N53043
2462A6822667k729961k358950k182917q716451j5309831j0066788L085481Q146431
2454a3310319J767861k740962J881899P307340O959524N688358N632331l50108
2446A2835924j1871667j4382287j765420R590883M498256o294845k908427J1930440
2438A632857J7632493O911679o822761j1341294p815832j478842M587178N849318
2430I154796J27624n129427k196464K256531l420249j4019401j2978192J42750
$$ plain form
2486 19492260 3084377 -4166627 -3476685 -4444077 -4862414 5336785 24567884 39363198
2478 39363198 43187825 42825770 44688928 45401243 38795989 24493254 7313364 -5774097
2470 -5774097 -7711768 2698412 16236010 21476500 18079501 15045905 16269624 16822667
2462 16822667 14092706 11733756 9550839 834388 -14475443 -24542231 -21456750 -13310319
2454 -13310319 -11542458 -14283420 -12401521 -5094181 1865343 7553701 13186032 12835924
2446 12835924 964257 -13418030 -15183450 -5592567 -1094311 -7389156 -10297583 1632857
2438 1632857 19265350 26177029 19354268 8012974 197142 -1281700 3305478 9154796
2430 9154796 9282420 4152993 1956529 4213060 792811 -13226590 -26204782 -26062032
2422b6062032P561684K285005j294481O546267J3890505Q172425k392136k807702
2414E899535N576801J0389216P588657K364126j887451l723999K02478Q072826
2406C4482189Q942537k876079j5950119j5653461m158666M754623N285489K240675
2398A7067188j109754n457510q579301p147531l586598k295998k166121q01761
2390a4077386r63543l947032l257706M480939R811199M592811j777544L564335
2382a573927J2976667Q037851r297447j6637992m804938Q613149N981376p134792
2374c840053j4064681q926820K013803J0093650Q529737l080048j3341009q826343
2366c1441764O451182J3929990P619840K793152R235594J2781732j605190k1547654
$$ plain form
2422 -26062032 -18500348 -16215343 -17509824 -10963557 2926948 11099373 8707237 5899535
2414 5899535 11476336 21865552 29454209 31818335 29930884 26206885 26409363 34482189
2406 34482189 43424726 40548647 24598528 8945067 4786401 9541024 14826513 17067188
2398 17067188 15957434 10499924 1920623 -5226908 -8813506 -11109504 -13275625 -14077386
2390 -14077386 -15040929 -18987961 -22245667 -17764728 -7953529 -3360718 -5138262 -1573927
2382 -1573927 11402740 19440591 10143144 -6494848 -11299786 -2686637 3294739 -3840053
2374 -3840053 -17904734 -26831554 -24817751 -14724101 -6194364 -9274412 -22615421 -31441764
2366 -31441764 -24990582 -11060592 -3440752 -647600 8587994 21369726 19764536 -1783118
2358a783118k1372456J366014K1858812K0213982K754015j1265205j2534171o734235
2350g496362l992021p959196j2962640j0690586m60954R329972J1628188Q780356
2342a3823243P327187Q917819J0050703P120872j403323j3580459k2144147j9683764
2334c7218355q856387r67375q15466p94808N157570J1024780R566545M844184
2326a8059312M207373N227842J690012l189602j369260N982662J0342385R062989
2318A3895089O491713M666777K881711L195556N912497L524649q839442k0646701
2310A1081849j7495238l025820N772264M068301L203369P759668O827975n678461
2302A2513907j8182980j8154070r207859k281101m4634J025358J984462L279209
$$ plain form
2358 -1783118 -23155574 -21789560 69252 20283234 23037249 11772044 -762127 -7496362
2350 -7496362 -11488383 -19447579 -32410219 -43100805 -43561759 -34231787 -22603599 -13823243
2342 -13823243 -6496056 2421763 12472466 19593338 18190015 4609556 -17534591 -37218355
2334 -37218355 -46074742 -47042117 -47857583 -48652391 -43494821 -32470041 -22903496 -18059312
2326 -18059312 -13851939 -8624097 -6934085 -10123687 -11492947 -5510285 4832100 13895089
2318 13895089 20386802 25053579 27935290 31130846 37043343 40567992 31728550 11081849
2310 11081849 -6413389 -9439209 -3666945 401356 3604725 11364393 18192368 12513907
2302 12513907 -5669073 -23823143 -33031002 -35312103 -35356737 -34331379 -32346917 -29067708
2294b9067708P591299J3614563J4500510Q541486K962220J591777q83194n998828
2286A2852125n258590M048256R602444K939716m323362J662065J2914737J1111914
2278D5549305l723013j4634450j3834066q776957m206756K670714Q462460M154694
2270A5661931p114377j0622021l357617N35286n723233r020304J444642J4805161
2262c390532J4648449L139705m813366l679288m21704m84850k290781l075403
2254c67770j570037K614176O313018L850855m206463r605088q677204p487674
2246a9136187q661997m313107Q355684J6293739Q933380l239874m635467K12793
2238f191036l171976j0882162n895589J0232320J5773866K879715j0117440q490734
$$ plain form
2294 -29067708 -21476409 -7861846 6638664 15180150 18142370 19734147 18850953 12852125
2286 12852125 7593535 11641791 21244235 24183951 19860589 21522654 34437391 45549305
2278 45549305 41826292 27191842 13357776 4580819 374063 3044777 11507237 15661931
2270 15661931 8547554 -2074467 -5432084 -4896798 -10620031 -19640335 -18195693 -3390532
2262 -3390532 11257917 14397622 9584256 5904968 5483264 4998414 2707633 -367770
2254 -367770 -1937807 676369 6989387 10840242 6633779 -2971309 -11648513 -19136187
2246 -19136187 -27798184 -32111291 -23755607 -7461868 1471512 -1768362 -6403829 -6191036
2238 -6191036 -9363012 -20245174 -26140763 -15908443 -134577 2745138 -7372302 -15863036
2230a5863036j816046l474322q491322o335139l82229J241425K054982Q388981
2222b4676706J4027268R905472J371546l41192K463603n07979p417313p017327
2214a2192628P49483M130900K1406j331509N043536J0542527Q442745M607414
2206B0013874N738764P328705J710198q523540j3220913p996010Q37079M276474
2198A0164631R05632j935260J732768O780435L203281p279432j0906931l151046
2190d85922K085726n036027j1546522k080609J2936837J2055665r22328k490441
2182D516379R535403J0693209p557214k0386871r609620O438480M327155o548426
2174h591505m119964O289643L335684r298452o636592J4205795K5894236J2275931
$$ plain form
2230 -15863036 -17679082 -21153404 -29644726 -35979865 -36362094 -35120669 -33065687 -24676706
2222 -24676706 -10649438 -743966 627580 286388 2749991 2242012 -5175301 -12192628
2214 -12192628 -11443145 -7312245 -7290839 -8622348 -3578812 6963715 15406460 20013874
2206 20013874 25752638 33081343 34791541 26268001 13047088 5051078 5888157 10164631
2198 10164631 11070263 9135003 10867771 17648206 20851487 13572055 2665124 -485922
2190 -485922 1599804 -3436223 -14982745 -17063354 -4126517 7929148 7006820 4516379
2182 4516379 14051782 24744991 17187777 -3199094 -12808714 -6370234 -2043079 -8591505
2174 -8591505 -12711469 -6421826 -3086142 -12384594 -19021186 -4815391 21078845 33354776
2166C3354776q798081j4411488o331915R72413L968996O476671N464637l516285
2158A7179724j4041926j5689528r005047k722884K13573L500659O958561N666874
2150g939994l19471m363824l208272j281554k024680j084409O525671J6039366
2142B342833J6772166O766402l255663m373486j484856l107494m384814O295568
2134A5570656K3522264K4504242R36902k3719660k3512475n655625J799036q441893
2126E003447j5805068o560840P128631J0176483O636974O442905N906716k645887
2118A6283361j2296961r812697K491898R143223M593699m39633K298348O125090
2110A8386328J395090q594649j1489590k752622P799073P696399l078955j2090506
$$ plain form
2166 33354776 24556695 10145207 3813292 4785705 8754701 15231372 20696009 17179724
2158 17179724 3137798 -12551730 -21556777 -24279661 -24066088 -20565429 -13606868 -7939994
2150 -7939994 -8259465 -12623289 -15831561 -17113115 -19137795 -20222204 -13696533 2342833
2142 2342833 19114999 25881401 22625738 18252252 16767396 13659902 9275088 15570656
2134 15570656 39092920 63597162 64534064 40814404 17301929 11646304 13445340 5003447
2126 5003447 -10801621 -17362461 -10233830 -57347 6579627 13022532 18929248 16283361
2118 16283361 3986400 -5826297 -3334399 5808824 10402523 9962890 12261238 18386328
2110 18386328 19781418 11186769 -302821 -3055443 4743630 12440029 9361074 -2729432
2102b729432r851167j041196L675139L341386O025918J2952959J3973137L403423
2094B9750167r177897j1929789p316717n867528q458028o553921J477823O532967
2086a1542923L607498k05998K166115O128355L532713k915450k595228O789556
2078D964638J4541798J1096588K85161p105660p286772m660510k088677J530860
2070A1277426L909180p49705j0608378j3817761l975805R468159J4250191J1308370
2062B1061677P596098Q61686j3308089k4477848j6743927M474053J5083529O711706
2054A258885j527709N199715J3794509O364555r564999j3579532m277017J907679
2046d23914k205709q111157r309446p423389k162043P538169J3129356N044821
$$ plain form
2102 -2729432 -12580599 -13621795 -9946656 -6605270 -579352 12373607 26346744 29750167
2094 29750167 20572270 8642481 1325764 -4541764 -12999792 -19553713 -18075890 -11542923
2086 -11542923 -7935425 -8141423 -5975308 153047 3685760 770310 -1824918 4964638
2078 4964638 19506436 30603024 30888185 23782525 16495753 11835243 9746566 11277426
2070 11277426 15186606 14436901 3828523 -9989238 -13965043 -4496884 9753307 21061677
2062 21061677 28657775 29519461 16211372 -8266476 -25010403 -20536350 -5452821 1258885
2054 1258885 -268824 4930891 18725400 25089955 15524956 1945424 -2331593 -423914
2046 -423914 -2629623 -10740780 -20050226 -27473615 -29635658 -22097489 -8968133 -3923312
2038c923312p700920n491206J0951586J7443186J937053j5524736j1237910Q642151
2030d904108J9167794J1863661J555399R79189M653709J590222o967828r964504
2022A7973534l062461M101614L0412j2182401j6949986o745483O919211R564696
2014c50864L637327J514923M085334J290941p471303j0573410m728066j354894
2006a3950012o040209q160860n09385O562110L619029M92560R253158J9669327
1998A0935718J1867641j1285311k4437842j3343880Q081039J7644992R200800
1991H663157o514293j5216092r891764L926963J1906323O359610l209475k967798
1983f943369M910431O596558l37466l404200K600307N697623l354937j4615798
$$ plain form
2038 -3923312 -11624232 -17115438 -6163852 11279334 13216387 -2308349 -13546259 -4904108
2030 -4904108 14263686 26127347 27682746 28661935 33315644 34905866 27938038 17973534
2022 17973534 14911073 19012687 19043099 6860698 -10089288 -16834771 -9915560 -350864
2014 -350864 3286463 4801386 8886720 10177661 2706358 -7867052 -12595118 -13950012
2006 -13950012 -19990221 -28151081 -28660466 -22098356 -18479327 -17986767 -8733609 10935718
1998 10935718 22803359 11518048 -12919794 -26263674 -18182635 -537643 8663157
1991 8663157 2148864 -13067228 -22958992 -19032029 -7125706 -766096 -3975571 -6943369
1983 -6943369 -2032938 4563620 4226154 821954 3422261 9119884 5764947 -8850851
1975h850851j3290134r12860R549276J2902080J3386278J1182148J312594j2697997
1967A2580534j6590940l434239J3327699J3375052n520516k3339608k1051060
1960c0653078k767872J0832426Q596800o8018k063852J308126J109093j629381
1952a5335756K242707J2252678J5988575P914797j330458j103157L388064O34866
1944B4652316q229221j1035288l263159M988336K967504o608290j1483354m863715
1936a2874871P361480J4232109J1679836M629311j410907n926156q817812o564251
1928B308739Q40239M227733l620466j3588146r249756Q401668J8477129P893722
1920A5690862j0726112j7535076j1092384l840877l37529N229535J3305689J5804230
$$ plain form
1975 -8850851 -22140985 -23053845 -13504569 -602489 12783789 23965937 25278531 12580534
1967 12580534 -4010406 -7444645 5883054 19258106 13737590 -9602018 -30653078
1960 -30653078 -33420950 -22588524 -13991724 -14059742 -16123594 -14815468 -13706375 -15335756
1952 -15335756 -13093049 -840371 15148204 23063001 21732543 20629386 24017450 24652316
1944 24652316 16423095 5387807 2124648 7112984 10080488 3472198 -8011156 -12874871
1936 -12874871 -5513391 8718718 20398554 25027865 23616958 17690802 8872990 2308739
1928 2308739 3148978 7376711 3756245 -9831901 -19081657 -10679989 7797140 15690862
1920 15690862 4964750 -12570326 -23662710 -27503587 -27841116 -22611581 -9305892 6498338
1912F498338J0062265L635764J519285j521278j0725811k0719677k1075225q845692
1904d1172031Q437015J9782633J8622201P091894m622308n794674M410472J4520051
1896B1275253J1564010m484777j8591992j5855214O07886J1250443L393798j1773594
1888b614187j3612502k78252J0079347P358585K974630P752116J2048718K656455
1880B6364910j1900216j2282152N44461N509712o185043j7727053j1851145N620267
1872b1906259J6139221J1911930J76714r098144j1719984q959638m452452o07189
1864b8515801L006144O246969O140465K430125J127866N326385P450996P89231
1856D002380o448677k374254P167721N768403n926207r710896j14350N801095
$$ plain form
1912 6498338 16560603 20196367 21715652 20194374 9468563 -11251114 -32326339 -41172031
1904 -41172031 -32735016 -12952383 5669818 12761712 8139404 2344730 6755202 21275253
1896 21275253 32839263 28354486 9762494 -6092720 -5484834 5765609 9159407 -2614187
1888 -2614187 -16226689 -16504941 -6425594 932991 3907621 11659737 23708455 26364910
1880 26364910 14464694 2182542 2727003 8236715 2051672 -15675381 -27526526 -21906259
1872 -21906259 -5767038 6144892 6321606 -2776538 -14496522 -23456160 -27908612 -28515801
1864 -28515801 -25509657 -19262688 -13122223 -10692098 -9564232 -4237847 3213149 4002380
1856 4002380 -2446297 -4820551 2347170 8115573 2189366 -7521530 -7635880 -1834785
1848a834785l168393j4106201j1899476k035338K487015K190087M052830O141041
1840a8173220M747485N823864J3792960J9014400J2031389P83929k434263j753126
1832C3833418q038215j7063993j6486890q113005l755679l870700P7158N961891
1824a7456015M061379k673241j977769N106503N602869j343335l026258K444311
1816i261556K103222p274885j1721696l744816O065231Q407969P709918P624354
1808i2259K923405n188804m534556O404892J0710387j68530r558833j433954J2507874
1799A1569622J0522729n942051j6580220j2634890l626102L016321J0647854K0120911
1791A7094174K2448973J0313762j0497812k5239736k3390185p575527R163226
$$ plain form
1848 -1834785 -5003178 -19109379 -31008855 -33044193 -30557178 -28367091 -24314261 -18173220
1840 -18173220 -13425735 -7601871 6191089 25205489 37236878 38020807 35586544 33833418
1832 33833418 25795203 8731210 -7755680 -15868685 -19624364 -23495064 -23417906 -17456015
1824 -17456015 -13394636 -16067877 -18045646 -12939143 -7336274 -8679609 -11705867 -9261556
1816 -9261556 -7158334 -14433219 -26154915 -29899731 -23834500 -15426531 -7716613 -92259
1808 -92259 2831146 -2357658 -6892214 -487322 10223065 10054535 495702 -938252 11569622
1799 11569622 22092351 16150300 -429920 -13064810 -16690912 -13674591 -3026737 17094174
1791 17094174 39543147 49856909 39359097 14119361 -9270824 -16846351 -7683125
1784g683125J6094297J4093046R592619L820882l716309o006999L018988J2734035
1776D1947434O057230j3085921k2061381j3524844n238925p937396p796834M662675
1768a6977962J2418160K46855j4895877q202095J2438397J8438717M474461p786167
1760A54489o096873n04320P86135L245574R208175J0541279M540101J25162K244986
1751B4244708M298213R27752m066539o265258o015598l145717L276264R128485
1743B2382310R118798N460228K781527j802974j1452732j7859771j2157958k421439
1735e952011k026783n164429L783659J8349437J3866560j2110093k9696496j8315148
1727c7265304M239321R705678j790329q687993j354750R824638J3563999R472061
$$ plain form
1784 -7683125 8411172 22504218 32096837 35917719 32201410 26194411 29213399 41947434
1776 41947434 48004664 34918743 12857362 -667482 -5906407 -13843803 -21640637 -16977962
1768 -16977962 -4559802 -4312947 -19208824 -27410919 -14972522 3466195 7940656 154489
1760 154489 -5942384 -6446704 -5660569 -2414995 6793180 17334459 21874560 21999722 24244708
1751 24244708 28542921 29470673 25404134 19138876 13123278 9977561 13253825 22382310
1743 22382310 31501108 36961336 39742863 37939889 26487157 8627386 -3530572 -5952011
1735 -5952011 -7978794 -13143223 -9359564 8989873 22856433 10746340 -18950156 -37265304
1727 -37265304 -33025983 -23320305 -25110634 -33798627 -35153377 -25328739 -11764740 -2292679
1719b292679K611126k769795m056240j256191K895531O303602Q978020J0301319
1711B0714693Q236815J981512o768489j3609427j1595001J722900J4703691J0377234
1703B5763928q594939j8114686o538590P089089M759327j038256O307928J2777236
1695B2411037j006967j7736088q592503J2770284J0539683p495882k568510J8292060
1687B6613114Q245588k3372418j468799Q9173620J45623770P9903874m7746236
1680B76972513j07565045p2908476k8331784k7094800l3772685j3316669R513324
1673C496378P007468k561680K772429Q562372o54328q129485R13093Q417519k046344
1664A7777422j2864187n714667L084655o145883j7055747n552436J4524100J2710570
$$ plain form
1719 -2292679 318447 -2451348 -6507588 -7763779 -4868248 1435354 10413374 20714693
1711 20714693 28951508 30933020 24164531 10555104 -1039897 683003 15386694 25763928
1703 25763928 17168989 -945697 -7484287 -395198 4364129 3325873 9633801 22411037
1695 22411037 21404070 3667982 -4924521 7845763 18385446 10889564 8321054 26613114
1687 26613114 34858702 11486284 10017485 99191105 244814875 324718749 276972513
1680 276972513 169407468 96498992 68167208 41072408 7299723 -6016946 3496378
1673 3496378 10503846 7942166 10714595 19276967 18622639 10493154 11406247 19823766 17777422
1664 17777422 4913235 -801432 2283223 -3862660 -20918407 -26470843 -11946743 763827
1656G63827o393979j1689583K910464J3312202Q913166N565466J1353227J1834389
1648C6569179j161034j2675664r369992o99243j438416q124196p151812L487715
1640e63463J3692471J6970348J5666816J2921083Q414823K506576j736882k849764
1632F5022008l944006q613565j4972605j6879178j2058743n877868m196194n418969
1624f939120m281752q48655J040012K616901Q512905J5593774J3519061J18441
1616B9331567j2910973j4930400q871403k958958J658243O828403Q281699J545932
1608G974110o663686m228637R005305J8886745J4244389l71609j2143742j4590733
1600A2112142j0454461l762606M618344J2653321J3901296M169892r663434j3949061
$$ plain form
1656 763827 -5630152 -17319735 -14409271 -1097069 7816097 13381563 24734790 36569179
1648 36569179 35408145 22732481 13362489 12663246 11224830 3100634 -4051178 -563463
1640 -563463 13129008 30099356 45766172 58687255 67102078 69608654 67871772 65022008
1632 65022008 61078002 52464437 37491832 20612654 8553911 2676043 -1520151 -6939120
1624 -6939120 -11220872 -12069527 -11029515 -8412614 100291 15694065 29213126 29331567
1616 29331567 16420594 1490194 -7381209 -10340167 -8681924 -1853521 6428178 7974110
1608 7974110 1310424 -2918213 6087092 24973837 39218226 38846617 26702875 12112142
1600 12112142 1657681 -2104925 2513419 15166740 29068036 33237928 23574494 9625433
1592I625433m195042Q204076R268198j509110j2777638j4736614n801010R040276
1584b881431J9529344J4910808l480373j8440714j5775736l029694K318529r38844
1576g788111R27839J0574276J3852346M131818n981004n536206j613369l852545
1568D715044o918490k054068N114562L596330l737559n170378L06099L186722
1560i61738J069395J950767Q863021J3118003O433976p973516j9184013j8253257
1552a4937362l846967J5594410K4822977J4005997q941273k3170954j5988322
1545a2461494L319359J4169158P940187l690708n130257L004107O489072j085760
1537A2553664r218172o979322J222743N194306N695578Q702738R260261j953294
$$ plain form
1592 9625433 5430391 13634467 22902665 21393555 8615917 -6120697 -11921707 -2881431
1584 -2881431 16647913 31558721 28078348 9637634 -6138102 -9167796 -6849267 -7788111
1576 -7788111 -6860272 3714004 17566350 21698168 15717164 10180958 8567589 4715044
1568 4715044 -2203446 -4257514 857048 4453378 715819 -4454559 -4148460 -961738
1560 -961738 107657 2058424 10921445 24039448 30473424 22499908 3315895 -14937362
1552 -14937362 -18784329 -3189919 21633058 35639055 26697782 3526828 -12461494
1545 -12461494 -9142135 5027023 12967210 9276502 4146245 7150352 13639424 12553664
1537 12553664 3335492 -3643830 -2421087 2773219 8468797 17171535 26431796 24478502
1529B4478502j7625105j8015816K13470J6468175J4156649R72797o893739o606231
1521G148702m567617k764365o79089j231469m228627k658428M775263P120553
1513B914923j884528j0084665l281823J2470767J9115188J1537790J1236q336772
1505B2462116j5305609j9456764j3033169M358606J9071147J7178949J115408
1498A6390684j2316979j0736765l33791K600063n461355r247750J704793J3542746
1490c858354P343995r427998j2476844N09685O829646j572401m808134P080237
1482a0380168J3046926k093274j6827524o077368J6295025J9354252M149138k286898
1474A5180109P213908J3319194N996872l850123q721957j2828306j4705077p186566
$$ plain form
1529 24478502 6853397 -11162419 -10948949 5519226 19675875 20648672 13754933 7148702
1521 7148702 2581085 -183280 -862369 -2093838 -6322465 -8980893 -4205630 2914923
1513 2914923 1030395 -9054270 -12336093 134674 19249862 30787652 30798888 22462116
1505 22462116 7156507 -12300257 -25333426 -20974820 -1903673 15275276 16390684
1498 16390684 4073705 -6663060 -6996851 -4396788 -9858143 -19105893 -17401100 -3858354
1490 -3858354 3485641 -5942357 -18419201 -17909516 -11079870 -12652271 -17460405 -10380168
1482 -10380168 2666758 573484 -16254040 -22331408 -6036383 13317869 17467007 15180109
1474 15180109 22394017 35713211 41710083 37859960 29138003 16309697 1604620 -5581946
1466e581946L509770L088985n119303m395259M474399L360749r161195j2498792
1458b2322592L58917J0121983M517847k390026K325592Q297959L391175m194641
1450A06214l208753l71256n360793j0002319j858297J2503476J6074806N813279
1442A3696357o590753j2187492j0545568m065917K676935L440886j399815l362796
1434a8338163J065384M580758K517476J311105N772997R437306P029390N261004
1426A8637257J0077978J3215979L967693j2938714k2848776j9434238q439036
1419a7761857J497904M467900j47833m604214N83524J1962040J4516982L255159
1411A3769605p957932o589717J339047L522414l92992l471392m328505m198327
$$ plain form
1466 -5581946 -2072176 1016809 -4102494 -8497753 -4023354 -662605 -9823800 -22322592
1458 -22322592 -21963675 -11841692 -7323845 -9713871 -7388279 909680 4300855 106214
1450 106214 -3102539 -3473795 -8834588 -18836907 -20695204 -8191728 7883078 13696357
1442 13696357 7105604 -5081888 -15627456 -19693373 -17016438 -13575552 -14975367 -18338163
1434 -18338163 -17272779 -12692021 -10174545 -8863440 -3090443 6346863 13376253 18637257
1426 18637257 28715235 41931214 45898907 32960193 10111417 -9322821 -17761857
1419 -17761857 -16263953 -11796053 -11943886 -16548100 -15964576 -4002536 10514446 13769605
1411 13769605 5811673 -778044 561003 4083417 3690425 219033 -4109472 -8307799
1403h307799p361Q767776J4244285J0927220M239700m34424p132695j7728500
1395D568202k2046857j2356032J440435M646033j385366m194658R0025M411722
1387b4826496L510840j518660p195195q485903j794530O940137O644043k63641
1379b6989405K795017J9325790K7887767J2040908j2418274j8524351n152961
1372a035509O629343N644974j027101n931425q011351m783026M950974J2840404
1364I277283R956315M95042o084788r728372j2847260q562238O300009J6090930
1356D896921O005457j0166137o215370J5834686K6341987J0413117j3814418k3544388
1348I751855j7341041o723677R54577M320062M983562O737778R005590L659789
$$ plain form
1403 -8307799 -8315160 452616 14696901 25624121 29863821 29429397 22296702 4568202
1395 4568202 -17478655 -29834687 -28394252 -23748219 -25133585 -29328243 -29238218 -24826496
1387 -24826496 -21315656 -22834316 -30029511 -38515414 -40309944 -33369807 -26725764 -26989405
1379 -26989405 -24194388 -4868598 23019169 35060077 22641803 4117452 -1035509
1372 -1035509 5593834 11238808 10211707 4280282 -3731069 -8514095 -3563121 9277283
1364 9277283 19233598 19728640 13643852 3915480 -8931780 -17494018 -11194009 4896921
1356 4896921 10902378 736241 -5479129 10355557 36697544 47110661 33296243 9751855
1348 9751855 -7589186 -14312863 -13358286 -9038224 -4054662 2683116 11688706 15348495
1340A5348495j0759445j8826766q328227P199650O611368m920325m696742R145999
1332i225993J5943174Q657199K425871L894625J926762m783058j517156J0808292
1324B8129716Q587539j4653329l0224934j5761930J0371250J8481636R863687
1317A4793635N278377Q471376P290978j69503m953734n772287p620823p999647
1309I318372k793566M60364o713835j5262447r148052Q866836J9244804J2671552
1301A6644028K38447l916034J658356Q254262O935608l679636j4361833j3685734
1293a912536l578739J227681n316309j0581719l607937O626257O503579Q39674
1285i800049L740314J2943138J1953457l067504j5319114j0158432N798024J3792187
$$ plain form
1340 15348495 4589050 -14237716 -22565943 -15366293 -8754925 -13675250 -18371992 -9225993
1332 -9225993 6717181 15374380 17800251 21694876 23621638 18838580 17321424 28129716
1324 28129716 36717255 22063926 -8161008 -23922938 -13551688 4929948 14793635
1317 14793635 20072012 28543388 35834366 35664863 30711129 24938842 17318019 9318372
1309 9318372 6524806 6985170 271335 -14991112 -24139164 -15272328 3972476 16644028
1301 16644028 16882475 12966441 14624797 22879059 29814667 26135031 11773198 -1912536
1293 -1912536 -5491275 -4263594 -9579903 -20161622 -23769559 -17143302 -10639723 -9800049
1285 -9800049 -6059735 6883403 18836860 15769356 450242 -9708190 -3910166 9882021
1277I882021N152682r500565j2031942K268536J7064947J3647289m140083j4123484
1269H219401o568575K994034j900401j5057760j8711949p678478Q290308J7935072
1261a2478348J5379574K433574q324192l360102J1616040J4566548j451919j6235486
1253B145689j3114938k947949j657988l323321L107207Q363090M46250p095124
1245a4077084N339832K5865926K5421224M064864j0281415p894777p650008j7555878
1237C232684j9259067k588153J4648366J5717112Q487553N130609J300952q212914
1229A8457142j3446098o447558K261143J350727k054720K510074Q126806K720544
1221A3478060q645610j1239379k953965O048028R468483P375982l88612j0220871
$$ plain form
1277 9882021 15034703 5534138 -6497804 -4229268 12835679 26482968 22342885 8219401
1269 8219401 1650826 4644860 2744459 -12313301 -31025250 -38703728 -30413420 -12478348
1261 -12478348 2901226 5334800 -2989392 -6349494 5266546 19833094 18381175 2145689
1253 2145689 -10969249 -13917198 -15575186 -18898507 -15791300 -7428210 -6981960 -14077084
1245 -14077084 -8737252 17128674 42549898 46614762 36333347 28438570 20788562 3232684
1237 3232684 -16026383 -18614536 -3966170 11750942 20238495 25369104 26670056 18457142
1229 18457142 5011044 -1436514 824629 2175356 120636 2630710 10757516 13478060
1221 13478060 4832450 -6406929 -9360894 -3312866 6155617 13531599 13142987 2922116
1213B922116j1288585K83488J0292957M024271j0386911j1915843K548988J3521997
1205B478O891624p240492r466002L737378J6472976J2655152n213439j8225373
1197c85698j2844801K443107P907495j729674j1787206r021395K724395J2664435
1189a0029342J7147775J6055762O193641j0832250k2046759j6141683J301694
1182a8351162J4846719J6989443J0897151J376573p203422q870318k035829N562700
1174A3211855N933284P20454m965807j1523043j8185530j5523341J851190K0668998
1166g811940K2339451Q298699k964482k919800j043765m650386p314957k969710
1158I63110K648686K796596J207205L877649P130777L031308p357424j3644394
$$ plain form
1213 2922116 -8366469 -8082981 2209976 6234247 -4152664 -16068507 -13519519 2478
1205 2478 6894102 -346390 -9812392 -6075014 10397962 23053114 17839675 -385698
1197 -385698 -13230499 -10787392 -2879897 -4609571 -16396777 -25418172 -22693777 -10029342
1189 -10029342 7118433 23174195 29367836 18535586 -3511173 -19652856 -18351162
1182 -18351162 -3504443 13485000 24382151 25758724 18555302 9684984 7649155 13211855
1174 13211855 19145139 19865593 14899786 3376743 -14808787 -30332128 -28480938 -7811940
1166 -7811940 14527511 22826210 19861728 16941928 15898163 11247777 3932820 963110
1158 963110 3611796 6408392 7615597 11493246 18624023 21655331 14297907 653513
1150F53513q121838N375423J3884842O951216j0908185k1358658j2146799O092123
1142a9578363J2153210K688601m239980K777088J1152956M600654j0580998j4032210
1134a5059042j276400J0009393N308946p308478r259282L970129J7926672J7586487
1126B1898425M712311o039376n903001j664332m132013j1714513j2771482l617008
1118a9230989M808437K290090o058402p666696m17946N834419M350411k42904
1110a6333580n85551K997310M372346K58036o351884r586987n428870N035183
1102b5623997J4948450J6208834P795873j215099p63209P116447Q549586m813004
1094B2203881k1634712k1727466k490951J4346919R474463p707686j1848046K235709
$$ plain form
1150 653513 -7468325 -2092902 11791940 18743156 7834971 -13523687 -25670486 -19578363
1142 -19578363 -7425153 -4736552 -8976532 -6199444 4953512 9554166 -1026832 -15059042
1134 -15059042 -16335442 -6326049 -1017103 -8325581 -17584863 -13614734 4311938 21898425
1126 21898425 26610736 20571360 14668359 13004027 8872014 -2842499 -15613981 -19230989
1118 -19230989 -14422552 -12132462 -18190864 -25857560 -26275506 -20441087 -16090676 -16333580
1110 -16333580 -16919131 -13921821 -9549475 -9291439 -15643323 -25230310 -30659180 -25623997
1102 -25623997 -10675547 5533287 13329160 12114061 11350852 18467299 27016885 22203881
1094 22203881 569169 -21158297 -23649248 -9302329 172134 -7535552 -19383598 -17147889
1086a7147889J2743081M565611p701142l631114R639783Q209566j0016465k0627083
1078b3965652r473274P781191J2457418R662080J2430084J4556839J403144j9598225
1070E253605k3588434n021407J1941785P488361p231742r681545J134659P163770
1062a2540948M74872o205313M56960J5271597K0914613Q730154j1365787k1554777
1054e818629j5003695k026567L977711L084292N169372J1713368J1733956p10751
1046A2119057j4877906j6530839n974228M845352Q012176M703576q49460m421937
1038a2974209k350682L491684M828572j818673p757906m260929L220125L505076
1030a4116942k119061k720102L801887Q674394Q248289Q042811R279225N558450
$$ plain form
1086 -17147889 -4404808 160803 -7540339 -11171453 -1531670 6677896 -3338569 -23965652
1078 -23965652 -33438926 -25657735 -13200317 -3538237 8891847 23448686 24851830 5253605
1070 5253605 -18334829 -23356236 -11414451 -3926090 -11157832 -20839377 -19704718 -12540948
1062 -12540948 -12066076 -18271389 -17814429 -2542832 18371781 27101935 15736148 -5818629
1054 -5818629 -20822324 -22848891 -18871180 -15786888 -10617516 1095852 12829808 12119057
1046 12119057 -2758849 -19289688 -25263916 -20418564 -12406388 -7702812 -8552272 -12974209
1038 -12974209 -15324891 -11833207 -7004635 -8823308 -16581214 -20842143 -17622018 -14116942
1030 -14116942 -16236003 -18956105 -15154218 -6479824 1768465 9811276 19090501 24648951
1022B4648951l077523o194808Q01417Q045546N790823k335047p640076q649969
1014A1389314p568847k985730N385588J1189016Q697184R61574n100341o608441
1006A5359317l369786M270897J1219630R321281p07690p280952m222825M04390
998B4994262o11240q23110O325060J1688547L545477j0593252j2772807k358322
990A9394615K504072p642679k0616923k1410223j0651638J524081R155270J1314142
982a6429283P920148J993743L00960N250291J0003246O951970j833675p296786
974F860614m748231J527315M646458K950420O6123j403412k936539m925562k445634
965d08448P270913J5167605Q652720q316681j5708446m755774P556942K879200
$$ plain form
1022 24648951 21571428 15376620 16178037 24223583 30014406 27679359 20039283 11389314
1014 11389314 3820467 834737 6220325 17409341 26106525 27068099 21967758 15359317
1006 15359317 11989531 16260428 27480058 36801339 36093649 28812697 24589872 24994262
998 24994262 24383022 23559912 29884972 41573519 45118996 34525744 21752937 19394615
990 19394615 21898687 14256008 -6360915 -27771138 -38422776 -36898695 -27743425 -16429283
982 -16429283 -8509135 -6515392 -6214432 -964141 9039105 15991075 14157400 6860614
974 6860614 2112383 3639698 8286156 11236576 11302699 9899287 6962748 2037186 -408448
965 -408448 6862465 22030070 30682790 22366109 6657663 1901889 9458831 12338031
957A2338031j0643416j1416982J724630Q687604K09177r360704o158112L792754
949a0827018P728352M862965J825334l27773m034615p067556n745644j739053
941a5325008J289453L432062N421713M959644J496815r04691p96523k958187q511718
932a1896440q677192K646318J5822372J5955146L605909o206244n441418k095827
924C712624m692715q094763k377674J0072625J5798966Q281253l239602o493462
916A2967252k241750j142439o718691r927469l430343O267317P558757J67065
908C499699n086050j398866O580729J0651732Q032569J590070l691495l931077
900A6247311m16658L54985m535778q034653k535841O679349P064515k492903r359383
$$ plain form
957 12338031 1694615 -9722367 -7997737 689867 899044 -8461660 -14619772 -10827018
949 -10827018 -3098666 1764299 3589633 3261860 -772755 -7840311 -13585955 -15325008
941 -15325008 -14035555 -10603493 -5181780 -222136 1274679 369988 -426535 -3384722 -11896440
932 -11896440 -20573632 -17927314 -2104942 13850204 17456113 11249869 5808451 3712624
924 3712624 -980091 -9074854 -11452528 -1379903 14419063 22700316 19460714 12967252
916 12967252 10725502 9583063 2864372 -7063097 -10493440 -4226123 3332634 3499699
908 3499699 -1586351 -2985217 3595512 14247244 22279813 23869883 20178388 16247311
900 16247311 15830653 16185638 11649860 3615207 1079366 7758715 14823230 12330327 2970944
891B970944n581873J938464L671729J78196k828809l945899m419442l150389J105205
882a0061874O802623J1861462J4310030J0419062m84548r684028p830470l05896
874A5026361o38186o941074k114925J6163484K4718372P145258j9421830k6981960
866F955500j4157567k345806k690413o258930l236840N387884J3819833J5674888
858A3148549N569907j1061752j6013374q21663J6152626J2895612l356123q012107
850H501675J739476N716511k562387o699538K18927K748358o971305j3143445
842a0451728m982610K794461l439668j0528546j227402J4885038J7245106P873769
834A2168420M019117O515625J482707j0863819j4429100m577102M908198M673433
$$ plain form
891 2970944 -2610929 -672465 2999264 3177460 348651 -3597248 -8016690 -11167079 -10061874
882 -10061874 -3259251 8602211 22912241 33331303 32846755 23162727 15332257 15026361
874 15026361 14388175 7447101 5332176 21495660 46214032 53359290 33937460 6955500
866 6955500 -7202067 -9547873 -12238286 -18497216 -21734056 -16346172 -2526339 13148549
858 13148549 18718456 7656704 -8356670 -9178333 6974293 19869905 16513782 8501675
850 8501675 10241151 15957662 13395275 6695737 6914664 9663022 2691717 -10451728
842 -10451728 -15434338 -12639877 -16079545 -26608091 -27835493 -12950455 4294651 12168420
834 12168420 16187537 22703162 24185869 13322050 -1107050 -5684152 -775954 3897479
826C897479L68021k363322n363559p128519j867291O633390P042858M74639O08281
817B301977Q420312O622683j0821027k3096231j1773503R869680J5255909J570792
809a649408j1178887j1659521p178582l589967M281272J7000214K1971284J0343925
801A8340330p739431j4848150p576367K645306O656027O270190N519064J955409
793A1222378p417780j5769144j0960821O967492K0346413J3618729n215643j3245348
785d53724k960746Q043990K974536j0090568j1096414K385713J2795650Q420194
777A0018631k394243o466135l698471k536065m989924n111748M9941N482417N377956
768d267641J052006p99208L024363P083650L320317p329548j3002459m465099
$$ plain form
826 3897479 4265500 1902178 -3461381 -10589900 -12457191 -5823801 1219057 1693696 2301977
817 2301977 10722289 17344972 6523945 -16572286 -28345789 -18476109 -3220200 -1649408
809 -1649408 -12828295 -24487816 -31666398 -35256365 -30975093 -13974879 7996405 18340330
801 18340330 10600899 -4247251 -11823618 -9178312 -2522285 3747905 9266969 11222378
793 11222378 3804598 -11964546 -22925367 -15957875 4388538 18007267 12791624 -453724
785 -453724 -3414470 4629520 7604056 -2486512 -13582926 -11197213 1598437 10018631
777 10018631 7624388 1158253 -2540218 -5076283 -10066207 -15177955 -15128014 -9645597 -4267641
768 -4267641 -3215635 -4014843 -990480 6093170 9413487 2083939 -10918520 -15383619
760a5383619J1660313J8872662R855720o098649j5553678j4426338o380012N256484
752a2197117J7230080K1815475J1444962r985997k6136586k3222071m772447J1916667
744a3907034J4199556N882192p91953j184037j090376m709071p389192m063233
736a3053148J178027N39090n542950q810452m596113L078857P564231N902899
728a3739559o6207m335150m61492R813625J4647135O271277n945319o540649L928446
719C572107J0105760N156281j558773l232562o134150j3716738j5530588m476243
711b5814906P023822L553090q613037r882606L510131J4995533J2332662K376198
703e19113j990528J387273M853976J717400p255419j4297134j1468529l86754
$$ plain form
760 -15383619 -3723306 15149356 25005076 18906427 3352749 -11073589 -17453601 -12197117
752 -12197117 5032963 26848438 38293400 28307403 2170817 -21051254 -25823701 -13907034
744 -13907034 292522 6174714 5382761 4198724 3108348 -1600723 -8989915 -13053148
736 -13053148 -11875121 -11336031 -16878981 -25689433 -30285546 -27206689 -19642458 -13739559
728 -13739559 -13805766 -18140916 -18602408 -8788783 5858352 12129629 6184310 -356339 3572107
719 3572107 13677867 18834148 17275375 14042813 7908663 -5808075 -21338663 -25814906
711 -25814906 -18791084 -15237994 -23851031 -33733637 -30223506 -15227973 -2895311 -519113
703 -519113 -2509641 -1122368 3731608 5449008 -1806411 -16103545 -27572074 -27958828
695b7958828P718169O326475L110676P869092J6238319J5550360L595938r287096
687B3163105j5007478j4105354q964624j515743L256408K154703Q91699N608682
679d518602R981553M234908n369084l135780R217209J1538871l419640j6547195
671A982240j0593238M219331O517845n886849j6617584j4534114l625353O776052
663c1761670J0520831N757105l572434q605378m067413N544108J1754738J0875786
655c554327M669035k629525n459197r15466O174584Q239400N732385M991474N800833
646B3049196K380443l021558k175935J298499o106148k2123907k4644608m352746
638c5696764J7219514J7335832L326492l306211N47634L166843K451286M722553
$$ plain form
695 -27958828 -20240659 -13914184 -10803508 -2934416 13303903 28854263 32450201 23163105
687 23163105 8155627 -5949727 -14914351 -16430094 -13173686 -11018983 -10127284 -4518602
679 -4518602 5462951 9697859 4328775 1192995 10410204 21949075 18529435 1982240
671 1982240 -8610998 -4391667 2126178 -3760671 -20378255 -34912369 -38537722 -31761670
663 -31761670 -21240839 -15483734 -19056168 -27661546 -31728959 -26184851 -14430113 -3554327
655 -3554327 1114708 -1514817 -6974014 -7889480 -1714896 6524504 12256889 17248363 23049196
646 23049196 25429639 22408081 20232146 21530645 15424497 -6699410 -31344018 -35696764
638 -35696764 -18477250 -1141418 2185074 -1121137 -573503 2593340 5044626 9767179
630I767179O820753J107781o698366n246290R59953j718457j0816574j0340893
622a6164914K050251J0862906P159399j495871p221804j0184085q856497N64833
614b3285782J2267218J4586594P757003K109021j566686j1125942k1466882j5714085
606c6439541O281694K1560796J5169451m72085o864803l195764J737553N857029
598C634330J0083793J0542973N385408k43149l411505p126868j0190382o988638
590A685962j871514o437418j5992836r433248J6023275L1596147J5968108j1132117
582B0406359j6308653O20263J1622070L749007p949728q925846l681816k052408
574b520752m031278m196810o96258M272811O823996M027444j231986j663843L185226
$$ plain form
630 9767179 16587932 17695713 10997347 5751057 6711010 4992553 -5824021 -16164914
622 -16164914 -14114663 -3251757 3907642 2411771 -4810033 -14994118 -23850615 -23285782
614 -23285782 -11018564 3568030 11325033 13434054 11867368 741426 -20725456 -36439541
606 -36439541 -30157847 -8597051 6572400 6100315 -764488 -3960252 -2222699 3634330
598 3634330 13718123 24261096 29646504 29403355 25991850 18864982 8674600 1685962
590 1685962 -185552 -6622970 -22615806 -32049054 -16025779 15570368 31538476 20406359
582 20406359 4097706 4717969 16340039 20089046 12139318 3213472 -468344 -2520752
574 -2520752 -6552030 -10748840 -11445098 -7172287 -348291 3679153 2447167 783324 3968550
565C968550M010374k838190o114880L304864J4852175J2039903k128343r453901
557A7640552l771089J919480l265552j3226005j5269663o309658N047348P890242
549i344345j52708r007090o697039L811238O559052l508192j0345553r11472J2525542
540a7070567J0141097m247113r219031J034405R802882M961829n691386j0576418
532b0864302r990859r081509p349391k392250L869219Q021053Q938195O775847
524b2073997L215812K151828M463649M693898k21837l379006J759746Q619728
516g70179P000904O99466J243646P021474N154069n921250j2853821r286594m996303
507a2708588p539982r459584j894310J0242135J5265842R715777M463n951043
$$ plain form
565 3968550 7978924 5140734 -974146 2330718 17182893 29222796 27094453 17640552
557 17640552 13869463 15788943 12523391 -702614 -15972277 -22281935 -17234587 -9344345
549 -9344345 -9497053 -18504143 -25201182 -21389944 -14830892 -18339084 -28684637 -29596109 -17070567
540 -17070567 -6929470 -11176583 -20395614 -19361209 -9558327 -4596498 -10287884 -20864302
532 -20864302 -30855161 -39936670 -47286061 -49678311 -45809092 -37788039 -28849844 -22073997
524 -22073997 -18858185 -16706357 -12242708 -7548810 -7770647 -11149653 -9389907 -770179
516 -770179 6230725 6930191 8173837 15195311 20349380 14428130 1574309 -7712285 -12708588
507 -12708588 -20248570 -29708154 -31602464 -21360329 -6094487 3621290 3625753 -2325290
499b325290n302371k396683m271501r857545q157496N239337J6771879J2436970
491B137300J06080k063093N727219Q013407L111555N256449J5522995J5795708
483E3607620k10592j3257946q019101L838581M101782n249156j0544258q018833
475A6248097k864603K075704M766112J778555k866417J117088J1852961J3103495
467D5210992N988j0388466o323346k13919m884386j0259970l609414M692714o58763
458A3571430j0564809o504524O170209P378274k793591o424477p88866o20751
450e77105p782081o579756O837782J5748769R862111r27963o263105q418869r165730
441g265947l457288O120922P335505j180320n356904L37681L209565l568759o789944
$$ plain form
499 -2325290 -7627661 -10024344 -14295845 -24153390 -32310886 -27071549 -10299670 2137300
491 2137300 2243380 180287 5907506 13920913 17032468 22288917 37811912 53607620
483 53607620 53397028 40139082 32119981 35958562 40060344 34811188 24266930 16248097
475 16248097 13383494 15459198 20225310 22003865 19137448 20254536 32107497 45210992
467 45210992 45216980 34828514 28505168 28291249 23406863 13146893 9537479 14230193 13571430
458 13571430 3006621 -3497903 2672306 10050580 7256989 832512 43646 -577105
450 -577105 -8359186 -14938942 -8101160 7647609 17509720 16581757 10318652 1899783 -7265947
441 -7265947 -10723235 -4602313 2733192 1552872 -3804032 -3466351 -256786 -3825545 -10615489
432a0615489L091335J1907507L103010j4247241j7968981m942772P747443R142968
424a2782220M554278N92600m147515j0454609j2265895m541144Q444844J6655632
416a3944029J4092883M007741m556190n568244j080078L700825P527834J0567251
408A4747993Q301843k786853j4572140j3927763j911227N960066K604194q52170
400b436057M643712R896888L470727p582256q510559j082326L20679n789239m397972
391a1466403J0643336K3091214J5026472q170993k3649240j8436563k502315O020017
383i444475K322060k671977O84702P568436O521581l177049r717356n408629K573385
374a0749322K880855m171605q286909m121985K412105L265219j412754m237009
$$ plain form
432 -10615489 -7524154 4383353 7486363 -6760878 -24729859 -29672631 -21925188 -12782220
424 -12782220 -8227942 -7635342 -11782857 -22237466 -34503361 -39044505 -30599661 -13944029
416 -13944029 148854 4156595 -399595 -5967839 -7047917 -3347092 4180742 14747993
408 14747993 23049836 20262983 5690843 -8236920 -10148147 -4188081 -1583887 -2436057
400 -2436057 2207655 12104543 15575270 7993014 -517545 -1599871 -1279192 -7068431 -11466403
391 -11466403 -823067 22268147 37294619 29123626 5474386 -12962177 -15464492 -9444475
383 -9444475 -7122415 -9794392 -9109690 -1541254 4980327 1803278 -7914078 -13322707 -10749322
374 -10749322 -7868467 -12040072 -20326981 -24448966 -22036861 -18771642 -20184396 -24421405
366b4421405K69967R325522J4684898J1334092K422986n030259p439715n819851
358d673765k360687M25375m69247m615596o108891j194223M492149L613029m75269
349a1367125J280736P764285Q867753L064870l4037K076623q96572j2632256j9998760
340b1874483j2811456o75134K784251J100667N381280J2967416J2874495O372614
332F119650M131551N788946K82391j3187037k1061433j4994972j786535Q797776
324b5909663J3649186J1931178L914995l513491k844733O33028m766690j5155704
316b2061894j2151995Q344429K5568517K1915468O357916k442359k911773n293196
308A7325113j0032050q712702r97197N429318Q848921J2908840J4241090N534461
$$ plain form
366 -24421405 -24151438 -14825916 -141018 11193074 13616060 8585801 1146086 -4673765
358 -4673765 -7034452 -6609077 -7078324 -11693920 -17802811 -18997034 -14504885 -10891856 -11367125
349 -11367125 -10086389 -2322104 6545649 9610519 9576482 11653105 10756533 -1875723 -21874483
340 -21874483 -34685939 -35361073 -32576822 -31476155 -26094875 -13127459 -252964 6119650
332 6119650 10251201 16040147 16322538 3135501 -17925932 -32920904 -34707439 -25909663
324 -25909663 -12260477 -329299 3585696 72205 -2772528 -2139500 -6906190 -22061894
316 -22061894 -34213889 -25869460 -300943 21614525 27972441 25530082 22618309 17325113
308 17325113 7293063 -1419639 -2416836 3012482 11861403 24770243 39011333 44545794
300D4545794r098111j6106925j1626282n375037l040801J148192R174954J0888407
292B0510191O43870r010692l405154J0905299J3073665k899279j9076111j7187329
284f445540j216887J0292569Q213644O04107j803401O37008O73555l211895m820595
275B922565n98859L834008J153509o506226r049170j799493P175127O890596j625150
266B396907n923959Q86731R507855O502885o222612j2820139n544147M371089
258f845390L916527k306752p72075Q137452J0336061J284292n989627j756020
250F004468M771106N00487j0733550j4621689p465450J834981P476429J1641863
242e91355J4462623J1569690L794223j228829n01753K675m213253r389274j0739837
$$ plain form
300 44545794 35447683 19340758 7714476 2339439 -701362 446830 9621784 20510191
292 20510191 21154061 12143369 8738215 19643514 32717179 29817900 10741789 -6445540
284 -6445540 -7662427 2630142 10843786 11447893 9644492 10281500 10955055 7743160 2922565
275 2922565 2323706 6157714 7311223 804997 -8244173 -10043666 -2868539 4022057 2396907
266 2396907 -3527052 -2640321 6867534 13370419 7147807 -5672332 -11216479 -6845390
258 -6845390 -2928863 -5235615 -6007690 2129762 12465823 13750115 7760488 6004468
250 6004468 10775574 11276061 542511 -14079178 -21544628 -19709647 -12233218 -591355
242 -591355 13871268 25440958 29235181 28006352 27504599 27507274 23294021 13904747 3164910
233C164910r023510o130270j248211M465190O182445K800785j91680P45481K449759
224C214899K778260N081860R488229Q302808k018592j1869317j0863114l044901
216A070132L57111k001211l022029j423100j874447k964081J771309J0385628
208B299312J2529663M958151m056214p971983q711365p869846l021126L547803
200h295605M462968N05416J755070R137697Q433474p321629k2204930j7948267
192c1475806m90907R704918P348903N097780R277631J0693039K450386p905253
184D700691r957158l865795L014953N256105J401004n958061r380044l072876
176a7861181P523220J0339947L022830l959569l265319J09308J17669j06772L475116
$$ plain form
233 3164910 -5858600 -11988870 -13237081 -8771891 -2589446 211339 19659 765140 3214899
224 3214899 5993159 11075019 20563248 28866056 26847464 14978147 4115033 1070132
216 1070132 1427243 -573968 -3595997 -5019097 -6893544 -9857625 -8086316 2299312
208 2299312 14828975 19787126 15730912 7758929 -952436 -8822282 -11843408 -8295605
200 -8295605 -3832637 -3327221 -1572151 7565546 15999020 8677391 -13527539 -31475806
192 -31475806 -31966713 -22261795 -14912892 -9815112 -537481 10155558 12605944 4700691
184 4700691 -5256467 -9122262 -6107309 -851204 549800 -5408261 -14788305 -17861181
176 -17861181 -10337961 1986 3024816 -934753 -4200072 -4090764 -3973095 -4079867 -604751
167f04751O274125K935269k055124j294088L077103L642940O86384Q20155M779621
158A8261634O329873K667360k751292p145310r712904o999751L168106J2902650
150A6720366J0397346k674410j0946675p019139k038363p070124j4451053r540651
142b6622703N618780J4333751R166368M35332j156472J644678J423844j075803
134C767775q05197J212563P3472l443911l616736N93900L607859J650701k700526
125C39900n865777p963071r632842q378992j824040P293258J2531537J0046645
117c453382K383378l696819l413015P97321J210853n592643j2372681q750033
109c2887021N004293J6813754J6769335P309078k447798p102332o614498k883183
$$ plain form
167 -604751 5669374 8604643 6549519 5255431 8332534 11975474 12661858 13482013 18261634
158 18261634 24591507 27258867 24507575 17362265 7649361 649610 3817716 16720366
150 16720366 27117712 24443302 13496627 6477488 4439125 -2630999 -17082052 -26622703
142 -26622703 -21003923 -6670172 2496196 2931528 1775056 3419734 4843578 3767775
134 3767775 2962578 4175141 4248613 804702 -2812034 -2218134 1389725 3040426 339900
125 339900 -5525877 -13488948 -23121790 -31500782 -33324822 -26031564 -13500027 -3453382
117 -3453382 -1070004 -4766823 -8179838 -7382517 -6171664 -11764307 -24136988 -32887021
109 -32887021 -27882728 -11068974 5700361 13009439 10561641 3459309 -3155189 -6038372
101f038372R07228J640207Q73349L683475R395139R794924J925341m793610k524054
92A4863627J114177n149771j5779239j4550613P8011J1213308P837637j580452
84a953315n083678l480021k840564k313982Q11535K716442k29920l242388j223797
75a6839688J154752k395843o943351k934345P502041J2094780N603682m161557
67f919529p899467m496102J351023M562493K466252k524980l944464K60952L171251
58a3972571j148887o949123m279411N755147J2596929J1338994O550682K172549
50A2064309k122033m765304l115458q36207l690064p699251l779510M991346N585496
41c366676k231282k523019R653324J5538864J020093j7571953j5251723L983595
$$ plain form
101 -6038372 -5131144 -3490937 -2617588 1065887 10461026 20255950 22181291 17387681 14863627
92 14863627 15977804 10828033 -4951206 -19501819 -19423808 -8210500 -372863 -1953315
84 -1953315 -7036993 -10517014 -13357578 -15671560 -14860025 -12143583 -12373503 -15615891 -16839688
75 -16839688 -15684936 -18080779 -25024130 -27958475 -20456434 -8361654 -2757972 -6919529
67 -6919529 -14818996 -19315098 -17964075 -13401582 -10935330 -13460310 -17404774 -17143822 -13972571
58 -13972571 -15121458 -22070581 -26349992 -20594845 -7997916 3341078 9891760 12064309
50 12064309 9942276 5176972 2061514 1225307 -2464757 -10164008 -13943518 -8952172 -3366676
41 -3366676 -5597958 -8120977 1532347 17071211 18091304 519351 -14732372 -10748777
33a0748777J3441636L856038n752037j64322J0412608R860943M83409m854417
25A6535081l524481k461745l495686k499551l3887j038920m500252l564386L073341
16a510486Q572546Q564790O599856O202087M528093j798625r777400j3592509
8G788352j1648458o418506n84164L282617K709270j178972l356319j691048
0a1097228
$$ plain form
33 -10748777 2692859 6548897 796860 632538 11045146 20906089 21389498 16535081
25 16535081 13010600 10548855 7053169 4553618 4519731 3480811 -1019441 -4583827 -1510486
16 -1510486 7062060 15626850 22226706 28428793 32956886 31158261 21380861 7788352
8 7788352 -3860106 -10278612 -10862776 -7580159 -4870889 -6049861 -9406180 -11097228
0 -11097228
$$ Imaginary data points
##PAGE= N=2
##DATA TABLE= (X++(I..I)), XYDATA
65535b528594K563104N487363M848045l770472j1563578o562492P186751J2900412
65527H560539M615822m972186m129687K422500M305365J220819j035647j993168
65519H994357l927102l963326J119750O634110O160893K200701J169180J542140
65511A9930703k493180q449694q163834j933853J463301p87536k259341K30886
65503b462548J934182N97176J021277N339329Q168959N737985J284149k664631
65495A8955878q523688j5435825j5865283o787614L375646N791611K554359K76659
65487a5658257j062571m762196p890072m110070N871206J3781759J3207159N096388
65479D473346m712685r902211p675737j576748J717515M16721o71889K100216
$$ plain form
65535 -2528594 34510 5521873 10369918 6599446 -4964132 -11526624 -4339873 8560539
65527 8560539 13176361 8204175 4074488 6496988 10802353 12023172 10987525 8994357
65519 8994357 5067255 1103929 2223679 8857789 15018682 17219383 18388563 19930703
65511 19930703 17437523 8987829 823995 -1109858 353443 -434093 -2693434 -2462548
65503 -2462548 -528366 68810 1090087 6429416 14598375 20336360 21620509 18955878
65495 18955878 10432190 -5003635 -20868918 -27656532 -24280886 -18489275 -15934916 -15658257
65487 -15658257 -16720828 -21483024 -29373096 -33483166 -27611960 -13830201 -623042 4473346
65479 4473346 -239339 -10141550 -17817287 -19394035 -17676520 -17259799 -17931688 -15831472
65471a5831472O294158Q091212O737529K401235m126044p455727j365364R655653
65463D401180J1479019j024522j4776018j5395833n574770K194041M066861N409558
65455i220484Q047775Q370880N812858L247043L23975m941697r503373q485603
65447f348626l674697j052050j302049k01239L074629N130299M235708R18194
65439G80169m426371q642715n598527L770747P734941r1857p993280k443312R393521
65430g516684R914633l47957l726954N316676J2438507Q729514L384823L370194
65422C1562752J50343j1126888j6621691m476559J2191995J1530699n219153j6454822
65414A536676j1584349j954204Q03128J145092P824979J7121784J7524558O672945
$$ plain form
65471 -15831472 -9537314 -1446102 5291427 7692662 3566618 -3889109 -5254473 4401180
65463 4401180 15880199 14855677 79659 -15316174 -20890944 -18696903 -14630042 -9220484
65455 -9220484 -1172709 7198171 13011029 16258072 16582047 11640350 2136977 -6348626
65447 -6348626 -10023323 -11075373 -12377422 -12578661 -9504032 -4373733 -138025 780169
65439 780169 -3646202 -12288917 -17887444 -14116697 -6381756 -6473613 -14466893 -16910205 -7516684
65430 -7516684 2397949 2049992 -1676962 3639714 16078221 24807735 28192558 31562752
65422 31562752 31713095 20586207 3964516 -512043 11679952 23210651 17991498 1536676
65414 1536676 -10047673 -12001877 -11198749 -10053657 -2228678 14893106 32417664 39090609
65406C9090609m875201p321447l462517l341781r732192j4846124j2726171q063911
65398b5278735p267519o904476k85270Q361919Q249792r0482m041714J892688
65390b5363797Q720610Q662086N403610K928673k634071j1318266j1911219J976521
65382b3535853J8002000J9981018R543561M39966k463148m900304q285534p437717
65374A343989k155678J544014K095870L417873M850501O77276q494023j3219279
65366i939457p323766L803311R394030L910973q286678j5470050q546659P057506
65358b5400790J4218165N017470p106500n046001P946849J3914108O230292l730586
65350F043007n440848j266601K396330M137068M151095J453481k181773l091217
$$ plain form
65406 39090609 34215408 26893961 23431444 20089663 10357471 -4488653 -17214824 -25278735
65398 -25278735 -32546254 -39450730 -39736000 -31374081 -23124289 -23214771 -27256485 -25363797
65390 -25363797 -16643187 -7981101 -2577491 351182 -2282889 -13601155 -25512374 -23535853
65382 -23535853 -5533853 14447165 23990726 24430692 21967544 17067240 8781706 1343989
65374 1343989 -811689 732325 2828195 6246068 11096569 11773845 3279822 -9939457
65366 -9939457 -17263223 -13459912 -4065882 -154909 -8441587 -23911637 -32458296 -25400790
65358 -25400790 -11182625 -6165155 -13271655 -18317656 -10370807 3543301 9773593 6043007
65350 6043007 602159 -664442 1731888 5868956 10020051 11473532 9291759 6200542
65342F200542j963655j832454o97451M334969O986017j582473j5497520j7496640
65334b1548665l125698J1544791J1842725K432976k913764O74162P701464J0526614
65326A7134605M517223p139350j2144962k871164Q637164M092763j1891950j5786134
65318a5451805k666697M323380o662420j3256268M002008K4343274J5870613j2575514
65310b073429k2091887j261221J9950283J6999787J523366m536089p86072K24461
65302G949199l779846n508031k226036K311090M057801O24515o632044j0015747
65294a3219099l841298L765283l92755j2594428j4314744n11456J1167116P245374
65286b2696007k330994k949737K246981K819331O14128K705816N259658J546908
$$ plain form
65342 6200542 4236887 2404433 1706982 6041951 13027968 11445495 -4052025 -21548665
65334 -21548665 -24674363 -13129572 -1286847 1146129 -1767635 -1093473 6607991 17134605
65326 17134605 21651828 14512478 2367516 -503648 8133516 12226279 334329 -15451805
65318 -15451805 -18118502 -13795122 -20457542 -33713810 -29711802 -5368528 10502085 -2073429
65310 -2073429 -24165316 -25426537 -5476254 11523533 13046899 8510810 7724738 7949199
65302 7949199 4169353 -1338678 -3564714 -1253624 2804177 3428692 -3203352 -13219099
65294 -13219099 -17060397 -13295114 -13687869 -26282297 -40597041 -41108497 -29941381 -22696007
65286 -22696007 -25027001 -27976738 -25729757 -22910426 -22296298 -19590482 -14330824 -12783916
65278a2783916k054069M250996J3974821J2499750J187669m932745j861518m66478
65270I814510n016893o637385k024492q77897p566749j0847191j312626J2917143
65262a1551580J7728843J1105656J062841o351140q766457m714622K541598M790833
65254E845972o2612l374632N42866M139073n70100o880902l551861N545411O437691
65245H070906k357667p256425j315534N580038L370459l274846m373493N3852
65237a502710L045634K966765L238739L179497j289712q057565q549064L27106
65229f641310J0070168J0332100J145651q390964j1232607p943097k299539L339744
65221a1619854O586839L811229m735297j0749891n205178Q854355J6502386P778205
$$ plain form
65278 -12783916 -14837985 -10586989 3387832 15887582 17075251 12142506 10280988 9814510
65270 9814510 4797617 -1839768 -3864260 -4742157 -12308906 -23156097 -24468723 -11551580
65262 -11551580 6177263 17282919 18345760 11994620 3228163 -1486459 1055139 5845972
65254 5845972 5783360 2408728 2951594 7090667 6520567 -360335 -3912196 1633215 8070906
65245 8070906 5713239 -1543186 -2858720 2721318 6091777 2816931 -1556562 -1502710
65237 -1502710 1542924 4509689 7748428 10927925 9638213 1580648 -6968416 -6641310
65229 -6641310 3428858 13760958 14906609 6515645 -4716962 -12660059 -14959598 -11619854
65221 -11619854 -5033015 -1221786 -5957083 -16706974 -21912152 -13057797 3444589 11222794
65213A1222794r382551j7868854j0938156K045371Q489508N710284L35492o55073
65205a1041185L879228Q956042P744292j312343j0778964j0965278j611955P012220
65197h117943O701440P42095k565879j527655p11384j645717q41560K586218L792525
65188a587860o02191o862231r203736p088384l440421J507698Q743695J3609818
65180d923612P793015q078069j9406789j2457083P177677J8705798J0888103m427010
65172d727970q639585l28557N811443J381935n300541l919760K563304M523074
65164h636657J170901J19346L788538N650181J365677m080084l988689P47098
65156c863689M374510M717261M034231L296114O76805l790903o127546l311728
$$ plain form
65213 11222794 1840243 -16028611 -26966767 -24921396 -16431888 -10721604 -10386112 -11041185
65205 -11041185 -7161957 1794085 9538377 8226034 -2552930 -13518208 -15130163 -8117943
65197 -8117943 -1416503 -674408 -3240287 -4767942 -5479326 -7125043 -7966603 -5380385 -1587860
65188 -1587860 -2190051 -9052282 -18256018 -25344402 -28784823 -27277125 -18533430 -4923612
65180 -4923612 2869403 -5208666 -24615455 -37072538 -29894861 -11189063 -300960 -4727970
65172 -4727970 -13367555 -13696112 -7884669 -6502734 -11803275 -15723035 -13159731 -8636657
65164 -8636657 -7465756 -7346410 -3557872 2092309 3457986 -622098 -4610787 -3863689
65156 -3863689 510821 5228082 9262313 12558427 13235232 9444329 3316783 5055
65148E055J654466K429658k714189p933578o628162M5458M452595K420859j785508
65139h053346k275704N76784K839931M154545O256176O472283N26262p742894
65131B754037q158515Q66297P452599K495174o285402n366659M236176Q533841
65123F527548J327772p710518q126215k065898K420343L757134N724195Q722952
65115A0577313R147271N590977M89984l379168m436370j895474K865137O031058
65107B4990728N152276J512908k898321p350758r440363n631180J562363L313356
65099A1211009k727940o226942P23186R068764N524297n218955o708171K419228
65091H064476O049448j790826o400808J598824Q396939J48770j1190288n287053
$$ plain form
65148 5055 1659521 4089179 1374990 -6558588 -13186750 -13141292 -8688697 -6267838 -8053346
65139 -8053346 -10329050 -9752266 -6912335 -2757790 3498386 9970669 10496931 2754037
65131 2754037 -5404478 -4538181 2914418 5409592 -875810 -6242469 -2006293 6527548
65123 6527548 7855320 144802 -7981413 -10047311 -7626968 -3869834 1854361 10577313
65115 10577313 19724584 25315561 25805545 22426377 17990007 16094533 18959670 24990728
65107 24990728 30143004 31655912 28757591 21406833 11966470 6335290 7897653 11211009
65099 11211009 8483069 2256127 2979313 12048077 17572374 12353419 5645248 8064476
65091 8064476 14113924 12323098 5922290 7521114 15918053 16066823 4876535 -410518
65083d10518J2534925J7025117K34983j8320844k1275827j4133148j0064308j0071005
65075d4480625p682731k043825L217796O927762R190962R207852Q682057J0829762
65067f150990J3130009R296407Q42021l704436l879496q348711j6041490j2371875
65059b7228561N944141J8704310R926102o295168o631772N655939Q194434l509774
65051D759651j1126984n065567L018678L542079K649230M762094J657321r948141
65043e751639j7100751j0051123R43439K014952k850059j252386O321340R958894
65035a7767333Q125723O829745N814221M32182n647482m052218L030772M639888
65027A405498j707454p018687o070719l753391m337859n736301o977576j0280016
$$ plain form
65083 -410518 12124407 29149524 29384507 11063663 -10212164 -24345312 -34409620 -44480625
65075 -44480625 -52163356 -54207181 -50989385 -44061623 -34870661 -25662809 -16980752 -6150990
65067 -6150990 6979019 16275426 17117447 13413011 9533515 1184804 -14856686 -27228561
65059 -27228561 -21284420 -2580110 7345992 1050824 -5580948 74991 8269425 4759651
65051 4759651 -6367333 -11432900 -8414222 -4872143 -2222913 2539181 4196502 -5751639
65043 -5751639 -22852390 -32903513 -31960074 -29945122 -32795181 -34047567 -27726227 -17767333
65035 -17767333 -9641610 -2811865 3002356 3434538 -2212944 -6265162 -3234390 1405498
65027 1405498 -301956 -7320643 -13391362 -17144753 -21482612 -27218913 -34196489 -44476505
65019d4476505j2291054m648215J1231231K0349249J2730262k178383p889390
65012b7172805j591633N909976O531664K237285k191155n384112p241170o231430
65004c5133380j190135O468041J3222813J5303486J1151708L535228k063965k854240
64996H439556j478685k099279n110484p171816n467854q34420K811470K249348
64988h662164q96941j102850L762474Q105140N676623p23442k593219J580333
64980E145954M126161J75355n489879o661854l906841o16036K400420L772731
64972a053989J89994n932790m990445N511369J2474935M006631j0772739j2259874
64964a2826908J420077J1509129N832011n457847p301405o66760L132904N49511
$$ plain form
65019 -44476505 -56767559 -61415774 -50184543 -29835294 -17105032 -19283415 -27172805
65012 -27172805 -28764438 -22854462 -16322798 -14085513 -16276668 -21660780 -28901950 -35133380
65004 -35133380 -36323515 -29855474 -16632661 -1329175 9822533 13357761 11293796 8439556
64996 8439556 6960871 4861592 -248892 -7420708 -12888562 -13722982 -10911512 -8662164
64988 -8662164 -9559105 -10661955 -6899481 1205659 6882282 6158840 3565621 5145954
64980 5145954 9272115 9447470 3957591 -2704263 -6611104 -7227140 -4826720 -1053989
64972 -1053989 -863995 -6796785 -11787230 -6275861 6199074 10205705 -567034 -12826908
64964 -12826908 -11406831 102298 5934309 476462 -6824943 -7491703 -4358799 -3809288
64956c809288k242846j086144K023645M991578Q036093R861262P190513n97973
64948B4366840r396681j3584240j0566866l621760l79295m722867r462560l057511
64940c0424940J3418384K3007019J2818524p964932j7782809p483867J1716481
64933b696140K2602090J7048290q91435j8630873k2578871j0115608N686914J0053104
64925D77471M052518L18040L312705N033913P12928l916064m481107m692459n693281
64916d875336j043080R668264J3862189L243798j1688187j6129719j1250194o962166
64908b5174431k969523O516981J5132748J0767469j856561m752485M902617R466511
64900A2033326k04886r672473n047352M760639M013695m737267p596334k493758
$$ plain form
64956 -3809288 -6052134 -7138278 -5114633 -123055 7913038 17774300 24964813 24366840
64948 24366840 14970159 1385919 -9180947 -12802707 -13182002 -17904869 -27367429 -30424940
64940 -30424940 -17006556 6000463 18818987 10854055 -6928754 -14412621 -2696140
64933 -2696140 19905950 36954240 36062805 17431932 -5146939 -15262547 -9575633 477471
64925 477471 4529989 4848029 8160734 13194647 13907575 9991511 5510404 817945 -4875336
64916 -4875336 -5918416 3749848 17612037 20855835 9167648 -6962071 -18212265 -25174431
64908 -25174431 -28143954 -21626973 -6494225 4273244 2416683 -2335802 2566815 12033326
64900 12033326 11828440 2155967 -2891385 1869254 5882949 1145682 -6450652 -8944410
64892h944410Q70168j091828l210990l523158l834970q71146Q937458J7123731
64884E454855J0505015p950390j9594089j4344429j561958O767329J0235693J1594082
64876A106108P339862l773064j2531290j0023052k95657O758747R424331J1759345
64868I765330J2130303N112458o535817j1731588m821871O681543J0162184P26586
64860B1489128j4085835k0627444j2085694L297797J0628466O630141L073522
64853a679919Q195555J3417635P069901o085871j1216368n222110J231808K260145
64845G970776L164101O401088N268132k980636r918558r149452o332735p763590
64837a3340874q470113j739870P363606R482110O114136N012421M709854k421704
$$ plain form
64892 -8944410 -8074242 -9166070 -12377060 -15900218 -19735188 -20606334 -11668876 5454855
64884 5454855 15959870 8009480 -11584609 -25929038 -27490996 -20723667 -10487974 1106108
64876 1106108 8445970 4672906 -7858384 -17881436 -18177093 -11418346 -1994015 9765330
64868 9765330 21895633 27008091 20472274 8740686 3918815 10600358 20762542 21489128
64860 21489128 7403293 -13224151 -25309845 -22012048 -11383582 -4753441 -1679919
64853 -1679919 6515636 19933271 27003172 20917301 9700933 4478823 5710631 7970776
64845 7970776 11134877 17535965 22804097 19823461 9904903 755451 -5577284 -13340874
64837 -13340874 -21810987 -23550857 -16187251 -6705141 -591005 4421416 9131270 6709566
64829F709566j2941871j3140551k67668J0437929O642957l671403m456825N993754
64821d694112J4709883J2740654N073696J570823M216015N657363j277341j3289621
64813B4707360j7392355n859435J0620663J2717068k228265j4664105r498924
64806a597993K053234j0770j2686015j3910014K382110J5108181P380838p974768
$$ plain form
64829 6709566 -6232305 -19372856 -19640524 -9202595 -2559638 -6231041 -10687866 -4694112
64821 -4694112 10015771 22756425 27830121 29400944 33616959 39274322 37996981 24707360
64813 24707360 7315005 1455570 12076233 24793301 22565036 7900931 -1597993
64806 -1597993 455241 444471 -12241544 -26151558 -23769448 -8661267 -1280429 -9255197
$$ [...]
##END NTUPLES=NMR SPECTRUM
##END=
