##TITLE=31Pdec_LR-698-R2-1-CR6
 CDCl3, 124 sc
 31.1.2020
##JCAMPDX= 6.0         $$ Bruker NMR JCAMP-DX V2.0
##DATA TYPE= NMR SPECTRUM
##DATA CLASS= NTUPLES
##ORIGIN= UXNMR, Bruker Analytische Messtechnik GmbH
##OWNER= root
$$ XWIN-NMR		Version 3.5
$$ Fri Jan 31 15:47:51 2020 Russian Standard Time (UT+4h)  she@DPX200
##.OBSERVE FREQUENCY= 81.013821
##.OBSERVE NUCLEUS= ^31P
##.ACQUISITION MODE= SIMULTANEOUS
##.ACQUISITION SCHEME= undefined
##.AVERAGES= 124
##.DIGITISER RES= 17
##SPECTROMETER/DATA SYSTEM= spect
##.PULSE SEQUENCE= zgpg30
##.SOLVENT NAME= CDCl3
##.SHIFT REFERENCE= (INTERNAL, CDCl3, 0, 182.463)
##AUDIT TRAIL= $$ (NUMBER, WHEN, WHO, WHERE, WHAT)
$$ ##TITLE= Audit trail, XWIN-NMR		Version 3.5
$$ ##JCAMPDX= 5.01
$$ ##ORIGIN= Bruker BioSpin GmbH
$$ ##OWNER= she
$$ F:/spectra/data/she/nmr/P31/1/pdata/1/auditp.txt
$$ ##AUDIT TRAIL=  $$ (NUMBER, WHEN, WHO, WHERE, WHAT)
(   1,<2020-01-31 15:46:14.03 +0400>,<she>,<DPX200>,
      <continue with go, POWCHK disabled, PULCHK disabled
       configuration hash MD5:
       00 E9 B6 7A A2 85 ED C7 34 08 36 98 17 FE 4E 26
       data hash MD5: 32K
       34 47 F6 9F F4 00 9B 6D D4 5E FE CA D0 64 82 72>)
(   2,<2020-01-31 15:46:16.25 +0400>,<she>,<DPX200>,
      <Start of raw data processing
       efp BC_mod = 2 LB = 1 FT_mod = 6 PKNL = 1 PHC0 = -1653.132 PHC1 = 60.00131 SI = 64K 
       data hash MD5: 64K
       32 7F 9C 5E 54 A3 94 F4 68 CB D9 58 5F 54 FB BF>)
(   3,<2020-01-31 15:46:20.10 +0400>,<she>,<DPX200>,
      <abs ABSG = 5 
       data hash MD5: 64K
       9E B3 80 2D 86 7D 81 B6 39 D1 38 CB 71 F3 E9 90>)
(   4,<2020-01-31 15:46:45.21 +0400>,<she>,<DPX200>,
      <pk PHC0 = -12.92264 PHC1 = 0 
       data hash MD5: 64K
       5D 19 18 EB B1 29 E3 41 80 DE 1F F1 03 DE EA 9A>)
$$ ##END=
$$ 
$$ hash MD5
$$ 71 D7 36 5C C1 BD 49 4A 78 D2 11 25 9B 9B 37 64
##$RELAX= 
##$RELAX= 
##$RELAX= 
##$RELAX= 
##$RELAX= 
##$RELAX= 
##$RELAX= 
##$RELAX= 
$$ Bruker specific parameters
$$ --------------------------
##$DU= <F:/spectra>
##$EXPNO= 1
##$NAME= <P31>
##$PROCNO= 1
##$TYPE= <nmr>
##$USER= <she>
##$AMP= (0..31)
100 100 100 100 100 100 100 100 100 100 100 100 100 100 100 100 100 100 
100 100 100 100 100 100 100 100 100 100 100 100 100 100 
##$AQSEQ= 0
##$AQ_mod= 1
##$AUNM= <au_zg>
##$AUTOPOS= <>
##$BF1= 81.014009
##$BF2= 200.13
##$BF3= 200.13
##$BF4= 200.13
##$BF5= 200.13
##$BF6= 200.13
##$BF7= 200.13
##$BF8= 200.13
##$BYTORDA= 1
##$CFDGTYP= 0
##$CFRGTYP= 5
##$CHEMSTR= <none>
##$CNST= (0..31)
1 1 145 1 1 1 1 1 1 1 1 1 1 1 1 1 1 1 1 1 1 1 1 1 1 1 1 1 1 1 1 1 
##$CPDPRG= <waltz16>
##$CPDPRG1= <>
##$CPDPRG2= <waltz16>
##$CPDPRG3= <>
##$CPDPRG4= <mlev>
##$CPDPRG5= <mlev>
##$CPDPRG6= <mlev>
##$CPDPRG7= <mlev>
##$CPDPRG8= <mlev>
##$CPDPRGB= <>
##$CPDPRGT= <>
##$D= (0..31)
0 1 0 0 0 0 0 0 0 0 0 0.03 2e-05 3e-06 0 0 0 0 0 0 0 0 0 0 0 0 0 0 0 0 
0 0 
##$DATE= 1580470994
##$DBL= (0..7)
120 120 120 11 120 120 24 19 
##$DBP= (0..7)
150 150 150 150 150 150 150 150 
##$DBP07= 0
##$DBPNAM0= <>
##$DBPNAM1= <>
$$ [...]
##$SUBNAM3= <"">
##$SUBNAM4= <"">
##$SUBNAM5= <"">
##$SUBNAM6= <"">
##$SUBNAM7= <"">
##$SUBNAM8= <"">
##$SUBNAM9= <"">
##$SW= 369.568048894756
##$SWIBOX= (0..15)
0 1 3 0 0 0 0 0 0 0 0 0 0 0 0 0 
##$SW_h= 29940.119760479
##$TD= 32768
##$TD0= 1
##$TE= 0
##$TE2= 300
##$TE3= 300
##$TEG= 300
##$TL= (0..7)
0 120 53 12 22 120 120 120 
##$TP= (0..7)
150 150 150 150 150 150 150 150 
##$TP07= 0
##$TPNAME0= <>
##$TPNAME1= <>
##$TPNAME2= <>
##$TPNAME3= <>
##$TPNAME4= <>
##$TPNAME5= <>
##$TPNAME6= <>
##$TPNAME7= <>
##$TPOAL= (0..7)
0.5 0.5 0.5 0.5 0.5 0.5 0.5 0.5 
##$TPOFFS= (0..7)
0 0 0 0 0 0 0 0 
##$TUNHIN= 0
##$TUNHOUT= 0
##$TUNXOUT= 0
##$USERA1= <user>
##$USERA2= <user>
##$USERA3= <user>
##$USERA4= <user>
##$USERA5= <user>
##$V9= 5
##$VALIST= <valist>
##$VCLIST= <CCCCCCCCCCCCCCC>
##$VD= 0
##$VDLIST= <DDDDDDDDDDDDDDD>
##$VPLIST= <PPPPPPPPPPPPPPP>
##$VTLIST= <TTTTTTTTTTTTTTT>
##$WBST= 1024
##$WBSW= 4
##$XGAIN= (0..3)
0 0 0 0 
##$XL= 0
##$YL= 0
##$YMAX_a= 17107
##$YMIN_a= -9637
##$ZGOPTNS= <>
##$ZL1= 120
##$ZL2= 120
##$ZL3= 120
##$ZL4= 120
##$ABSF1= 182.463
##$ABSF2= -187.1042
##$ABSG= 5
##$ABSL= 3
##$ALPHA= 0
##$AQORDER= 0
##$ASSFAC= 0
##$ASSFACI= 0
##$ASSFACX= 0
##$ASSWID= 0
##$AUNMP= <proc_1d>
##$AZFE= 0.1
##$AZFW= 0.5
##$BCFW= 0
##$BC_mod= 2
##$BYTORDP= 0
##$COROFFS= 0
##$CY= -3
##$DATMOD= 1
##$DC= 0
##$DFILT= <>
##$DTYPP= 0
##$F1P= 0
##$F2P= 0
##$FCOR= 1
##$FTSIZE= 65536
##$FT_mod= 6
##$GAMMA= 0
##$GB= 0
##$INTBC= 1
##$INTSCL= 5.30512e-09
##$ISEN= 30
##$LB= 1
##$LEV0= 0
##$LPBIN= 0
##$MAXI= 10000
##$MC2= 0
##$MEAN= 0
##$ME_mod= 0
##$MI= 50
##$NCOEF= 0
##$NC_proc= -8
##$NLEV= 6
##$NOISF1= 182.463
##$NOISF2= 159.3651
##$NSP= 0
##$NTH_PI= 0
##$NZP= 0
##$OFFSET= 182.463
##$PC= 4
##$PHC0= -1666.055
##$PHC1= 60.00131
##$PH_mod= 1
##$PKNL= yes
##$PPARMOD= 0
##$PSCAL= 0
##$PSIGN= 0
##$REVERSE= no
##$SF= 81.0140089999434
##$SI= 65536
##$SIGF1= 159.3651
##$SIGF2= -187.1042
##$SINO= 113.3802
##$SIOLD= 16384
##$SREGLST= <1H.CDCl3>
##$SSB= 0
##$STSI= 65536
##$STSR= 0
##$SW_p= 29940.119760479
##$SYMM= 0
##$S_DEV= 0
##$TDeff= 32768
##$TDoff= 0
##$TI= <>
##$TILT= no
##$TM1= 0
##$TM2= 0
##$TOPLEV= 0
##$USERP1= <user>
##$USERP2= <user>
##$USERP3= <user>
##$USERP4= <user>
##$USERP5= <user>
##$WDW= 1
##$XDIM= 65536
##$YMAX_p= 303745185
##$YMIN_p= -78783002
$$ End of Bruker specific parameters
$$ ---------------------------------
##NTUPLES= NMR SPECTRUM
##VAR_NAME=  FREQUENCY,     SPECTRUM/REAL,   SPECTRUM/IMAG
##SYMBOL=    X,             R,               I
##VAR_TYPE=  INDEPENDENT,   DEPENDENT,       DEPENDENT
##VAR_FORM=  AFFN,          ASDF,            ASDF
##VAR_DIM=   65536,         65536,           65536
##UNITS=     HZ,            ARBITRARY UNITS, ARBITRARY UNITS
##FACTOR=    0.456856943014862, 1,           1
##FIRST=     14782.0589164792, 0,            0
##LAST=      -15158.0608439998, 0,           0
##MIN=       -15158.0608439998, -78783002,   0
##MAX=       14782.0589164792, 303745185,    0
$$ Real data points
##PAGE= N=1
##DATA TABLE= (X++(R..R)), XYDATA
$$ [...]
4085b2065952O33096M994317L870667m819013r754020k104579J0875363J5619263
4077b750858Q752414k282950q802868o416207K397192P818810K263938p606700
4069f627229q305606n89259N04712r036006j3055385o34193J4744410J4891254
4061h107302L502447k357873J735083O228067O222818N513925N062571J788153
4053A9587889k366943k409714m13456k848879q986180j2162327j1216465j0431413
4045c1247488r231508k579240Q051865J3977258J1346189O161824N384399Q650499
4037A0513798J0050937M597225o493517j4930585j3255586n477918l019100o864658
4029b4879404m017828J1202449K3908510J8582367K496143n688722l293867k587810
$$ y = [-22065952, -21432856, -16438539, -12567872, -17386885, -27140905, -29245484, -18370121, -2750858, 6001556, 3718606, -5084262, -11500469, -9103277, -1284467, 979471, -6627229, -14932835, -15522094, -15017382, -24053388, -37108773, -37742966, -22998556, -8107302, -4604855, -6962728, -5227645, 1000422, 7223240, 12737165, 17799736, 19587889, 17220946, 14811232, 14397776, 11548897, 2562717, -9599610, -20816075, -31247488, -40478996, -43058236, -35006371, -21029113, -9682924, -3521100, 1863299, 10513798, 20564735, 25161960, 18668443, 3737858, -9517728, -14995646, -18014746, -24879404, -28897232, -17694783, 6213727, 24796094, 27292237, 21603515, 18309648, 15721838]
4021A5721838p068466p403136n29265M695863L040052j109719n279451j1333591
4013i265875j4091082l936155J4296397K1113025Q619927p354122j0381439n231319
4005f230643n021741q027856k354911J1852091J9744577J1949567k975474r682879
3997I252731m324893J935260k913074j5903750k0752227p771501J2011382J9224431
3989i241641J0210248j66272L12060P236797R605675M493349l491768j0006995
3981H951453j1928114n723806Q265307K1871311K4622417J3881366j948732j0675870
3973D7315332p982469k474786n874066j6791682k0666602j0284487K071476K075739
3965a2611545m878164k973015P742468J0738910j269400j5497737j7235018o209944
$$ y = [15721838, 8653372, 1250236, 720971, 5416834, 8456886, 7347167, 2067716, -9265875, -23356957, -27293112, -12996715, 8116310, 16736237, 9382115, -999324, -6230643, -11252384, -19280240, -21635151, -9783060, 9961517, 21911084, 18935610, 9252731, 4927838, 6863098, 3950024, -11953726, -32705953, -40477454, -28466072, -9241641, 968607, 802335, 1114395, 8351192, 17956867, 22450216, 18958448, 8951453, -2976661, -8700467, -435160, 21436151, 46058568, 59939934, 57991202, 47315332, 39332863, 36858077, 30984011, 14192329, -6474273, -16758760, -14687284, -12611545, -17489709, -20462724, -12720256, -1981346, -3250746, -18748483, -35983501, -42193445]
3957d2193445Q150627J6415762J2280995k082907j2369911o254525Q201521J2163111
3949e688772L853283n08285N115803P890168N64289o522762n937907m819879o275210
3940a2329272o97018J2061213J4136646j118951j3379116p323197J679770l944532
3932a0914457j1770218l120052J0728534Q549457q14653M605446J4902356K455707
3924A4622120k3657744k3515138P962604K7059999Q590533j5331697q673782J3004425
3916F1320J3837107k538683l563781J5662451K4869928O594183j9603315k7021006
3908H298204j3765663K875051Q828033K975832n889694p356883k16820N339372
3900A087432J876050l428256j81650O993234M813363n988772r301170K285351
$$ y = [-42193445, -34042818, -17627056, -5346061, -7428968, -19798879, -26053404, -17851883, -5688772, -1835489, -2343774, 2772029, 10662197, 11226486, 4703724, -1234183, -6054062, -12329272, -13026290, -965077, 13171569, 12052618, -1326498, -8649695, -6969925, -10914457, -22684675, -25804727, -15076193, -6526736, -7341389, -2735943, 12166413, 14622120, -9035624, -32550762, -24588158, 2471841, 11062374, -4269323, -12943105, 61320, 13898427, 11359744, 7795963, 23458414, 48328342, 54922525, 35319210, 8298204, -5467459, -2592408, 6235625, 9211457, 3321763, -4035120, -4251940, 1087432, 2963482, -464774, -646424, 6346810, 11160173, 5171401, -4129769, -1844418]
3892a844418J5557235J5112058L113093p444338j1199956j2188748j1515853m706932
3884a5117859P170694J3113562N119144r090775j3787698m897449N590197O788130
3876e112054K472880J946333M628804L254563j924828l732860j738533l097757
3868c303452q139823p562309J581802Q811749N774737j434636l239915k89778
3860g801625K614069O871517J3365456J3664814J382054j3187860j4152781k933421
3852a77777M216742O03015l835484j349271K775131L055664L584729O974164N394156
3843B1241069o445096j7872666j4562194P1738Q733407M934389J048920P766212
3835D915779J6672520J2477720l512066j3781286q555480J435926J211080p879798
$$ y = [-1844418, 13712817, 28824875, 31937968, 24493630, 13293674, 1104926, -10410927, -15117859, -7947165, 5166397, 10285541, 1194766, -12592932, -17490381, -11900184, -5112054, -2639174, -692841, 3935963, 7190526, 5265698, 1532838, -205695, -3303452, -11443275, -19005584, -17423782, -8612033, -2837296, -4271932, -7511847, -7801625, -5187556, 1683961, 15049417, 28714231, 30096285, 16908425, 2755644, -177777, 4038965, 4641980, 806496, -542775, 2232356, 5288020, 8872749, 15846913, 21241069, 14795973, -3076693, -17638887, -17567149, -8833742, -3899353, -2850433, 4915779, 21588299, 34066019, 30553953, 16772667, 8217187, 9653113, 10864193, 2984395]
3827B984395j2665347q245603k272415q5525K118372O034541N178755k678715
3819i631542p158092N12884J2563302J5544983J0150062O789396N697781k174784
3811C2293990j4654920j6611892l941122P140886M008041l467962m68310Q213180
3803A2511891P394266k323629o201094j036741k61080r812485j6109471o848647
3795b2686990R228235J4719797P011069k535131o955975q506614p819387j672594
3787a9217590O818386P724135j104712q270489m148073N056051O084735l323396
3779a0380953j3020567j4141859o459467O091956J8799504K4931509J9483807
3772B5303930O572789l638903p839101j2428223k0291291k2956403j2772979L400609
$$ y = [2984395, -9680952, -17926555, -20198970, -20284495, -18166123, -12131582, -6952827, -9631542, -16789634, -16276750, -3713448, 11831535, 21981597, 28770993, 34468774, 32293990, 17639070, 1027178, -2913944, 4226942, 8234983, 4767021, 4298711, 12511891, 19906157, 17582528, 11381434, 10344693, 10083613, 271128, -15838343, -22686990, -13458755, 1261042, 8272111, 5736980, -1218995, -9725609, -17544996, -19217590, -12399204, -4675069, -5779781, -14050270, -18198343, -13142292, -7057557, -10380953, -23401520, -37543379, -44002846, -37910890, -19111386, 5820123, 25303930, 31876719, 28237816, 20398715, 7970492, -12320799, -35277202, -48050181, -44649572]
3764d4649572J1595232Q349088J997241j278039k460828j157220O230730J6374955
3756d998413J8123255Q226216j589458j743490Q6806p057073j5849565j0022842
3748a4824564O962016J2309402k042346j4815961o533408J0969320J3644232K309975
3740G978666j548446P607058J1214907j610902j6540979j7460967q671845j507920
3732b0540428M761608J3453412J5988223N369033o339670m380374K407374n491303
3724E227875k2882184k3275675n68630J8587289J3993517M36142J431629J3023731
3716E973694J4087672J151736q779328n861447J549708M109060L749770M902897
3708B0883762N352858J395701m976829q662440p701943m723496l826979n917968
$$ y = [-44649572, -33054340, -24705252, -22708011, -23986050, -26446878, -27604098, -21373368, -4998413, 13124842, 21351058, 19761600, 18018110, 18104916, 11047843, -4801722, -14824564, -7862548, 4446854, 2404508, -12411453, -18944861, -7975541, 5668691, 7978666, 6430220, 14037278, 25252185, 23641283, 7100304, -10360663, -19032508, -20540428, -15778820, -2325408, 13662815, 19031848, 12692178, 8311804, 10719178, 5227875, -17654309, -40929984, -41498614, -22911325, -8917808, -8481666, -7050037, 5973694, 20061366, 21213102, 12433774, 6572327, 8122035, 12231095, 15980865, 20883762, 26236620, 27632321, 22655492, 13993052, 6291109, 1567613, -2259366, -8177334]
3700h177334o733487k575808J965046j037006q380255o602855P011353J6285691
3692h244655R423977j308810J481392J1483768R142762m395583p984868L417426
3684A3015409Q535318n135538j8783534j1100155P287660R047237q876094k0737008
3676b6746705q179172J5985344K5300468J0998297j0009919j4833444N81416J6630453
3668I726738J2362584q013562j8677338n372183J5312305J8409115K952322j1283571
3660A5416410j3110597r293437n863217J661355J3807861J8445441P094435r939175
3652A8219076j5680658p631281K909861P584425O757760K078762n407558j0258795
3644a428408o501171J877434L991185j835885n042467l12243K698905m556008
$$ y = [-8177334, -14910821, -17486629, -15521583, -16558589, -24938844, -31541699, -24530346, -8244655, 1179322, -129488, 1351904, 12835672, 21978434, 17582851, 9597983, 13015409, 21550727, 16415189, -2368345, -13468500, -6180840, 2866397, -6009697, -26746705, -34925877, -18940533, 6359935, 17358232, 7348313, -7485131, -6903715, 9726738, 22089322, 14075760, -4601578, -9973761, 5338544, 23747659, 26699981, 15416410, 2305813, -6987624, -12850841, -11189486, 2618375, 21063816, 28158251, 18219076, 2538418, -5092863, -2183002, 5401423, 12159183, 14237945, 8830387, -1428408, -7929579, -6052145, -2060960, -3896845, -8939312, -9251555, -6552650, -11108658]
3636a1108658j3195438r150740M141960J0297783N587266L367887R465596J0256659
3628I662315m384569k0097408j5669096N848969K0542247J5963168L756369j895632
3620A3726363k776595o696566j1262785p993019L432501J3936314J5512707P463741
3612B5342661m926916j3655251j3276824o716199k150207j394789K453731J1463155
3604b860639J5038074M342331j1646215j6091863p509500m74798k810010n198944
3596b7211564J840527J2246102J4030757O678481o30542l334364m285413m792323
3588e458339k832173j00557j220297l958660L80795J2428746J9318877J1027520
3580B9585912m437742j1205285o484182r80946o48382r8456M285898O678957K493703
$$ y = [-11108658, -24304096, -33454836, -29312876, -19015093, -13427827, -10059940, -594344, 9662315, 5277746, -14819662, -30488758, -24639789, -4097542, 11865626, 15621995, 13726363, 10949768, 4253202, -7009583, -15002602, -11570101, 2366213, 17878920, 25342661, 20415745, 6760494, -6516330, -13232529, -15382736, -16777525, -14323794, -2860639, 12177435, 16519766, 4873551, -11218312, -18727812, -19202610, -22012620, -27211564, -25371037, -13124935, 905822, 7584303, 6953761, 3619397, -666016, -5458339, -8290512, -8391069, -9611366, -13570026, -13189231, -760485, 18558392, 29585912, 25148170, 13942885, 7458703, 6477757, 5829375, 5730919, 10016817, 16695774, 19189477]
3571A9189477l070426l910015k264559j852428J12324N074923N055360n874582
3563A2460074j7625149j5152506q24233Q233959M834596l96108J954125O894067
3555C78825N756817j446541r881509j5961115j4621114j253038J7481809K5099299
3547E553433J4774726j719152j0928786j3204602j3983940j1577520m334378O77362
3539c4742857j298995k089995N775755J3599791R633306m47372l517037k675901
3531a5763305j0333619k0987997j4431106J0735456K9114460K2529835L523686
3524D387410n989362l841619k106330m548087m923935j621137j79709k647700
3516b1470469m131619l97441O474400J0112144N809052l695595r164782o012763
$$ y = [19189477, 16119051, 12209036, 9944477, 8092049, 8204373, 13279296, 18334656, 12460074, -5165075, -20317581, -21141814, -12907855, -8073259, -8469367, -6515242, 378825, 6135642, 4689101, -5192408, -21153523, -35774637, -37027675, -19545866, 5553433, 20328159, 18609007, 7680221, -5524381, -19508321, -31085841, -35420219, -34742857, -36041852, -38131847, -32356092, -18756301, -9122995, -9570367, -13087404, -15763305, -26096924, -47084921, -61516027, -50780571, -21666111, 863724, 4387410, -1601952, -5443571, -7549901, -12097988, -17021923, -18643060, -18822769, -21470469, -25602088, -25999529, -19525129, -9412985, -3603933, -7299528, -16464310, -22477073]
3508b2477073j738649m004868n317780N825624J9906663J3437929j2733230k5142841
3500c2244225l249943K6500952K5025091m365982k2492035j0322792J0113827
3493a1035107J3647731M079800k168538l089230n946822q813410l990180O647643
3485a0668113J3486196J3285836J0674955P572688J111237p635565j1290716n292869
3477A1243649N606644J2689341J2208221O534935j609596j1950835k2187600k4783053
3469a2248294j4538680Q59501O208009j324779o293607L146835J5650089J1711804
3461C170878o725439j7813910j0593283K899822J0027845J4152180J9879171J8517983
3453C3515247L179452j3493564j4187115k800439J911165m867839r258761k934804
$$ y = [-22477073, -24215722, -28220590, -33538370, -27712746, -7806083, 5631846, -7101384, -32244225, -35494168, -8993216, 16031875, 11665893, -10826142, -21148934, -11035107, 2612624, 6692424, 4523886, 1434656, -4512166, -13325576, -17315756, -10668113, 2818083, 16103919, 26778874, 34351562, 35462799, 27827234, 16536518, 11243649, 16850293, 29539634, 41747855, 48282790, 46673194, 34722359, 12534759, -12248294, -26786974, -25927473, -19719464, -21044243, -27337850, -24191015, -8540926, 3170878, -3554561, -21368471, -31961754, -29061932, -19034087, -4881907, 14997264, 33515247, 36694699, 23201135, 9014020, 6213581, 8124746, 3256907, -6001854, -8936658]
3445h936658N185245N770920K462031J361378k38358n623077r040518m624159
3437a3683196J825112M00887p610352j1694962p198359M27832N480485P546388
3429b4506165O713948J509179n721438p948259j865533P211978J2268222J2666105
3421C28037J1873054J0783132P966809M179471J392625j549923o772611j0967046
3413A7233548p644316K000856O883138m78879j3081661j8114647j2655810l288318
3405b9146089O467627J7548899K4580648J7151912k636780j5909319j0074454
3398G982444K960439L705025o806677j0911306k888953L881977M50059m319769
3390e946761j327120K699381j626264q126304m245006P697682J2844982N507518
$$ y = [-8936658, -3751413, 2019507, 4481538, 5842916, 5604558, -18519, -9059037, -13683196, -11858084, -11457197, -19067549, -30762511, -37960870, -37533038, -32052553, -24506165, -17792217, -16283038, -22004476, -29952735, -31818268, -24606290, -12338068, 328037, 12201091, 22984223, 30951032, 35130503, 36523128, 34973205, 28200594, 17233548, 9589232, 11590088, 18473226, 17994347, 4912686, -13201961, -25857771, -29146089, -22678462, -5129563, 19451085, 36602997, 33966217, 18056898, 7982444, 10942883, 14647908, 7841231, -3070075, -5959028, -2077051, -1626992, -5946761, -7273881, -4574500, -6200764, -14327068, -18572074, -10874392, 1970590, 7478108]
3382G478108m163648n731159J25566P324040J1676822R886678L42238j1082510
3374A5856135j3744633n517568L061447K908111j421104P103O979363J0104656
3366A8233510N544800M14458J564946N268270K565872p715753j5926667j2381264
3358b431828J276979J3353353J4039801M401179o277091r774556m867277L201158
3350A2921718O842297J803176q041294j2656612o112111N368451R275988J597946
3342A0999559p646936o085649N475846J2583240L961835j2789165j7165747p06340
3334a1373357J8631490J5675636r058098k7276437j8442278M534639J5161490
3327a2146915Q445231Q04755J492494L446091K272811M117579Q933282M616886
$$ y = [7478108, 3314460, -2416699, -2291133, 5032907, 16709729, 26596407, 26938645, 15856135, 2111502, -3406066, -344619, 2563492, 1142388, 1149491, 8128854, 18233510, 23778310, 24192768, 25757714, 31025984, 33591856, 25876103, 9949436, -2431828, -1154849, 12198504, 26238305, 30639484, 24362393, 14587837, 9720560, 12921718, 19764015, 21567191, 13525897, 869285, -5242826, 125625, 9401613, 10999559, 3352623, -2733026, 2742820, 15326060, 19287895, 6498730, -10667017, -11373357, 7258133, 22933769, 13875671, -13400766, -31843044, -27308405, -12146915, -3701684, -2896929, -1404435, 2041656, 4314467, 8432046, 17365328, 21982214]
3319B1982214j1700200k2396967j3290166L604447P233579j757131n264212K694738
3311a8893698R700907P769399M358461O611071R805687P866917L312279r7229
3303C0433794m303746r502466r429529k310667K406690j735909n126780L959372
3295D390759J7474102J5469290l899061j8498510j2463262K022733M296099m733059
3287D059091q080069j925451N12078m709842l093162J2074613K3033478J2957368
3279C4828104n987240j0038836J93691M456221j495077j880653O042059L966141
3271C0084410j2812189k0670383m789197J3325276Q508770p688694p354696P106212
3263E709509Q793011p214304j6254030n337416Q172820P542548N74771N31790
$$ y = [21982214, 10282014, -12114953, -25405119, -21800672, -14567093, -16324224, -21588436, -18893698, -9192791, -1423392, 2935069, 9546140, 19351827, 27218744, 30531023, 30433794, 26130048, 16627582, 7198053, 4887386, 7294076, 5558167, 431387, 4390759, 21864861, 37334151, 33435090, 14936580, 2473318, 4496051, 8792150, 4059091, -4020978, -5946429, -5434351, -10144193, -13237355, -1162742, 21870736, 34828104, 28840864, 18802028, 18995719, 23451940, 21956863, 20076210, 26118269, 30084410, 17272221, -3398162, -8187359, 5137917, 13646687, 5957993, -1396703, 5709509, 14502520, 7288216, -8965814, -14303230, -6130410, 1412138, 1986909, 2518699]
3255B518699M243869L126994k59844r8682J132994M73702J870450N498123K379706
3246B0886011r182161j4675006m178461R311031P497583o099917j2687072o031315
3238a5159307K273965K896851o38549k114139j461653q31130J09016K212407M372649
3229h339890L945584j444393r936234j3142698m211003J0477980J6288876R561694
3221C199916J373851j266070l951395p833623j098654J8756507K9583834J1786323
3213E0550689j8680047k7166396o908727J3315999R956515p092833j4005710n055917
3205e086427N406171M740879l705668o834172J566074J2229471J1588029P13721
3197B0618078n711027j778254J246354l990689p021998J38881M607448o099366
$$ y = [2518699, 6762568, 9889562, 9629718, 9531036, 10664030, 11137732, 13008182, 18506305, 20886011, 11703850, -2971156, -7149617, 2161414, 9658997, 3559080, -9127992, -15159307, -12885342, -9988491, -10627040, -12741179, -14202832, -15033962, -14924946, -12712539, -8339890, -4394306, -5838699, -15774933, -28917631, -33128634, -22650654, -6361778, 3199916, 4573767, 3307697, -643698, -8477321, -9575975, 9180532, 38764366, 50550689, 31870642, 4704246, -2204481, 11111518, 21068033, 13975200, -30510, -5086427, 319744, 5060623, 1354955, -5479217, -3913143, 8316328, 19904357, 20618078, 14907051, 13128797, 14375151, 10384462, 3362464, 3501345, 8108793, 2009427]
3189B009427j8011847j0456256Q001002J1495917j043204o773764m63355j163569
3181a6405649j2694461j2865980N709206J8011476Q384301j284897J0467030K5881579
3173B5202605J7297024n798698j2858148j762522K783209o249245j0197637k071766
3165F344822O72094j1084710j9810799r038613J0557994J7427766Q190894l042154
3157B17294n917024k604739N22242R63231K18001J51102K73413m90060O81390
3148e985150P903917J6337813J2672212o179869k2724446j9002034j233199R237094
3140h973662N089850k560223o021599q838295j0687259l722496J0324799J6705974
3132h682911R376151O82179K04286n70040j0072746j7302809p315900J3010394
$$ y = [2009427, -16002420, -26458676, -18457674, -6961757, -8004961, -14778725, -15242080, -16405649, -29100110, -41966090, -36256884, -18245408, -9861107, -11146004, -678974, 25202605, 42499629, 36700931, 23842783, 22080261, 24863470, 18614225, 8416588, 6344822, 7016916, -4067794, -23878593, -32917206, -22359212, -4931446, 3259448, 217294, -5699730, -8304469, -7782227, -6818996, -6600995, -6449893, -6176480, -6666540, -5985150, 1918767, 18256580, 30928792, 24748923, 2024477, -16977557, -18210756, -8973662, -3883812, -6444035, -12465634, -21303929, -31991188, -35713684, -25388885, -8682911, 693240, 1375419, 1579705, 1009665, -9063081, -26365890, -33681790, -20671396]
3124b0671396K2311705J3653522J47294o459954p318236n809298m54017O688020
3116B087640O802177l043040j2424422j0598450j365953L243706R58620J898392
3108a2441330J1959240K1061170J4042633q468293k6351528k0825352L442439
3101a7581021K2061057J7541263k409906j6014724j2503776m06863P032117O736780
3093D454927L724363J100239j670214l811721l576030l026019n744315q649812
3085a7198582l459046R849030J8235488J1670211r80765k166016R711221J6962678
3077D2624219O678482j1671484j8663006q329483P296850J2928431L987715j0944202
3069B3907522j7640132r603722L477063N858091l595778r551036l453125L112911
$$ y = [-20671396, 1640309, 15293831, 15441125, 8981171, 1662935, -4146363, -4600380, 2087640, 8889817, 5846777, -6577645, -17176095, -18542048, -15298342, -14339722, -12441330, -482090, 20579080, 34621713, 26153420, -198108, -21023460, -17581021, 4480036, 22021299, 19611393, 3596669, -8907107, -9313970, -2281853, 4454927, 8179290, 9279529, 7609315, 3797594, 221564, -2804455, -8548770, -17198582, -20657628, -10808598, 7426890, 19097101, 18116336, 15950320, 25661541, 42624219, 49302701, 37631217, 18968211, 10638728, 17935578, 30864009, 34851724, 23907522, 6267390, -3336332, 140731, 5998822, 2403044, -7147992, -10601117, -7488206]
3061g488206j670070q157204p0291J5952713J6392744l400980k0165929j5806464
3053b4413687j342624L172765k202434l441482J577233J008917q735927j4211819
3045d8589058l512564J5408642K2241146Q132374j2849797j8405468l313754J4103251
3037b6785228J4187092K04366p800061j461150N972274K016652n577562k076161
3029b1319778J0362030J5883309Q641188q36609m189377o668549j3795088j7135914
3021b9058788m478536J9476095L3576722K3678929j513255k1797618k6956958
3014g073409k1326911j1945086k076946L766774r6492r924267j1364917K456199
3006e7585055J8500192J9663326P756846j284870j320395o78944l611873k929343
$$ y = [-7488206, -9158276, -17315480, -17385771, -1433058, 14959686, 11558706, -8607223, -24413687, -25756311, -22583546, -24785980, -28227462, -26650229, -25641312, -34377239, -48589058, -52101622, -36692980, -14451834, -6319460, -19169257, -37574725, -40888479, -26785228, -12598136, -12393770, -20193831, -21654981, -15682707, -13666055, -19243617, -21319778, -10957748, 4925561, 13566749, 12730140, 8540763, 1872214, -11922874, -29058788, -33537324, -14061229, 19515493, 43194422, 41681167, 19883549, -7073409, -28400320, -40345406, -42422352, -38655578, -38752070, -48676337, -60041254, -57585055, -39084863, -19421537, -11664691, -12949561, -14269956, -14948900, -18560773, -21490116]
2998b1490116N050574J2320017J1819697O340462l20133q346117j2693932m168464
2990a1488012J1932028J4820138j704075j4871514n774551R269327L563943j5652139
2982i904855j7101244M215712J8208043O686391j0195086p820194O678731J0653232
2974A420730J166257o483150m957108k19885L470642O639637N814171k740049
2966D111245j1661364r019075L351968J0781687O558731r6171K28220M441248
2958H696489M925302J334407j595827j974133j219817r60311l066087q093207
2950a953184j0791150l521423J1130678J7903796O790551j1172585j5599422k634254
2942i846993J0870910J0353867Q34584l455314J565193Q439543J0933147R316163
$$ y = [-21490116, -16439542, -4119525, 7700172, 14040634, 13720501, 5374384, -7319548, -11488012, 444016, 15264154, 13560079, -1311435, -7085986, 2183341, 5747284, -9904855, -27006099, -22790387, -4582344, 2104047, -8091039, -15911233, -9232502, 1420730, 2586987, -3896163, -8853271, -9073156, -5602514, 1037123, 6851294, 4111245, -7550119, -16569194, -13217226, -2435539, 4123192, 4027021, 4255241, 8696489, 13621791, 14956198, 13360371, 11386238, 10166421, 9206110, 6140023, -1953184, -12744334, -16265757, -5135079, 12768717, 19559268, 8386683, -7212739, -9846993, 1023917, 11377784, 12212368, 8757054, 10322247, 18761790, 29694937, 39011100]
2934C9011100M876957k119514q250097q322424l530141k127034q366457j5380636
2926d208246j3295981j790995Q983844Q939279j922031j2648358j1079868K427746
2918b4594610J2706288P094805o601091r106465K710251J0234836P13463j3322730
2910b0165253j3378029j987718M894067L874031M127669O250840J721381o441478
2902b1104490l498940J1689435K0751232J3258397J861390o55754j624376j0913035
2894I763859j8813639j1127693M164156P003082k918578o038024N315793J5382939
2886B731895J0118639l112186r079369n333977l37350M22535j879322m207657
2878a0676792l984893m70965K661649O99259m089274m220982O45891J216547o640661
$$ y = [39011100, 43888057, 41768543, 33518446, 25196022, 21665881, 19538847, 11172390, -4208246, -17504227, -19295222, -10311378, -1372099, -3294130, -15942488, -27022356, -24594610, -11888322, -4793517, -11394608, -20501073, -17790822, -7555986, -6842523, -20165253, -33543282, -35531000, -30636933, -26762902, -22635233, -16384393, -14663012, -21104490, -24603430, -12913995, 7837237, 21095634, 22957024, 22301270, 20676894, 9763859, -9049780, -20177473, -16013317, -9010235, -11928813, -17966837, -12651044, 2731895, 12850534, 9738348, 658979, -4674998, -5012348, -4589813, -6469135, -10676792, -14661685, -15132650, -12471001, -11771742, -15861016, -20081998, -19436107, -18219560, -24860221]
2869b4860221j2654271n654225R328041J6897576J1657894L170182L14793K11180
2861a589051k988503n803622n15390R749493J1180514j406423j3786801j0003824
2853a5163607M155781Q483403j356887p335805J118071Q712169J24688j1306830
2845a2569017l296958J6188081J7528495l194750j5424935j520432J5619515R726957
2837B3056956q267703j1339787l90382K413025m848522q92159J9268500L1260089
2829E0260017J7105026q906614k2743937k1150551j5350917q771726J559303J0015367
2821B015968P008829l421701o319419J877574O798068k651234j6736121j7655121
2813b9083157m522802N482237J565051n922934j968395R889781J3059889M179933
$$ y = [-24860221, -37514492, -43168717, -33840676, -16943100, -5285206, -2115024, -1800231, -1589051, -4577554, -10381176, -10896566, -1147073, 10033441, 8627018, -5159783, -15163607, -11007826, -2524423, -3881310, -11217115, -10099044, -1386875, -1262187, -12569017, -15865975, 322106, 17850601, 14655851, -769084, -2289516, 13329999, 23056956, 14789253, 3449466, 3059084, 5472109, 623587, -268572, 18999928, 50260017, 67365043, 58458429, 35714492, 14563941, -786976, -9558702, -7999399, 2015968, 9024797, 5603096, -716323, 1161251, 7959319, 5308085, -11428036, -29083157, -33605959, -28123722, -26558671, -32481605, -34450000, -24560219, -11500330, -7320397]
2805g320397j055582P208702J6387294J0098281o973117j6184361j0772334j080857
2797i692371K576531m36839o136122q615607p48820J4988364K0562020L355799
2789A5852955k0071219k1045926K91681J3543297K180877j4430905j3204984R24661
2781c5959563J0390341J2582092J3637731J0359665j501689j2461277j2036312
2774a4989012o332045m781929q31023J3037495K2309558Q805547j4687884j7205180
2766a4674473L847902J8205964R180180m236991k125300N856215J513011j0484744
2758G081764j2445232k705825M393669J847324k454683p0592O921891R716305
2750A2284621K586149j0071208j5574988o493024Q008490J2169607M597330j601465
$$ y = [-7320397, -8375979, -1167277, 15220017, 25318298, 18345181, 2160820, -8611514, -9692371, -7115840, -7552679, -13688801, -22304408, -23053228, -8064864, 12497156, 15852955, -4218264, -25264190, -24972509, -11429212, -9248335, -23679240, -36884224, -35959563, -25569222, -12987130, 650601, 11010266, 9508577, -2952700, -14989012, -21321057, -26102986, -26934009, -13896514, 8413044, 17218591, 2530707, -14674473, -10826571, 7379393, 16559573, 12322582, 10197282, 16053497, 17566508, 7081764, -5363468, -8069293, -3675624, -1828300, -4282983, -4353575, 2568316, 12284621, 14870770, 4799562, -10775426, -17268450, -9259960, 2909647, 7506977, 5905512]
2742E905512k67741J48783n700539r446360l730237N246930Q779199Q146045P329010
2733A6410602M098078k381037n433314j967532L07825l714394o458626j383810
2725e22208M112836J552421l113886k90411N865974M888911k534358p974913r043138
2716g058772p023065Q28790J2714954J5442253K480513j0226703n306264P536399
2708I388105O029792p835045j0949782K308008J1246769K890079j0030903j3346771
2700a0299748j1482811j2257938j1002781k934304M194378L093145J06725L309034
2692c7274300Q590696R068686P937339J0494218J2828976R710234N004008L328333
2684B9688190J07810q574423j4760479r905237J1260L882635L386487P087721
$$ y = [5905512, 5637771, 5786554, 86015, -9360345, -13090582, -7843652, 935547, 9081592, 16410602, 20508680, 18127643, 12694329, 10726797, 11034622, 7320228, 861602, -522208, 3590628, 5143049, 2029163, 1738752, 7604726, 12493637, 9959279, 1984366, -7058772, -14081837, -13253047, -538093, 14904160, 17384673, 7157970, 1851706, 9388105, 15417897, 7582852, -3366930, -1058922, 10187847, 13077926, 3047023, -10299748, -21782559, -34040497, -45043278, -47977582, -43783204, -40690059, -40583334, -37274300, -28683604, -19614918, -11677579, -1183361, 11645615, 21355849, 26359857, 29688190, 29796000, 21221577, 6461098, -3444139, -3432879, 449756, 3836243, 10923964]
2676A0923964J2005139P505492m382003r387702l574981J04416p062373j5392384
2668i260432j1933418K34529P535387M782565r48125k600204p81938P53097M23925
2659a1794614j792044n116972o400140k607694K808346J574257o829760r975863
2651d0134484J857035J8555171K0345481N206409p329744m052598M750414N347347
2643D545031L429793J0934622K0409738J3604928p637355k0586823j4183031k713302
2635G803601r70347m102715k173467R25671l207430r766187o680083O710360J8343339
2626F882742J8451711Q131898m532592j1023073p933692n32920K112155k001774
2618I554455o258490n875947l067208j85096L749959O978416M643693j999939
$$ y = [10923964, 22929103, 30434595, 26052592, 16664890, 13089909, 13194325, 6131952, -9260432, -21193850, -20959321, -13423934, -8641369, -9589494, -12189698, -12971636, -12218539, -11794614, -13586658, -18703630, -25103770, -27711464, -24903118, -23328861, -30158621, -40134484, -38277449, -19722278, 623203, 5829612, -1500132, -5552730, -802316, 4545031, 7974824, 18909446, 39319184, 52924112, 45286757, 24699934, 10516903, 7803601, 6833254, 2730539, 557072, 1482743, -1724687, -11490874, -18170957, -11460597, 6882742, 25334453, 33466351, 28933759, 17910686, 9976994, 9444074, 11556229, 9554455, 3295965, -2579982, -5647190, -5832286, -2082327, 4896089, 9539782, 7539843]
2610G539843n274435l200353j679106j695600K830161R896772P042766q026553
2602G433495j9042167j3655668r56521M448781K528606Q2062l078936o156849
2594b8397197M18342J8138879K8581440J6944679l939815j2494157r779348j0124254
2586f51431j1616424k404545J0897218R866938l472531r446399m913282m914859
2578a6655315q756817K381589K6333812L2435042Q373855j6342805j4449604j075859
2570A2243898m056821j6958770j3250450O925621J7325113P851560l872756l982563
2562B224832Q18194K229532L172429M697563K5174r569403j0497704J040860Q458769
2553B600246r52806j4936672j5212008o493957p011983j6050584j3674099N439730
$$ y = [7539843, 2265408, -934945, -2614051, -4309651, -1479490, 8417282, 15460048, 7433495, -11608672, -25264340, -26220861, -21772080, -19243474, -19161412, -22240348, -28397197, -27978855, -9839976, 18741464, 35686143, 31746328, 19252171, 9472823, -651431, -12267855, -14672400, -3775182, 6091756, 2619225, -6827174, -11740456, -16655315, -25412132, -23030543, 3303269, 35738311, 44112166, 27769361, 13319757, 12243898, 8187077, -8771693, -22022143, -15096522, 2228591, 10080151, 6207395, 2224832, 3043026, 5272558, 8444987, 13142550, 13167724, 3598321, -6899383, -5858523, 2600246, 1647440, -13289232, -28501240, -34995197, -42007180, -58057764, -71731863, -66292133]
2545f6292133K0312043J5090892L095638M594504J5376255J6609558O213148j475381
2537A3524524k503753o361530j2483499q194302N364931R929986J213377j876266
2529a386532Q316348J1189344n581604j8906389o681438J1744553N623910j4499069
2521a0180877j4552065L405910N284957j2026379j0691575K2814066M8266930
2514C2320967L1137401o088927k1535044j2971218n962059n756377J864461J4063269
2506B7072473J1541413o690313j9105504j4494840m895392j891878p21944N378127
2498c807858J0831463O379503o303140j4856550q822354Q182140J8605959R329100
2490A9538263q771207j0914860P226712K0332800Q667060j3507616k0510215j1825065
$$ y = [-66292133, -45980090, -30889198, -27793560, -23199056, -7822801, 8786757, 14999905, 13524524, 11020771, 4659241, -7824258, -16018560, -10653629, -723643, 489734, -1386532, 6929816, 18119160, 12537556, -6368833, -13050271, -1305718, 4318192, -10180877, -24732942, -21327032, -16042075, -28068454, -38760029, -15945963, 32320967, 63458368, 57369441, 35834397, 22863179, 16901120, 11144743, 13009204, 27072473, 38613886, 31923573, 12818069, -1676771, -6572163, -8464041, -9185985, -3807858, 7023605, 13403108, 7099968, -7756582, -16578936, -8396796, 10209163, 19538263, 10767056, -147804, 7078908, 27411708, 36078768, 22571152, 2060937, -9764128]
2482i764128n383560n082206K65952J0118595R780127l040568j1241667l969341
2474a8316796P966443R232393o85089j1343260j4233136p614865K806368O195314
2466b5992628j782362r944266m360354J0840606J7555872Q756957l465580o615298
2458a5007053j833194L849752P362284P275999J731283o499982j0378191p196718
2450b0695820p83508N172198Q920159P062217j863779j1027335j1710233n125701
2442c0051802Q94931M244224P467452Q414542M338532J125415M234395N325132
2434E992821m759355j4636372o175224J2617919J5067301r53414o694880J0572879
2426A1031675K3923135Q368701j9138491k5622201r655006L489002K300623k081498
$$ y = [-9764128, -15147688, -20229894, -19963942, -9845347, -65220, -3105788, -14347455, -18316796, -10350353, -1117960, -1803049, -13146309, -27379445, -34994310, -32187942, -25992628, -27774990, -37719256, -42079610, -31239004, -13683132, -4926175, -8391755, -15007053, -16840247, -12990495, -5628211, 1647788, 3379071, -3120911, -13499102, -20695820, -21479328, -16307130, -7386971, -324754, -2188533, -13215868, -24926101, -30051802, -29156871, -24912647, -17445195, -9030653, -4692121, -3566706, 667689, 5992821, 1233466, -13402906, -19578130, -6960211, 8107090, 7153676, 458796, 11031675, 34954810, 43323511, 24185020, -1437181, -11092187, -7603185, -5302562, -7384060]
2418g384060j535983n36830q38814K440708P768788O981718l09864n810409n781025
2409e005771k389261N526170J8092002K3605889J0041314j2842153k1843049j2745728
2401B439413m204428m950544o12928J5615693K2977746M414372k0069683j8297295
2393b687654N187621J4862570j984711j8095729j1599029J065161k990795j2310633
2385b8553199j216265K2951786K6900835M225352j2754287l073092J1788771M986473
2377B5256374j3005586j4436734K42438O571926k313046p839457L82164R582256
2369D440335P572094o77259p392843j4029941k0677365j9681319q623990L558388
2361e5511900J0255237J4257343J6429564J2211854M559532L688332P768550K726265
$$ y = [-7384060, -8920043, -9456873, -10295687, -7854979, -86191, 6895527, 6585663, 775254, -5005771, -7395032, -1868862, 16223140, 39829029, 49870343, 37028190, 15185141, 2439413, -1765015, -6715559, -7328487, 8287206, 31264952, 35679324, 15609641, -2687654, 2499967, 17362537, 15377826, -2717903, -14316932, -13251771, -16242566, -28553199, -29769464, -6817678, 20083157, 24308509, 11554222, 8481130, 20269901, 25256374, 12250788, -2185946, -1943508, 4628418, 2315372, -5524085, -5141921, 4440335, 12012429, 11335170, 3942327, -10087614, -30764979, -50446298, -59070288, -55511900, -45256663, -30999320, -14569756, -2357902, 2201630, 5889962, 13658512, 16384777]
2353A6384777j0636303j1309449O973240J8346643K412174k0743019j8724226
2346a7296163M591324J7322408P656705o219967j1080439j3213656j4789408m628242
2338c7657438J7018686K8234166J4822171o809037j1418481J766584J1834663
2331A7791314N036532j2106994k5063821k5950481j6234271k238914R928460J7360814
2323c1477361J9608280J6713723J0267860M476200K057236K81080m732108j1214880
2315E980030j3545721r163167m7951R403443J2237134K814704j2599498j6211149
2307b1132175K92958K0828694K2835050N632890j1934064j7738661j4680043n782786
2299b1678137R680395K2873823J7611954o168406k6136057k3725162n092609J1164253
$$ y = [16384777, 5748474, -5560975, 1412265, 19758908, 22171082, 1428063, -17296163, -12704839, 4617569, 12274274, 6054307, -5026132, -18239788, -33029196, -37657438, -20638752, 7595414, 22417585, 15608548, 4190067, 5956651, 17791314, 22827846, 10720852, -14342969, -40293450, -56527721, -58766635, -48838175, -31477361, -11869081, 4844642, 15112502, 19588702, 21645938, 21927018, 17194910, 5980030, -7565691, -16728858, -16776809, -7373366, 4863768, 7678472, -4921026, -21132175, -20839217, -10523, 22824527, 28457417, 16523353, -1215308, -15895351, -21678137, -11997742, 10876081, 28488035, 22319629, -3816428, -27541590, -32634199, -21469946]
2291b1469946J5521221R512759j657762r540475n973388N020269Q613108J97207
2283B22993o391286o98146P256013M369769l016751k49312J0565839J4396688
2275B6455807P366418m28076l934473q070937j3620598j4363824j0384189r214430
2267b6194302j0266549k820310J4499885K5463591J6174747n954197k1460322
2260a0557457k0398866p987247M854826R724520M779625k831311k563050O382271
2252a8596689J2167444N727764o325524j0834179n466168R85593K812683L327843
2244a6201233O620870J0515013R918747L621347l482609m040963L799509J0901998
2236B1652679M779930j3280026k4776525j4953186P444080K0369621J5199159
$$ y = [-21469946, -5948725, 3564034, 1906272, -7634203, -13607591, -8587322, 25786, 222993, -6168293, -6866439, 389574, 4759343, 1742592, 1493280, 12059119, 26455807, 33822225, 33394149, 29459676, 21388739, 7768141, -6595683, -16979872, -26194302, -36460851, -39281161, -24781276, 682315, 16857062, 10902865, -10557457, -30956323, -38943570, -34088744, -24364224, -19584599, -22415910, -24978960, -18596689, -6429245, -701481, -7027005, -17861184, -23327352, -22341759, -19529076, -16201233, -9580363, 934650, 10853397, 14474744, 10992135, 6951172, 10750681, 21652679, 26432609, 13152583, -11623942, -26577128, -19133048, 1236573, 16435732]
2229A6435732L036076l584954l183456R92466O978810J0158143M814861n437673
2221C0210005r239508m376439j729754o366798p696729K115745J2607967J0724897
2213B6249386J430570k160018m31868k617514p431429o265759j130451j043262
2205F599655l785512m62749M268928j939831j3603189j1862136K482058O406188
2197a1896588p001452j4237575R05343K0020838J9144096M124549m648898n345353
2189A064960q557369j1703875m972899O176839Q781591N902391Q935873J2661818
2181A8289329L188294j2921523j4151926R81051J0456481L784647m489903k656076
2173B480374Q49713k132245l422784M016055R910828K247115j3400259k2296278
$$ y = [16435732, 19471808, 15886854, 12703398, 13695864, 20674674, 30832817, 35647678, 30210005, 20970497, 16594058, 14864304, 8497506, 800777, 2916522, 15524489, 26249386, 27679956, 25519938, 25088070, 22470556, 15039127, 8773368, 7642917, 6599655, 2814143, 2351394, 6620322, 4680491, -8922698, -20784834, -18302776, -11896588, -18898040, -33135615, -32230272, -12209434, 6934662, 11059211, 6410313, 1064960, -7492409, -19196284, -24169183, -17992344, -9210753, -3308362, 5627511, 18289329, 21477623, 8556100, -5595826, -4614775, 5841706, 9626353, 5136450, 2480374, 3330087, 1197842, -2224942, 1791113, 11701941, 13949056, 548797, -21747481]
2165b1747481j8507955n336593J1763540K3982081K1207628M505513j1525859
2158D340874j5473494r804521j071790Q410454J3975106Q059366n509592j0330533
2150g404130j21088J0472078P998482n12576k703802j750929o504820j1951454
2142a2478239p362059L097405N273738l302477j1800917j3163083r039682o95187
2134d9470501J1201866J9629049J7262161Q605196M403704N459947L708872k300065
2126A8500229n515459l270770K57250M135202J0487197J3956352N374409j1208616
2118C2715794j8838511j0308985J788412M645816L337008R039170J7751783J4517176
2110E4647663k903739j7313643j3592048J078153O276154m954523j7281904j4066098
$$ y = [-21747481, -40255436, -45592029, -33828489, -9846408, 11361220, 15866733, 4340874, -11132620, -20937141, -22008931, -13598477, 376629, 8435995, 2926403, -7404130, -7525218, 2946860, 10945342, 10432766, 7728964, 5978035, -526785, -12478239, -19840298, -16742893, -11469155, -14771632, -26572549, -39735632, -48775314, -49470501, -38268635, -18639586, -1377425, 7227771, 11631475, 17091422, 20800294, 18500229, 12984770, 9714000, 9971250, 14106452, 24593649, 38550001, 43924410, 32715794, 13877283, 3568298, 5356710, 10002526, 13339534, 22378704, 40130487, 54647663, 51743924, 34430281, 20838233, 21916386, 28192540, 23238017, 5956113, -8109985]
2102h109985L14476P360661J14759r118939q128233q98189J330514l355342p435343
2093b7925621m976479L813519J4439660J9144004J1642862l526469j2649384r789766
2085i827674m545905n766569p177170l25077P411731L458840o932384o383108
2077c0087316O794808J4612253O614159n589692p780991k631640j20872p1099
2069a8260390L571378Q237152N560191l430350p358584n40446Q582232R368945
2061E730128L747856K461193Q046119R514049j598662j5845889j5914871r55377
2053d815454J0392863N243214o221609p109790J658743N746469J121835j479279
2045D536992L924047Q579369L435960p219168j3717625j5024198j6253472j6327571
$$ y = [-8109985, -7795509, -434848, -320089, -9439028, -17567261, -18465450, -17134936, -20490278, -27925621, -32902100, -29088581, -14648921, 4495083, 16137945, 12611476, -37908, -9827674, -14373579, -20140148, -27317318, -27642395, -20230664, -16771824, -23704208, -30087316, -23292508, -8680255, -2066096, -7655788, -15436779, -18068419, -18189291, -18260390, -14689012, -6451860, -891669, -4322019, -11680603, -12221049, -3638817, 5730128, 9477984, 11939177, 19985296, 29499345, 27900683, 12054794, -3860077, -4815454, 5577409, 10820623, 4599014, -2510776, -852033, 4894436, 6016271, 4536992, 8461039, 17040408, 20476368, 13257200, -460425, -15484623, -31738095, -48065666]
2037d8065666p809571R608511K2911212J8883713J194865j2005705r066256K548528
2029b1800369Q670517P062526N414692N508966J539926o491543j0702406q719522
2021a9517213o290596l572504O286946J9267217J8032910j970017j9448977j4533991
2013b1746225L827620J3590581J1093268Q462081Q632052L489735p367557j4782073
2005E199482j4938280j0626159j483476J1358923J6286845M790915j0673277j1503869
1997a1588896j062856K846396j063118J307798R531304P652593m334601o525221
1989c236601O242983J3448236L493710p043206l161092L683436k097862j3749971
1981b420367j6863629j3005511r931905m106353P780461J4325912O555502l071926
$$ y = [-48065666, -55875237, -46266726, -23355514, -4471801, -3276936, -15282641, -24348897, -21800369, -13129852, -6067326, -652634, 4856332, 6396258, -95285, -10797691, -19517213, -25807809, -29380313, -23093367, -3826150, 14206760, 12236743, -7212234, -21746225, -17918605, -4328024, 6765244, 15227325, 23859377, 27349112, 19981555, 5199482, -9738798, -20364957, -21848433, -10489510, 5797335, 10588250, -85027, -11588896, -12651752, -9805356, -10868474, -9560676, -29372, 7623221, 3288620, -3236601, 3006382, 16454618, 19948328, 12905122, 9744030, 13427466, 11329604, -2420367, -19283996, -32289507, -42221412, -46327765, -38547304, -24221392, -17665890, -20737816]
1973b0737816Q04541J0279532P802531l940236q388650l874344k514387m981197
1965b5550026m63898R189925Q953898k857183r231130j566522P116926M597533
1957i810477j442452J898356J0975179J1465658J79707j0083830o795004P568182
1949C955319J8004102J2347066n692523j9161988j4984203K550083J7118978J7264215
1941C1401049N709885n701481p388159j60175N963333K939600n334510q598833
1933A8830709n179651l632057q083550j1477622p553001l45328L677572M286309
1925i476619K979542o64723k637402L894872J3463946Q720471j2873461k7166585
1917b3759959j4144689J1635556K1063981J1396886L931577O083755K672280j2097330
$$ y = [-20737816, -19933275, -9653743, -1851212, -5791448, -14180098, -18054442, -20568829, -25550026, -26013924, -16823999, -7870101, -10727284, -19958414, -21524936, -14408010, -9810477, -11252929, -9354573, 1620606, 13086264, 13265971, 3182141, -3612863, 3955319, 21959421, 34306487, 28613964, 9451976, -5532227, -2982144, 14136834, 31401049, 37110934, 31409453, 24021294, 23861119, 29824452, 32764052, 27429542, 18830709, 13651058, 10019001, 1935451, -9542171, -17095172, -17440500, -13762928, -9476619, -6497077, -7161800, -9799202, -5904330, 7559616, 16280087, 3406626, -23759959, -37904648, -26269092, -5205111, 6191775, 10123352, 16207107, 18879387, 6782057]
1909F782057j9928815o924771J2835843J7073688N807434l152776j623274J022920
1901A1892306m347892j3066913j4084547m422018P925437J3584087J1156178O102822
1893A4739460K504408l69000l298485m148940k365190j710396m361399o055225
1885e064767j722279O857533J2986479J2061051M000965p430985j5182820j3791065
1877g285888o476153j713598p91677K900310R355164Q290637l215109j1323831
1869a0260145m469318P831733Q029398m313219j3487460r727725J285884Q507059
1861a6603793O028151l505523r243357j340938J4103400J7950961L318984j2954036
1853b246151j3742277l845612L572869Q400968J4424721J2463583n351534k4127865
$$ y = [6782057, -13146758, -20071529, -7235686, 9838002, 15645436, 12492660, 10869386, 11892306, 7544414, -5522499, -19607046, -24029064, -16103627, -2519540, 8636638, 14739460, 17243868, 16874868, 13576383, 9427443, 7062253, 5351857, 990458, -5064767, -6787046, 70487, 13056966, 25118017, 29118982, 21687997, 6505177, -7285888, -13762041, -15475639, -16267316, -13367006, -4011842, 4278795, 1063686, -10260145, -14729463, -6897730, 1131668, -3181551, -16669011, -26396736, -25110852, -16603793, -10575642, -14081165, -23324522, -24665460, -10562060, 7388901, 10707885, -2246151, -15988428, -19834040, -16261171, -7860203, 6564518, 19028101, 13676567, -10451298]
1845a0451298k2714669n564631N093805L826604M237979R964549R732438K051100
1837c824123m73266N233152P953565M488918M117817P408964L943408m656496
1829B4191939l896830N577677M540289j1828404k2829373j5134123k205461K256223
1821a9328063N878814J6090795J9884391N904969j1128079j0063082N278656J4475098
1813B6993499J0526348L118274p45639k979988n969324r764421j2888714r242763
1805i52728O054193K1781071J6731291r383937k7848993j7904501L857091Q311948
1797F45435n645858j5430193r733298J996337R888008J3704148J3506537O418330
1789A5349446n450957j4237927j4520022p153610K056966M609676k557224q839692
$$ y = [-10451298, -33165967, -38730598, -33636793, -29810189, -25572210, -15607661, -5875223, -3824123, -4297389, 935763, 8889328, 13378246, 17496063, 24905027, 28848435, 24191939, 20295109, 25872786, 30413075, 18584671, -4244702, -19378825, -21584286, -19328063, -13449249, 2641546, 22525937, 28430906, 17302827, 7239745, 12518401, 26993499, 37519847, 40638121, 39892482, 36912494, 30943170, 21178749, 8290035, -952728, 5101465, 26882536, 43613827, 34229890, 6380897, -11523604, -7666513, 645435, -5000423, -20430616, -30163914, -28167577, -18279569, -4575421, 8931116, 15349446, 9898489, -4339438, -18859460, -26013070, -23956104, -19346428, -21903652, -30743344]
1781c0743344j206816J3610677J4389303j448156j0081860K366742J6977893J1963833
1773A5828272m331998j0977411p752012p330084q254008j198717P953793O475202
1765i586963j294778j949529K517671J708482L3657P244221J3369484J957330
1757A3999575j6540487j5874787K558323J0137985j577497p640408O057329J7638061
1749H758094N745635j5286069j8718004n047878M464592K045484p72025L472524
1741a5337647P742637M496411k510761m355406P79676M952049K17632r870208
1733a3885617j2696558l394759O876841O161194j120080k183021M192555Q080374
1725g969071N574928K507471K122745J176960j796078m558057o337612o077966
$$ y = [-30743344, -31950160, -18339483, -3950180, -5398336, -15480196, -13113454, 3864439, 15828272, 11496274, 518863, -7233149, -14563233, -22817241, -24015958, -16062165, -9586963, -10881741, -12831270, -10313599, -8605117, -8571460, -1327239, 12042245, 13999575, -2540912, -18415699, -15857376, -5719391, -7296888, -14937296, -8879967, 8758094, 14503729, -782340, -19500344, -24548222, -20083630, -18038146, -18810171, -15337647, -7595010, -3098599, -5609360, -9964766, -9185090, -4233041, -4015409, -13885617, -26582175, -29976934, -23100093, -16938899, -18058979, -20242000, -16049445, -7969071, -2394143, 113328, 2236073, 3413033, 1616955, -2941102, -9278714, -15356680]
1717a5356680M97037J2350833J8025092J0814633J154832q1110o58301j1125116
1709A5621220k0489486j1973113M387936L347240j3905952j9871044m740533J0100175
1701c7523557R283068M751585Q954858J3593144R009178K011536M84092P7036
1693A0640940j862101J620762J1635071K1277418L5751386O6121590R2020797
1686B37205863O6539322j7081920r5072720j03000391n4015548j2625914q308555
1679A3640137j5037848p687823M151305M286403k539241m495299k027640j539712
1671a1249718l868457o597471p656708m031960L395166N174027m504101j3651745
1663d2990967n481820J5636215K7410105J9954147O869247K683478M538488K635395
$$ y = [-15356680, -14859643, -2508810, 15516282, 26330915, 27485747, 27404637, 26746336, 15621220, -4868266, -16841379, -12453443, -9106203, -23012155, -42883199, -47623732, -37523557, -28240489, -23488904, -14534046, -940902, 8068276, 10079812, 10563904, 10640940, 8778839, 10399601, 22034672, 43312090, 79063476, 145185066, 237205863, 303745185, 286663265, 191590545, 88590154, 34574606, 21948692, 13640137, -1397711, -9085534, -4934229, -647826, -3187067, -7682366, -9710006, -11249718, -15118175, -21715646, -29372354, -33404314, -30009148, -24835121, -29339222, -42990967, -48472787, -32836572, -5426467, 14527680, 21396927, 24080405, 28618893, 31254288]
1655C1254288l572012p575831n974170R8614P787592J1952060O947809o353608
1647C4564742j8325390j8815613o982351P399550J1818089K157982j2322514j7461857
1639a7967362r069860L606356R573021O221302k318241r584447q455901K681584
1631b5313548J3411098J0924031j441532p084628m73639O001923M444461L303108
1623C771274P909896P683186l658364j2564056p390020K69478m048983j0501502
1615a8529091j878706J3454225J2238881o023804j8748308j5679273q995010o871194
1607e1032280j802179R530412J6475625J2136617L982824M86458J568538O250749
1599b403236J5085613K1507982J5503052n44777j3222764j6878325j6574657j2622951
$$ y = [31254288, 27682276, 20106445, 14132275, 14230889, 22018481, 33970541, 40918350, 34564742, 16239352, -2576261, -9558612, -2159062, 9659027, 11817009, -505505, -17967362, -27037222, -23430866, -13857845, -7636543, -9954784, -19539231, -27995132, -25313548, -11902450, -978419, -2419951, -9504579, -9978218, -3976295, 468166, 3771274, 11681170, 19364356, 15705992, 3141936, -4248084, -3978606, -8027589, -18529091, -20407797, -6953572, 5285309, -738495, -19486803, -35166076, -44161086, -51032280, -52834459, -43304047, -26828422, -14691805, -10708981, -10222523, -8653985, -2403236, 12682377, 34190359, 49693411, 49148634, 35925870, 19047545, 2472888, -10150063]
1591a0150063n20195J2008704Q656757r128952j9257779j0173793L910697P887210
1583a6767414O705081R446362J0352288J553870q735790p470793K646221Q706437
1575F436262P221604M877063M375690J743347m141877q424977o422880J341287
1567G005519Q474502O688649m067535j0683488k056963J1420953Q038189j2706888
1559A2112938k4858920j1529489J0590409J5029789Q63276j1113503q829247M21792
1551a7312955N959154O388410N936773O969413P355585K395215q147277j4892404
1543e348086q454020M851778Q295109j170330q064019l508331R98578m672804
1535a7072125j0238601l405140O486625K923775q946594r510205L441038J1385887
$$ y = [-10150063, -10670258, 1338446, 9995203, 866251, -18391528, -28565321, -24654624, -16767414, -10062333, -615971, 9736317, 11290187, 2554397, -4916396, -2270175, 6436262, 13657866, 18534929, 22910619, 24653966, 20512089, 12087112, 5664232, 7005519, 15480021, 22168670, 18101135, 7417647, 5360684, 16781637, 24819826, 12112938, -12745982, -24275471, -13685062, 1344727, 2208003, -8905500, -17734747, -17312955, -11353801, -4965391, 971382, 7940795, 15296380, 17691595, 9544318, -5348086, -13802106, -8950328, -655219, -1825549, -9889568, -13397899, -12399321, -17072125, -27310726, -30715866, -24229241, -21305466, -30252060, -39762265, -36321227, -24935340]
1527b4935340M479311m804804k335272Q345218J4215475J0122096J482368m316303
1519B252749m876550m077194p048650j2021207j0908600j697426O076970M747197
1511b7552711L09381J840142O390745O091248L841302P537905J2930321Q323274
1503A9711607m839906j2124435p844142j344583N56161J797566L794590k10872
1495e04014j0481128j4659368n470801P157347J1240976R436735R987112J0537573
1487A7244432L996675n712144p666967j589037J123696n014120j1434966q392775
1479a7445206J462190P095256K958195n223092p874769k621394L485957L394338
1471a4768525n05963n14788L646410L418121m480312j0278913m330152P694614
$$ y = [-24935340, -20456029, -25260833, -27596105, -19250887, -5035412, 5086684, 6569052, 2252749, -2623801, -6700995, -13749645, -25770852, -36679452, -38376878, -32299908, -27552711, -27243330, -25403188, -19012443, -12921195, -9079893, -1541988, 11388333, 19711607, 14871701, 2747266, -5096876, -6441459, -5885298, -4087732, -293142, -504014, -10985142, -25644510, -31115311, -23957964, -12716988, -3280253, 6706859, 17244432, 21241107, 15528963, 7861996, 6272959, 7396655, 2382535, -9052431, -17445206, -15983016, -8887760, -5929565, -11152657, -19027426, -21648820, -18162863, -14768525, -15274488, -15789276, -12142866, -8724745, -13205057, -23483970, -27814122, -20119508]
1463b0119508J1948903N623811j181614j892359n01321l11230K340788P352593
1455C260063N192372q135455j9288452j3872216P78501M401048n867445j0762732
1447d4294316J450981J6816553J6738308M425537k581550K026721Q894733R499147
1439A2976114M334788k896423p875901m496550P835966J7585105J3012672j005149
1431C9470622r729492r759760r668109j1239032p096013J463661K654387m486933
1423h390669m991456P337069J6973379R720699n967835j3266812r610258k183571
1415a0379454O363396J3216461Q856181p754453j8060530o895995J1853629J2855064
1407A0054299l689338j4576636r779577k685546k999863k512565N681731J3283093
$$ y = [-20119508, -8170605, -2546794, -3728408, -5620767, -6122088, -6433318, -4092530, 3260063, 8452435, 316980, -18971472, -32843688, -32065187, -27664139, -33531584, -44294316, -42843335, -26026782, -9288474, -4862937, -7444487, -5417766, 3476967, 12976114, 17310902, 14414479, 6538578, 2042028, 9877994, 27463099, 40475771, 39470622, 29741130, 19981370, 10313261, -925771, -8021784, -6558123, -3903736, -8390669, -13382125, -6045056, 10928323, 20649022, 14681187, 1414375, -8195883, -10379454, -4016058, 9200403, 18056584, 10302131, -7758399, -14654394, -2800765, 10054299, 6364961, -8211675, -17991252, -20676798, -23676661, -26189226, -20507495, -7224402]
1399g224402J1232031L307755k921777o416267p368223l606341J815282J529836
1391i652106k388983R28934J0895258J1599239k559882j3513120n517508R478402
1383g29766R936509k124982o489435J754519N769785m047476j4146966q942642
1375a9020454O079979J3058929N669484n634709q576030j225054R270588J3858923
1367A3481656P928326m339881j1696972o529259N179231R029269p19706j3798888
1359a466224j7049532j0211956k790106P86994L745367O175093L362124k289595
1351a9737835J00598J2292401J9223584R491241o006345r435587k387812j93885
1343C346360m811513l659129M300560L565645r923290j7003669m680072J0639143
$$ y = [-7224402, 4007629, 7315384, 4393607, -2022660, -9390883, -12997224, -11181942, -9652106, -12041089, -11112155, -216897, 11382342, 8822460, -4690660, -10208168, -729766, 9206743, 7081761, 592326, 2346845, 8116630, 4069154, -10077812, -19020454, -12940475, 118454, 5787938, 153229, -8422801, -9647855, -377267, 13481656, 21409982, 17070101, 5373129, -1156130, 4023101, 13052370, 12332664, -1466224, -18515756, -28727712, -31517818, -30730824, -26985457, -20810364, -17448240, -19737835, -19637237, -7344836, 11878748, 21369989, 15363644, 5928057, 3540245, 3346360, -1465153, -5124282, -823722, 2741923, -7181367, -24185036, -28865108, -18225965]
1335a8225965P699616m977969j941023J7675683K6432041R568405j2654369j4307906
1327I268513J216490J0720703N245204l133014n071202o253414j1651660j2899398
1319a2557778k100863J1241283J0676585l201336j2611805p387020K620542M340220
1311h980172o88164l071761j088670O99142K274332O411812R243213L746622p671200
1302H75154j3705530q288702L289628J2472547J4351088P350221n221836j3249441
1294b126871q874367J347632L097762m896827p720784L231229J5485276J2179172
1286A1722222l705208j2691614m290588J0551348J4644313N619588l398107k254218
1278A6197736L554076K694388l961491m310975N354281J2694050P042111n235981
$$ y = [-18225965, -10526349, -15504318, -17445341, 230342, 26662383, 36230788, 23576419, 9268513, 10485003, 21205706, 26450910, 23317896, 18246694, 11993280, 341620, -12557778, -14658641, -3417358, 7259227, 4057891, -8553914, -15940934, -13320392, -8980172, -9668336, -12740097, -13828767, -13129625, -10855293, -4443481, 4799732, 8546354, 875154, -12830376, -21119078, -17829450, -5356903, 8994185, 16344406, 11122570, -2126871, -11001238, -9653606, -6555844, -11452671, -19173455, -15942226, -456950, 11722222, 8017014, -4674600, -8965188, 1586160, 16230473, 21850061, 18451954, 16197736, 19751812, 22446200, 18484709, 14173734, 19528015, 32222065, 39264176, 34028195]
1270C4028195j1824105j1664411j0070274n762116K846358O301563l237568j3470964
1262a2853322o320616J1779601J6219118J727759r782823l502354R343383J4289322
1254B0900068J2380508O486412p276543k1415015j5075153J1504054K4180475
1247C1684806P24782l0619318k7645663N132892K4897216J2310928q677461j3184893
1239e376711n634132J89692M278130J0270335J1728729L310091o515899o421619
1231E828616J527686N779396P50393p678103r557531j775151O644002L196785
1223D716093j0282761j5664853k841516J2589295R652947p100438j4808522o436901
1215c0176656K673718K471549R36772M289809M578916m013570j2840542j2703837
$$ y = [34028195, 22204090, 10539679, 469405, -5292711, -2446353, 3855210, 617642, -12853322, -19173938, -7394337, 8824781, 10552540, 769717, -2732637, 6610746, 20900068, 33280576, 39766988, 32490445, 11075430, -3999723, 7504331, 31684806, 32409588, 1790270, -25855393, -20722501, 4174715, 16485643, 7808182, -5376711, -11010843, -10821151, -6543021, 3727314, 15456043, 18766134, 12250235, 5828616, 7356302, 13135698, 13886091, 6207988, -3349543, -5124694, 1519308, 4716093, -5566668, -21231521, -24073037, -11483742, -1830795, -8931233, -23739755, -30176656, -27502938, -25031389, -24094617, -19804808, -15225892, -19239462, -32080004, -44783841]
1207d4783841o942282j915666L072222P969604O741798p30819l314620M933903
1199c4969701J3833617J2545268N381796J570142l17491n383451q913379l815296
1191b0068495M514266M626768k797128n639369J583423J0353412R549131k130608
1183h600j5067432j7025833n556288O340210L707691r129887j1560285L938044
1175d4362380J8726328J4555326J92032l870026K666214K583954q877198j7163434
1167c5549184j2794327m277923j247532K81361P655912J7257714J9390180J1797669
1159B513870J713036k593206R86088O907703O754672j338486r246518r442265
1151c745106o068604p744562j1942291p623362N989040J5331046J1352721J810351
$$ y = [-44783841, -51726123, -53641789, -50569567, -42599963, -35858165, -36588984, -39903604, -34969701, -21136084, -8590816, -3209020, -1638878, -1956369, -7339820, -16253199, -20068495, -15554229, -10927461, -13724589, -19363958, -17780535, -7427123, 2122008, -8600, -15076032, -32101865, -37658153, -31317943, -27610252, -36740139, -48300424, -44362380, -25636052, -11080726, -10888694, -14758720, -12092506, -9508552, -18385750, -35549184, -48343511, -52621434, -53868966, -53587605, -45931693, -28673979, -9283799, 2513870, 4226906, 1633700, 2619788, 9527491, 16282163, 14943677, 5697159, -3745106, -9813710, -17558272, -29500563, -37123925, -31134885, -15803839, -4451118, -2640767]
1143b640767j548520R42920J588010p41247p91779K109049J817514n556685j5236898
1134b0058403j7336179n932406J3287295K4396677J5715361m854704j5362179
1127a0144538m936881J2876890J7675920O689958o514690j2398185j3190484j2233173
1119b2175183q131341k021161L28189j238380J800764J2581206J9759982J1945061
1111A2849137m073820j0653729l090573N290661L274636m062833o129241k147912
1103h743674K061227N314800R103827R076223L69456r713550p344181O367629
1095F491757J2236092p82831j6783934j2792805Q430211K0505316Q598268j1967912
1087A3934162j7810950o417144O260944Q802446L214408m866905j1941874j2420697
$$ y = [-2640767, -4189287, -3246367, -1658357, -2399604, -3191383, -1082334, 735180, -4821505, -20058403, -37394582, -43326988, -30039693, -5643016, 10072345, 5217641, -10144538, -15081419, -2204529, 15471391, 22161349, 15646659, 3248474, -9942010, -22175183, -30306524, -32327685, -31999496, -33237876, -31437112, -18855906, 904076, 12849137, 8775317, -1878412, -4968985, 321676, 3596312, -466521, -6595762, -8743674, -6682447, -1367647, 7736180, 16812403, 17181859, 7468309, 124128, 6491757, 18727849, 17945018, 1161084, -11631721, -3201510, 17303806, 25902074, 13934162, -3876788, -10293932, -4032988, 4769458, 7983866, 3116961, -8824913, -21245610]
1079b1245610j116525J5502373K0545915O322631j3893255k0746783j0260831
1072b4892085O171577J7257144J8547910R311124n393834j2220709k611268J1347547
1064A7517406Q347270j1874329k4871529j4824817L761816Q919527J778905j753121
1056a2998872Q72936n67645n415355j464168J0343845J2001861k977889j5093413
1048a5298700n191571J7625276K8248285J7599346r80340j2505598j4360012j0728138
1040D408548m781545Q14183L056851J700571m33714j757578l748855p421680r904620
1031a8067839o207257M554631J4554812J2392788k900895j6078596j1743897M745681
1023a8750572J2814298N058380k498148M410370J5217660J0066367q862016j8113413
$$ y = [-21245610, -22362135, -6859762, 13686153, 20008784, 6115529, -14631254, -24892085, -18720508, -1463364, 17084546, 26395670, 21001836, 8781127, 6169859, 17517406, 25864676, 13990347, -10881182, -25705999, -21944183, -13024656, -11245751, -12998872, -12125936, -12693581, -18108936, -19573104, -9229259, 2772602, -205287, -15298700, -20490271, -2864995, 25383290, 42982636, 42002296, 29496698, 15136686, 4408548, -372997, 441186, 3498037, 5198608, 4764894, 3007316, -741539, -8163219, -18067839, -24275096, -19720465, -5165653, 7227135, 4326240, -11752356, -23496253, -18750572, -5936274, -877894, -3376042, 1034328, 16251988, 26318355, 17456339, -657074]
1015f57074n067536J5250056K0377748P053226r214923j4556462q975207p45849
1007C463979M266393N838730N587066L685246R7610l345781m863858n797899q462297
998D69189j1464486j1456623r278448q412129o592637L022060J8692333K6528694
990A507953J7177951j38230q605530m533494J512069J108320l779309p584005
982c334275p118778o70228J0461078J8355568J4273956N11776j0060775r258951
974A3159371k984018j948547p198482r328618j207231J1496311J4561651J390991
966A7941428j6677486k1334209r444356K979535K783283l147337j304691N639552
958b2564281L288654r804287j7224072p835595Q780174J6397804J2206343N267202
$$ y = [-657074, -5724610, 9525446, 29903194, 36956420, 27741497, 13185035, 4209828, 3463979, 7730372, 13569102, 19156168, 22841414, 22939024, 19593243, 14729385, 8931486, 469189, -10995297, -22451920, -31730368, -40142497, -46735134, -43713074, -25020741, 1507953, 18685904, 18547674, 9942144, 5408650, 6920719, 8029039, 4249730, -3334275, -10453053, -11123281, -662203, 17693365, 31967321, 32479097, 22418322, 13159371, 10175353, 8226806, 1028324, -8300294, -9507525, 1988786, 16550437, 17941428, 1263942, -20070267, -29514623, -26535088, -23751805, -26899142, -28203833, -22564281, -19275627, -29079914, -46303986, -54139581, -45359407, -28961603, -16755260, -11488058]
950a1488058J727155R11k498838n152483o293995n030162q06266O015794J2908175
941a0617767J6042185J2946449M689030m086001q343573p200669m530968m425707
933e527021p653189j2403495j4899232r579731M727942J7660052J5716538J884815
925a0073321m469365M798730J1897979l77951j8942321j7074793N574953K2422111
917f243978J8602442O766572K68759n624028j5645619j8950745p065851P975238
909a9917210R794630J255389k951599J487804P696243J1317903J1398332M341016
901B4422508r259315j7374514r970481M427398Q722316M77110p501221p077808
893a3134007k721968r03092k712201n987918n755809L946710J9116426K2755171
$$ y = [-11488058, -9760903, -9759992, -12258830, -17411313, -23705308, -28735470, -29541736, -23525942, -10617767, 5424418, 18370867, 23059897, 18973896, 10630323, 3429654, -1101314, -5527021, -13180210, -25583705, -40482937, -50062668, -45334726, -27674674, -11958136, -10073321, -14542686, -9743956, 2154023, 1776072, -17166249, -34241042, -28666089, -6243978, 12358464, 19125036, 19393795, 13769767, -1875852, -20826597, -27892448, -19917210, -10122580, -8867191, -11818790, -10330986, -2634743, 8683160, 20081492, 24422508, 15163193, -2211321, -12181802, -7754404, 967912, 1445022, -6056199, -13134007, -15855975, -16759067, -19471268, -25459186, -31214995, -27268285, -8151859, 14603312]
885A4603312N883998j4282892j3870903L560227J1980158J928066p195447L3167
877B639686J0651501M344981j5978363k9279043k3397682m660337J3374647K0371834
869b1932776J3511088O53548m699658J075738O212180O87332p696603m478602
861a6667753Q904629J5814520P117961p641234j4154085r965345l010569P98499
853a8803377K997760O736706R604701N372839o195376j4649417r618417M182204
845b0372377J0503655K926292n859182k283211Q923190J3741759J0379752P792549
837B5752427N690349o268469k5170794k8784977n762751K0781004J8630318r088455
829d221348k5191789p947784J9762108K2753138P64150j5168975p577935P465095
$$ y = [14603312, 20487310, 6204418, -7666485, -4106258, 7873900, 9801966, 2606519, 2639686, 13291187, 17636168, 1657805, -27621238, -51018920, -55679257, -42304610, -21932776, -8421688, -7768140, -12467798, -11392060, -5179880, -4492548, -12189151, -16667753, -7763124, 8051396, 15169357, 7528123, -6625962, -16591307, -19601876, -18803377, -15805617, -9068911, 535790, 5908629, -286747, -14936164, -24554581, -20372377, -9868722, -6942430, -12801612, -15084823, -6161633, 7580126, 17959878, 25752427, 31442776, 25174307, 3513, -28781464, -34544215, -13763211, 4867107, -4221348, -29413137, -37360921, -17598813, 5154325, 5918475, -9250500, -16828435, -9363340]
821i363340R062395J312758K104765J3546380J9132696P594793j2724600k4366202
813F299645j7969074R83272J6348271J3797765l831646j5715641o050932J4171502
805H033162J9410184L332712j3074943j0885397L021981R942744N482855m22125
797B4841173k296928m248653q371090r882393n339150K173344P489773P809892
789A2175968L172491k580950l038053L130483Q249716N633176m0435p87131q4175
780B5831090p514647j9555548k0200524m665347J1333985J3461226P496140N662535
772A1848910N213730m321228j8745126k1287888p287509Q448080J2807296R872074
764c451661Q899276Q158933O48485j1045185j6371705j0939419n60271P871934
$$ y = [-9363340, -300945, 1011813, 3116578, 16662958, 35795654, 43390447, 30665847, 6299645, -11669429, -10686157, 5662114, 19459879, 15628233, -87408, -6138340, 8033162, 27443346, 30776058, 17701115, 6815718, 9837699, 19780443, 25263298, 24841173, 22544245, 18295592, 9924502, 42109, -5297041, -3123697, 4366076, 12175968, 15348459, 12767509, 9729456, 12859939, 21109655, 26742831, 26702396, 25915265, 25831090, 18316443, -1239105, -21439629, -26104976, -14770991, -1309765, 6186375, 11848910, 17062640, 12741412, -6003714, -27291602, -34579111, -26131031, -13323735, -3451661, 5447615, 13606548, 14255033, 3209848, -13161857, -24101276, -24661547, -16789613]
756a6789613J2453050J3496149J1159751O652538R85678p343726j8284958k4581365
748b2252496j7498112N2931J3233021J1976748K385996k806381J73077N521579
740i213637Q100443P113576K318700n580365j1318053r231304j944342J726759
732a8028223r05677k779396J491894O975026N716308k149527r610874j1520025
724c0810494p290399J665260J1371435J4653811P725818l215974p975675m830716
716a8706934j047546p70928L22640N738930J0496828P969388j5737n618639n272162
707f904160k528859j775145l367313m751614l538513j0183J929272j168954n478720
698b7594189k205699Q782458J3885705L247928j1467079j0031910O266935J3616583
$$ y = [-16789613, -4336563, 9159586, 20319337, 26971875, 27957553, 20613827, 2328869, -22252496, -39750608, -39697677, -26464656, -14487908, -12101912, -14908293, -14735216, -9213637, -1113194, 6000382, 8319082, 2738717, -8579336, -17810640, -19754982, -18028223, -18933900, -21713296, -20221402, -13246376, -7530068, -9679595, -19290469, -30810494, -38100893, -36435633, -25064198, -10410387, -2684569, -5900543, -13876218, -18706934, -19754480, -20525408, -20202768, -14463838, -3967010, 4002378, 3986641, -1631998, -6904160, -9433019, -11208164, -14575477, -19327091, -22865604, -22875787, -20946515, -22115469, -27594189, -29799888, -21017430, -7131725, -3883797, -15350876, -25382786, -19115851, -5499268]
690e499268J51985j5109450j0459290M896293M904643j2015346j8685403N61042
682e1254794K6114829L0379557J3549778k463200o111703n416743q376409j0520535
674a4099220n444935L755250R318034Q312867K847150l845631p465220l790658
666a0412363N113596R299212J360555j2762920j8820588j0746761K317495P521754
658b7130020L294755r45455J460591O037682M596237k669923p027575k557645
650b4941353O506666J1066389O989089j674932p012485l768786N773939J2179583
642E118110P233783o139523j5537762j3055833l980283J830610K984921N096385
634a6449592R154902R341552L073182l969962n675205k881348L86800L136419
$$ y = [-5499268, -5347283, -20456733, -30916023, -26019730, -21115087, -33130433, -51815836, -51254794, -25139965, 5239592, 18789370, 16326170, 10214467, 4797724, -3578685, -14099220, -19544155, -15788905, -6470871, 1841996, 4689146, 843515, -6621705, -10412363, -5298767, 4000445, 5361000, -7401920, -26222508, -36969269, -34651774, -27130020, -23835265, -24780720, -23320129, -17282447, -12686210, -15356133, -22383708, -24941353, -18434687, -7368298, -379209, -2054141, -9066626, -12835412, -7061473, 5118110, 12351893, 6212370, -9325392, -22381225, -26361508, -24530898, -21545977, -16449592, -7294690, 2046862, 5120044, 1150082, -4525123, -7406471, -7019671, -3883252]
626c883252N426089M367714j706349p148930m055491O047933J2149736P969048
618A9166498K89119j361229K091763L439149K397912M216154N910575k795136
610C3354805j9767460k5141771p404417J5009409J4509580p582578k1930513j1279393
602c0232338Q508255J3806498L299038p681017r898534m920827L336337R454943
594a4327645O638062k541744l819151P852437J4597237o05015k4335901k7796995
586d4338715q140659Q251811N928365J89704P956388J9941458J7182351R77209
578G947912j0972029j0740954o592257n766164m258465M100074J6374853K2033518
570A2126488J4102132k068880j2945539j2111708p596596p874598o362649P352314
$$ y = [-3883252, 1542837, 5910551, 4204202, -2944728, -7000219, -952286, 11197450, 19166498, 19455617, 18094388, 20186151, 23625300, 26023212, 30239366, 36149941, 33354805, 13587345, -11554426, -18958843, -3949434, 10560146, 2977568, -18952945, -30232338, -21724083, -7917585, -4618547, -12299564, -22198098, -27118925, -23782588, -14327645, -7689583, -10231327, -14050478, -6198041, 8399196, 7794181, -16541720, -44338715, -52479374, -44227563, -38299198, -38109494, -30153106, -10211648, 6970703, 7947912, -3024117, -13765071, -20357328, -26123492, -30381957, -26281883, -9907030, 12126488, 26228620, 24159740, 11214201, -897507, -8494103, -16368701, -22731350, -15379036]
562a5379036K4081453K1448444k480353k1099125j4571553L599065Q776350m80097
554C895148p261411n056947k650928n064244o877646l745903K463803R054938
546a5243190J2821180Q363262l511027j0554379m006718O487819O181455j806202
538a267800k482572N666337Q936877J838886m887385k525458L874200N536053
530A4689138J05593r780766j7346854j2745903L939172J4481729M066925j2737037
522a5328003r314056J1041716J7288897q28626j5941578o926701Q971489P412165
514c624697m285018m687766M268026N375669p60199O93648Q910822Q243153l531529
505A0602109j2197343j1652270q994338n489133M670758J5414476J2087397k349989
$$ y = [-15379036, 8702417, 30150861, 27670508, 6571383, -8000170, -4401105, 4375245, 3895148, -3366263, -8423210, -11074138, -16138382, -23016028, -26761931, -24298128, -15243190, -2422010, 5941252, 2430225, -8124154, -12130872, -5643053, 538402, -1267800, -3750372, 1915965, 10852842, 12691728, 7804343, 5278885, 9153085, 14689138, 14794731, 5013965, -12332889, -25078792, -21139620, -6657891, -2590966, -15328003, -24642059, -13600343, 3688554, 2859928, -13081650, -20008351, -11036862, -3624697, -7909715, -12597481, -8329455, -2953786, -3713985, -3020337, 5890485, 14133638, 10602109, -1595234, -13247504, -22241842, -27730975, -23060217, -7645741, 4441656, 2091667]
497B091667p343658K858237R528369J089623p975469k770898P566574P282167
489A2326612o82003m554930n387920r887126j2356199m138720O142031K798215
481a5740040r912627j1791998K109705J4415890J3279461Q157057R774484J1403698
473B1695630K981602q284170p310802M513210J0143397K152250o843442m179247
465A4868428L515365R06798j1851881j8105208q871592L916500N210616j388409
457a1799383j123411P815707J2295947O547235R09430K688969K952856o872429
449A3414921j7108312j3185201N19088O400997j032n633827k249295K702215J418136
440a3722310j871204l39246M463153P951537J0036718J0880239P088778j440533
$$ y = [2091667, -5251991, -2393754, 7134615, 8224238, 248769, -2522129, 5044445, 12326612, 11644609, 7089679, 1701759, -8185367, -20541566, -24680286, -18538255, -15740040, -25652667, -37444665, -35334960, -20919070, -7639609, 517448, 10291932, 21695630, 24677232, 16393062, 9082260, 13595470, 23738867, 25891117, 19047675, 14868428, 18383793, 19290591, 7438710, -10666498, -19538090, -15621590, -10410974, -11799383, -12922794, -5107087, 7188860, 13736095, 14645525, 17334494, 20287350, 13414921, -3693391, -16878592, -16359504, -9958507, -9959539, -15593366, -17842661, -15140446, -13722310, -15593514, -15932760, -11469607, -3518070, 6518648, 17398887, 24487665, 23047132]
432B3047132q007969q347059o315843n088311j142541O481061J0202272N648785
424A6477527L22763N32196q43421j0456487j7241550o772463J1774529J3388349
416G181443o435380k2497529j3878226R001596K1270911J5229177L384573k024177
408A1232388p01220J041371j719236q733192j3932015j0933509j921641L740676
400b1926378K494526J333863N438992R159242O003467Q1951j063561J023260m0642
391B504720l486369l970887k744197n282206r454637p254417J375433P085599
383b1226961N286828J929552K213600K877655L09051j868383M63862L649984J717729
374d647083l535516m876425q45781J659138k597485r003439q335994J231882J1247934
$$ y = [23047132, 15039163, 6692104, 376261, -4712050, -5854591, 626470, 10828742, 16477527, 16800290, 17332486, 16489065, 6032578, -11208972, -17981435, -6206906, 7181443, 746063, -21751466, -35629692, -26628096, -5357185, 9871992, 13256565, 11232388, 10531168, 11572539, 9853303, 1120111, -12811904, -23745413, -25667054, -21926378, -19431852, -18097989, -12658997, -3499755, 2503712, 2585663, 1522102, 2545362, 2504720, -981649, -4952536, -7696733, -12978939, -22433576, -29687993, -28312560, -21226961, -15940133, -14010581, -11796981, -8919326, -8610275, -10478658, -10014796, -6364812, -4647083, -8182599, -13059024, -13904805, -12245667, -14843152, -23846591, -32182585, -30950703, -19702769]
365a9702769J3453881R508938O315601M766595M81618n053722m188434K918509
357H500217M878389l334306r794438l450176O396780L050148j0642237j5158297
349a9553920l096785J1369770J4047361O683471k358394r075969j0364470l230718
341a5579654O175176N555365m752811r100568l34149Q012382L897491l255314
333i382082N22649Q957448N969813o701459j1931270m602002K111396q00039n967091
324b1822637m302026J568063M748108N102824O183642P316241M480460l441409
316a66734j1838177j3052854l723975Q617372J1103212J973379n025683K97059
308a1816401Q626964N160013o715310j0049449J76286J1184164J2159753N864444
$$ y = [-19702769, -6248888, 3260050, 9575651, 14342246, 14823864, 9770142, 5581708, 8500217, 13378606, 10044300, 249862, -3200314, 3196466, 6246614, -4395623, -19553920, -22650705, -11280935, 2766426, 9449897, 7091503, -1984466, -12348936, -15579654, -9404478, -3849113, -8601924, -17702492, -18036641, -10024259, -6126768, -9382082, -8859433, 98015, 6067828, -633631, -12564901, -17166903, -15055507, -15855546, -21822637, -26124663, -24556600, -19808492, -14705668, -8522026, -1205785, 3274675, -166734, -12004911, -25057765, -28781740, -20164368, -9061156, -7087777, -12113460, -11816401, -3189437, 1970576, -4744734, -14794183, -14617897, -3433733, 8726020, 14590464]
300A4590464p99122m404971j541537Q498935J5317683O350094j2198559j8798944
292G014043o539906O187525K951215q363945j1410765n509916l39229K232470
284a3778508O099437Q754502N762034J803135L860422P791375M215342n918299
276A8589440j3420641j4953156j3477594q299063K784967J3552440J4064071N000071
268C840535l255555n122916l630157j496521R70884O92631m293165p137730k97284
259a9729278R607620Q228284m614580j3247453q936936p41897J008689q36724
251b9262275P97120M580808N204816K712025K45818j584007k558269p37982K939171
242a7662775L643293K06268k054608M60340M492268O000083N264968L410493L52197
$$ y = [14590464, 13791342, 9386371, 7844834, 16343769, 31661452, 38011546, 25812987, 7014043, 474137, 6661662, 9612877, 1248932, -10161833, -15671749, -16010978, -13778508, -7679071, 1075431, 6837465, 8640600, 12501022, 20292397, 24507739, 18589440, 5168799, -9784357, -23261951, -31561014, -28776047, -15223607, -1159536, 3840535, 584980, -4537936, -8168093, -9664614, -8693730, -8001099, -12294264, -19431994, -19729278, -10121658, -1893374, -6507954, -19755407, -28692343, -29434240, -28425551, -29262275, -28465155, -23884347, -18679531, -15967506, -15721688, -17305695, -19863964, -20601946, -17662775, -14019482, -13813214, -15867822, -15407482, -10915214, -4915131, 349837, 3760330, 4112527]
233D112527j814302o19921K89723m774146j1747724r921334O18327O773241J856150
224a5227459n410469o655982n083267m097702O56041Q719432R384072N36720k378398
215a9557012R030850J7722471O278088j3003208j5843738l887630R76662n282693
207b3566210m554921Q817271J6879662Q635303k283378j330535N294066N008895
199A2900153j047079m798646n439047n255746j848701N124575Q808009N666238
191A4109756J920848J784665l16768p597510j2104943p548575l09482K340788
183g721221M208968R287585R950294m42697j2441154j2793425m659696o96499
175a5307845k028134K13902O595104Q726933N214621L313149M934390M621694
$$ y = [4112527, 2298225, 1678304, 1968027, -2806119, -14553843, -24475177, -23856850, -17083609, -15227459, -20637928, -27293910, -32377177, -36474879, -35818838, -27099406, -17715334, -17178614, -19557012, -10526162, 7196309, 13474397, 471189, -15372549, -19260179, -18283517, -23566210, -28121131, -19303860, -2424198, 6211105, 3927727, 2597192, 7891258, 12900153, 11853074, 7054428, 1615381, -3640365, -5489066, -364491, 8443518, 14109756, 16030604, 17815269, 17498501, 9900991, -2203952, -9752527, -10062009, -7721221, -3512253, 5775332, 15725626, 15282929, 2841775, -9951650, -14611346, -15307845, -17335979, -17122077, -10526973, -1800040, 3414581, 6727730, 11662120, 16283814]
167A6283814J647141J192764K953539J066896l823979m761131j589110j171254
159A1798680l197447M43614R068501J0293752m20680j0512755q807198k082711
151F583756l154597j0861872j3176002n701795L387734N831925K732839N04803
143a3853209K191521M600931K775687l367815q096198p023315k877689n87244
135b6237331N86879M255338Q556391Q233775M072702J787939J611144j379182
127A487655n399450j652013R896153J5346899N089419j1047852j5864748o770310
119h914247L163751L314876l504872p876142n377113J62011K187154r16278l858158
110b1619018j344391M305493O149260K573870r49629n36422J422512J755987J122538
$$ y = [16283814, 17930955, 19123719, 22077258, 23144154, 19320175, 14559044, 12969934, 11798680, 8601233, 9044847, 18113348, 28407100, 27986420, 17473665, 8666467, 6583756, 3429159, -7432713, -20608715, -26310510, -22922776, -17090851, -14358012, -13853209, -11661688, -7060757, -4285070, -7652885, -15749083, -22772398, -25650087, -26237331, -25650452, -21395114, -12838723, -4604948, -532246, 1255693, 2866837, 1487655, -3911795, -5563808, 4332345, 19679244, 24768663, 13720811, -2143937, -8914247, -5750496, -2435620, -5940492, -13816634, -19193747, -19031736, -16844582, -17760860, -21619018, -22963409, -18657916, -12508656, -9934786, -10884415, -11420837, -9998325, -8242338, -7119800]
101g119800R50690O87633J43601J73563k14672k804220n766627n596371l235680
92b2781883k012962m50473M605345Q446681K825024q964968j3069668m588368
84c5991272N308898O314449J697356j312114k265288k016409K001413P397264
76a8865703N156880n075159r707323j209656Q222660M992127m581155m950050
68b6017379N338098J4924219J6966824J1954145O44827j2214020j4807182l401425
60f611893P108629L147650n637930k432840P327481M904180q704886j3842592
52a4742201n798802j551391q569158j1629968J81754J4866116J7622184J1838580
44B217114P683799M876141l07353l289847O78569N956017M903638r35718o118052
$$ y = [-7119800, -6169110, -5481477, -5337876, -5164313, -5378985, -8183205, -13949832, -19546203, -22781883, -24794845, -25245318, -20639973, -12193292, -9368268, -18333236, -31402904, -35991272, -30682374, -24367925, -22670569, -23982683, -26247971, -28264380, -26262967, -18865703, -13708823, -18783982, -28491305, -29700961, -21478301, -16486174, -21067329, -26017379, -20679281, -5755062, 11211762, 23165907, 23810734, 11596714, -3210468, -6611893, 496736, 3644386, -1993544, -4426384, 2901097, 7805277, -899609, -14742201, -20541003, -22092394, -30661552, -42291520, -42109766, -27243650, -9621466, 2217114, 9900913, 14777054, 14469701, 11179854, 11858423, 17814440, 22718078, 21782360, 15664308]
35A5664308r051589p796882J096819J2082631J1079670l999674j5030699p271505
27c226921R535993J5792620P809370m102031j3755263k0080789j7412448j794659
19b7234128J6127938J9928186Q512693l993565q217927p314124n859011l516251
11a1566189o73290L94016J136800M286230O019085N43687p815086q432350j306523
2a7413620J878012l362987
0a8898595
$$ y = [15664308, 6612719, -1184163, -87344, 11995287, 23074957, 19075283, 4044584, -3226921, 6309072, 22101692, 29911062, 25809031, 12053768, -8027021, -25439469, -27234128, -11106190, 8821996, 17334689, 13341124, 5123197, -2190927, -8049938, -11566189, -12239479, -11845463, -10708663, -6422433, -403348, 140339, -7674747, -16107097, -17413620, -15535608, -18898595]
$$ Imaginary data points
##PAGE= N=2
##DATA TABLE= (X++(I..I)), XYDATA
65535a5893175L326995J1412484R714779L381092J989386L277793j667648j1004733
65527D536973j2297651j512743Q873231O557316l279351n840851K017409Q555361
65519G609694N251127k351516n778488n929341p077087o630589q58353M569687
65511a1194866J178369p754074j0579500m392847K312879M232202N092681P415852
65503a3689304P782947N274668M143933M773516K148677l409914m734999p32014
65495A557510O73076k929560l380083K292994M020297m545530j3326705j0543363
65487b6181364M3649P678546J0784079J2509006R227789k251356j2604031j0134627
65479a0928309O07929M256494l283845j0858541r291346j082935P085521J1552294
$$ y = [-15893175, -12566180, -1153696, 8561083, 11942175, 13931561, 17209354, 15541706, 4536973, -7760678, -9273421, -400190, 6157126, 2877775, -2963076, -945667, 7609694, 12860821, 10509305, 4730817, -1198524, -8275611, -14906200, -15764553, -11194866, -10016497, -17770571, -28350071, -32742918, -30430039, -26197837, -21105156, -13689304, -5906357, -631689, 3512244, 8285760, 10434437, 7024523, 2289524, 1557510, 2230586, -698974, -4079057, -1786063, 2234234, -2311296, -15638001, -26181364, -26137715, -18459169, -7675090, 4833916, 14061705, 11810349, -793682, -10928309, -10320380, -6063886, -9347731, -20206272, -29497618, -30580553, -23495032, -11942738]
65471a1942738J1045316O912749L574046K537815j021342r097727j3597030p316906
65463a8905817L100609N991986J885966Q0073K072023J685626q86059O71555N181069
65454H77031M533380j374356l574811M44374L005374M69845j288778Q97432J588722
65445E578213k373109n367804k450798K887675M547890Q84570n859547j0656959
65437a2809869o876159N363638J3946484Q406565l612274o685832j778756k776545
65429f822748r312459m842798J2683192K1199691P783172r049003p593362L448269
65421G493954J240577j2985653j6695815k949507R551240O456530k582538k665628
65413a3136840L115503J281029r112818j3649603k509796J5070902K0676822Q512880
$$ y = [-11942738, -897422, 6015327, 9589373, 12127188, 11105846, 2008119, -11588911, -18905817, -15805208, -9813222, -7927256, -7847183, -5775160, -4089534, -4975593, -4304038, 877031, 5410411, 4036055, 461244, 905618, 3910992, 4380837, 3092059, 3989491, 5578213, 3205104, -2162700, -4613498, -1725823, 2822067, 3706637, -2152910, -12809869, -19686028, -14322390, -375906, 8030659, 4418385, -2267447, -4046203, -6822748, -16135207, -20978005, -8294813, 12904878, 20688050, 11639047, 4045685, 7493954, 8734531, -4251122, -20946937, -23896444, -14345204, -7888674, -10471212, -13136840, -10021337, -8740308, -17853126, -31502729, -34012525, -18941623, 1735199, 10248079]
65405A0248079p790708j2028222m360983K300658J623686J59005L765862Q215408
65397B132785P823697M539858K354285K00311l060773l706346l45658Q61463l775133
65388G024489o871852p93397Q597025R617467K130351l807810l970749l213090
65380H712434l759975j858261K659840L980239K59367k821252j613430J58881
65372E717843q54047j627691J048770M013165K285518l401178p738611p192875
65364g749106k391079L624034P177935O035441J874473p75033L12759K301914
65356A0411338J156399k777488m734663j398566L975691L933884m169956j2889470
65348f492831j2091530j940253O209637M061668l378004n899879k079666R57414
$$ y = [10248079, 2457371, -9570851, -13931834, -11631176, -10007490, -9848485, -6082623, 2132785, 9956482, 14496340, 16850625, 17050936, 13990163, 10283817, 9938159, 10799622, 7024489, 152637, -640760, 7956265, 17573732, 19704083, 15896273, 11925524, 8712434, 4952459, 3094198, 5754038, 9734277, 9993644, 7172392, 5558962, 5717843, 4863796, 3236105, 4284875, 8298040, 10583558, 7182380, -556231, -7749106, -10140185, -6516151, 661784, 6697225, 8571698, 7796665, 8109424, 10411338, 11567737, 8790249, 4055586, 2657020, 6632711, 10566595, 6396639, -6492831, -18584361, -20524614, -14314977, -10253309, -13631313, -19531192, -21610858, -20653444]
65340b0653444o66306l102253k362472j65991O1552j226737j074170J228269L409985
65331b4551567L663063K988969L455889M907457N102956L678534L367390M855447
65323G468138L535286l568674j0051886o931931L197803Q001735L251542j449331
65315C452682O81989K299528m311604j2004832r219419J064193O183779L689353
65307h164331K362294M854492M045672j590858l383653J898842M668135j825711
65299B864882r232731o883306J364080L812376o73388k325631K995603P489211
65291e88904L590923n387945j0414590p697413j121328L245845K375207j787985
65283a7786190l454095J786870J0665445J3701769O364046l600554n300810k9691
$$ y = [-20653444, -21319750, -24422003, -26784475, -26950466, -26888914, -28115651, -29189821, -27961552, -24551567, -20888504, -17899535, -14443646, -9536189, -4433233, -754699, 2612691, 7468138, 11003424, 7434750, -2617136, -9549067, -6351264, 1650471, 4902013, 3452682, 4134671, 6434199, 2122595, -9882237, -19101656, -18037463, -11853684, -8164331, -5802037, -947545, 3098127, 1507269, -1876384, 22458, 4690593, 2864882, -6367849, -13251155, -11887075, -8074699, -8748087, -11073718, -8078115, -588904, 3002019, -2385926, -12800516, -20497929, -21619257, -18373412, -15998205, -17786190, -21240285, -19453415, -8787970, 4913799, 11277845, 7677291, 2376481, 2346790]
65275B346790K34216q309115j3039714k709523J3872508J8273391Q009206j584909
65267A7092850j176691J401108j737855m728461n74662M321248P47767o567967
65259H777337o483020k38712J355154l525000o056481k557180J905277N782557
65251a040068J2381597J6951259Q189315j1339013k1054447q689338J0690615
65244F089920J4079190Q51438r620251o228135J958075K546706l349299n795501
65236E32143k37350Q402043J2506987Q592264j264382j1699815j7335517j5310990
65228a5814617o436002M685328J1182484Q444802q22201p391858l948473O794555
65220c305982J3897091R241040l653932j3212481j2461038n877540j649754j32837
$$ y = [2346790, 2581006, -5728109, -18767823, -21477346, -7604838, 10668553, 18677759, 17092850, 15916159, 17317267, 15579412, 10850951, 10276289, 14597537, 15345304, 8777337, 2294317, 2055605, 3410759, -114241, -6170722, -8727902, -6822625, -1040068, 11341529, 28292788, 36482103, 25143090, 4088643, -4600695, 6089920, 20169110, 21020548, 11400297, 5172162, 7130237, 9676943, 6327644, 532143, 294793, 8696836, 21203823, 29796087, 28531705, 16831890, -503627, -15814617, -22250619, -17565291, -6382807, 2061995, 1239794, -6152064, -10100537, -3305982, 10591109, 19832149, 16178217, 2965736, -9495302, -15372842, -17022596, -17155433]
65212a7155433M340550J1183944J1749709L258177m061278j302849M284678o14650
65204A1682848j3863763j8668200o832920R873184J5529583Q513186q91219m499265
65196H43434k132146J940219L248712K68361l715125m374677k914129m244945
65188a1080296p461084m930290N408280J3501223R246289l201165j0127243n310611
65180a3954897L951687P617229M292694K83137M69281K562080M88744p266976
65172a557021j4478243j4028276o325941K251730P710498J0363453R447146K867368
65164c749286o212144r775763n456545j64450J039920K706923R069287J2955266
65156D13208M851823r936556j4999778n508489L644813j389772j2533883r821384
$$ y = [-17155433, -12814883, -1630939, 10118770, 13376947, 9315669, 8012820, 12297498, 11682848, -2180915, -20849115, -27682035, -17808851, -2279268, 6233918, 5342699, 843434, -1288712, 651507, 3900219, 4168580, 453455, -3921222, -6835351, -11080296, -18541380, -23471670, -18063390, -4562167, 4684122, 1482957, -8644286, -13954897, -10003210, -2385981, 1906713, 2189850, 2659131, 5221211, 5709955, -1557021, -16035264, -30063540, -36389481, -34137751, -26427253, -16063800, -6616654, -3749286, -9961430, -19737193, -25193738, -25358188, -24318268, -21611345, -12542058, 413208, 5265031, -4671525, -19671303, -25179792, -21534979, -22924751, -35458634, -45280018]
65148d5280018J0074505K6514115K0289557j773399j6061770j2290546l452852
65141b1980408l918500q924754m527332Q925232J5612644O360079q892917j4761979
65133c2107935q885312r26034K158415K967560O441060J1344961J1991730P039550
65125B3995K856258N261378R772478N811142p943952j8918207j5935408l563844
65117b2636160N204776N821718L684445K424486L87273k344088k709942q17581
65109a0985073N19680K070906O074826Q954026N535166j73625P33719O528936
65101A9258561N537219n215602j4043672j1661000l269303J655185J766006N21329
65093e451277n99082m21444K062402K453583m941102j4639198j3364861l08553
$$ y = [-45280018, -35205513, -8691398, 11598159, 9824760, -6237010, -18527556, -21980408, -25898908, -34823662, -39350994, -30425762, -14813118, -8453039, -17345956, -32107935, -40993247, -41919281, -39760866, -36793306, -30352246, -19007285, -7015555, 23995, 2880253, 8141631, 17914109, 23725251, 15781299, -3136908, -19072316, -22636160, -17431384, -11609666, -7925221, -5500735, -5113462, -7457550, -10167492, -10985073, -10465393, -8394487, -2319661, 6634365, 12169531, 11995906, 12729625, 19258561, 24795780, 19580178, 5536506, -6124494, -9393797, -7738612, -5972606, -5451277, -6050359, -6471803, -4409401, -1955818, -6896920, -21536118, -34900979, -35209532]
65085c5209532R023999N272156k164433k455139J267355L207977O289995J0424899
65077d342723N211819j0564023j7497041k343865J7334356J7018731K160252l607752
65069C369754J898334P65357p769399l790340J4978572K2594352N032176j5724696
65061B1354110j4917506p30960L622780l100023m507091K008967K456833p318286
65053a131176j3698118p076442N034448J2052523J3861025J3090166N395854j1914528
65045A5613752k8305379k8897940j3458211L269644J0340884R876559N911411
65038b5649280l574742j6004629j7320735K60356K0536448K0418678K490904q036179
65030b6879179m31658Q046104K699460n583236j512972Q314515Q632633J799360
$$ y = [-35209532, -26185533, -20913377, -23077810, -25532949, -24265594, -21057617, -14767622, -4342723, 869096, -9694927, -27191968, -29535833, -12201477, 4817254, 6977506, 3369754, 5268088, 6033445, -1735954, -5526294, 9452278, 32046630, 37078806, 21354110, 6436604, 5705644, 9328424, 6228401, 1721310, 3730277, 6187110, -1131176, -14829294, -21905736, -16871288, -4818765, 9042260, 22132426, 27528280, 15613752, -12691627, -41589567, -55047778, -51778134, -41437250, -31560691, -25649280, -29224022, -45228651, -62549386, -62289030, -41752582, -21333904, -18843000, -26879179, -27310837, -19264733, -16565273, -22148509, -23661481, -15346966, -6714333, -4914973]
65022d914973P40847M755713L039151l320247l121028M126534Q003061O045320
65014A5354378N062501N319231J264636l492859o22609M446842j648510j5401017
65006A0282593j8195694n378889P084287Q694583O113860L885605m177386j6266925
64998g957966j7128378k572646R983259P585776M52220K195829Q740479J0476023
64990A1774596R049383P756928P44759j3122529k0104267j0872558L134410P314875
64982d324403M388422K986665J113441k851106Q69613J4270694J7848079j263692
64974C3037713k2719841k0612514m281773j659366j2251472j1064507M855712
64967c4696048J0608893j986680r227826L986490J9301850J6383518L756320l10974
$$ y = [-4914973, -4174126, 581587, 3620738, 300491, -2820537, 1305997, 9309058, 15354378, 20416879, 25736110, 27000746, 23507887, 22885278, 27332120, 25683610, 10282593, -7913101, -13291990, -6207703, 2486880, 8600740, 12486345, 8308959, -7957966, -25086344, -27658990, -17675731, -10089955, -9637735, -7441906, 1298573, 11774596, 20823979, 28580907, 29325666, 16203137, -3901130, -14773688, -11639278, -4324403, 64019, 3050684, 4164125, 1313019, 2182632, 16453326, 34301405, 33037713, 10317872, -10294642, -14576415, -16235781, -28487253, -39551760, -34696048, -24087155, -26073835, -35301661, -31315171, -12013321, 4370197, 8126517, 7815543]
64959G815543K537966J07323o220122o453344j515229l90822l780897m852252
64951a2751834j910041J237591L706931O808432Q676920P466320N719159N038497
64943B3991975J842067m977008q506380l802240K337503M73409o754787q098291
64935c493752Q6490R081999R181839K57144r355232j1256690m397921M599590
64927e296533R252816R961008R823435P114906n55704p064864l915903M209916
64919B3529077L156319q327855j4214714n581559N349166N522723J116560L258767
64911A3808484O153523k150801j5211971j5125230j464791O879492N60961q115043
64903a4665376o872682l84193K407130L443982P622837J0749654O999704R41775
$$ y = [7815543, 10353509, 10460832, 4240710, -2212634, -3727863, -4118685, -7899582, -12751834, -14661875, -13424284, -9717353, -2908921, 5767999, 13234319, 18953478, 23991975, 25834042, 20857034, 12350654, 8548414, 10885917, 11359326, 4604539, -3493752, -3407262, 5674737, 14856576, 15113720, 5758488, -5498202, -9896123, -5296533, 3956283, 13917291, 23740726, 30855632, 30299928, 23235064, 19319161, 23529077, 26685396, 18357541, 4142827, -1438732, 3910434, 9433157, 10549717, 13808484, 19962007, 17811206, 2599235, -12525995, -13990786, -7111294, -6550333, -14665376, -21538058, -21922251, -19515121, -16071139, -8448302, 2301352, 9301056, 10242831]
64895A0242831Q80520N021802M702251j531733o787137p553218p740555j0320226
64887a3085465j2010897q372349m9184P313570P382815j257127j1249803j1194985
64879d2523425J469427J5191669J7235784R117435K562887K457335K395064k810945
64871E095231r041425r853417m767432K047224O028683M126129j576432k413570
64863a0355009O477312J4769789P578192j0838238j8561346o953256N681900J854659
64855a0345997r161698q694843J153284M578869K33132P3976N068556N203662
64847a1891059J929587O430986J4288216P506642j2655026k0915962o301372R565207
64839a2042781O711555l958250l871620J930184q80012p404989m367385K967896
$$ y = [10242831, 11123351, 16145153, 20847404, 19315671, 12528534, 4975316, -2765239, -13085465, -25096362, -33468711, -33517895, -26204325, -18821510, -20078637, -31328440, -42523425, -41053998, -25862329, -8626545, 490890, 3053777, 5511112, 7906176, 5095231, -3946194, -13799611, -18567043, -16519819, -10491136, -6365007, -7941439, -10355009, -3877697, 10892092, 18470284, 7632046, -10929300, -17882556, -12200656, -10345997, -19507695, -28202538, -27049254, -22470385, -22237253, -22163277, -17094721, -11891059, -9961472, -3530486, 10757730, 18264372, 5609346, -15306616, -21607988, -12042781, -5331226, -9289476, -13161096, -11230912, -12110924, -19515913, -23883298, -20915402]
64831b0915402N03078o630983j803251J2112672J5123621K571471q456277o591193
$$ y = [-20915402, -20412324, -27043307, -28846558, -16733886, -1610265, 961206, -7495071, -14086264]
$$ [...]
##END NTUPLES=NMR SPECTRUM
##END=
