##TITLE=31Pdec_LR-698-R2-1-CR10
 CDCl3, 124 sc
 3.2.2020
##JCAMPDX= 6.0         $$ Bruker NMR JCAMP-DX V2.0
##DATA TYPE= NMR SPECTRUM
##DATA CLASS= NTUPLES
##ORIGIN= UXNMR, Bruker Analytische Messtechnik GmbH
##OWNER= root
$$ XWIN-NMR		Version 3.5
$$ Mon Feb  3 14:22:41 2020 Russian Standard Time (UT+4h)  she@DPX200
##.OBSERVE FREQUENCY= 81.013821
##.OBSERVE NUCLEUS= ^31P
##.ACQUISITION MODE= SIMULTANEOUS
##.ACQUISITION SCHEME= undefined
##.AVERAGES= 124
##.DIGITISER RES= 17
##SPECTROMETER/DATA SYSTEM= spect
##.PULSE SEQUENCE= zgpg30
##.SOLVENT NAME= CDCl3
##.SHIFT REFERENCE= (INTERNAL, CDCl3, 0, 182.463)
##AUDIT TRAIL= $$ (NUMBER, WHEN, WHO, WHERE, WHAT)
$$ ##TITLE= Audit trail, XWIN-NMR		Version 3.5
$$ ##JCAMPDX= 5.01
$$ ##ORIGIN= Bruker BioSpin GmbH
$$ ##OWNER= she
$$ F:/spectra/data/she/nmr/P31/1/pdata/1/auditp.txt
$$ ##AUDIT TRAIL=  $$ (NUMBER, WHEN, WHO, WHERE, WHAT)
(   1,<2020-02-03 14:20:58.15 +0400>,<she>,<DPX200>,
      <continue with go, POWCHK disabled, PULCHK disabled
       configuration hash MD5:
       00 E9 B6 7A A2 85 ED C7 34 08 36 98 17 FE 4E 26
       data hash MD5: 32K
       CE DB F6 4A FE 62 E5 69 BE 12 56 3D 0C DC 96 1F>)
(   2,<2020-02-03 14:21:48.60 +0400>,<she>,<DPX200>,
      <Start of raw data processing
       efp BC_mod = 2 LB = 1 FT_mod = 6 PKNL = 1 PHC0 = -1657.82 PHC1 = 60.00131 SI = 64K 
       data hash MD5: 64K
       53 7A B2 B2 5A 71 13 4C 11 F7 0B 84 FD C6 0C EE>)
(   3,<2020-02-03 14:22:03.60 +0400>,<she>,<DPX200>,
      <pk PHC0 = 8.999743 PHC1 = 0 
       data hash MD5: 64K
       87 45 2A 4F D7 9A 80 8D 31 81 26 E7 5A 95 C7 88>)
(   4,<2020-02-03 14:22:10.01 +0400>,<she>,<DPX200>,
      <abs ABSG = 5 
       data hash MD5: 64K
       22 44 3A 9F 75 C6 65 63 ED 83 49 B3 EC AE C4 7F>)
$$ ##END=
$$ 
$$ hash MD5
$$ AD 43 7E F8 86 03 AD D4 C5 52 26 BA F7 97 44 BB
##$RELAX= 
##$RELAX= 
##$RELAX= 
##$RELAX= 
##$RELAX= 
##$RELAX= 
##$RELAX= 
##$RELAX= 
$$ Bruker specific parameters
$$ --------------------------
##$DU= <F:/spectra>
##$EXPNO= 1
##$NAME= <P31>
##$PROCNO= 1
##$TYPE= <nmr>
##$USER= <she>
##$AMP= (0..31)
100 100 100 100 100 100 100 100 100 100 100 100 100 100 100 100 100 100 
100 100 100 100 100 100 100 100 100 100 100 100 100 100 
##$AQSEQ= 0
##$AQ_mod= 1
##$AUNM= <au_zg>
##$AUTOPOS= <>
##$BF1= 81.014009
##$BF2= 200.13
##$BF3= 200.13
##$BF4= 200.13
##$BF5= 200.13
##$BF6= 200.13
##$BF7= 200.13
##$BF8= 200.13
##$BYTORDA= 1
##$CFDGTYP= 0
##$CFRGTYP= 5
##$CHEMSTR= <none>
##$CNST= (0..31)
1 1 145 1 1 1 1 1 1 1 1 1 1 1 1 1 1 1 1 1 1 1 1 1 1 1 1 1 1 1 1 1 
##$CPDPRG= <waltz16>
##$CPDPRG1= <>
##$CPDPRG2= <waltz16>
##$CPDPRG3= <>
##$CPDPRG4= <mlev>
##$CPDPRG5= <mlev>
##$CPDPRG6= <mlev>
##$CPDPRG7= <mlev>
##$CPDPRG8= <mlev>
##$CPDPRGB= <>
##$CPDPRGT= <>
##$D= (0..31)
0 1 0 0 0 0 0 0 0 0 0 0.03 2e-05 3e-06 0 0 0 0 0 0 0 0 0 0 0 0 0 0 0 0 
0 0 
##$DATE= 1580725081
##$DBL= (0..7)
120 120 120 11 120 120 24 19 
##$DBP= (0..7)
150 150 150 150 150 150 150 150 
##$DBP07= 0
##$DBPNAM0= <>
##$DBPNAM1= <>
$$ [...]
##$SUBNAM3= <"">
##$SUBNAM4= <"">
##$SUBNAM5= <"">
##$SUBNAM6= <"">
##$SUBNAM7= <"">
##$SUBNAM8= <"">
##$SUBNAM9= <"">
##$SW= 369.568048894756
##$SWIBOX= (0..15)
0 1 3 0 0 0 0 0 0 0 0 0 0 0 0 0 
##$SW_h= 29940.119760479
##$TD= 32768
##$TD0= 1
##$TE= 0
##$TE2= 300
##$TE3= 300
##$TEG= 300
##$TL= (0..7)
0 120 53 12 22 120 120 120 
##$TP= (0..7)
150 150 150 150 150 150 150 150 
##$TP07= 0
##$TPNAME0= <>
##$TPNAME1= <>
##$TPNAME2= <>
##$TPNAME3= <>
##$TPNAME4= <>
##$TPNAME5= <>
##$TPNAME6= <>
##$TPNAME7= <>
##$TPOAL= (0..7)
0.5 0.5 0.5 0.5 0.5 0.5 0.5 0.5 
##$TPOFFS= (0..7)
0 0 0 0 0 0 0 0 
##$TUNHIN= 0
##$TUNHOUT= 0
##$TUNXOUT= 0
##$USERA1= <user>
##$USERA2= <user>
##$USERA3= <user>
##$USERA4= <user>
##$USERA5= <user>
##$V9= 5
##$VALIST= <valist>
##$VCLIST= <CCCCCCCCCCCCCCC>
##$VD= 0
##$VDLIST= <DDDDDDDDDDDDDDD>
##$VPLIST= <PPPPPPPPPPPPPPP>
##$VTLIST= <TTTTTTTTTTTTTTT>
##$WBST= 1024
##$WBSW= 4
##$XGAIN= (0..3)
0 0 0 0 
##$XL= 0
##$YL= 0
##$YMAX_a= 58261
##$YMIN_a= -34844
##$ZGOPTNS= <>
##$ZL1= 120
##$ZL2= 120
##$ZL3= 120
##$ZL4= 120
##$ABSF1= 182.463
##$ABSF2= -187.1042
##$ABSG= 5
##$ABSL= 3
##$ALPHA= 0
##$AQORDER= 0
##$ASSFAC= 0
##$ASSFACI= 0
##$ASSFACX= 0
##$ASSWID= 0
##$AUNMP= <proc_1d>
##$AZFE= 0.1
##$AZFW= 0.5
##$BCFW= 0
##$BC_mod= 2
##$BYTORDP= 0
##$COROFFS= 0
##$CY= -3
##$DATMOD= 1
##$DC= 0
##$DFILT= <>
##$DTYPP= 0
##$F1P= 0
##$F2P= 0
##$FCOR= 1
##$FTSIZE= 65536
##$FT_mod= 6
##$GAMMA= 0
##$GB= 0
##$INTBC= 1
##$INTSCL= 5.30512e-09
##$ISEN= 30
##$LB= 1
##$LEV0= 0
##$LPBIN= 0
##$MAXI= 10000
##$MC2= 0
##$MEAN= 0
##$ME_mod= 0
##$MI= 50
##$NCOEF= 0
##$NC_proc= -9
##$NLEV= 6
##$NOISF1= 182.463
##$NOISF2= 159.3651
##$NSP= 0
##$NTH_PI= 0
##$NZP= 0
##$OFFSET= 182.463
##$PC= 4
##$PHC0= -1648.82
##$PHC1= 60.00131
##$PH_mod= 1
##$PKNL= yes
##$PPARMOD= 0
##$PSCAL= 0
##$PSIGN= 0
##$REVERSE= no
##$SF= 81.0140089999434
##$SI= 65536
##$SIGF1= 159.3651
##$SIGF2= -187.1042
##$SINO= 113.3802
##$SIOLD= 16384
##$SREGLST= <1H.CDCl3>
##$SSB= 0
##$STSI= 65536
##$STSR= 0
##$SW_p= 29940.119760479
##$SYMM= 0
##$S_DEV= 0
##$TDeff= 32768
##$TDoff= 0
##$TI= <>
##$TILT= no
##$TM1= 0
##$TM2= 0
##$TOPLEV= 0
##$USERP1= <user>
##$USERP2= <user>
##$USERP3= <user>
##$USERP4= <user>
##$USERP5= <user>
##$WDW= 1
##$XDIM= 65536
##$YMAX_p= 447370615
##$YMIN_p= -507414184
$$ End of Bruker specific parameters
$$ ---------------------------------
##NTUPLES= NMR SPECTRUM
##VAR_NAME=  FREQUENCY,     SPECTRUM/REAL,   SPECTRUM/IMAG
##SYMBOL=    X,             R,               I
##VAR_TYPE=  INDEPENDENT,   DEPENDENT,       DEPENDENT
##VAR_FORM=  AFFN,          ASDF,            ASDF
##VAR_DIM=   65536,         65536,           65536
##UNITS=     HZ,            ARBITRARY UNITS, ARBITRARY UNITS
##FACTOR=    0.456856943014862, 1,           1
##FIRST=     14782.0589164792, 0,            0
##LAST=      -15158.0608439998, 0,           0
##MIN=       -15158.0608439998, -507414184,  0
##MAX=       14782.0589164792, 447370615,    0
$$ Real data points
##PAGE= N=1
##DATA TABLE= (X++(R..R)), XYDATA
$$ [...]
44429A7949094K1379712j5558413j8620432R181490K3119868L891689j5362796
44422B5980212m531207J5292417R386457j2135386j4576721n41355l971546k7005298
44414a2102427l2206939n443540J9583277J6141495L054205O170792J6361961
44407A1558824J2536902j444900r609950j0788270q749501K196379J8486833J7845254
44399C2031571o266574k4927405j6266835k141585r313423k0140707m331077K1420544
44391b9935491J6815878j0173710j1108051K1493769L7256752Q358719k4464355
44384H243511j4655900K1466543L3885557J0067086j8391172k4884957j2033382
44377C697286N799941J8332372J9880405J2379999O211187O217963L041965j0313384
$$ y = [17949094, 39328806, 23770393, 5149961, 14331451, 37451319, 41343008, 25980212, 21449005, 36741422, 46127879, 33992493, 19415772, 18874417, 14902871, -12102427, -44309366, -49752906, -30169629, -14028134, -10973929, -4803137, 11558824, 24095726, 22650826, 13040876, 2252606, -6496895, -4300516, 14186317, 32031571, 25764997, 837592, -15429243, -17570828, -26884251, -47024958, -51356035, -29935491, -13119613, -23293323, -34401374, -12907605, 24349147, 32707866, 8243511, -6412389, 15054154, 48939711, 59006797, 40615625, 15730668, 3697286, 9497227, 27829599, 47710004, 60090003, 66301190, 72519153, 75561118, 65247734]
44369F5247734k2545521j9102612n144432K593709J195278K234673J0069537J5757049
44361E0305415J2804625M942451l129868j0245806j2404276m725756O185179M031320
44353D7763284j5235252l2301496k5966828j665487J3081341L507885j2461158
44346b3277711p261988J8724827L4998744J9024409j4484745l1112482j7100508
44339b0489454Q803522K1401774J5306793L327284j622756J884780N106277j251831
44331C2466389j5906773k5769271k0027281l776256Q132227Q380157R03174r340740
44323b4938374j9295111k1596732q664017J3656366K7545924K3235523R774665
44316b81756K979208J0048929K6671766M0024671L4804649Q101207k0856329k8464744
$$ y = [65247734, 42702213, 23599601, 18455169, 21048878, 22244156, 24478829, 34548366, 50305415, 63110040, 68052491, 64922623, 54676817, 42272541, 37546785, 43731964, 47763284, 32528032, 226536, -25740292, -27405779, -14324438, -10816553, -23277711, -30539699, -11814872, 23183872, 42208281, 27723536, -3388946, -20489454, -11685932, 9715842, 25022635, 28349919, 26727163, 28611943, 33718220, 32466389, 16559616, -9209655, -29236936, -33013192, -24880965, -16500808, -15597634, -24938374, -44233485, -65830217, -74494234, -60837868, -33291944, -10056421, -281756, 2697452, 12746381, 39418147, 79442818, 114247467, 122348674, 101492345, 73027601]
44308G3027601j5097223j918326j70403k198893l696911j0690793j8459141j0633907
44300A0162004Q864629J1745783q752885j8208671N553035K8554757R192796l0877026
44292A6234422l2945635R973457M2099384K7791910l742745j3070881n434158
44285D0905754m657265q299140j809936Q245036Q802827R124570K1102378K5601026
44277I9015250l936962n0473882o4068660k7820199J9175440L4096738J8339898
44270B4327623P72982l283347N18376K387045m447462k2234767l9996453l6685573
44262g8641576p872529K0042570J9524203k85771m917386J7042782L7351536K7122813
44254B9366642m025250k1519565j0085714J0848265J5611551K709357j0245467
$$ y = [73027601, 57930378, 56012052, 55841649, 53642756, 49945845, 39255052, 20795911, 10162004, 19026633, 30772416, 22019531, 3810860, 9363895, 37918652, 47111448, 16234422, -16711213, -6737756, 35361628, 63153538, 59410793, 46339912, 40905754, 36248489, 27949349, 26139413, 34384449, 43187276, 52311846, 73414224, 99015250, 95078288, 44604406, -19464254, -47284453, -28109013, 5987725, 24327623, 25100605, 21817258, 22335634, 24722679, 20275217, -1959550, -41956003, -78641576, -86514105, -66471535, -46947332, -47233103, -52150489, -35107707, 2243829, 29366642, 25341392, 3821827, -6263887, 4584378, 20195929, 22905286, 12659819]
44247A2659819j4159181j8508530l1161582l8837351k0387333K0657646N0307496
44240c9429016M0373739L567247j9840006q933155J6540803K4436066Q145328
44233B4861006j1100279j2178105M696769K1527207K0365963p22870k4664066
44226B2785625l0271348j3659532Q085265J6676315J0217279j580569j0066476
44219B186559r064683M856227K1807183J9123306j0628916m0160477l6559591
44212d8440392n347819J7796443J7409160J2356426J6049550J5435063L946435
44205B9204866K978978K4676641L9359036J4288834l1313119m7799014k5132704
44198F263518k960606p746429j7334400l006629K2845543K4662262n578107l7041733
$$ y = [12659819, -1499362, -20007892, -51169474, -90006825, -110394158, -89736512, -39429016, 944723, 4511970, -15328036, -24261191, -7720388, 16715678, 24861006, 13760727, 1582622, 6279391, 27806598, 48172561, 47449691, 22785625, -7485723, -21145255, -13059990, 3616325, 13833604, 12253035, 2186559, -6878124, -2021897, 19785286, 38908592, 28279676, -11880801, -48440392, -53788211, -35991768, -18582608, -6226182, 9823368, 25258431, 29204866, 32183844, 56860485, 96219521, 110508355, 79195236, 31396222, 6263518, 3302912, -4443517, -21777917, -24784546, -1939003, 22723259, 17145152, -19896581]
44190a9896581l6706237o037017K0043106J0478254k3676267l6638459l717186
44183i6150387M2367980N1596934K2427829l225134n693195p625834k1165821
44176a7467628k0269993R956997L5183907J9059588j8947454l2220375j4412989
44169c9117947K386795L944108N556250J2406830J0311327j338882n168004L77917
44161a0641606j710812j0019939k317346K0044521K4440317l8009k0522703j3981262
44153a4746839m780943j7076869k4868485O462466N2409051N4427308N870696
44146E7696385l5700002k7917736O228492K1141308P076295j3552487k2619131
44139g646876j7088878M233J9001746K3855411R227615r323225j4532460r508136
$$ y = [-19896581, -56602818, -62639835, -42596729, -32118475, -55794742, -92433201, -96150387, -53782407, -2185473, 20242356, 17017222, 11324027, 3698193, -17467628, -37737621, -27780624, 7403283, 26462871, 7515417, -24704958, -39117947, -36731152, -32787044, -27230794, -14823964, -4512637, -5851519, -11019523, -10641606, -12352418, -22372357, -24689703, -4645182, 19795135, 19757126, -765577, -14746839, -19527782, -36604651, -61473136, -55010670, -2601619, 51825689, 57696385, 21996383, -5921353, 307139, 21448447, 28524742, 14972255, -7646876, -24735754, -24731521, -5729775, 18125636, 27353251, 18030026, 3497566, -6010570]
44131f010570q481324j2496329r281059M043378J1974991m8607k3609064l1989995
44123g5898579r971435K3593423L1790989L825898k6284552j8698507K0899959
44116e0742804M8616716L9954181J5465761J864171n200426k0931424l7016106
44109g989931l5193569k1130437j4085904j0269007R902928L8404496M0287252
44102g4172Q315246j8136915r641133Q117102l976885l4049118l5328529K404003
44094h2370401L7880443L8528499J8712594N364738j127076j0047638j1700916
44087d759757M548490K0609012J0609334j6300953k6263923j2102581j187471
44080b4847849o739493o347536J4445466K9364133J1044105j8880076j6048981
$$ y = [-6010570, -14491894, -26988223, -36269282, -32225904, -20250913, -20299520, -43908584, -75898579, -85870014, -62276591, -30485602, -26659704, -52944256, -71642763, -50742804, -2126088, 37828093, 53293854, 55158025, 49957599, 29026175, -7989931, -43183500, -64313937, -78399841, -88668848, -78765920, -40361424, -74172, 8241074, -9895841, -19536974, -11419872, -15396757, -49445875, -84774404, -82370401, -44489958, -5961459, 12751135, 18115873, 16988797, 6941159, -4759757, -211267, 20397745, 31007079, 14706126, -11557797, -23660378, -24847849, -31587342, -37934878, -23489412, 5874721, 16918826, -1961250, -18010231]
44073a8010231J8836171L6479587Q260830l4129150m3469103j6355848J3228895
44066c5158849K3124367K0787934J7577199R873215p227863k3067837k1240266
44059a5332100k566783J2257784O947309r088584j1846216N674910K4002345K4168092
44051C4216757J1615069J891719m706584j4628925j6772312M921274L4975104
44044E1512102L4672675k819677l5763248k9736099k778050Q073622m24189p824869
44036A4912267j0488266j5587411j1058543J6417204M1935906K6626884j7700028
44029D5058013l4411266k436061L3652147L1338618N675182q169917r112718j2754873
44021D8839125j0953555J0041382L0341890J7486246k0847779m2315338k7435490
$$ y = [-18010231, 825940, 37305527, 45566357, 11437207, -32031896, -48387744, -35158849, -12034482, 8753452, 26330651, 36203866, 28976003, 5908166, -15332100, -17898883, -5641099, 1306210, -7782374, -19628590, -13953680, 10048665, 34216757, 45831826, 47723545, 43016961, 28388036, 11615724, 16536998, 51512102, 86184777, 83365100, 47601852, 17865753, 15087703, 23161325, 22737136, 14912267, 4424001, -11163410, -22221953, -5804749, 36131157, 62758041, 45058013, 10646747, 8210686, 41862833, 73201451, 78876633, 70706716, 61593998, 48839125, 37885570, 47926952, 78268842, 95755088, 74907309, 32591971, 5156481]
44014E156481q03723P905287j350151q804026j541348J4520776K0275456L727096
44006C9085848k0131393k2651602k269720J0148401O90896k878837J8485054L3393101
43998E3871748R606489k4064762j9667473P271332K519383k9139025k6391835
43991b5994143K0874291M5798691J3830578j7933369M164203M2278038L3263107
43984A16281396j0136595l1881763k6641598k8844771l5367388j5350235J6672909
43977a5268045J3893087j7655114k0886942J5968387L5939912O875071k7966736
43970i100380k4582228m846087p170166j8582701m763334K5560668L5450288J8822820
43962A0788880J205543n296795r143655j0450186k28593J5454296J9657016J0018978
$$ y = [5156481, 4352758, 12258045, 10907894, 2103868, 562520, 15083296, 35358752, 39085848, 18954455, -3697147, -5966867, 4181534, 4872430, 1993593, 20478647, 53871748, 63478237, 39413475, 19746002, 27017334, 29536717, 397692, -25994143, -5119852, 40678839, 54509417, 36576048, 40740251, 83018289, 116281396, 106144801, 74263038, 47621440, 18776669, -16590719, -31940954, -15268045, -1374958, -19030072, -39917014, -23948627, 11991285, 18866356, -9100380, -33682608, -38528695, -45698861, -64281562, -69044896, -43484228, -8033940, 10788880, 11994423, 6697628, -2446027, -12896213, -13124806, 2329490, 21986506, 32005484]
43954C2005484k873979j5201618k4823998j7410115J3508491M0643762K9893417
43947E5741444q642614k9394915j4295170N631046J127329j3896772r907655J2767242
43939h70065K8865852K5684962J4220415P592926N417384M29110j0168014k2293029
43931D8879541k8405348k2524651n798724J1790674J7998816R801076j120843
43924C0620541J098046J5615568J9948829k407409l2631643l4193201l796463
43917e745732J9271758Q288549j1772233n301578J5707127J1383486j9512741
43910A2318636l5743778j7463098Q309569J6299773J6209992J8887405Q551803
43903B7370302k1978380m0435972j6405724K7506556M2992875K0760655p537781
$$ y = [32005484, 29131505, 13929887, -10894111, -28304226, -14795735, 25848027, 55741444, 47098830, 17703915, 3408745, 9039791, 10167120, -3729652, -13637307, -870065, 27995787, 53680749, 67901164, 75494090, 80911474, 81340584, 71172570, 48879541, 20474193, -2050458, -7849182, 3941492, 21940308, 31741384, 30620541, 31718587, 47334155, 67282984, 64875575, 32243932, -1949269, -5745732, 13526026, 21814575, 10042342, 4740764, 20447891, 31831377, 12318636, -23425142, -40888240, -32578671, -16278898, -68906, 18818499, 27370302, 5391922, -35044050, -51449774, -23943218, 19049657, 39810312, 32272531]
43896C2272531k0609754k2570897j3687824J1719206L5844163K7106408j0140294
43889C9933539l2509194j8887325Q2090o461680k2032621j4786954R720386K1528032
43881b3413727J4904335R799532J4042180J6466206J3819158J4146733J3246774
43874G3011191l224734k9539848l8448558j8895715P136544J6139172J2024147
43867A8202199J1107842J4928504J3921392P794276O173856J1634673J3053487
43860I6816229j854363k9314824m5898803k9022464J2156125L5992407J4259339
43853E3133646k7982237l9898059r623216K3931972K6055852M599942j4325271
43846A5892629j9166739p909367J9557148M4375528L3248731j4124499m8611279
$$ y = [32272531, 11662777, -10908120, -24595944, -12876738, 22967425, 50073833, 39933539, 7424345, -11462980, -11380890, -17842570, -39875191, -54662145, -44941759, -23413727, -8509392, 1290140, 15332320, 31798526, 45617684, 59764417, 73011191, 69786457, 40246609, 1798051, -17097664, -9961120, 6178052, 18202199, 29310041, 44238545, 58159937, 65954213, 72128069, 83762742, 96816229, 94961866, 65647042, 19748239, -9274225, 2881900, 38874307, 53133646, 25151409, -14746650, -24369866, -437894, 25617958, 30217900, 15892629, -3274110, -11183477, 8373671, 52749199, 85997930, 71873431, 23262152]
43839B3262152l2913504N412243J7526857N902989Q155088K5586779K2499124
43832G5431728o321175k3055090j1308160j504109j3481369k1079658j194252
43825b512085K1915304J4973606j1468071k2947929j2577856o29732J741698n9933
43817a1564998q06628L707383J9439062L7185577L0057694q606590m2372187l3999544
43809f960231L996797K8771980K3524773N518644r207096j6858728j0967835J0060165
43801B7878469K5486086J4054876j0359384j5672251r4944Q899219J215895n756239
43793D5651727m449898p506545j5388288j0365784P118661J1341636n538528j6345603
43785D517378k609213J4371050P102219j7845720l4080056l0050135j0980805
$$ y = [23262152, -9651352, -4239109, 13287748, 19190737, 27345825, 52932604, 75431728, 69110553, 46055463, 34747303, 33243194, 19761825, -1317833, -2512085, 19403219, 34376825, 22908754, -39175, -12617031, -13246763, -11505065, -11564998, -12371626, -8664243, 10774819, 47960396, 78018090, 69411500, 27039313, -6960231, -2963434, 25808546, 49333319, 54851963, 45644867, 28786139, 17818304, 27878469, 53364555, 67419431, 57060047, 41387796, 41292852, 50192071, 51407966, 45651727, 41201829, 33695284, 18306996, 7941212, 15059873, 26401509, 20862981, 4517378, 1908165, 16279215, 23381434, 5535714, -28544342, -58594477, -69575282]
43778f9575282J5460429L7794451M1223652K5180899O685116l476104j0486451
43771D2806710j5109125q388071L953788J067793j5506850j5910803Q553653K5111095
43763B6578190J2817403j324725P701101J5210493o104423k5548378O57390M5686617
43755G5673668M0606112j7792449n5153705k7651833J9421496K5815298l069796
43748E7848791k3598131k1548235j3376683o557075L575450J2124962J0338579
43741A8807658L684741J860757J392656k886851k562015Q220453J5622597P100280
43733E1240276m324946j338544N081493o411241k5970761k2847014L668891J8720019
43725A7818173N571948q279397L748554K3872704J8129219r519452k2371851n497087
$$ y = [-69575282, -54114853, -16320402, 24903250, 50084149, 56769265, 53293161, 42806710, 27697585, 19309514, 23263302, 24331095, 8824245, -7086558, 1467095, 26578190, 39395593, 38070868, 45771969, 60982462, 54878039, 29329661, 29987051, 75673668, 116279780, 98487331, 43333626, 15681793, 35103289, 60918587, 57848791, 34250660, 12702425, -674258, -7231333, -3655883, 8469079, 18807658, 22492399, 24353156, 25745812, 22858961, 20296946, 28517399, 44139996, 51240276, 46915330, 45576786, 50658279, 44247038, 18276277, -4570737, -901846, 17818173, 23390121, 15110724, 18859278, 42731982, 60861201, 51341749, 28969898, 23472811]
43717B3472811J4341163R143844j3575573k7020614k1049109n965089P869307
43710a2783260J5461650Q931466j4165054l3755630k1766255J7282174M1331721
43703E36812K2917789j0877687j4020108J3669022K7192773K421887k9671485
43696A2169003k8677405j90244J7379399P979713o060845j520763J4865659K0372374
43688C6316891O507050j4461474k5470473j9058444n11516J6342283J9038423
43681A8702740P858805m161111o638239m410268r268870k1954283l0322087k5048571
43673g5241884q717292J1527492L0193161L9116800K9134555M463587j4730976
43666A5745443j4818432n212715j433281k288703R95438M376604J028999K173235
$$ y = [23472811, 37813974, 46957818, 33382245, 6361631, -14687478, -20652567, -12783260, 2678390, 11609856, -2555198, -36310828, -58077083, -40794909, 536812, 23454601, 12576914, -1443194, 12225828, 39418601, 41840488, 12169003, -16508402, -16698646, 680753, 8660466, 2599621, 1078858, 15944517, 36316891, 42823941, 28362467, 2891994, -16166450, -16677966, -335683, 18702740, 26561545, 22400434, 15762195, 11351927, 2083057, -19871226, -50193313, -75241884, -83959176, -72431684, -42238523, -3121723, 26012832, 30476419, 15745443, 927011, -4285704, -5718985, -8007688, -7012250, -2635646, -1606647, 566588]
43658E66588K0210901L6632916K1000084j6178920k8066375m19260K3377246P327694
43650F4450874k4066647k7556852m342704J3800255J5242845P092431j3227552
43643C1392650m1796124m3811566M740779O3289523O6900012J5391501k9471341
43636F6635434l3488476k0987874j3816744j579787J2877304P15656l4492466
43629b4136953m3693687j0101955J5686694k341832k3383364J49354M0062580
43622d7759163M1290864J3467395M504435J1759774n033773l8064518l7235365
43615e7070351l53323J9072880M453552J669075K9699755L8672029l664790m6504002
43607a4025175l0304386J9639477L3574587K057849k0547367m752195J9397909
$$ y = [566588, 20777489, 57410405, 78410489, 62231569, 34165194, 33745934, 57123180, 64450874, 40384227, 12827375, 8484671, 22284926, 37527771, 44620202, 31392650, -10403474, -54215040, -49474261, 13815262, 80715274, 96106775, 66635434, 33146958, 12159084, -1657660, -3237447, 9639857, 10355513, -24136953, -67830640, -77932595, -62245901, -64587733, -87971097, -87821743, -47759163, -6468299, 6999096, 11503531, 23263305, 18229532, -19834986, -57070351, -57423674, -38350794, -33897242, -32228167, -2528412, 36143617, 32478827, -14025175, -44329561, -24690084, 8884503, 10942352, -9605015, -14357210, 5040699]
43600E040699J9448627M122812m325833n540094r414080j2287912m785652Q497287
43592G55854J3313605N538362l956128m035424K808200M034578n821703j5625100
43584b987756j1048179M637213J3501081P951077j98588n85718P73792k714462
43576I328460k917172O656451J2225100j174200k0157333j7686086M560197J5536050
43568F371467J948045j1089900k75842J9112091J8551432R50033p149086J410361
43560B9828601Q734707P205637R150309J4928200L430583k8597547m6396732k3479744
43552b5195986J2847913J6256108j0156499j8998007Q595232L5896605K8897911
43545D8143277N524794K598815J9517220K4242688J750750l0347039m8196447
$$ y = [5040699, 24489326, 28612138, 24286305, 18746211, 9332131, -2955781, -7741433, 755854, 14069459, 19607821, 15651693, 11616269, 14424469, 18459047, 12637344, -2987756, -14035935, -9398722, 4102359, 12053436, 11854848, 11269130, 12042922, 9328460, 6411288, 13067739, 25292839, 24118639, 3961306, -13724780, -9164583, 6371467, 8319512, -2770388, -3046230, 16065861, 34617293, 35567326, 28418240, 29828601, 38563308, 45768945, 54919254, 69847454, 73278037, 44680490, -1716242, -25195986, -12348073, 3908035, -6248464, -25246471, -16651239, 19245366, 48143277, 53668071, 56266886, 75784106, 100026794, 101777544, 71430505, 23234058]
43538B3234058m2033310j4866526J9213693L7537725K7337394K566302r982682
43531D3006654m82409J7051138K3223339R442235j7924732l9999827l9657562
43524e341164k2330741j2200591j8759638k2801820q533620J0057900J4856347
43517f5053327J5654641K9336463M3995420L6586759J4141387J913011l39705
43510G6234649j1353898k4211441j4088662R197753N309030k9027625m5015074
43503c2955268j5436273K0963950J8318135j0232427k0366393k291749J8137782
43496b3862243K3907398J7118070o53059k4543842l2800442q770198K8468624
43489b1135692M2809825K6865236M740629o681906j3443603k1215247k0975981
$$ y = [23234058, -18799252, -33665778, -14452085, 23085640, 50423034, 52989336, 43006654, 42524245, 59575383, 82798722, 92240957, 74316225, 34316398, -5341164, -27671905, -39872496, -58632134, -81433954, -89967574, -79909674, -65053327, -49398686, -20062223, 23933197, 60519956, 74661343, 76574354, 76234649, 64880751, 40669310, 26580648, 35778401, 41087431, 12059806, -32955268, -48391541, -27427591, -9109456, -19341883, -39708276, -42000025, -23862243, 45155, 17163225, 16510166, -8033676, -40834118, -49604316, -21135692, 21674133, 48539369, 53279998, 46598092, 33154489, 11939242, -9036739]
43482i036739n924717J2734972J6028806j595971k4071635k7050171m278989K0744768
43474b2449676K0535807k52205j1900353l349076N352513p9539p574656p156444
43466b6873629r344098j6642465p989706K2958949M3733136K8256533o33422q193343
43458B5271955j132947m269486r051061O116413K3135834P190323k7162419l1287928
43450a1189316l506877N489129k1108189l4226108K386085N2563755O0608080
43443E1016559K5942432r439480j9998777j1039522M538025J4859898R843848
43436F5722983m202814n481330J0869010K0311534O438344j0920025o978830Q737155
43428H4496027R657071o636890j9613177j7401838n116519R292634J8284162J2984430
$$ y = [-9036739, -14961456, -2226484, 13802322, 12206351, -11865284, -38915455, -43194444, -22449676, -1913869, -2166074, -14066427, -17415503, -12062990, -12142529, -19717185, -26873629, -36217727, -52860192, -60849898, -37890949, 5842187, 34098720, 33465298, 25271955, 24139008, 19869522, 10818461, 16934874, 40070708, 47261031, 20098612, -11189316, -14696193, -9207064, -30315253, -64541361, -62155276, -9591521, 51016559, 76958991, 67519511, 47520734, 36481212, 41019237, 55879135, 65722983, 61520169, 56038839, 66907849, 87219383, 93657727, 82737702, 75758872, 84496027, 94153098, 87516208, 67903031, 50501193, 45384674, 54677308, 72961470, 85945900]
43420H5945900m472372j6373241j2310703m660388o237416p750376M036240K0852200
43412E9029844K6856570K4399496K3668137K0079509O639719l604553M654851
43405A61723573J8215155J2286919p599572j1582892Q508705K9971402L7079845
43398B48603135L6619547L1207936J0630736j8478735k6008850n21651K7599538
43391C09651656K7183523Q681020j26740k322979k2239966n5409733o5166769
43384B00250012l6779585l932667l072558k3024139k4415675K054594K4093198
43377A35173180J5009601j2032859k6446625j8628532k276150Q733217R952065
43370A09483897J070165j2614103j7336486l937906J8326992L2297440L1977599
$$ y = [85945900, 81473528, 65100287, 52789584, 48129196, 41891780, 34141404, 38177644, 59029844, 85886414, 110285910, 133954047, 154033556, 160673275, 157068722, 161723573, 179938728, 192225647, 184626075, 173043183, 181551888, 211523290, 248603135, 285222682, 316430618, 327061354, 308582619, 282573769, 282052118, 309651656, 336835179, 345516199, 345389459, 343066480, 320826514, 265416781, 200250012, 163470427, 159537760, 156465202, 133441063, 109025388, 111079982, 135173180, 150182781, 138149922, 111703297, 93074765, 90798615, 99531832, 109483897, 110554062, 97939959, 80603473, 76665567, 94992559, 127289999, 159267598]
43363A59267598J9473045o195537l7415877m5812079j1779823L6030134M4823642
43356A58391103Q137400k2109689q955561J7878729R199502l1112691n3804615
43349G7624178l1257089J3263081L8499178K4957030j4049681m3530304l4867381
43342C0639012K684874K7809398J7502348m449163p371693r31047j2531241l3903714
43334A9448774k9730771M244652L0868494K5368348N589611k395059O15570R15406
43326E4925025l284422p692531j4126699k0878876j5699630N950172K6559775
43319B5752814K5002806K759899j8919433k2926298j0219038M366060M479038
43312A0295848j3728054l5116862l8329612j8465215P763038K1058309J8437965
$$ y = [159267598, 178740643, 172545106, 135129229, 89317150, 77537327, 113567461, 158391103, 166528503, 144418814, 135463253, 153341982, 162541484, 131428793, 77624178, 46367089, 59630170, 98129348, 123086378, 109036697, 65506393, 30639012, 33323886, 61133284, 78635632, 74186469, 66814776, 65883729, 53352488, 19448774, -10281997, -6037345, 24831149, 50199497, 55789108, 53394049, 54009619, 54925025, 51640603, 43948072, 29821373, 8942497, -6757133, -806961, 25752814, 50755620, 53515519, 34596086, 11669788, 1450750, 5816810, 10295848, -3432206, -38549068, -76878680, -95343895, -87580857, -66522548, -48084583]
43305d8084583J2317048J5477723K6865115L0214359J2007217j6525409k6989857
43298E281613j1319063L867290m219857j8134014o906227K3072527L5689571J9538243
43290D6870083O98515k162851j423981r123235j4409835r370721r167612k4027435
43282b2117072l3292628j3202631K3777629M2811173L2194613J2264709K267692
43275D4703485j45439l340037l500248O880019J9645011J4137195j3919154l5575807
43267B8885025j7989672K7562874M9149549J9065286k6922775l8435370j7901670
43260B3413247n476189j2426432j3516258m20780N954821J822195J0222514L1051385
43252D0624503L0228351r3216j8691857j748808J4614460l410855k5707678p866887
$$ y = [-48084583, -35767535, -20289812, 6575303, 36789662, 48796879, 32271470, 5281613, -6037450, -2170160, -6390017, -24524031, -31430258, -8357731, 27331840, 46870083, 47568598, 45405747, 43981766, 34858531, 20448696, 11077975, 1910363, -22117072, -55409700, -68612331, -44834702, -2023529, 30171084, 42435793, 44703485, 44558046, 41218009, 37717761, 44597780, 64242791, 78379986, 64460832, 28885025, 10895353, 38458227, 87607776, 106673062, 79750287, 41314917, 23413247, 17937058, 5510626, -8005632, -8426412, -2471591, -649396, 9573118, 40624503, 70852854, 70759638, 52067781, 50318973, 64933433, 61522578, 35814900, 27948013]
43244B7948013L1550992L9440999J2015592p171200j614628K454283o858939q408058
43236H9357054N269074R696304p884196k4566492j8929365k567652K344044n583641
43228D7135130j2717075j1295300m227246k8520n822768j5630416j1159434J2091247
43220a654382L0251031K1773026j88045j0177227j0533013j8733555k9231726
43213a8493891k5086905j5540328j8877086j7414402J8902360O6246556O2877525
43206E2613829K321396m7019396l6966663q35316R302646l306969o811796j67720
43198c0869989k102406r571749p709941K92441O625539J9303815L8086840L6743381
43190E0797931M473647k2142864r094655J8125289J3508699j4427343j9049811
$$ y = [27948013, 59499005, 98940004, 110955596, 103784396, 102169768, 104624051, 97765112, 89357054, 94626128, 104322432, 96438236, 71871744, 52942379, 50374727, 52718771, 47135130, 34418055, 23122755, 18895509, 18866989, 13044221, -2586195, -13745629, -1654382, 28596649, 50369675, 50181630, 40004403, 29471390, 10737835, -18493891, -43580796, -59121124, -77998210, -95412612, -76510252, -10263696, 52613829, 54935225, 7915829, -29050834, -29886150, -20583504, -23890473, -30702269, -30869989, -32972395, -42544144, -50254085, -49961644, -43336105, -24032290, 14054550, 50797931, 55271578, 33128714, 24034059, 42159348, 55668047, 41240704, 22190893]
43183B2190893N313623J7180744N36038j1311919L592610J9119210O186032k1149462
43175D1657769k8447774o392480K5074069M1060323K8015094p608160l7115276
43168E6243565l1892414L228035L2572572L1290108J0448552l715370q97510Q144011
43160A05421549N937633j4950155m0594700m4725030k0178792P244381J2247924
43153A0402810N141615J0012143K0484332J0820919j4967007k4635074j1365109
43146E894629n319323k0174411k7558619m835901K6158591L4244876K5180801
43139C3590643K3847031L0776468K6751242Q535577p388254j1317400r939657
43132I4855650j2826020k2866283l4731334l4644187j2758715J6923360K5650799
$$ y = [22190893, 27504516, 44685260, 45221298, 33909379, 37501989, 56621199, 62807231, 41657769, 13209995, 6817515, 31891584, 72951907, 100967001, 93358841, 56243565, 24351151, 27579186, 60151758, 91441866, 101890418, 98175048, 97277538, 105421549, 111359182, 96409027, 55814327, 11089297, -9089495, -1845114, 10402810, 15544425, 25556568, 46040900, 56861819, 41894812, 17259738, 5894629, 575306, -19599105, -47157724, -51993625, -25835034, 8409842, 33590643, 57437674, 88214142, 114965384, 123500961, 116112707, 104795307, 94855650, 82029630, 59163347, 24432013, -10212174, -22970889, -6047529, 19603270]
43125A9603270Q680986n357458K955084J5415484R391393n070690p706472n665718
43117C2245879j5579883k4446218o755540K7090738L8734916J8953490L50391
43110G0593773O109684J8633039J1435425j3749593l5008261l5504962j1360287
43103A1148818K5591062M4803036K0123704l1297712n5523680k4814433K4373519
43096A4404314L6744972O690318k2719980k0884059k543922L691958l460672k550478
43088I372451J5283037L2068942K6999293M765496r937358m846683M497537j909099
43080G6293616j9709003k7114929j5481348K144996J2623136J7066109J9114716
43073F4937293J3473709l768913k1907328k3790825n949103J5340606J9120955
$$ y = [19603270, 28284256, 22926798, 25881882, 41297366, 50688759, 45618069, 37911597, 32245879, 16665996, -7780222, -14535762, 12554976, 51289892, 70243382, 70593773, 76703457, 95336496, 106771921, 93022328, 58014067, 22509105, 11148818, 36739880, 81542916, 101666620, 70368908, 14845228, -9969205, 14404314, 51149286, 57839604, 35119624, 14235565, 11691643, 15383601, 11922929, 9372451, 24655488, 56724430, 83723723, 88489219, 78551861, 73705178, 78202715, 76293616, 56584613, 29469684, 13988336, 16133332, 28756468, 45822577, 64937293, 78411002, 74642089, 52734761, 28943936, 22994833, 38335439, 57456394]
43066E7456394P61820k1657558k5451922r816547L455780R99843l092350P306218
43058I961678J9632166J1363680q565876q743630J2983931K1548648r5107k2115818
43050C5969672j5410137K839356J064904j4336809j5650906n408855q179788j8064779
43042c7177342j584459M0360674N8661278K4426653k5172728l7467860j3389022
43035H657194O570518O295497N931253J6231797J9207884K285396j8072433k2168729
43027B4938377j5721415j4882869j6773713n553242J7742965L1627915K3557772
43020D4935790P782215N600708J6736877K0864251N296979j8515449k9501366
43013E3200005k1812141q329164j071886K685180R700120J4266159N306313j0597053
$$ y = [57456394, 58218214, 36560656, 11108734, 1292187, 4747967, 5747810, 2655460, 9961678, 29593844, 40957524, 32391648, 23648018, 36631949, 58180597, 58085490, 35969672, 20559535, 23398891, 24463795, 10126986, -5523920, -10932775, -19112563, -37177342, -38761801, 1598873, 60260151, 84686804, 59514076, 22046216, 8657194, 15227712, 21523209, 27454462, 43686259, 62894143, 65179539, 47107106, 24938377, 9216962, -5665907, -22439620, -27992862, -10249897, 21378018, 44935790, 52718005, 58318713, 75055590, 95919841, 101216820, 82701371, 53200005, 31387864, 23058700, 21986814, 24671994, 34372114, 48638273, 53944586, 43347533]
43005D3347533r049249J9981270N1550283N2442081K2692907o851277j6818788
42998A57294760j8400132k4520015k4064241j957973K9380899M0990929K5831761
42991A84555988O627880L881004J2713718J6712101J1750243P661629J2273226
42984B56175789J9931403J5677472p361850l3019042l2718548M58928L6907319
42977B56051471M3183862K2258831L782394P30249m04048p306613q094459K026153
42969C12227840O823501l295939j1384096K0127J9671604K3476727P391136j2442274
42961C42488626k1820669j6381226M40093J3381977L859919k2149085l1987016
42954B67832619j0793333J1808808M697531j5387065j2016717Q564215O340516
$$ y = [43347533, 34298284, 54279554, 105829837, 158271918, 180964825, 174113548, 157294760, 138894628, 114374613, 90310372, 88352399, 117733298, 158724227, 184555988, 191183868, 195064872, 207778590, 224490691, 236240934, 243902563, 256175789, 276107192, 291784664, 284422814, 251403772, 218685224, 219144152, 256051471, 299235333, 321494164, 325276558, 326006807, 325602759, 318296146, 310201687, 312227840, 319051341, 315755402, 304371306, 304391433, 324063037, 347539764, 354930900, 342488626, 320667957, 304286731, 304726824, 318108801, 321968720, 299819635, 267832619, 257039286, 268848094, 273545625, 258158560, 246141843, 254706058, 261046574]
42947B61046574k4779406m2805793j9990076J8877796L4828222K0211072q221028
42940B39167361l2662009l5935801q535268K8391229L3669708j184595l5298729
42933A87611896l4670405j7827413j8916045l0921103k1407609J0543048L0970989
42926A05383358K0714114l229568j6840595j3974792q38839J2018773J0797889
42919A14030340q202573k5272624j6808586J0540579K4552354R046278j7348808
42912I0536960k8101109j7847221N34733J3335606J4549127Q079098N603851J3557398
42904A00248443K1899869J5696602l893410k2098544l1238434l4167289k8989528
42897A7457709q538535K1770303M1606892L7024588J3738983j1799399k3798183
$$ y = [261046574, 236267168, 193461375, 173471299, 192349095, 227177317, 247388389, 239167361, 206505352, 170569551, 162034283, 190425512, 224095220, 222910625, 187611896, 152941491, 135114078, 116198033, 85276930, 63869321, 74412369, 105383358, 126097472, 122867904, 106027309, 92052517, 91213678, 103232451, 114030340, 105827767, 80555143, 63746557, 74287136, 98839490, 107885768, 90536960, 62435851, 44588630, 45123363, 58458969, 73008096, 81087194, 86691045, 100248443, 122148312, 137844914, 133951504, 111852960, 80614526, 46447237, 17457709, 8919174, 30689477, 72296369, 109320957, 123059940, 111260541, 87462358]
42890H7462358j3303866J0831340K0680199l68744k7828116k2270327J2842205
42883F8045049L0319221O414709k3788714j9469074N783662Q554579j6869801
42876E8989631l1552922r672353K7505428M2090331K3317694p381325k1949906
42869H1346578r791702J5487560K9055260J8284149o864629k7716842l3604865
42862F6195509k1523157O609116L4834323L6026769L788653k7971514k1237277
42855G6722422J4235251L1391443J0289335j6056120j1678574J1706662J5510909
42848A32121328r304884l1836815k4788541K621622K1265287J8072000N461036
42841A13611033J63311L039672L337511k768561o511718q71606P904990R805362
$$ y = [87462358, 74158492, 84989832, 105670031, 105301287, 77473171, 55202844, 68045049, 98364270, 104778979, 80990265, 61521191, 67304853, 75859432, 58989631, 27436709, 17764356, 45269784, 87360115, 110677809, 103296484, 81346578, 71554876, 87042436, 116097696, 134381845, 127517216, 99800374, 66195509, 44672352, 51281468, 86115791, 122142560, 125931213, 97959699, 76722422, 90957673, 122349116, 132638451, 116582331, 104903757, 116610419, 132121328, 122816444, 90979629, 66191088, 68812710, 90077997, 108149997, 113611033, 113774344, 116814016, 120151527, 117382966, 110871248, 109999642, 117904632, 127709994]
42833A27709994N876434M211156N360387K935677l742144j0149343j7915619l0111063
42825H4175479l5194290j6318197J6708377K7622091J750414k6248853j6701863
42818C5793158J7514377K8910692N442017j3582350O74797K4240068K1415989
42811A20408748M66881l824973J2245315J8092401J476887j1481949L68970J9437139
42803A57189419J7884069j145512j3092133q989307J74959P609731J5686056K0173745
42795A95491027J2257787k876037r654975n765536k200276R65828J3985927K7932747
42787B30136492J5588940k3721439m9044354l1185507K778794Q516701j0578993
42780A42490634j4141581R238767K7442336J7902625l001313j3792286j7415785
$$ y = [127709994, 133586428, 137797584, 143157971, 146093648, 142351504, 132202161, 114286542, 84175479, 48981189, 32662992, 49371369, 76993460, 78743874, 52495021, 35793158, 53307535, 82218227, 87660244, 74077894, 74752691, 98992759, 120408748, 120875629, 117050656, 129295971, 147388372, 148865259, 137383310, 137752280, 157189419, 175073488, 173927976, 160835843, 151846536, 152021495, 159631226, 175317282, 195491027, 207748814, 204872777, 195217802, 189452266, 187251990, 188217818, 202203745, 230136492, 245725432, 222003993, 172959639, 141774132, 144552926, 153069627, 142490634, 128349053, 137587820, 165030156, 182932781, 179931468, 166139182, 148723397]
42773A48723397k1231248j6238810M114346K6410611L6567068L6897522K8717148
42766B43960034K475200l4402658m6288194j5555851K1371787J9095525j1630538
42759A79025305k3134672m965855O088607r440859k5060781j6919694p41428N66741
42751A05417364o039777k852654P917720J6245779K5048921L4735966K7399643
42744B07872962o014785l8294919l4830627o77501K7505311K9379752J5902023
42737B00842216K856713m564938l824568L620233M085726j2688361l1454917k8102620
42729A30769484o363451P367873N031144M233588J1897710J1952579j109489o856747
42721A56922691O728328J9830698J2031881m475142n578146P217232J3670689
$$ y = [148723397, 127492149, 111253339, 115367685, 141778296, 178345364, 215242886, 243960034, 246435234, 212032576, 165744382, 150188531, 171560318, 190655843, 179025305, 155890633, 150924778, 157013385, 147572526, 122511745, 105592051, 104850623, 105417364, 99377587, 96524933, 104442653, 120688432, 145737353, 180473319, 207872962, 201858177, 163563258, 128732631, 128055130, 155560441, 184940193, 200842216, 203698929, 199133991, 195309423, 198929656, 203015382, 190327021, 158872104, 130769484, 124406033, 131773906, 136805050, 141038638, 152936348, 164888927, 163779438, 156922691, 163651019, 183481717, 195513598, 191038456, 185460310, 192677542, 206348231]
42714B06348231Q068544K252188J407651j753237r662816j3782483p983302K296678
42706A87191454N602762m810107k1879005k4979923k78423L4915296M3365682
42699B19127736J3139880k3277911k8217246l805395J7394124J4882674l762589
42692B05481273k0871539k5825127j8544023p456208N53609J2141314L5667431
42685A81146730N3817898L3900566k0550666n7929664m3235788p257763J335916
42678A41227229j2700500j0063660J2463751K1099384P118643j889617N528873
42671A62784103J0111000O169829J1970633K4664861J3602776k3550190m4579401
42664A61173611k5893011J052719K856574p542962o053053j455189q395890j1180420
$$ y = [206348231, 214416775, 216668963, 218076614, 216323377, 206660561, 192878078, 184894776, 187191454, 192794216, 187984109, 166105104, 141125181, 140846758, 175762054, 219127736, 232267616, 208989705, 180772459, 176967064, 194361188, 209243862, 205481273, 184609734, 158784607, 140240584, 132784376, 133337985, 145479299, 181146730, 234964628, 268865194, 248314528, 190384864, 147149076, 139891313, 141227229, 128526729, 118463069, 130926820, 152026204, 159144847, 157255230, 162784103, 172895103, 179064932, 191035565, 215700426, 229303202, 205753012, 161173611, 135280600, 136333319, 139189893, 131646931, 125593878, 124138689, 115742799, 104562379]
42656A04562379O030204K2147899J2412284o926989p229733L501672J569559o130870
42648A29936405j329861K683102j3333479k6232309l437078L0769059K4257658
42641A43313497j3817326k0202408J9992548M6355192J9327573j9892281j9055914
42634A56020881Q070944J5575815l108399k0315547k3127426j8034315o547556
42627A08534397R887319J6643963O128033m747823k144220r18283j6102029k9745020
42619H7536337j7697422Q151970J8101543J1171384R127369J5267572J4699553
42612A46358306P825991P424836P361837q620129k8843283k3488819M560641J8327613
42604A30906993M381658q111944k17230N238883j1517222k7173644j2538858J7811305
$$ y = [104562379, 110592583, 132740482, 145152766, 138225777, 130996044, 134497716, 136067275, 129936405, 128606544, 131289646, 117956167, 91723858, 88286780, 119055839, 143313497, 129496171, 109293763, 129286311, 175641503, 194969076, 175076795, 156020881, 164091825, 179667640, 176559241, 156243694, 133116268, 115081953, 108534397, 118421716, 135065679, 141193712, 136445889, 134301669, 133383386, 117281357, 87536337, 69838915, 77990885, 96092428, 107263812, 116391181, 131658753, 146358306, 154184297, 161609133, 168970970, 160350841, 131507558, 108018739, 112579380, 130906993, 135288651, 127176707, 126959477, 132198360, 120681138, 93507494, 80968636, 98779941]
42596I8779941K9371470K1206803J7287644J8803372Q016117o153233O363937
42589A93676051L8174369L7795375j5444768o7939197n7902487k37843L4650988
42582A62772488J5633569j7109039j7861730M970254J2616041o574509k7673667
42575A26773407k6526640o272644J2155656J3854744K961711l499348M693982
42568A24140868J8473300K2476955J6999731J3792446J1419620m832512l2413849
42561A70056559m3496388k2285341Q612121J8071956P012355k080953j736302
42554A34154007k14084L141690J3884357J9523339J766630k7698492l3530292
42547A11027155m373264L1854750M6247353L7278630J5021653j4919389m0486540
$$ y = [98779941, 128151411, 149358214, 166645858, 185449230, 193465347, 187312114, 193676051, 231850420, 269645795, 254201027, 186261830, 128359343, 128121500, 162772488, 178406057, 161297018, 143435288, 148405542, 161021583, 154447074, 126773407, 100246767, 93974123, 106129779, 119984523, 122946234, 119446886, 124140868, 142614168, 165091123, 182090854, 195883300, 207302920, 202470408, 170056559, 126560171, 104274830, 112886951, 130958907, 137971262, 135890309, 134154007, 133939923, 137081613, 150965970, 170489309, 172255939, 144557447, 111027155, 106653891, 138508641, 184755994, 222034624, 237056277, 222136888, 181650348]
42540A81650348m2544185k0742256Q16503O787028Q068454J3919465J2478027
42533A60433384k353521r550308Q240416L1222595K6873422m266528l1687148
42526A78912312l4687047j7972065L149966J3633911N074020j0337918n398286
42519A32374893K3128423L8941361J5525775j8032602j5929673J4216354K3886274
42512B14110805Q83682j5303182k903637P253438j1099282l0765045j5097509
42505A47079270J8560542K1832408j1092939l3808634j4024120K3448179L3121514
42498A85116220P378289j9053352j5599195Q856091K1004561N558648j7164029
42491A76097233j8346061L585261K3898800K3506199O887557j1359539k2821677
$$ y = [181650348, 139106163, 118363907, 119180410, 125967438, 134035892, 147955357, 160433384, 158079863, 148529555, 156769971, 187992566, 214865988, 210599460, 178912312, 144225265, 126253200, 129403166, 143037077, 148111097, 137773179, 132374893, 155503316, 194444677, 209970452, 191937850, 176008177, 190224531, 214110805, 214994487, 199691305, 196787668, 204041106, 192941824, 162176779, 147079270, 165639812, 187472220, 176379281, 142570647, 128546527, 151994706, 185116220, 192494509, 173441157, 157841962, 166698053, 187702614, 193261262, 176097233, 157751172, 161336433, 185235233, 208741432, 215628989, 204269450, 181447773]
42484A81447773k3768044j2189811M488761J0650520K751269j384762J3302780
42477A75298486L3778772L4354443J3527537l887721l758408j712478j4856290
42470B32744341l1672899k8826942q462536M113453j003850n926438J980775Q399385
42462A71345289o14438r754866K853322K6919273L2313707J4692372p51657j091002
42454B35912000l41592o876301q014325R19986L143716o362654l787509K3745163
42446B38338484M8018898L8542063R744310l218589J515562j285073j5223630
42439C16432025j8165559l825680Q036575N580454j111549l579104n891986q858193
42431B88616983p688245p095974j5119464k2341298j2617243O242563R639809
$$ y = [181447773, 157679729, 145489918, 149978679, 160629199, 163380468, 161995706, 175298486, 209077258, 243431701, 256959238, 253071517, 249313109, 247600631, 232744341, 201071442, 172244500, 163781964, 167895417, 166891567, 160965129, 162945904, 171345289, 170730851, 160975985, 163829307, 190748580, 223062287, 237754659, 237003002, 235912000, 235570408, 228694107, 220679782, 221599768, 224743484, 218380830, 214593321, 238338484, 286357382, 324899445, 334643755, 331425166, 332940728, 331655655, 316432025, 298266466, 294440786, 302477361, 308057815, 306946266, 303367162, 297475176, 288616983, 280928738, 273832764, 258713300, 236372002, 223754759, 229997322, 239637131]
42424B39637131o003209k0255944k2802925k1126442j5733814q25061J1573314
42417A64463050N484775j915945J8503517M7200686L0762185k9368129o2585763
42410A72544376l1597428R747070L985428j9023685J283009M9246374N5601343
42403B41786487R204111k6556769j1737467J9254814K0917879r35100j5222709
42396B36711246j6011857j7194485j9463162j0696005Q849797K1517716J3604289
42389B17317539o606915j6563804p281185J229708j4964999m4335052m8059410
42382H0735882j5191250J7603450J8503902M219258N006572J3457772M719415
42375A29055001j2835580r837071J2605569K6021897K2947107K0615907K0072059
$$ y = [239637131, 233633922, 213377978, 190575053, 169448611, 153714797, 152889736, 164463050, 169947825, 168031880, 186535397, 233736083, 264498268, 235130139, 172544376, 140946948, 150694018, 154679446, 135655761, 136938770, 186185144, 241786487, 250990598, 224433829, 212696362, 231951176, 252869055, 251933955, 236711246, 220699389, 203504904, 184041742, 173345737, 182195534, 203713250, 217317539, 210710624, 194146820, 186865635, 188095343, 173130344, 128795292, 80735882, 65544632, 83148082, 101651984, 105871242, 110877814, 124335586, 129055001, 116219421, 106382350, 118987919, 145009816, 167956923, 188572830, 208644889]
42368B08644889N086905j6922119j6850264O225244J8180213K707234j7184079
42361A89888023k0898079j5952500j0995250j192118P180400l574606k4989467
42354A19466403k5561608n940385m209697k5531559j9661071L6563733Q5440228
42347A60566044O6451166P349516k0120827n422632L233781j1429154j6807527
42340A83820367r41147K635714k2601580m0738731j6880200K9439009N0570270
42333A85303702K8620182j2288123l6339743k6736335J198911J3147889m680284
42326A48226199k3367652r891567K0003801K1811836o157053j5037513J8106534
42319A53694585N0955075M0198273O299902m295367P429187M191892j8666592
$$ y = [208644889, 213731794, 196809675, 179959411, 186184655, 204364868, 207072102, 189888023, 168989944, 153037444, 142042194, 140850076, 148030476, 144455870, 119466403, 93904795, 87964410, 83754713, 58223154, 38562083, 75125816, 160566044, 227017210, 234366726, 214245899, 208823267, 212057048, 200627894, 183820367, 182879220, 185514934, 162913354, 122174623, 105294423, 134733432, 185303702, 213923884, 201635761, 165296018, 138559683, 139758594, 152906483, 148226199, 124858547, 114966980, 134970781, 156782617, 150625564, 135588051, 153694585, 204649660, 244847933, 251147835, 246852468, 254281655, 258473547, 239806955]
42312B39806955k5822934m087282J4212110L203081j8036923j8484858J547551
42305A92337700K1712622L3248869L5629492K1286110q014486k4189114n742657
42298B66268536J9760936M725945m3924771o1516521j5575291L9974409L5155232
42291B44868475j9219972n0349277k6435086R306665J1509232r223632k0280840
42284A40175565j7583047j1677045N194107M0175945O7121872N2707195P953780
42277B84068372k2109558j8784110o634303p689943j1805151l434845R271314
42270B22881776Q198297r058011k9777120l9726354k9097344P17097K9911693
42263A54050034L5005919J7004507k91904m025566m998372j1233156j2522347
$$ y = [239806955, 213984021, 209896739, 224108849, 227311930, 209275007, 190790149, 192337700, 214050322, 247299191, 282928683, 304214793, 296200307, 272011193, 266268536, 286029472, 290755417, 246830646, 185314125, 169738834, 209713243, 244868475, 225648503, 175299226, 148864140, 158170805, 169680037, 160456405, 140175565, 122592518, 110915473, 116109580, 156285525, 223407397, 276114592, 284068372, 261958814, 243174704, 236540401, 228850458, 217045307, 213610462, 222881776, 231080073, 222022062, 192244942, 152518588, 123421244, 124138341, 154050034, 189055953, 206060460, 205768556, 201742990, 196744618, 185511462, 172989115]
42256A72989115k620058O498436P502466J2000761K4375512K5597200O427224
42249B52770656p323996O534255K3626524P355501k7962065l3251319j1938K7647782
42241B49385400K2555429R205428J2687619J7714737O017763l944958Q842178
42234C22463596K3478898R135355j7799865j4276665J9833557L8548030J9111037
42227D00493943p923976j0158987J959825J698831j1289557j8425911j2962846
42220C43391322j285929J2336844K2728602J7959784m219969k4465478k4654359
42213C41790817j2529608n120305L89210J5409473K9330565K0165987o193002
42206C83243137j8572969p242543K678703m791219j0312284L437023J6778013
$$ y = [172989115, 170369057, 176867493, 184369959, 196370720, 220746232, 246343432, 252770656, 245446660, 251980915, 275607439, 282962940, 255000875, 221749556, 221737618, 249385400, 271940829, 281146257, 293833876, 311548613, 317566376, 313621418, 322463596, 345942494, 355077849, 337277984, 323001319, 342834876, 381382906, 400493943, 392569967, 382410980, 384370805, 386069636, 374780079, 356354168, 343391322, 342105393, 354442237, 377170839, 395130623, 390910654, 366445176, 341790817, 329261209, 324140904, 324530114, 339939587, 369270152, 389436139, 383243137, 364670168, 357427625, 360106328, 355315109, 345002825, 348439848, 365217861]
42199C65217861N312647j3041967j098360L4868993M5734662J0376779k9776792
42192D17593823k7138514O652344J9563202q742448m2853186m1480543q370551
42185C15224127J8002406J3259354q591365j8256950p454968N269898K665743
42178C20118245p263862l486854J6295114K9230410J6646242j1186401k7817086
42171C32535808k0572284R57310J9402157K2187279O024914j7928079k7311052
42164C15296053j1391286J1448730J4474818q68455q510116Q85300O305292o712641
42156C20927695k0610594j5552422l423503o576449j7446865r921952J5313605
42149B62709515K8533112J5966083k318324o867188m447923p481695j1653302
$$ y = [365217861, 370530508, 357488541, 356390181, 391259174, 436993836, 447370615, 417593823, 390455309, 397107653, 416670855, 407928407, 365075221, 323594678, 315224127, 333226533, 346485887, 337894522, 319637572, 312182604, 317452502, 320118245, 312854383, 309367529, 325662643, 354893053, 371539295, 360352894, 332535808, 311963524, 312920834, 332322991, 354510270, 360535184, 342607105, 315296053, 303904767, 315353497, 329828315, 328959860, 320449744, 321335044, 327640336, 320927695, 300317101, 284764679, 281341176, 274764727, 257317862, 247395910, 262709515, 291242627, 307208710, 304890386, 298023198, 293575275, 286093580, 274440278]
42142B74440278r839081r309141j7697005k6380062k4141820j4913185p034165
42135A65125819K165612J5545124K3425658J8954618J2769358J3414080Q028901
42128B59429170j3579070l0162232j5709096J4201462J9343737l422653j5384875
42121B14716443n60249O992306j8731961m7815798l8104608q45065J7036666L256333
42113A35944067q264005M444649K0517706J5262923j390617n880549P80120L43231
42105A61757525q027449o039935J1091465K2906195J3277706m525338o609729
42098A83830440O568623J1084809n367326k5897499k8619628j5522416n579669
42091A20497334o835772r398673m345411L769223O447055L656174J552933K872501
$$ y = [274440278, 264601197, 255292056, 237595051, 211214989, 187073169, 172159984, 165125819, 167291431, 182836555, 206262213, 225216831, 237986189, 251400269, 259429170, 245850100, 215687868, 199978772, 214180234, 233523971, 230101318, 214716443, 214156194, 221148500, 202416539, 154600741, 116496133, 115651068, 132687734, 135944067, 127680062, 132124711, 152642417, 167905340, 166514723, 160634174, 161414294, 161757525, 153730076, 147690141, 158781606, 181687801, 194965507, 190440169, 183830440, 190399063, 201483872, 196116546, 170219047, 141599419, 126077003, 120497334, 113661562, 104262889, 99917478, 103686701, 110133756, 113789930, 115342863, 118215364]
42083A18215364L478640l024132j6764912k6098325j6074322J0921052K8860005
42076I9513370J4575818k0762686l9667012k0521514J8839529M3053230L5285451
42069A30316186P909635j4044859j5838901n322300l471095j7314534k7043914
42062E5190218j1841026J6875267K7294619J1566941n297724o180314n085975
42055H2522006j5848887k3109190p901394J6006438J9202182N44944j2842941
42048E8573158n582028J0349841J8886395J6140786L187186j5028705k1771427
42041F4755206k794583K6653207L2732031R126560j1902156p316444L076647p655633
42033A06674835k6089239j8900401R492565J7035426j2950923m2480061l0779403
$$ y = [118215364, 121694004, 118669872, 101904960, 75806635, 59732313, 70653365, 99513370, 114089188, 93326502, 53659490, 33137976, 51977505, 95030735, 130316186, 138225821, 124180962, 108342061, 103019761, 99548666, 82234132, 55190218, 43349192, 60224459, 87519078, 99086019, 93788295, 87607981, 82522006, 66673119, 43563929, 35662535, 51668973, 70871155, 71416099, 58573158, 52991130, 63340971, 82227366, 98368152, 101555338, 86526633, 64755206, 61960623, 88613830, 121345861, 130472421, 118570265, 111253821, 114330468, 106674835, 80585596, 61685195, 71177760, 88213186, 75262263, 32782202, 2002799]
42026B002799Q819566K9671874J6316639j026258M635330K1374361K1967265L179042
42018A06940618j4787355j7454811r044780q64782O09898m199542q620010m320233
42010D8259003P952678J6388072J3528898O815220N074775L707376l507180p137113
42002I1081729M354396J9083469J2429024j5573726l5475705k7172673m348753
41995D4377761Q488405P037294M245176P881249J1946070N685775j2716700k8210699
41987D8734331k0409890P302132K1553878J653739k3216404j0449322K8818806
41980E3987270L9851862O123666k4541030j3558133J2385718Q954111j8519293
41973F4684171l3056820k4974414j3050157m643107O846713J5992514J1869728
$$ y = [2002799, 10822365, 40494239, 56810878, 55784620, 60419950, 81794311, 103761576, 106940618, 92153263, 74698452, 65653672, 64788890, 65398788, 61199246, 52579236, 48259003, 56211681, 72599753, 86128651, 92943871, 98018646, 101726022, 98218842, 91081729, 95436125, 114519594, 126948618, 111374892, 75899187, 48726514, 44377761, 52866166, 59903460, 64148636, 72029885, 83975955, 89661730, 76945030, 48734331, 28324441, 35626573, 57180451, 58834190, 35617786, 25168464, 53987270, 93839132, 99962798, 75421768, 61863635, 74249353, 83203464, 64684171, 31627351, 6652937, -6397220, -11040327, -4193614, 11798900, 23668628]
41966B3668628L187568O760262J8254494K1277399J5995668J2351633O512758
41959A08008410q390593k0897247j9151323j5563527k2869298k2647775O166856
41952D655503M3554310N3762630M0002588K9696326J9227993j4463229n4984556
41945A21451565n6805481j7171434J7038292K0942334J6009136J4102540m120267
41938A11446685l6529902m2452472o700069K7907149K3036849j873105r059064
41931F5776071K820456J3231864J5156336Q960929p272959j9565687n212598K3426627
41923I7321039K4368691n394577j7448521O405808J9005646p741095k5952681
41916I0564310N544832L9521833J3239468m1213200m1905286J3370193M6491886
$$ y = [23668628, 26856196, 33616458, 51870952, 73148351, 89144019, 101495652, 108008410, 99617817, 78720570, 59569247, 44005720, 21136422, -1511353, 4655503, 48209813, 101972443, 141975031, 171671357, 190899350, 176436121, 121451565, 64646084, 47474650, 64512942, 85455276, 101464412, 115566952, 111446685, 74916783, 32464311, 25764242, 53671391, 76708240, 74835135, 65776071, 68596527, 81828391, 96984727, 105945656, 98672697, 79107010, 73894412, 97321039, 121689730, 116295153, 98846632, 105252440, 124258086, 116516991, 90564310, 96109142, 135630975, 148870443, 107657243, 65751957, 79122150, 125614036]
41909A25614036J9869463k0187005k6047734o742323R334727J3470659M127044
41902A19438867j8798141l6386951k6478443j506495O814217j401721O04824J4528088
41894E6814245J6365801M396250k17022J964673n908090j0543322J4972949M8246698
41886A26092182L5734826j7514492m3562404j4808161J5937829N570340j5131593
41879I2318527n250630J7651094J8514540N591885L003188L312699o817692j0524043
41871A17799568M744132J1680999j1475566l2920751j4397419K1839985K5189659
41864A22460607n849288k9697449k8557175j9416433j0669967L941697J5777877
41857D7989869R616602m746670q138548q706575k2471991l0669177m251440L7637479
$$ y = [125614036, 145483499, 125296494, 99248760, 92506437, 101841164, 115311823, 119438867, 100640726, 64253775, 37775332, 36268837, 43083054, 41681333, 42286157, 56814245, 73180046, 77576296, 77359274, 79323947, 73415857, 62872535, 77845484, 126092182, 161827008, 144312516, 100750112, 85941951, 101879780, 107450120, 92318527, 87067897, 104718991, 123233531, 128825416, 131828604, 135141303, 128323611, 117799568, 122543700, 134224699, 122749133, 89828382, 75430963, 97270948, 122460607, 116611319, 86913870, 58356695, 38940262, 28270295, 32211992, 47989869, 57606471, 52859801, 44721253, 36014678, 13542687, -17126490, -21377930, 16259549]
41849A6259549M5336553J3782756j0737290l342922R325379J808496j3632496
41842E8800025j8326965j4823571p514683Q219554K3262494J6588343o056959
41835F0148238j1100368J0149249K4727577J1825267m650524l14624R540158K456861
41827A02781834j1054071j1662188p422837j2413274j3897773L637131K2461037
41820G2429859J6571875m202475j2299019r473629j5639820k2743982m956718
41813A9686091K8908893L9105464J5506501q483238j1218674r293102j4344372
41806E9867563o812263K2120080M0043590J8164924k0809095l4319495j8576862
41799E9678442o24818J0148992K3033092K9992755J2225056j8074510k4356084
$$ y = [16259549, 61596102, 75378858, 64641568, 61298646, 70624025, 72432521, 58800025, 40473060, 25649489, 18134806, 26354360, 49616854, 66205197, 60148238, 49047870, 59197119, 83924696, 95749963, 91099439, 90784815, 100324973, 102781834, 91727763, 80065575, 72642738, 60229464, 46331691, 49968822, 72429859, 89001734, 84799259, 72500240, 63026611, 47386791, 24642809, 19686091, 48594984, 87700448, 103206949, 94723711, 83505037, 74211935, 59867563, 53055300, 75175380, 115218970, 133383894, 112574799, 78255304, 59678442, 59053624, 69202616, 92235708, 122228463, 134453519, 116379009, 92022925]
41792I2022925j569842J2936613k586964k1504769j4211087N153763M787540j4297164
41784F0731015k3362568q971984J4363730K6824813J9183842n205152k7720337
41777E5843359k5295109k72311J5692673N799416m271846J1370719L1716415K1665462
41769A12248778n902367r027425J0064901N740840l0891263m9665799k1028683
41762A1538982J3958750Q398553j7658964j3664965K0602647L8778542J9297597
41755H1251142j0670190k0412363r843500L883387P654914k154536j6578214j8129479
41747A5001161l271490P551643q1535p747429P724173L1064161K5625170r931186
41739F5934668l4844649k1063060J2558048K9330897J6911813p913514k0991242
$$ y = [92022925, 90453083, 103389696, 100802732, 79297963, 65086876, 70240639, 75028179, 60731015, 37368447, 28396463, 42760193, 69585006, 88768848, 83563696, 55843359, 30548250, 30275939, 45968612, 51768028, 47496182, 58866901, 90583316, 112248778, 106346411, 97318986, 107383887, 113124727, 82233464, 32567665, 11538982, 25497732, 33896285, 16237321, 2572356, 23175003, 61953545, 81251142, 70580952, 50168589, 40325089, 44208476, 51863390, 49708854, 33130640, 15001161, 11729671, 19281314, 19199779, 11452350, 19176523, 50240684, 75865854, 65934668, 31090019, 10026959, 22585007, 51915904, 68827717, 60914203, 39922961]
41732C9922961j1842681N873598O131346j5703715k9571103r636680K4416920
41725I590646L2114476J0759073l935118N332061J6171028Q511992p250227j6144368
41717E5149563k0032374j8283129N39604K8130049K9358749p434665l9956115
41710B7471682k4443522K0420129L7424359Q132733k9138294l6806151k0450167
41703a7389231o491480l886297k416040N994386J8506440K7964118K8574058J6979998
41695F7835952m971922k5999198k8496801m544583K8094606L6211065Q553659
41688G6682778k4490710k4816989M196746K2745784Q421186j8839542l0954720
41681A2944533k5902632j5954555m603912P792230J3154882Q373086N229069J2014978
$$ y = [39922961, 28080280, 33953878, 40085224, 24381509, -5189594, -14826274, 9590646, 41705122, 52464195, 48529077, 53861138, 70032166, 78544158, 71293931, 55149563, 35117189, 16834060, 17373664, 45503713, 74862462, 67427797, 27471682, 3028160, 23448289, 60872648, 69005381, 39867087, 3060936, -17389231, -23880711, -27767008, -30183048, -24188662, -5682222, 22281896, 50855954, 67835952, 62864030, 36864832, 8368031, 3823448, 31918054, 68129119, 76682778, 52192068, 27375079, 31571825, 54317609, 62738795, 43899253, 12944533, -12958099, -28912654, -33516566, -25724336, -12569454, -4196368, 1032701, 13047679]
41673A3047679J8327245J2438060j84135r351234j5090316j6132311l202610J8538619
41665A8390997K2300106j958045k3619699j4097352P439457N305879j4196483
41658d35140j7060334j884013J588642r103579k562892K6770390M0603073J6196891
41650E4113038j7880192k7748676j9580004j3910332p668374Q692241K3149151
41643h33148K1855321J5083163J4634433P605686j5376141k7649943j828723L7101890
41635E0592538L7696696m094824l9959621l9533135k2530163j1860043J103777
41628b8584775K3107692K9770692L475493k5033798j1731508L4654980N8179355
41621H3838131K8245141k3625416m7680008l2724873n878082P667804P741290
$$ y = [13047679, 31374924, 43812984, 43628849, 34277615, 19187299, 3054988, -147622, 18390997, 40691103, 38733058, 15113359, 1016007, 8455464, 13761343, -435140, -17495474, -19379487, -17790845, -26894424, -29457316, -2686926, 37916147, 54113038, 36232846, 8484170, -11095834, -25006166, -32674540, -23982299, -833148, 21022173, 36105336, 50739769, 58345455, 42969314, 15319371, 13490648, 50592538, 88289234, 84194410, 44234789, 4701654, -17828509, -29688552, -28584775, -5477083, 24293609, 27769102, 2735304, -8996204, 25658776, 83838131, 112083272, 88457856, 40777848, 8052975, 2174893, 9842697, 17583987]
41614A7583987Q377247J7311787K7176836K3080393J114594k0766861j9474432
41607E4403551K200235J4276012n67031j9144978q697337K2471343L1604702J484366
41599I8030863l3388098l4067960p711274J0238784P622730K596133P290554J2743120
41591F3354852J0785546O086092J133316r438814k2371905k2832438o906073R346850
41583B9157426J2050205N623449q73562o992620j1526609o903098O077115J3554453
41575D0166759Q919111J306821m985292j7885768l2594849k6168574L711093K2820064
41567d710635R891691o553313L959474J7625567l642148l7358810k6935203K3149529
41559b4573848M5635792J4694507j4770234J202866K6994490J3382103j9593323
$$ y = [17583987, 25961234, 43273021, 70449857, 93530250, 94644844, 73877983, 54403551, 56603786, 70879798, 70312767, 51167789, 42470452, 64941795, 96546497, 98030863, 64642765, 30574805, 22863531, 33102315, 40725045, 43321178, 50611732, 63354852, 74140398, 80226490, 81359806, 71920992, 49549087, 26716649, 19810576, 29157426, 41207631, 46831080, 45957518, 38964898, 27438289, 20535191, 26612306, 40166759, 49085870, 50392691, 45407399, 27521631, -5073218, -31241792, -27530699, -4710635, 5181056, -1372257, 2587217, 20212784, 16570636, -20788174, -47723377, -24573848, 21061944, 35756451, 20986217, 22189083, 49183573, 62565676, 42972353]
41552D2972353k1298718L820767R985194j0447664k1027358p683419M478078L197491
41544C996724O829913J9847611J6528212j2776070l6737757k6997572J250171
41537b8058768J5235484R743280M063253Q536869J4778718J2552995K439356n652552
41529C3638635j777645J1280894J6076661J757903j6557242j5634734J882939
41522C0667411J1675211M673331l902146m142820m199486q093688p089378j169871
41514A8418564k722417r413298j571392K0962443K8941957P329134k0082448k8749169
41506A3113374k6070525k3291689p702744K4953643M0741325J2407052k7210925
41499F939511k3292492K0649581M7406430K8249635m987148j5446810p140246
$$ y = [42972353, 21673635, 25494402, 35479596, 25031932, 4004574, -3678845, 799233, 3996724, 10826637, 30674248, 47202460, 34426390, -2311367, -29308939, -28058768, -12823284, -3080004, 983249, 9520118, 24298836, 36851831, 39291187, 33638635, 31860990, 43141884, 59218545, 60976448, 44419206, 28784472, 30667411, 42342622, 47015953, 43113807, 38970987, 34771501, 26677813, 19588435, 18418564, 15696147, 6282849, 4711457, 25673900, 54615857, 61944991, 41862543, 13113374, -12957151, -36248840, -43951584, -18997941, 21743384, 34150436, 6939511, -16352981, 4296600, 51703030, 79952665, 74965517, 59518707, 52378461]
41492E2378461j971270m516410o757728m788721K226501J2214444J3429115l387160
41484E8827232k3485366k0943167M390353K6428461L1026934K7570687J9993983
41477A23809117j265044k9657665l8134818j9473454j303576m003888j2463325
41470A7507347r158127n955075j7368494k7610264j4615362J1509742K4216828
41463b1473405K0864241J8053571J7406978N805220j5677250l0125835k9927584
41456c5074064k1080559n900962J5945658L1693925K4189719j921082k2047093
41449a4194458k1571530p687395P988224K0754642K5848738J8096421L174408
41442C2409050m162828K566079J4837763J9987775J0840178j1764455l6050384
$$ y = [52378461, 50407191, 45890781, 39133053, 34344332, 36570833, 48785277, 62214392, 58827232, 35341866, 14398699, 18789052, 45217513, 76244447, 103815134, 123809117, 122544073, 92886408, 54751590, 35278136, 33974560, 29970672, 17507347, 8349220, 2394145, -14974349, -42584613, -57199975, -45690233, -21473405, -609164, 17444407, 34851385, 40656605, 24979355, -5146480, -35074064, -56154623, -62055585, -46109927, -14416002, 9773717, 7852635, -14194458, -35765988, -43453383, -35465159, -14710517, 11138221, 29234642, 32409050, 28246222, 30812301, 45650064, 65637839, 76478017, 64713562, 28663178]
41435B8663178m3989659l0299773j1055496k047924K197828J2971074K2442080
41428b1118692J5692392m81979n581063K067014O361224M614003R950740K1682633
41420C3186272K2380205R389976P79150L051610K042170n835090n609613Q90191
41412F0274871j1787638m3594022n0953987j0462090L2668907K3500109j8956564
41405a9310414k8328778J0046193M2112341L0633866L230822l358018J353557
41398C6379569o821867j6989994m586792K0253615K6142668J0549322j734505
41391F3192016n155167j9349896m4265860m7785084j5215460J9530395J8128204
41384c0920852o496271q966075K1974250M6941861L1699361o019770k1963113
$$ y = [28663178, -15326481, -45626254, -56681750, -58729674, -56531846, -43560772, -21118692, -5426300, -5908279, -11489342, -9422328, -3061104, 1552899, 11503639, 33186272, 55566477, 64956453, 65735603, 68787213, 70829383, 64994293, 59384680, 60274871, 48487233, 4893211, -46060776, -56522866, -23853959, -353850, -19310414, -47639192, -37592999, 4519342, 35153208, 38384030, 35026012, 36379569, 29557702, 12567708, 7980916, 28234531, 54377199, 64926521, 63192016, 58036849, 38686953, -5578907, -53363991, -68579451, -49049056, -30920852, -37417123, -46383198, -24408948, 22532913, 54232274, 48212504, 26249391]
41377B6249391l342162J9365873J6072019p133554k3720620k3855316k0034753
41370a6399122k0874827j7661680j532292K0606749L5700900L8148682K4840703
41363F2829113q553816n0523016o6881456l5730057J6681101M1663949K8797964
41356a1716218J2800208J7157745K3842790J0945324j1861442k4735566k5647070
41349i214229j4892299J7923726O1963767P0660145K0188168m0216867m3882737
41342F2529674J831129L0737663J6038131m278107k777976j606644j7558922k4698799
41334F0216149k738352K3083454K4979089J6812586J9818539J9857059j485941
41327A60542583k4081678k0610484n597376q743799k0344846j0460445J3069564
$$ y = [26249391, 22907229, 42273102, 58345121, 51211567, 27490947, 3635631, -16399122, -37273949, -54935629, -56467921, -35861172, -160272, 37988410, 62829113, 54275297, 3752281, -63129175, -98859232, -82178131, -40514182, -11716218, 1083990, 18241735, 42084525, 53029849, 41168407, 16432841, -9214229, -24106528, -6182802, 55780965, 126441110, 146629278, 106412411, 62529674, 64360803, 95098466, 111136597, 106858490, 104080514, 102473870, 84914948, 60216149, 57477797, 80561251, 105540340, 122352926, 142171465, 162028524, 160542583, 136460905, 115850421, 110253045, 101509246, 81164400, 70703955, 83773519]
41320H3773519J5524465l664793r980838O551321J6990179M153463j3659938j8220803
41312H1466575j4340409q283455L558824J5342705J2005702k661828p376842P42807
41304H0454079K233846o852776p031421O010498J0746408L99056k468175J1009305
41296I4500820J5615448k104936j3796000M060547K5359457J4853735j0463056
41289A28026015n483669K8781880M1931891R445205k9659247k8310498M034635
41282A48766212J8675116k856436k5328283j2260847J9942855K3039650j3496237
41275A56482030m3322920k5966299J7921101L9743741L0717875J9936928J6732111
41268B12244567N84452k9274745m1055938k2372415l529762p141598j1970348
$$ y = [83773519, 99297984, 95633191, 85652353, 92203674, 109193853, 113347316, 99687378, 81466575, 67126166, 58842711, 62401535, 77744240, 89749942, 87088114, 79711272, 80454079, 82687925, 75835149, 68803728, 74814226, 85560634, 85959690, 83491515, 94500820, 110116268, 108011332, 94215332, 98275879, 123635336, 138489071, 128026015, 122542346, 151324226, 193256117, 202701322, 173042075, 144731577, 148766212, 167441328, 164584892, 139256609, 126995762, 146938617, 169978267, 156482030, 113159110, 87192811, 105113912, 144857653, 175575528, 195512456, 212244567, 212829019, 183554274, 142498336, 120125921, 116596159, 109454561, 97484213]
41261I7484213N790519K8933120K9647149J5550436R659753P206153r303297k8947725
41253A56020321k5961680m168779R500128Q777680R130358J0745940r42075j8250007
41245A44851886j4263738J0582631K2137245N302663j0797608M61812J9405870
41238A77680761Q228809l4101246o9666357o6750279k8608488J7867088M5915993
41231E0566281M3219805J7334693r298993j7936384j0832300n848038j2643244
41224E4561820k0285427j3139061O095372J8939763J6631670J0753303J2287746
41217H5845186J2872981O913j8845697k4790692j4444871k15516J1145390J9715641
41209G1289335J7654146r88068j8928642j4420951p05733j0376208l5987898k9959672
$$ y = [97484213, 103274732, 132207852, 161855001, 177405437, 187065190, 194271343, 184968046, 156020321, 130058641, 125889862, 135389990, 144167670, 153298028, 164043968, 163101893, 144851886, 130588148, 141170779, 163308024, 168610687, 157813079, 158274891, 177680761, 185909570, 151808324, 82141967, 15391688, -13216800, 4650288, 50566281, 93786086, 111120779, 101821786, 83885402, 73053102, 67205064, 54561820, 34276393, 21137332, 27232704, 46172467, 62804137, 73557440, 85845186, 98718167, 98725080, 79879383, 55088691, 40643820, 40428304, 51573694, 71289335, 88943481, 87955413, 69026771, 54605820, 53900087, 43523879, 7535981, -22423691]
41201b2423691K0087051O0171821M2340256r591572m0462374l7289541k4446876
41194a1614926j3232270J059986J0498325L816181p730763p139530r2565K400677
41186b2034885Q150980J8533677P299709l4121068n9224456k5608538L3133169
41179g3871412N1923222K8977992J2138170R569501j0094962l6936816k3417266
41172d1711571K3510005L7802526J710648k3621501l762840J4428723m769371
41165C586619j8315491J3615128M7489702K7447612j8724336k9115232j0291641
41158A5692361j2086736l0228779j5803097L1341375N5405174L1450661n850959
41151F9920000k4931656l0482000k7313449o664199J9390997J9863726l504650
$$ y = [-22423691, -2336640, 57835181, 100175437, 90583865, 50121491, 12831950, -11614926, -24847196, -23787210, -13288885, -9472704, -17203467, -24342997, -24435562, -22034885, -13883905, 4649772, 11949481, -22171587, -81396043, -107004581, -73871412, -21948190, 7029802, 19167972, 28737473, 18642511, -18294305, -41711571, -18201566, 19600960, 21311608, -2309893, -6072733, 8355990, 3586619, -14728872, -1113744, 46375958, 73823570, 55099234, 25984002, 15692361, 3605625, -26623154, -42426251, -11084876, 44320298, 75770959, 69920000, 44988344, 14506344, -12807105, -19471304, -80307, 19783419, 16278769]
41144A6278769j0863595J3074600L2586748J7372456j1749074j8548817l792864
41137C4358223M857818l835480j5918102j6742781o466570M515976O713859J675082
41129I158025J667853J2476956K1302407J4022500j841195q344464n414890p162396
41121C5864796j3909921j1832759l53507M852281K6740Q51458J4458503K4753286
41113E4710877J5840421n374944j9297064j5673698k20669J1905947Q011545q077169
41105D1825246j6579113n981358J0644454J6591352J7379975K5390132K9633553
41098A18904241R201081k7070234m4323093k7760332J123759J7555492J7500595
41091F5131509N866187j1892068k0208184k606799K9485774M0637212J4809022
$$ y = [16278769, 5415174, 18489774, 51076522, 68448978, 56699904, 38151087, 34358223, 39216041, 35380561, 19462459, 2719678, -3746892, 769084, 7482943, 9158025, 10825878, 23302834, 44605241, 58627741, 56786546, 48442082, 43027192, 35864796, 21954875, 10122116, 9768609, 14620890, 14647630, 15499088, 29957591, 54710877, 70551298, 65176354, 45879290, 30205592, 29984923, 41890870, 49902415, 41825246, 25246133, 19264775, 29909229, 46500581, 63880556, 89270688, 118904241, 128105322, 101035088, 56711995, 28951663, 30075422, 47630914, 65131509, 70997696, 59105628, 38897444, 36290645, 65776419, 106413631, 121222653]
41084A21222653k4767045m6636295m2377730k1884631J02183O892225p546369
41077a4995009k2841153j2406945J6681379L0930990K1013524J2084091J6135219
41070D6602096J2145707j0570642k7116348j7967992j233538J805334J604872
41063E269489J2437071K0130380R936861j136904N443748J2882632l28442j7244730
41055D7390105j1365576K911632m964034k3555294j7171455Q335208J2113774
41048A3694360j0192039j6791969Q714601K8143745J0919829j8162624j9143020
41041b817117P762644L2076158L4128794J5839383r264887k1425452r465903R619657
41033E6453277Q157075q972130q576736J4982442K5729264M514252j8594572j5990844
$$ y = [121222653, 96455608, 49819313, 7441583, -14443048, -14340865, -7448640, -14995009, -37836162, -50243107, -33561728, -2630738, 18382786, 30466877, 46602096, 58747803, 48177161, 21060813, 3092821, 1859283, 3664617, 5269489, 17706560, 37836940, 47773801, 46636897, 52080645, 64963277, 64634835, 47390105, 36024529, 38936161, 33972127, 10416833, -6754622, 1580586, 13694360, 3502321, -13289648, -4575047, 23568698, 34488527, 16325903, -2817117, 4945527, 37021685, 71150479, 86989862, 77724975, 56299523, 46833620, 56453277, 64610352, 55638222, 47061486, 62043928, 87773192, 92287444, 73692872, 57702028]
41025E7702028o698973j3799126j5475946J4461960M6621686L2823430j3501362
41018A02133697l2843219j1087836M135940j4439867l3851875k3063998k276287
41011a1293445L71497k552782J0359524K3944061J4708431j864155L366892J9571706
41003E6611729J4821908l319864J990224K7108442K3760943k0473669m9939827
40996E0559886k0757901K8419472K9118536j8876691n0770349k9476122J2004282
40989B21113K7374988J5967093O538248J0458117J4754872P793972p299448j8673664
40981E7135291j4772636M944503K2051716J4409327j3232674k9901838k0412699
40974B0220990p386864j3509320k1815417k506754L3134642M1948858J2257016
$$ y = [57702028, 51003055, 37203929, 21727983, 36189943, 82811629, 115635059, 102133697, 69290478, 58202642, 62338582, 47898715, 14046840, -9017158, -11293445, -10921948, -13474730, -3115206, 20828855, 35537286, 33673131, 37040023, 56611729, 71433637, 68113773, 70103997, 97212439, 120973382, 100499713, 50559886, 29801985, 58221457, 87339993, 68463302, 17692953, -11783169, 221113, 27596101, 43563194, 50101442, 60559559, 75314431, 83108403, 75808955, 57135291, 42362655, 47307158, 69358874, 83768201, 70535527, 40633689, 20220990, 12834126, -675194, -22490611, -24997365, 8137277, 50086135, 62343151]
40967F2343151j7471507j3814922Q795813J8007344J0153335K833714o32032j1014263
40959E9200633k5463982k6894973j2184299l28129o770324k2627732k4958534
40952f0027340j285848L6695535N9211046M3159998j071814l3507213k5994108
40945A7180256O112095K5973878K1406007J0632253O362109j195376j9396410
40938F7074812l3666138k7604702q731248J751648k316773p866624m183099L969285
40930a1572839O477036K448241l7011M189690J0264084J0121885L917795j439812
40922B4369069n398453j5079187k7628337k3923784N508771L7031929L6452290
40915C1332298L364331k6598536k5440664K5951K6796800L9809266L1489809R01574
$$ y = [62343151, 44871644, 31056722, 39852535, 57859879, 68013214, 70846928, 70214896, 59200633, 33736651, 6841678, -5342621, -5670750, -12441074, -35068806, -60027340, -61313188, -24617653, 34593393, 77753391, 76681577, 43174364, 17180256, 23292351, 49266229, 70672236, 81304489, 87666598, 86471222, 67074812, 33408674, 5803972, -2927276, -1175628, -3492401, -11359025, -15542124, -11572839, -5095803, -2647562, -2684573, 1505117, 11769201, 21891086, 25808881, 24369069, 18970616, 3891429, -23736908, -47660692, -42151921, -5119992, 31332298, 34696629, 8098093, -17342571, -17316620, 9480180, 49289446, 80779255, 81680829]
40907H1680829l3467488m0309822j2154207J9465909K1950013J085659j4525238
40900B3725655j4698589j1550245j0916544m178059J0925766K0358752J0638027
40893B4304763j3564198l2184856k7622745k193847K1770649K5783337J6954656
40886A3247759J3232354J1243022p352639l5956757m1148802j2633693J6705090
40879d2663666J8842097P097925K829505N37610n078124N052708L2769363L4733805
40871E4121223j3441959n9178797m0909254J3062333K5642059p512385j9927978
40864d8144758P297235J9526605n492759j6884931J2220145L1918221O160441
40857F600199k0161257j363955K8893447K2067448J002512R962179K6704741L087254
$$ y = [81680829, 48213341, 7903519, -4250688, 15215221, 37165234, 38250893, 23725655, 9027066, -2523179, -13439723, -17617782, -6692016, 13666736, 24304763, 10740565, -21444291, -49067036, -51260883, -29490234, -3706897, 13247759, 26480113, 37723135, 30370496, -5586261, -46735063, -59368756, -42663666, -23821569, -16723644, -13894139, -13356529, -18434653, -13381945, 19387418, 54121223, 40679264, -18499533, -59408787, -46346454, -20704395, -28216780, -48144758, -40847523, -21320918, -26813677, -43698608, -31478463, 439758, 6600199, -13561058, -14925013, 13968434, 36035882, 37038394, 47000573, 73705314, 76792568]
40849G6792568m1056346m4863508o327600K0698280J6696962J1687713J6993840
40842E0621909J1061553o487176r975640L92943n95444r843466j436678J4884485
40834D8622486L023303k7860258k6703128J2852783L4652885Q801563k3551917
40827B9837717k0833959j0745O635193L610553O150402M357037j1423600k3919442
40819e596844j8601130r009174o574424K055400K2082168K9023523Q178767j5676923
40811E881363j6073235l408727P15439n98197M723481J2608724J6571058K0024931
40803D0444837J6939720o801457l4996711k5759989K0626755M4187836R708273
40796F4349264l6326732l5789126l798214P389540o400198j0170244J108196J626675
$$ y = [76792568, 35736222, -9127286, -15454886, 5243394, 21940356, 33628069, 50621909, 61683462, 55196286, 45220646, 45613589, 45018145, 35174679, 33738001, 48622486, 51645789, 23785531, -2917597, 9935186, 44588071, 53389634, 29837717, 9003758, 8993013, 15628206, 19238759, 25389161, 29746198, 18322598, -5596844, -24197974, -33207148, -39781572, -37726172, -15644004, 13379519, 21558286, 5881363, -10191872, -13600599, -12885160, -13483357, -8759876, 3848848, 20419906, 40444837, 57384557, 50583100, 15586389, -10173600, 10453155, 54640991, 64349264, 28022532, -7766594, -11564808, -4175268, -10575466, -20745710, -19637514, -18010839]
40788a8010839j0840238j3659187m205286J191998M225305J5870978K1300470
40781d126799l81957l0536985l1698417o351161J1000980J2302833J7644980K5414686
40773f731840J4012022p915044p243288J3685184J6658151n200597j4616902K043213
40765D690899R432354j2461199l0576530j5452051R126866Q459504p539654r117774
40757d3437585J194267P42227p586041k91999K4271815M0885348L3981253J4516250
40749F4275535j765377j3545544k4672413k7755435r195232K7133733N0114109
40742F4589376L0440988j8487363m8297532l5245413j0304885j0566319k4668975
40735e2540123j8084888O508672J5131782j21446j1781677m065517R515162J6651689
$$ y = [-18010839, -28851077, -42510264, -46715550, -45523552, -41298247, -25427269, -4126799, -4508756, -35045741, -66744158, -73095319, -62094339, -49791506, -32146526, -6731840, 7280182, -634862, -7878150, 5807034, 22465185, 17264588, 2647686, 4690899, 14123253, 1662054, -28914476, -44366527, -35239661, -26780157, -34319811, -43437585, -42243318, -41501091, -49087132, -49379131, -25107316, 15778032, 49759285, 64275535, 62510158, 48964614, 24292201, -3463234, -12658466, 14475267, 64589376, 95030364, 76543001, 28245469, -6999944, -17304829, -27871148, -52540123, -70625011, -64116339, -48984557, -49106003, -60887680, -64953197, -55438035, -38786346]
40727c8786346J7930149Q627208j3332788k3816684O0231L1218645K2060601j5442626
40719a1481610j8268141K6944575N5628436K4292775k3222848k7718211m24836
40712B5750140J0109546m759998j8929186k2306750j9879299n629804K0340374
40705a5304977L2313387J5183008n122326m457678k889112k1831419l2767985
40698c4877102k905000L6162145K8386557j5492592l2613849o926088J3241596
40691a5024333N96645j2937783P3721J7560646J2141164m240439p523425r8703
40683i452507K653563p93750m105574n242402q1005J5269882K8334434K0577735
40675D7160376m47873o934658N180112R382703n676662j7934689j2809146p270890
$$ y = [-38786346, -20856197, -12228989, -25561777, -49378461, -49318230, -18099585, 3961016, -11481610, -29749751, -2805176, 52823260, 77116035, 53893187, 26174976, 25750140, 35859686, 31099688, 12170502, -10136248, -30015547, -35645351, -15304977, 17008410, 32191418, 27069092, 22611414, 19722302, -2109117, -34877102, -37782102, -1619957, 26766600, 11274008, -21339841, -28265929, -15024333, -14427688, -27365471, -27291750, -9731104, 2410060, -1830379, -9353804, -9452507, -6798944, -7592694, -11698268, -16940670, -17021675, -1751793, 26582641, 47160376, 46712503, 39777845, 44957957, 54340660, 48663998, 30729309, 17920163, 10649273]
40667A0649273j4133716j6047712N00430J5639677R060557l803860j76574P889056
40659I577131m399517k6161240k3463132N779054K6442960J7465212l923019j5629729
40651a4312280j9194950k2746629j9552957j396672K1249045K9912952K1858909
40644d182582R672910K402645k09695J729088R085656J3890024K962958k1700316
40636A3650688l7451013k6824531j347919J3457409J1605829Q711816J1974386
40629f223335Q492450r779643k8096905k8761015j5465622m036368P75823N525366
40621g7569249J3419274K2119474K8920449K8130112J3390721p540685j4398915
40614F471181l128392M597527k960727m203229J7991719L6560251J5395521k8976857
$$ y = [10649273, -3484443, -19532155, -19031725, -3392048, 5668509, 1864649, 1688075, 9577131, 5177614, -20983626, -44446758, -38667704, -12224744, 5240468, 1317449, -14312280, -33507230, -56253859, -75806816, -77203488, -55954443, -26041491, -4182582, 5490328, 7892973, 7683278, 9412366, 18498022, 32388046, 35351004, 13650688, -23800325, -50624856, -51972775, -38515366, -26909537, -18197721, -6223335, 2269115, -7510528, -35607433, -64368448, -79834070, -83870438, -83094615, -77569249, -64149975, -42030501, -13110052, 15020060, 28410781, 20870096, 6471181, 3342789, 7940316, 4979589, 776360, 18768079, 55328330, 70723851, 41746994]
40606D1746994m3765127j5204226J5355365J5451714L0321n442036j524234K445072
40598I093843P913001J0407667n557116l4738836m4148644j9624308R488429J5706831
40590e1459133J3239832K3542639L0884176J0523274k0578417k3934306J194869
40583a6587066J9712764J6434413J0347441J3003713J0875508l372224j4816818
40576C5597731j2878934p698522q473463p868594M36358P765108N255207k730744
40568I404147q315382q683655k8741J8932729L1459208J2877264l1626773n9983084
40560c5964287m1831080J355979K4293501J4370530j531559j46752J1649149J5680393
40552a2124126Q911479K573945M911918J2432666J4941864O760947n205167p286715
$$ y = [41746994, -2018133, -17222359, -1866994, 13584720, 13615041, 8173005, 6648771, 9093843, 17006844, 27414511, 21857395, -12881441, -57030085, -76654393, -67165964, -51459133, -38219301, -14676662, 16207514, 26730788, 6152371, -17781935, -16587066, 3125698, 19560111, 29907552, 42911265, 53786773, 50414549, 35597731, 22718797, 15020275, 6546812, -1321782, -885424, 6879684, 12134891, 9404147, 1088765, -7594890, -7623631, 11309098, 42768306, 55645570, 24018797, -35964287, -77795367, -76439388, -52145887, -37775357, -39306916, -39453668, -27804519, -12124126, -3212647, -638702, 4273216, 16705882, 31647746, 38408693, 33203526, 25916811]
40544B5916811K279325N790053j2160689l8104131m0372393j0768563J9899131
40537d7520456J9865998j408678p138710J4626488L4067882K1674999j0720454
40530B3447069k6400161j1356058J2849295K1357708J2810347k32894j1102118
40523B1373188j8817579j9498860j1354555k552416j254825n97105J2968010L5448551
40515A5714409M3105178K1243666j4002208l1862710k0913594J009853R314577
40508B3609171j810726j6793676j6384374L359558K6344257L0216499Q544582
40501E7085291k0127124k9319124j1906087J3301984K3022519J2536066m404841
40494D0188684j2284224o165242P098760J4491922Q100078m528738p272523K031959
$$ y = [25916811, 28196136, 33986189, 21825500, -16278631, -56651024, -67419587, -47520456, -27654458, -29063136, -36201846, -21575358, 12492524, 34167523, 23447069, -2953092, -14309150, -1459855, 19897853, 32708200, 32475306, 21373188, 2555609, -16943251, -28297806, -30850222, -32105047, -32702152, -19734142, 15714409, 58819587, 80063253, 66061045, 34198335, 13284741, 14294594, 23609171, 21798445, 5004769, -11379605, -8020047, 18324210, 48540709, 57085291, 36958167, 7639043, -4267044, 9034940, 32057459, 44593525, 40188684, 27904460, 21739218, 28837978, 43329900, 51429978, 46901240, 39628717, 41660676]
40486D1660676N236023j0251258k9396705k8619118q910699R328517J8547599
40479b404965K6992730L1401992J5849631j6144822l7035208l3731008k3000146
40472c8071796j5820653J533896L0763233M0556471J4082904j3062440l290771
40465A6690844J9163685M282480l9528907n3866551k0647290J3931093J6387268
40458d3587378J1327944K6444581M0803227K2907904j3987015l1349923j8913248
40451f353908J647488J0599382L408698j4693490k7156298j5505126J2122914
40444c5930340K1575239k21288k1973000j3200740J1884202K1406191J2780670
40437c679066L042721n375019j5958395j5077927O424134K5722254J9222857M381287
$$ y = [41660676, 46896699, 36645441, 7248736, -21370382, -30281081, -20952564, -2404965, 24587765, 55989757, 71839388, 55694566, 18659358, -15071650, -38071796, -53892449, -52358553, -21595320, 18961151, 33044055, 19981615, 16690844, 35854529, 40137009, 608102, -53258449, -73905739, -59974646, -43587378, -32259434, -5814853, 34988374, 57896278, 43909263, 12559340, -6353908, -4706420, 5892962, 9301660, -5391830, -32548128, -48053254, -35930340, -14355101, -14576389, -36549389, -49750129, -37865927, -16459736, -3679066, -636345, -6011364, -21969759, -37047686, -30623552, -4901298, 14321559, 18702846]
40429A8702846R486517J8847473k089572l8029723l8140736m7242K0446791k713485
40421a3537131k5668321p712862K6720708L3815963J6057344K296951m590534
40414B7382118j6800278k2566476l289088K4021173K4094419k564383k0660938
40407I616547j2701206M493968J5791865K4815231K9594567J5593348j4022008
40400G3182312l0222251j7586457J178726p85584j5730376j9172268j1276288
40393b0412186j2343285k2781725j7546347J2795914L9963896L2476999k605457
40386I547809l0053603l0398569j5081932q08591J0428228J9881516J8904073
40379a7581069J497852j9527265k3930220q726809R779337J6589495J0325776
$$ y = [18702846, 28189363, 47036836, 44947264, 6917541, -31223195, -31270437, -10823646, -13537131, -39205452, -46918314, -20197606, 13618357, 29675701, 31972652, 27382118, 10581840, -11984636, -15273724, 8747449, 32841868, 30277485, 9616547, -3084659, 1409309, 17201174, 42016405, 71610972, 87204320, 73182312, 42960061, 25373604, 26552330, 25766746, 10036370, -9135898, -20412186, -32755471, -55537196, -73083543, -60287629, -20323733, 12153266, 9547809, -20505794, -50904363, -65986295, -66794886, -56366658, -36485142, -17581069, -16083217, -35610482, -59540702, -68267511, -58488174, -41898679, -31572903]
40372c1572903k849695j5534316j8629661o594451J2846173K3536410J9820149
40365a8978294J2546315J1589608J0914223j061618k1523124l3158235k4266794
40358f3937919k728834J2868856J3756537R657261J5573983L1300488L8673252
40351E5163624K2512019q867274l0057490k6007006p978276P95959p862581j9517960
40343b1818985j7277157l594228N123663L295470L002004J1078444J4108690O82553
40335e399546j3661963o701711J1471436Q925268j6352379k7776868n639512K0753963
40327c4381312J8267644j075424n968374K077690j056749j3865268j0856896J1092508
40319c5766181K4656912J3722325p502203k1477921k5844722k0567498l313796
$$ y = [-31572903, -34422598, -49956914, -68586575, -75181026, -62334853, -38798443, -18978294, -6431979, 5157629, 16071852, 15010234, -6512890, -39671125, -63937919, -66666753, -53797897, -40041360, -30384099, -14810116, 16490372, 55163624, 77675643, 68808369, 38750879, 12743873, 4765597, 5561556, -2301025, -21818985, -39096142, -42690370, -37566707, -34271237, -31269233, -20190789, -6082099, -5399546, -19061509, -25763220, -14291784, -5366516, -21718895, -49495763, -55135275, -34381312, -16113668, -17189092, -23157466, -21079776, -22136525, -36001793, -46858689, -35766181, -11109269, 2613056, -4889147, -26367068, -52211790, -72779288, -76093084]
40312g6093084J6678096K4329908K2237923K4489966K6486302J0435050j6331000
40305C2233161k2708131k302199J3651064N119400q399600n263210N400852R068611
40297B6799948J2678567K1032225J5552131j3575401l8410920k8793044J526752
40290c189742J5691699N948701m984738k532847Q163259J8904362K1348085N242510
40282F4591289k1977748k9364525l560890K1535805Q576061k6260037l7807903
40275b4267948j9720824m435955l703093K727649J8402813J8992873j68692j0063400
40267b2236577K868810J3657856L453774r780460o707251J479460J021413M130248
40259a2112727K1723348L4670966K2395993j602106j2230470j1233855j3412573
$$ y = [-76093084, -59414988, -35085080, -12847157, 11642809, 38129111, 48564161, 32233161, 9525030, 7222831, 20873895, 25993295, 17593695, 12330485, 17731337, 26799948, 39478515, 60510740, 76062871, 62487470, 24076550, -4716494, -3189742, 12501957, 18450658, 13465920, 10933073, 19096332, 38000694, 59348779, 64591289, 42613541, 13249016, 9688126, 31223931, 39799992, 13539955, -24267948, -43988772, -48424727, -52127820, -49400171, -30997358, -12004485, -12173177, -22236577, -19367767, -5709911, -2256137, -12036597, -18743848, -17264388, -16242975, -12112727, 9610621, 44281587, 66677580, 65075474, 52845004, 41611149, 28198576]
40252B8198576j3395358K00514J2603923K092529j7486958j1997551J6811557
40245A7027232K8266713K060850l2996802m0968009k1612317K256026J6241538
40238b9724769J7537819O206439r596112j3469933n86136J3481146J5166169J1244375
40230A0258998J2564063J3817252N750274m663105n357611j652498o966407j6582147
40222G168819j2698291N631734J9592945J9806511J6542297J5205533M257649
40215G5507197k0801786m1284716l9274987k2603803r080336L97501J3383021
40208d3757909K2672756J5802765R36000k574404L063602j826169j6161919j4909481
40200c6754759O483210J6422189l905903k3938372o785949K9743813L3386858
$$ y = [28198576, 14803218, 15003732, 27607655, 29700184, 12213226, 215675, 17027232, 45293945, 47354795, 14357993, -26610016, -48222333, -45966307, -29724769, -12186950, -5980511, -15576623, -29046556, -29632692, -16151546, -985377, 10258998, 22823061, 36640313, 42390587, 37727482, 32369871, 30717373, 23750966, 7168819, -5529472, 102262, 19695207, 39501718, 56044015, 71249548, 75507197, 54705411, 13420695, -25854292, -48458095, -57538431, -57140930, -43757909, -21085153, -5282388, -4346388, -6920792, -3857190, -5683359, -21845278, -36754759, -30271549, -13849360, -17755263, -41693635, -48479584, -18735771, 14651087]
40193A4651087n857975l8408751k4872316J0125698J6738544r118687k4085162
40186f0827562j159250L4171057M0951920J5489048j0595842j5397830q848656
40179f217115q255513j1432273o502940L920218N892527k037037m851087O666781
40171b2816439K3130064L0767631K7495691J8910141P347258p585987k2613469
40164E4634890l0767471k6349837r853886Q749425J5038423N417328o557638p606678
40156B704556k082951q8107K386255J2535886J8690624N484409j3874803j2669474
40148A3086395K343001k614292k8106600l1910552J928039K9804664J5495109
40141B5764j0989078l701464K4070417K6089597J569119q398176P748937J8374057
$$ y = [14651087, 8793112, -29615639, -54487955, -44362257, -27623713, -36742400, -60827562, -61986812, -27815755, 13136165, 28625213, 18029371, 2631541, -6217115, -14472628, -25904901, -32407841, -28487623, -22595096, -24632133, -29483220, -22816439, 313625, 31081256, 58576947, 77487088, 84834346, 77248359, 54634890, 23867419, -2482418, -12336304, -3586879, 11451544, 16868872, 10311234, 2704556, 621605, 533498, 2919753, 15455639, 34146263, 39630672, 25755869, 13086395, 15429396, 12815104, -15291496, -47202048, -45274009, -15469345, 25764, -10963314, -14664778, 9405639, 35495236, 37064355, 28666179, 36415116, 54789173]
40133E4789173N564514j3165312k3581640l0228800k8152065l229032L0787869
40126g215293L7749660J2740257r216860q885810o548346j6672841k0988606o227664
40118b5265503R781560J1577243J0608483J5105597J0636685o508640j2300193
40111A3635232K854938J0335630q942915k7475994j5542782R200514J3744556
40104b190821K970631J185141N644241N79166m273114O508851J4202010p184757
40096A7441348l8378828l8202201j0239644M505229k559808J271398K4454135
40089d1708371L0763667J289638k9642091k5198297K738920J8530565J1889110
40082c1336859j602570p816901j187593J7692715L3711849K3209767j4304089
$$ y = [54789173, 60353687, 47188375, 23606735, -6622065, -34774130, -38003162, -7215293, 30534367, 43274624, 34057764, 25171954, 18623608, 1950767, -19037839, -25265503, -15483943, -3906700, 6701783, 21807380, 32444065, 25935425, 13635232, 16490170, 26825800, 17882885, -9593109, -25135891, -15935377, -2190821, 779810, 1964951, 7609192, 8188358, 3915244, 10424095, 24626105, 17441348, -20937480, -59139681, -69379325, -64874096, -67433904, -66162506, -41708371, -10944704, -9655066, -39297157, -64495454, -61756534, -43225969, -31336859, -32939429, -40756330, -41943923, -24251208, 9460641, 32670408, 18366319]
40075A8366319m4964751l8108812l925733K0924412J5914741p393059k3649683
40068f2836566j7376526N514422K3477502K2718931J5008586J9846002L0402301
40061C6754652J9324786j5015773l3819888q331833L3946765L9989925Q53724
40054G3702358l6362493l0068622M825115K1340855K462648k1887681j9861426
40047e849246J215992J2261896O226688J057961M048430K014833p714246o696997
40039F565311R968559J7785051L143085r369436J069292J0847057p212558k7068605
40031E727756n301594M0264837M7293168M489288l0465114k1431551k612561j1362205
40023B6602024k7461480j7825800K768753J399061j4469995j4896799k123210
$$ y = [18366319, -26598432, -64707244, -68632977, -47708565, -31793824, -39186883, -62836566, -80213092, -74698670, -51221168, -28502237, -13493651, 6352351, 36754652, 56079438, 41063665, 7243777, -1088056, 32858709, 72848634, 73702358, 37339865, 7271243, 12096358, 33437213, 35899861, 14012180, -5849246, -4633254, 7628642, 13855330, 14913291, 18961721, 20976554, 13262308, 6565311, 16533870, 34318921, 37462006, 28092570, 29161862, 40008919, 32796361, 5727756, 426162, 40690999, 87984167, 92473455, 62008341, 40576790, 37964229, 26602024, -859456, -18685256, -15916503, -14517442, -28987437, -43884236, -46007446]
40016d6007446k027524j4339452j3361274Q066126L0901677M1365892L9099763
40009D3697762K0420461j4749758m3542175l9453758j0789765P986251L378759
40002c3052223m556156K877762K0310062L2630852L1043187J4077069r262090
39995E4068463k0145068j1312991n52790l268314m579244J3433224L0209929J1188590
39987F9041799l1488137m6296370j5438196K1254379K6886699J1746181K90082
39980C5996437o911148j4200646q621398J3343678K4679083N553254k0302892
39973B9536368j9906507k526340n54884j2870803q176721J8214465L0620938M684920
39965C9021436l7379239n5836799l6816644L436764L9483076N1392910L3733830
$$ y = [-46007446, -48034970, -62374422, -75735696, -67669570, -36767893, 4597999, 43697762, 64118223, 49368465, 5826290, -33627468, -44417233, -36430982, -33052223, -37608379, -34730617, -14420555, 18210297, 49253484, 63330553, 54068463, 33923395, 22610404, 22057614, 18789300, 14210056, 27643280, 57853209, 69041799, 37553662, -8742708, -24180904, -2926525, 23960174, 35706355, 35996437, 29085289, 14884643, 6263245, 19606923, 44286006, 49839260, 29536368, 9629861, 7103521, 6548637, -6322166, -14498887, 3715578, 34336516, 39021436, 1642197, -54194602, -91011246, -87574482, -48091406, 3301504, 37035334]
39958C7035334J814329j9457351j9762352r198718J225930J1667715K1786182
39951B5111069K2581831J0676461k30499M647670J8838574K0092187j984850l1432359
39943F8300084m1306060k1915003O567475J2632665j0472059l1315243j4903815
$$ y = [37035334, 38849663, 19392312, -370040, -9568758, -8342828, 3324887, 25111069, 47692900, 58369361, 58138862, 62786532, 81625106, 101717293, 99732443, 68300084, 26994024, 5079021, 11646496, 24279161, 13807102, -17508141, -32411956]
$$ [...]
##END NTUPLES=NMR SPECTRUM
##END=
