##TITLE=31Pdec_LR-698-CM-Et20
 CDCl3, 24 sc
 11.11.2019
##JCAMPDX= 6.0         $$ Bruker NMR JCAMP-DX V2.0
##DATA TYPE= NMR SPECTRUM
##DATA CLASS= NTUPLES
##ORIGIN= UXNMR, Bruker Analytische Messtechnik GmbH
##OWNER= root
$$ XWIN-NMR		Version 3.5
$$ Mon Nov 11 16:21:48 2019 Russian Standard Time (UT+4h)  she@DPX200
##.OBSERVE FREQUENCY= 81.013821
##.OBSERVE NUCLEUS= ^31P
##.ACQUISITION MODE= SIMULTANEOUS
##.ACQUISITION SCHEME= undefined
##.AVERAGES= 24
##.DIGITISER RES= 17
##SPECTROMETER/DATA SYSTEM= spect
##.PULSE SEQUENCE= zgpg30
##.SOLVENT NAME= MeOD
##.SHIFT REFERENCE= (INTERNAL, MeOD, 0, 182.463)
##AUDIT TRAIL= $$ (NUMBER, WHEN, WHO, WHERE, WHAT)
$$ ##TITLE= Audit trail, XWIN-NMR		Version 3.5
$$ ##JCAMPDX= 5.01
$$ ##ORIGIN= Bruker BioSpin GmbH
$$ ##OWNER= she
$$ F:/spectra/data/she/nmr/P31/1/pdata/1/auditp.txt
$$ ##AUDIT TRAIL=  $$ (NUMBER, WHEN, WHO, WHERE, WHAT)
(   1,<2019-11-11 16:20:57.17 +0400>,<she>,<DPX200>,
      <created by zg, POWCHK disabled, PULCHK disabled
       configuration hash MD5:
       00 E9 B6 7A A2 85 ED C7 34 08 36 98 17 FE 4E 26
       data hash MD5: 32K
       CE 1C C8 31 1C B1 BC DF C9 32 5E 3C 03 48 A1 8F>)
(   2,<2019-11-11 16:20:59.64 +0400>,<she>,<DPX200>,
      <Start of raw data processing
       efp BC_mod = 2 LB = 1 FT_mod = 6 PKNL = 1 PHC0 = -971.5634 PHC1 = 155.0007 SI = 64K 
       data hash MD5: 64K
       13 E7 DF AA 25 87 BA 51 29 2F E3 5F 3C 07 BD A6>)
(   3,<2019-11-11 16:21:12.68 +0400>,<she>,<DPX200>,
      <pk PHC0 = 5.428625 PHC1 = 0 
       data hash MD5: 64K
       A3 5D 77 92 1C 45 0D BA F4 24 52 B0 F6 0E 1A 37>)
(   4,<2019-11-11 16:21:16.09 +0400>,<she>,<DPX200>,
      <abs ABSG = 5 
       data hash MD5: 64K
       5E F0 9D 67 25 3D 42 E5 6B 8C BB 10 F1 04 98 D7>)
$$ ##END=
$$ 
$$ hash MD5
$$ 0E 08 C4 D2 7A 02 C8 BD 19 00 6E B2 E3 13 E3 E4
##$RELAX= 
##$RELAX= 
##$RELAX= 
##$RELAX= 
##$RELAX= 
##$RELAX= 
##$RELAX= 
##$RELAX= 
$$ Bruker specific parameters
$$ --------------------------
##$DU= <F:/spectra>
##$EXPNO= 1
##$NAME= <P31>
##$PROCNO= 1
##$TYPE= <nmr>
##$USER= <she>
##$AMP= (0..31)
100 100 100 100 100 100 100 100 100 100 100 100 100 100 100 100 100 100 
100 100 100 100 100 100 100 100 100 100 100 100 100 100 
##$AQSEQ= 0
##$AQ_mod= 1
##$AUNM= <au_zg>
##$AUTOPOS= <>
##$BF1= 81.014009
##$BF2= 200.13
##$BF3= 200.13
##$BF4= 200.13
##$BF5= 200.13
##$BF6= 200.13
##$BF7= 200.13
##$BF8= 200.13
##$BYTORDA= 1
##$CFDGTYP= 0
##$CFRGTYP= 5
##$CHEMSTR= <none>
##$CNST= (0..31)
1 1 145 1 1 1 1 1 1 1 1 1 1 1 1 1 1 1 1 1 1 1 1 1 1 1 1 1 1 1 1 1 
##$CPDPRG= <waltz16>
##$CPDPRG1= <>
##$CPDPRG2= <waltz16>
##$CPDPRG3= <>
##$CPDPRG4= <mlev>
##$CPDPRG5= <mlev>
##$CPDPRG6= <mlev>
##$CPDPRG7= <mlev>
##$CPDPRG8= <mlev>
##$CPDPRGB= <>
##$CPDPRGT= <>
##$D= (0..31)
0 1 0 0 0 0 0 0 0 0 0 0.03 2e-05 3e-06 0 0 0 0 0 0 0 0 0 0 0 0 0 0 0 0 
0 0 
##$DATE= 1573474856
##$DBL= (0..7)
120 120 120 11 120 120 24 19 
##$DBP= (0..7)
150 150 150 150 150 150 150 150 
##$DBP07= 0
##$DBPNAM0= <>
##$DBPNAM1= <>
##$DBPNAM2= <>
$$ [...]
##$SUBNAM3= <"">
##$SUBNAM4= <"">
##$SUBNAM5= <"">
##$SUBNAM6= <"">
##$SUBNAM7= <"">
##$SUBNAM8= <"">
##$SUBNAM9= <"">
##$SW= 369.568048894756
##$SWIBOX= (0..15)
0 1 3 0 0 0 0 0 0 0 0 0 0 0 0 0 
##$SW_h= 29940.119760479
##$TD= 32768
##$TD0= 1
##$TE= 0
##$TE2= 300
##$TE3= 300
##$TEG= 300
##$TL= (0..7)
0 120 53 12 22 120 120 120 
##$TP= (0..7)
150 150 150 150 150 150 150 150 
##$TP07= 0
##$TPNAME0= <>
##$TPNAME1= <>
##$TPNAME2= <>
##$TPNAME3= <>
##$TPNAME4= <>
##$TPNAME5= <>
##$TPNAME6= <>
##$TPNAME7= <>
##$TPOAL= (0..7)
0.5 0.5 0.5 0.5 0.5 0.5 0.5 0.5 
##$TPOFFS= (0..7)
0 0 0 0 0 0 0 0 
##$TUNHIN= 0
##$TUNHOUT= 0
##$TUNXOUT= 0
##$USERA1= <user>
##$USERA2= <user>
##$USERA3= <user>
##$USERA4= <user>
##$USERA5= <user>
##$V9= 5
##$VALIST= <valist>
##$VCLIST= <CCCCCCCCCCCCCCC>
##$VD= 0
##$VDLIST= <DDDDDDDDDDDDDDD>
##$VPLIST= <PPPPPPPPPPPPPPP>
##$VTLIST= <TTTTTTTTTTTTTTT>
##$WBST= 1024
##$WBSW= 4
##$XGAIN= (0..3)
0 0 0 0 
##$XL= 0
##$YL= 0
##$YMAX_a= 11782
##$YMIN_a= -15231
##$ZGOPTNS= <>
##$ZL1= 120
##$ZL2= 120
##$ZL3= 120
##$ZL4= 120
##$ABSF1= 182.463
##$ABSF2= -187.1042
##$ABSG= 5
##$ABSL= 3
##$ALPHA= 0
##$AQORDER= 0
##$ASSFAC= 0
##$ASSFACI= 0
##$ASSFACX= 0
##$ASSWID= 0
##$AUNMP= <proc_1d>
##$AZFE= 0.1
##$AZFW= 0.5
##$BCFW= 0
##$BC_mod= 2
##$BYTORDP= 0
##$COROFFS= 0
##$CY= -3
##$DATMOD= 1
##$DC= 0
##$DFILT= <>
##$DTYPP= 0
##$F1P= 0
##$F2P= 0
##$FCOR= 1
##$FTSIZE= 65536
##$FT_mod= 6
##$GAMMA= 0
##$GB= 0
##$INTBC= 1
##$INTSCL= 5.30512e-09
##$ISEN= 30
##$LB= 1
##$LEV0= 0
##$LPBIN= 0
##$MAXI= 10000
##$MC2= 0
##$MEAN= 0
##$ME_mod= 0
##$MI= 50
##$NCOEF= 0
##$NC_proc= -5
##$NLEV= 6
##$NOISF1= 182.463
##$NOISF2= 159.3651
##$NSP= 0
##$NTH_PI= 0
##$NZP= 0
##$OFFSET= 182.463
##$PC= 4
##$PHC0= -966.1348
##$PHC1= 155.0007
##$PH_mod= 1
##$PKNL= yes
##$PPARMOD= 0
##$PSCAL= 0
##$PSIGN= 0
##$REVERSE= no
##$SF= 81.0140089999434
##$SI= 65536
##$SIGF1= 159.3651
##$SIGF2= -187.1042
##$SINO= 113.3802
##$SIOLD= 16384
##$SREGLST= <1H.CDCl3>
##$SSB= 0
##$STSI= 65536
##$STSR= 0
##$SW_p= 29940.119760479
##$SYMM= 0
##$S_DEV= 0
##$TDeff= 32768
##$TDoff= 0
##$TI= <>
##$TILT= no
##$TM1= 0
##$TM2= 0
##$TOPLEV= 0
##$USERP1= <user>
##$USERP2= <user>
##$USERP3= <user>
##$USERP4= <user>
##$USERP5= <user>
##$WDW= 1
##$XDIM= 65536
##$YMAX_p= 276389190
##$YMIN_p= -10596523
$$ End of Bruker specific parameters
$$ ---------------------------------
##NTUPLES= NMR SPECTRUM
##VAR_NAME=  FREQUENCY,     SPECTRUM/REAL,   SPECTRUM/IMAG
##SYMBOL=    X,             R,               I
##VAR_TYPE=  INDEPENDENT,   DEPENDENT,       DEPENDENT
##VAR_FORM=  AFFN,          ASDF,            ASDF
##VAR_DIM=   65536,         65536,           65536
##UNITS=     HZ,            ARBITRARY UNITS, ARBITRARY UNITS
##FACTOR=    0.456856943014862, 1,           1
##FIRST=     14782.0589164792, 0,            0
##LAST=      -15158.0608439998, 0,           0
##MIN=       -15158.0608439998, -10596523,   0
##MAX=       14782.0589164792, 276389190,    0
$$ Real data points
##PAGE= N=1
##DATA TABLE= (X++(R..R)), XYDATA
$$ [...]
$$ plain form
45586 2762972 1672197 765429 490269 516010 492097 515548 677605 732462 589095 643861
45576 643861 1124515 1494118 1127382 333922 16217 389779 750469 587483 237132 203698
45566 203698 451585 712943 966434 1194180 1109977 603666 104979 19760 101353 -123689
45556 -123689 -603643 -1002127 -1391782 -1979708 -2345180 -1879607 -1035222 -1101876 -2336518 -3275433
45546 -3275433 -2635118 -1139588 -494847 -1043526 -1575515 -1308538 -843259 -894095 -1147786
45537 -1147786 -974355 -497227 -250225 -283107 -300544 -325988 -539899 -707759 -464028 -39733
45527 -39733 -37770 -510049 -888125 -868209 -748012 -781972 -832844 -885051 -1291293 -2108340 -2644339
45516 -2644339 -2169826 -881753 225897 371580 -353013 -1197367 -1416888 -820010 165327
$$ packed form
45586B762972j090775r06768k75160K5741k3913K3451J62057N4857j43367N4766
45576F43861M80654L69603l66736p93460l17705L73562L60690j62986l50351l3434
45566B03698K47887K61358K53491K27746q4203n06311m98687q5219Q1593k25042
45556a23689m79954l98484l89655n87926l65472M65573Q44385o6654j234642r38915
45546c275433O40315J495530O44741n48679n31989K66977M65279n0836k53691
45537a147786J73431M77128K47002l2882j7437k5444k13911j67860K43731M24295
45527c9733J963m72279l78076J9916J20197l3960n0872n2207m06242q17047n35999
45516b644339M74513J288073J107650J45683p24593q44354k19521N96878R85337
$$ plain form
45507 165327 948997 1265933 1156270 698166 75805 -300289 -237677 -189394 -625287 -1086242
45497 -1086242 -694799 338282 736106 28770 -661622 -353871 300334 209639 -350839
45488 -350839 -358820 140394 241265 -88151 72328 910894 1490721 1306097 995683 1101911
45478 1101911 1259511 1135246 1102254 1324966 1160439 286771 -405250 7127 1013881
45469 1013881 1353749 748643 24868 -225158 -176467 -64560 180135 474847 448414 -12962
45459 -12962 -527467 -695019 -511647 -223572 -14526 98237 199264 311946 296595 89875
45449 89875 11488 420913 994470 925120 111804 -498837 -238046 257751 44953 -641618
45439 -641618 -802263 -246528 238054 223531 205640 694855 1537718 2358609 3004061 3306376
$$ packed form
45507A65327P83670L16936j09663m58104o22361l76094O2612M8283m35893m60955
45497a086242L91443J033081L97824p07336o90392L07751O54205r0695n60478
45488c50839p981M99214J00871l29416J60479Q38566N79827j84624l10414J06228
45478A101911J57600j24265l2992K22712j64527q73668o92021M12377J006754
45469A013881L39868o05106p23775k50026M8691J11907K44695K94712k6433m61376
45459a2962n14505j67552J83372K88075K09046J12763J01027J12682j5351k06720
45449H9875p8387M09425N73557o9350q13316o10641K60791M95797k12798o86571
45439f41618j60645N55735M84582j4523j7891M89215Q42863Q20891O45452L02315
$$ plain form
45429 3306376 2998133 2149768 1250910 651124 297386 104639 117890 200766 50582 -321907
45419 -321907 -544966 -409966 -28286 537546 1275748 1842800 1792160 1269388 849774 606310
45409 606310 83099 -653100 -823032 -182474 384491 81930 -707122 -1163399 -1194512 -1148833
45399 -1148833 -979913 -536913 -238251 -576966 -1239968 -1526130 -1379590 -1190677 -837670
45390 -837670 100035 1258545 1640072 1009547 258613 130957 400342 639375 998503
45381 998503 1693491 2340167 2420103 2028878 1623988 1317251 913830 422690 27027 -312197
45371 -312197 -735747 -1021145 -721238 130091 828197 719696 -97547 -984197 -1522433 -1831489
45361 -1831489 -2135229 -2275196 -1880427 -977821 -176716 -85011 -650720 -1250496 -1387922 -1155630
$$ packed form
45429C306376l08243q48365q98858n99786l53738j92747J3251Q2876j50184l72489
45419c21907k23059J35000L81680N65832P38202N67052n0640n22772m19614k43464
45409F06310n23211p36199j69932O40558N66965l02561p89052m56277l1113M5679
45399a148833J68920M43000K98662l38715o63002k86162J46540J88913L53007
45390h37670R37705J158510L81527o30525p50934j27656K69385K39033L59128
45381I98503O94988O46676P9936l91225m04890l06737m03421m91140l95663l39224
45371c12197m23550k85398K99907Q51329O98106j08501q17243q86650n38236l09056
45361a831489l03740j39967L94769R02606Q01105R1705n65709n99776j37426K32292
$$ plain form
45351 -1155630 -1024164 -1313997 -1893046 -2299809 -2152275 -1493607 -732410 -243520 -108528
45342 -108528 -230864 -499015 -748692 -785076 -603050 -398728 -226685 81953 450804 364654
45332 364654 -443161 -1374767 -1581318 -1096938 -807303 -1243358 -1920535 -2053262 -1536346 -992189
45322 -992189 -1063764 -1785181 -2501890 -2428872 -1474972 -405781 49899 23805 53971 131430
45312 131430 -110084 -426452 -91724 863223 1408733 869517 -203411 -902531 -1015261
45303 -1015261 -781279 -327477 92329 -22719 -628441 -843675 -201882 402651 -73745
45294 -73745 -1158601 -1463102 -650861 299179 685888 817076 1057670 1222531 1204464 1283197
45284 1283197 1452779 1252116 635911 251709 444507 714024 613947 477962 697326
$$ packed form
45351a155630J31466k89833n79049m06763J47534O58668P61197M88890J34992
45342a08528j22336k68151k49677l6384J82026K04322J72043L08638L68851q6150
45332C64654q07815r31606k06551M84380K89635m36055o77177j32727N16916N44157
45322i92189p1575p21417p16709P3018R53900J069191M55680k6094L0166P7459
45312A31430k41514l16368L34728R54947N45510n39216j072928o99120j12730
45303a015261K33982M53802M19806j15048o05722k15234O41793O04533m76396
45294g3745j084856l04501Q12241R50040L86709J31188K40594J64861j8067P8733
45284A283197J69582k00663o16205l84202J92798K69517j00077j35985K19364
$$ plain form
45275 697326 909732 553650 -238593 -901051 -1189422 -1141193 -709741 -24412 381692 244216
45265 244216 136258 691663 1520081 1611815 698713 -451201 -1050870 -1020485 -724649 -530939
45255 -530939 -653979 -999696 -1182097 -1041210 -957972 -1215025 -1321695 -606319 708546 1727627
45245 1727627 2057616 2005966 1707198 973464 115150 -61861 569251 1107580 861437 182002
45235 182002 -365091 -853972 -1431103 -1656712 -1202698 -627899 -601846 -795253 -446010 293154
45225 293154 560680 207287 -7073 260408 376346 -158979 -839937 -900899 -370668 160267
45215 160267 446741 715787 1097080 1453464 1745196 2109839 2468384 2415097 1766329 1010707
45205 1010707 812212 1035825 732383 -559638 -1880773 -1892699 -748691 -57885 -719503
$$ packed form
45275F97326K12406l56082p92243o62458k88371M8229M31452O85329M06104j37476
45265B44216j07958N55405Q28418R1734r13102j149914n99669L0385K95836J93710
45255e30939j23040l45717j82401J40887Q3238k57053j06670P15376J314865J019081
45245A727627L29989n1650k98768p33734q58314j77011O31112N38329k46143o79435
45235A82002n47093m88881n77131k25609M54014N74799K6053j93407L49243P39164
45225B93154K67526l53393k14360K67481J15938n35325o80958o0962N30231N30935
45215A60267K86474K69046L81293L56384K91732L64643L58545n3287o48768p55622
45205A010707j98495K23613l03442j292021j321135j1926J144008O90806o61618
$$ plain form
45196 -719503 -1693624 -1590316 -716013 -509571 -1370499 -2252475 -2374830 -2136744 -2035227 -1776607
45186 -1776607 -1075188 -488625 -677287 -1354550 -1699625 -1460932 -1001316 -553632 -114341
45177 -114341 116105 -103922 -466987 -317615 426217 1028953 789699 -202144 -1314093
45168 -1314093 -2083340 -2482042 -2633023 -2481748 -1836770 -759686 188880 354629 -270481
45159 -270481 -972775 -1133015 -834577 -457748 -51275 472984 812345 530460 -206328 -690770
45149 -690770 -574031 -273348 -324048 -666884 -786563 -356604 403805 901091 671584 -124167
45139 -124167 -724388 -488975 400320 1156089 1254987 841103 313705 -130233 -453680 -589838
45129 -589838 -494640 -273072 -155142 -363613 -899874 -1360700 -1210942 -513884 -112987 -613454
$$ packed form
45196g19503r74121J03308Q74303K06442q60928q81976j22355K38086J01517K58620
45186a776607P01419N86563j88662o77263l45075K38693M59616M47684M39291
45177a14341K30446k20027l63065J49372P43832O02736k39254r91843j111949
45168a314093p69247l98702j50981J51275O44978J077084R48566J65749o25110
45159b70481p02294j60240K98438L76829M06473N24259L39361k81885p36788m84442
45149f90770J16739L00683n0700l42836j19679M29959P60409M97286k29507p95751
45139a24167o00221K35413Q89295P55769R8898m13884n27398m43938l23447j36158
45129e89838R5198K21568J17930k08471n36261m60826J49758O97058M00897n00467
$$ plain form
45119 -613454 -1401885 -1344352 -396764 288441 41936 -382827 -17651 901750 1412546 1201740
45109 1201740 725187 282460 -187108 -513017 -343168 123987 196390 -307679 -751380 -658462
45099 -658462 -404527 -523795 -839404 -843976 -620318 -743647 -1343106 -1834563 -1688166 -1007378
45089 -1007378 -164439 730659 1654082 2224572 1934523 889750 -72702 -272058 14105
45080 14105 -48168 -743535 -1509576 -1808424 -1824111 -1972157 -2120304 -1864663 -1369427 -1193790
45070 -1193790 -1225623 -614506 822051 1880190 1420290 56331 -543431 157121 1104537
45061 1104537 1437758 1579530 2072617 2385141 1785453 720038 258290 504297 595964
45052 595964 152926 -284371 -291289 -60745 278278 874964 1423274 1206028 310735 -160403
$$ packed form
45119f13454p88431N7533R47588O85205k46505m24763L65176R19401N10796k10806
45109A201740m76553m42727m69568l25909J69849M67155P2403n04069m43701R2918
45099f58462K53935j19268l15609m572K23658j23329n99459m91457J46397O80788
45089a007378Q42939Q95098R23423N70490k90049j044773r62452j99356K86163
45080A4105o2273o95367p66041k98848j5687j48046j48147K55641M95236J75637
45070a193790l1833O11117J436557J058139m59900j363959n99762P00552R47416
45061A104537L33221J41772M93087L12524n99688j065415m61748K46007R1667
45052E95964m43038m37297o918K30544L39023N96686N48310k17246q95293m71138
$$ plain form
45042 -160403 321195 868410 689631 481428 1231255 2413473 2727830 2162336 1846892
45033 1846892 2021363 1700698 565424 -303238 -132435 356558 216340 -311173 -509509
45024 -509509 -483743 -787655 -1328786 -1551678 -1322430 -856854 -153268 743122 1303107 1178649
45014 1178649 985564 1522620 2438399 2658882 2067473 1709090 2147709 2608653 2166987
45005 2166987 996233 -75132 -623899 -695153 -313518 417543 998299 926690 354883
44996 354883 -79482 -47855 192320 285187 192779 66802 -19998 -104824 -277008 -683283
44986 -683283 -1432742 -2358137 -2971231 -2850101 -2111892 -1369336 -1115568 -1221151 -1160615 -687311
44976 -687311 -101123 187413 166294 156932 349549 581736 604099 470605 553879 1073693
$$ packed form
45042a60403M81598N47215j78779k08203P49827J182218L14357n65494l15444
45033A846892J74471l20665j135274q68662J70803M88993j40218n27513j98336
45024e09509K5766l03912n41131k22892K29248M65576P03586Q96390N59985j24458
45014A178649j93085N37056R15779K20483n91409l58383M38619M60944m41666
45005B166987j170754j071365n48767p1254L81635P31061N80756p1609n71807
44996C54883m34365L1627K40175R2867r2408j25977q6800q4826j72184m06275
44986f83283p49459r25395o13094J21130P38209P42556K53768j05583O0536M73304
44976f87311N86188K88536k1119r362J92617K32187K2363j33494Q3274N19814
$$ plain form
44966 1073693 1635971 1484096 397421 -867317 -1350903 -969220 -430729 -212639 -166827
44957 -166827 -113823 -124361 -24434 629755 1666912 2090950 1375280 399071 349837 1124990
44947 1124990 1646045 1441513 994204 668161 291692 -85728 43946 782114 1411172
44938 1411172 1223948 294584 -790069 -1472565 -1358740 -436746 568258 654659 -292167
44929 -292167 -1313950 -1672279 -1738070 -2153630 -2702214 -2673679 -1984611 -1231355 -776398 -399112
44919 -399112 157809 802765 1325230 1619321 1561176 949725 -236721 -1584501 -2359481
44910 -2359481 -2029358 -832934 267225 493670 91075 -92155 192892 374585 157781
44901 157781 117379 724113 1380316 1160112 198970 -427002 -143394 493867 705459 440880
$$ packed form
44966A073693N62278j51875j086675j264738m83586L81683N38491K18090M5812
44957a66827N3004j0538R9927O54189J037157M24038p15670r76209m9234P75153
44947A124990N21055k04532m47309l26043l76469l77420J29674P38168O29058
44938A411172j87224r29364j084653o82496J13825R21994J005004Q6401r46826
44929b92167j021783l58329o5791m15560n48584K8535O89068P53256M54957L77286
44919c99112N56921O44956N22465K94091n8145o11451j186446j347780p74980
44910b359481L30123J196424J100159K26445m02595j83230K85047J81693k16804
44901A57781m0402O06734O56203k20204r61142o25972K83608O37261K11592k64579
$$ plain form
44891 440880 217999 440536 1095041 1812916 2056349 1529281 587076 -15028 27091 192358
44881 192358 -186930 -1100848 -1989982 -2497037 -2683490 -2559042 -1920778 -888715 -155450
44872 -155450 -239038 -738609 -894123 -762312 -1117961 -2080611 -2672553 -2206358 -1370779 -1193656
44862 -1193656 -1493793 -1323974 -619539 -292482 -696871 -1104429 -980470 -810544 -1201226
44853 -1201226 -1939327 -2448281 -2545786 -2290295 -1686668 -1012229 -825093 -1123578 -1071979 -133402
44843 -133402 1063689 1612000 1583164 1704495 2168275 2490475 2318530 1732816 905314 -3734
44833 -3734 -760290 -1287754 -1757521 -2107603 -1868422 -912839 57377 312613 -7680 -311230
44823 -311230 -413219 -428981 -325921 -223365 -588416 -1397769 -1695751 -876149 166062 211187
$$ packed form
44891D40880k22881K22537O54505P17875K43433n27068r42205o02104M2119J65267
44881A92358l79288r13918q89134n07055j86453J24448O38264J032063P33265
44872a55450q3588m99571j55514J31811l55649r62650n91942M66195Q35579J77123
44862a193656l00137J69819P04435L27057m04389m07558J23959J69926l90682
44853a201226p38101n08954r7505K55491O03627O74439J87136k98485N1599R38577
44843a33402J197091N48311k8836J21331M63780L22200j71945n85714q27502r09048
44833c734p56556n27464m69767l50082K39181R55583R70216K55236l20293l03550
44823c11230j01989j5762J03060J02556l65051q09353k97982Q19602J042211M5125
$$ plain form
44813 211187 -449215 -538257 214829 901503 1034940 976038 831935 319159 -189044 108602
44803 108602 898069 809905 -535793 -1812604 -1857093 -1084292 -446293 -126612 2092 -320666
44793 -320666 -1096993 -1539589 -1048196 -110833 448980 506021 317338 -122962 -735226 -1007796
44783 -1007796 -695071 -305163 -290575 -366085 -239918 -350341 -1155504 -2274479 -3042873 -3380860
44773 -3380860 -3449766 -3045038 -2064517 -1044074 -515854 -340557 -287271 -605388 -1301781 -1594486
44763 -1594486 -985453 -210349 -154377 -455609 -231603 406160 712083 644697 610302 338992
44753 338992 -611869 -1541905 -1256892 36697 873579 614778 63416 -106877 -167464 -299159
44743 -299159 -61214 636527 1161286 1244721 1424447 1932630 2139229 1624659 892572 502624
$$ packed form
44813B11187o60402q9042P53086O86674J33437n8902j44103n12776n08203K97646
44803A08602P89467q8164j345698j276811m4489P72801O37999L19681J28704l22758
44793c20666p76327m42596M91393R37363N59813N7041j88683m40300o12264k72570
44783a007796L12725L89908J4588p5510J26167j10423q05163j118975p68394l37987
44773c380860o8906M04728R80521J020443N28220J75297N3286l18117o96393k92705
44763a594486O09033P75104N5972l01232K24006O37763L05923o7386l4395k71310
44753C38992r50861r30036K85013J293589Q36882k58801n51362j70293o0587j31695
44743b99159K37945O97741N24759Q3435J79726N08183K06599n14570p32087l89948
$$ plain form
44733 502624 381259 485775 1184092 2339661 2949714 2466937 1680313 1486492 1566731 1210063
44723 1210063 738697 952380 1553466 1347292 8181 -1371489 -1706909 -1123747 -441792
44714 -441792 -52495 264415 703767 1045074 957234 510059 177040 246675 424312 272150
44704 272150 -114901 -275455 -147526 -172258 -608647 -1271489 -2018377 -2882372 -3542666 -3337900
44694 -3337900 -2177841 -888609 -260960 -265461 -573735 -1224862 -2199743 -2876925 -2640269
44685 -2640269 -1713719 -758347 40007 793944 1137947 522652 -723312 -1466994 -1151837
44676 -1151837 -477802 -396934 -935920 -1405303 -1410266 -1163107 -917636 -579496 -30815 476818
44666 476818 575504 335632 212490 367919 422160 108681 -216927 -142817 64828 -97979
$$ packed form
44733E02624j21365J04516O98317J155569O10053m82777p86624j93821Q0239l56668
44723A210063m71366K13683O01086k06174j339111j379670l35420N83162O81955
44714d41792L89297L16910M39352L41307q7840m47175l33019O9635J77637j52162
44704B72150l87051j60554J27929k4732m36389o62842p46888q63995o60294K04766
44694c337900J160059J289232O27649m501l08274o51127r74881o77182K36656
44685b640269R26550R55372P98354P53937L44003o15295j245964p43682L15157
44676a151837O74035Q0868n38986m69383m963K47159K45471L38140N48681N07633
44666D76818R8686k39872j23142J55429N4241l13479l25608P4110K07645j62807
$$ plain form
44656 -97979 -410384 -153078 727806 1467765 1611988 1503637 1433353 1157975 650978 465071
44646 465071 762837 787593 58048 -611572 -218732 825632 1267133 901766 787967 1546353
44636 1546353 2466191 2601368 1995392 1415815 1342716 1549516 1415968 505770 -928723
44627 -928723 -1990101 -1957043 -1049291 -116129 316535 341669 187066 -43320 -162191 52175
44617 52175 493857 809208 909065 1019764 1157713 967483 253210 -638600 -1151196 -1051110
44607 -1051110 -547864 -55728 113094 -44335 -308869 -582694 -969418 -1371187 -1307870 -503195
44597 -503195 541227 994340 661059 130161 -713 298222 659803 744351 493188 205704
44587 205704 319275 904146 1476258 1490757 855144 -170567 -1232900 -1841219 -1584391
$$ packed form
44656i7979l12405K57306Q80884P39959J44223j08351p0284k75378n06997j85907
44646D65071K97766K4756p29545o69620L92840J044364M41501l65367j13799P58386
44636A546353R19838J35177o05976n79577p3099K06800j33548r10198j434493
44627i28723j061378L3058R07752R33162M32664K5134j54603k30386j18871K14366
44617E2175M41682L15351R9857J10699J37949j90230p14273q91810n12596J00086
44607a051110N03246M92136J68822j57429k64534k73825l86724m01769O3317Q04675
44597e03195J044422M53113l33281n30898j30874K98935L61581Q4548k51163k87484
44587B05704J13571N84871N72112J4499o35613j025711j062333o08319K56828
$$ plain form
44578 -1584391 -807178 -538671 -1172701 -1751413 -1295742 -309588 25135 -271650 -144773
44569 -144773 591300 888682 253948 -378739 -111547 616341 853243 430739 -241306 -966321
44559 -966321 -1631733 -1860538 -1528196 -1227164 -1553962 -2228982 -2486132 -2071689 -1366959 -789997
44549 -789997 -535632 -641643 -863277 -719884 -72990 577506 731238 540877 468286 607658
44539 607658 764494 903625 1052672 996407 536030 -96643 -468551 -451351 -215826 49049
44529 49049 131307 -175798 -696734 -867152 -513980 -280816 -752144 -1458504 -1386286 -333111
44519 -333111 865909 1451967 1529625 1643292 1995386 2261632 1982289 1070122 7443
44510 7443 -567984 -551317 -411383 -435007 -307690 295209 1088031 1522760 1458956 1139331
$$ packed form
44578a584391P77213K68507o34030n78712M55671R86154L34723k96785J26877
44569a44773P36073K97382o34734o32687K67192P27888K36902m22504o72045p25015
44559i66321o65412k28805L32342L01032l26798o75020k57150M14443P04730N76962
44549g89997K54365j06011k21634J43393O46894O50496J53732j90361p2591J39372
44539F07658J56836J39131J49047n6265m60377o32673l71908J7200K35525K64875
44529D9049Q2258l07105n20936j70418L53172K33164m71328p06360P2218J053175
44519c33111J199020N86058P7658J13667L52094K66246k79343r12167j062679
44510G443n75427J6667J39934k3624J27317O02899P92822M34729o3804l19625
$$ plain form
44500 1139331 807165 675124 895397 1202394 1038125 441063 237076 791688 1246601
44491 1246601 821981 239346 722835 2015789 2718093 2450735 2264042 2724534 3011723
44482 3011723 2423013 1525441 1079012 851411 356455 -72391 113281 619493 783559
44473 783559 655148 743372 1057842 1236237 1288658 1340036 928072 -426084 -2036672 -2502535
44463 -2502535 -1531595 -408725 -316469 -978122 -1398548 -1246621 -899962 -601686 -237627
44454 -237627 258373 800832 1337993 1755097 1758010 1251734 665728 446167 356969 -171130
44444 -171130 -1034432 -1442103 -1075393 -624010 -772585 -1186971 -1101034 -558997 -331025 -673610
44434 -673610 -943677 -649841 -217240 -271737 -648920 -706233 -381419 -285368 -684391 -952915
$$ packed form
44500A139331l32166j32041K20273L06997j64269n97062k03987N54612M54913
44491A246601m24620n82635M83489J292954P02304k67358j86693M60492K87189
44482C011723n88710q97572m46429k27601m94956m28846J85672N06212J64066
44473G83559j28411Q8224L14470J78395N2421N1378m11964j354156j610588m65863
44463b502535R70940J122870R2256o61653m20426J51927L46659K98276L64059
44454b37627M96000N42459N37161M17104K913n06276n86006k19561q9198n28099
44444a71130q63302m07671L66710M51383j48575m14386Q5937N42037K27972l42585
44434f73610k70067K93836M32601n4497l77183n7313L24814R6051l99023k68524
$$ plain form
44424 -952915 -347467 994527 2197094 2648912 2480736 2037062 1335145 373537 -343837
44415 -343837 -190473 640199 1159842 830298 271432 281035 618263 450646 -265778 -693594
44405 -693594 -402619 51150 19419 -472884 -1106377 -1733330 -2136063 -1962763 -1308490 -787974
44395 -787974 -647904 -434052 29769 85125 -664991 -1386986 -1035645 115304 885070 825523
44385 825523 533693 518828 680912 878872 1180097 1494013 1651178 1834125 2263460 2539528
44375 2539528 2031642 857472 -278977 -1120112 -1855585 -2176368 -1410486 193933 1340732
44366 1340732 1233017 416756 -277500 -785309 -1331973 -1687634 -1518293 -980685 -489887
44357 -489887 -280707 -456565 -975384 -1382390 -1144531 -448539 -21897 -6054 201208 777903
$$ packed form
44424i52915O05448J341994J202567M51818j68176m43674p01917r61608p17374
44415c43837J53364Q30672N19643l29544n58866R603L37228j67617p16424m27816
44405f93594K90975M53769l1731m92303o33493o26953m02733J73300O54273N20516
44395g87974J40070K13852M63821N5356p50116p21995L51341J150949P69766n9547
44385H25523k91830j4865J62084J97960L01225L13916J57165J82947M29335K76068
44375B539528n07886j174170j136449q41135p35473l20783P65882J604419J146799
44366A340732j07715q16261o94256n07809n46664l55661J69341N37608M90798
44357d89887K09180j75858n18819m07006K37859O95992M26642J5843K07262N76695
$$ plain form
44347 777903 1092303 841125 590311 688994 642193 175935 -98278 149053 148419 -671915
44337 -671915 -1514219 -1444662 -971396 -1149660 -1797647 -1949346 -1546782 -1239276 -869789 275743
44327 275743 1794525 2299331 1459528 553108 598233 1123597 1280245 1116159 1112213 1248494
44317 1248494 1186506 885592 572205 453535 692081 1255855 1670747 1403024 600200 -17467
44307 -17467 -48783 282159 643643 828322 558063 -232940 -957599 -974703 -603827 -711222
44297 -711222 -1279634 -1345043 -507611 458434 775255 548313 197034 -118134 -197490 172396
44287 172396 569959 230114 -690231 -1126055 -731092 -359549 -454118 -252068 631688 1139692
44277 1139692 407163 -646955 -685498 -35243 32081 -546148 -710042 -163164 294750 198201
$$ packed form
44347G77903L14400k51178k50814R8683m6801m66258k74213K47331o34q20334
44337f71915q42304O9557M73266j78264o47987j51699M02564L07506L69487J145532
44327B75743J518782N04806q39803r06420M5125N25364J56648j64086l946J36281
44317A248494o1988l00914l13387j18670K38546N63774M14892k67723q02824o17667
44307a7467l1316L30942L61484J84679k70259p91003p24659j7104L70876j07395
44297g11222n68412o5409Q37432R66045L16821k26942l51279l15168p9356L69886
44287A72396L97563l39845r20345m35824L94963L71543r4569K02050Q83756N08004
44277A139692p32529j054118l8543O50255O7324n78229j63894N46878M57914r6549
$$ plain form
44267 198201 -137296 -554762 -1189245 -1617022 -1079872 250441 1267123 1362881 942455
44258 942455 443786 -125244 -562552 -470991 -104018 -164462 -531245 -323067 441971 524168
44248 524168 -571736 -1517680 -993345 334702 738288 -290493 -1705669 -2408645 -2103033
44239 -2103033 -968501 518256 1501034 1321919 284618 -689136 -1120392 -1214676 -1206867
44230 -1206867 -1056975 -761506 -459993 -234878 -167593 -434643 -935932 -1082655 -511768 214017
44220 214017 282298 -157497 -224651 304246 696749 492563 167195 226170 405573 266802
44210 266802 -42980 -189229 -296296 -583764 -761976 -450165 70348 171978 -209806 -592055
44200 -592055 -754228 -909792 -1108728 -1108052 -919329 -904021 -1174801 -1410558 -1408005 -1307351 -1134082
$$ packed form
44267A98201l35497m17466o34483m27777N37150J330313J016682R5758m20426
44258I42455m98669n69030m37308R1561L66973o0444l66783K08178P65038Q2197
44248E24168j095904r45944N24335J328047M03586j028781j415176p02976L05612
44239b103033J134532J486757R82778j79115j037301r73754m31256r4284P809
44230a206867J49892K95469L01513K25115O7285k67050n01289j46723N70887P25785
44220B14017O8281m39795o7154N28897L92503k04186l25368N8975J79403j38771
44210B66802l09782j46249j07067k87468j78212L11811N20513J01630l81784l82249
44200e92055j62173j55564j98936O76J88723J5308k70780k35757K553J00654J73269
$$ plain form
44189 -1134082 -710813 -249169 -351426 -1001852 -1215481 -329861 887964 1226410 748519
44180 748519 576007 1089931 1405428 871348 126614 107801 706800 1122638 1116112 1144566
44170 1144566 1394984 1414822 852647 45285 -416961 -418823 -322483 -383509 -476235 -447290 -466855
44159 -466855 -762797 -1106321 -946196 -180234 579936 794316 681016 673717 551658 -164292
44149 -164292 -1103898 -1257740 -479281 127712 -218810 -825909 -622128 249548 796654 696201
44139 696201 484965 429430 207098 -201855 -220309 398273 1036352 1021779 498768 107298
44129 107298 140325 375121 509738 461918 344190 303012 298632 57262 -544088 -1095355
44119 -1095355 -1004015 -256379 543707 951905 1073580 1071646 803001 253275 -93951 229225
$$ packed form
44189a134082M23269M61644j02257o50426k13629Q85620J217825L38446m77891
44180G48519j72512N13924L15497n34080p44734j8813N98999M15838o526K8454
44170A144566K50418J9838n62175q07362m62246j862R6340o1026r2726K8945j9565
44159d66855k95942l43524J60125P65962P60170K14380j13300p299j22059p15950
44149a64292r39606j53842P78459O06993l46522o07099K03781Q71676N47106j00453
44139F96201k11236n5535k22332m08953j8454O18582O38079j4573n23011l91470
44129A07298L3027K34796J34617m7820j17728m1178m380k41370o01350n51267
44119a095355R1340P47636Q00086M08198J21675j934k68645n49726l47226L23176
$$ plain form
44109 229225 1001995 1537982 1475045 1054736 707622 615760 637644 481894 -4236 -621012
44099 -621012 -994236 -1038632 -1063188 -1299152 -1525909 -1335548 -602839 463395 1544718 2289111
44089 2289111 2347565 1624124 462989 -593876 -1228324 -1448065 -1367144 -1025312 -408112
44080 -408112 409835 1134529 1351985 930500 291913 60800 423396 1023706 1447651 1539419
44070 1539419 1301966 877315 637445 840088 1104260 723896 -320128 -1176248 -1211312
44061 -1211312 -760919 -442800 -266030 58101 372547 297778 -49776 -179549 52946 354885
44051 354885 503794 481341 243344 -170980 -439627 -340540 -183698 -378476 -761456 -918192
44041 -918192 -981725 -1411534 -2046267 -2130230 -1386884 -405067 187755 331094 178080 -226121
$$ packed form
44109B29225P72770N35987o2937m20309l47114r1862K1884j55750m86130o16776
44099f21012l73224m4396k4556k35964k26757J90361P32709J066234J081323P44393
44089B289111N8454p23441j161135j056865o34448k19741Q0921L41832O17200
44080d08112Q17947P24694K17456m21485o38587k31113L62596O00310M23945R1768
44070A539419k37453m24651k39870K02643K64172l80364j044024q56120l5064
44061a211312M50393L18119J76770L24131L14446p4769l47554j29773K32495L01939
44051C54885J48909k2453k37997m14324k68647R9087J56842j94778l82980j56736
44041i18192o3533m29809o34733q3963P43346R81817N92822J43339j53014m04201
$$ plain form
44031 -226121 -694618 -894060 -809126 -713325 -581324 -165828 240296 -40274 -840483 -970870
44021 -970870 168392 1600957 2119985 1906997 1921054 2257317 2203495 1642233 1267856 1384514
44011 1384514 1482528 1196624 812388 521239 -37303 -1024586 -1799774 -1640333 -739461 9545
44001 9545 63893 -326059 -665314 -879239 -1306821 -2105150 -2803584 -2674461 -1638467 -515283
43991 -515283 -97255 -246482 -324465 -240919 -435562 -932630 -1189043 -1016311 -914587 -1198101
43981 -1198101 -1457470 -1275962 -861481 -518573 -115479 354211 298969 -604505 -1555099 -1567869
43971 -1567869 -986384 -1032025 -1898641 -2368471 -1577858 -214786 511807 343106 -148645
43962 -148645 -551863 -841924 -1000407 -1035295 -1185895 -1606556 -1981568 -1859725 -1248601 -556612
$$ packed form
44031b26121m68497j99442Q4934R5801J32001M15496M06124k80570q00209j30387
44021i70870J139262J432565N19028k12988J4057L36263n3822n61262l74377J16658
44011A384514R8014k85904l84236k91149n58542r87283p75188J59441R00872P49006
44001I545N4348l89952l39255k13925m27582p98329o98434J29123J035994J123184
43991e15283M18028j49227p7983Q3546j94643m97068k56413J72732J01724k83514
43981a198101k59369J81508M14481L42908M03094M69690n5242r03474r50594j2770
43971a567869N81485m5641q66616m69830P90613J363072P26593j68701m91751
43962a48645m03218k90061j58483l4888j50600m20661l75012J21843O11124O91989
$$ plain form
43952 -556612 -120841 -85219 -483265 -1061579 -1266147 -828036 -157550 240180 461061 831026
43942 831026 1163880 1050898 667873 535822 597375 362451 -53855 16216 555598 679594
43932 679594 50540 -512925 -390483 -151174 -402713 -547975 225957 1366181 1626210
43923 1626210 983205 576307 805198 826702 175972 -393128 -226516 176656 191392 243462
43913 243462 984685 1900369 1847626 777520 -98974 44563 683952 899077 612209 403456
43903 403456 510113 577809 322513 -35113 -143367 -15064 129938 357073 945857 1757294
43893 1757294 2108392 1605214 776362 393178 374455 12532 -744407 -1015813 -276771 780815
43883 780815 1196456 1008771 900367 944022 546887 -374992 -965492 -496556 625644 1322087
$$ packed form
43952e56612M35771L5622l98046n78314k04568M38111O70486L97730K20881L69965
43942H31026L32854j12982l83025j32051O1553k34924m16306P0071N39382J23996
43932F79594o29054n63465J22442K39309k51539j45262P73932J140224K60029
43923A626210o43005m06898K28891K1504o50730n69100J66612M03172J4736N2070
43913B43462P41223R15684n2743j070106q76494J43537O39389K15125k86868k08753
43903D03456J06657O7696k55296l57626j08254J28303J45002K27135N88784Q11437
43893A757294L51098n03178q28852l83184j8723l61923p56939k71406P39042J057586
43883G80815M15641j87685j08404M3655l97135r21879n90500M68936J122200O96443
$$ plain form
43873 1322087 1068226 307724 -268149 -503859 -690029 -880036 -652484 264784 1387751
43864 1387751 1906986 1690077 1392474 1472796 1623530 1446481 1139528 1023243 857415 309627
43854 309627 -202593 52973 921073 1406208 1044201 464634 311666 326014 -18348 -534618
43844 -534618 -628965 -290124 -124331 -440381 -821932 -744661 -296493 -94799 -591229 -1548735
43834 -1548735 -2201944 -1969774 -1036045 -159224 110712 -78523 -196245 15784 296862
43825 296862 204886 -357640 -947011 -985925 -442956 63237 33444 -246404 -156849 327015
43815 327015 685355 755374 907158 1192431 1061626 314492 -340069 -250774 197995 273822
43805 273822 111430 376432 980551 1131715 693736 510732 1079757 1764773 1809695 1400134
$$ packed form
43873A322087k53861p60502n75873k35710j86170j90007K27552R17268J122967
43864A387751N19235k16909k97603Q0322J50734j77049l06953j16285j65828n47788
43854C09627n12220K55566Q68100M85135l62007n79567j52968J4348l44362n16270
43844e34618r4347L38841J65793l16050l81551P7271M48168K01694m96430r57506
43834a548735o53209K32170R33729Q76821K69936j89235j17722K12029K81078
43825B96862r1976n62526n89371l8914N42969N06193k9793k79848Q9555M83864
43815C27015L58340P0019J51784K85273j30805p47134o54561Q9295M48769P5827
43805B73822j62392K65002O04119J51164m37979j83004N69025O85016M4922m09561
$$ plain form
43795 1400134 1097269 827022 233848 -344414 -178905 623644 1039540 468305 -514741
43786 -514741 -1027723 -912566 -498428 136295 1049352 1854009 1934431 1267739 492466 31641
43776 31641 -375355 -1041372 -1668652 -1704581 -1096529 -278270 435119 984756 1167049 652563
43766 652563 -389035 -1126620 -924053 -150034 251239 -90655 -637903 -777841 -578744
43757 -578744 -495797 -632771 -674601 -456986 -211286 -168946 -257229 -359691 -577112 -953204
43747 -953204 -1197511 -1068246 -839513 -881054 -880496 -174511 1011713 1434652 426952 -1006332
43737 -1006332 -1388479 -650381 -10646 -219013 -789616 -945090 -459592 549416 1816028
43728 1816028 2659989 2356492 1185357 389334 622399 1128847 977590 358843 -57891
$$ packed form
43795A400134l02865k70247n93174n78262J65509Q02549M15896n71235r83046
43786e14741n12982J15157M14138O34723R13057Q04657Q0422o66692p75273m60825
43776C1641m06996o66017o27280l5929O08052Q18259P13389N49637J82293n14486
43766F52563j041598p37585K02567P74019M01273l41894n47248j39938J99097
43757e78744Q2947j36974m1830K17615K45700M2340q8283j02462k17421l76092
43747i53204k44307J29265K28733m1541N58P05985J186224M22939j007700j433284
43737a006332l82147P38098O39735k08367n70603j55474M85498J009008J266612
43728A816028Q43961l03497j171135p96023K33065N06448j51257o18747m16734
$$ plain form
43719 -57891 -328847 -818441 -1104275 -479590 634076 949840 96721 -901766 -1182838 -1115116
43709 -1115116 -1386634 -1854290 -1906055 -1407457 -703644 -49922 481810 820253 995431 1146829
43699 1146829 1158947 667336 -265724 -932505 -862317 -503868 -519260 -787792 -749943 -463716
43689 -463716 -561351 -1194107 -1722199 -1596230 -1002568 -462637 -259205 -455972 -1057151 -1863506
43679 -1863506 -2446696 -2507927 -2098559 -1413638 -651390 -155251 -279464 -855063 -1138980 -643551
43669 -643551 233995 758331 782907 692157 614470 275390 -350099 -808872 -777351 -424835
43659 -424835 60643 818371 1806414 2395631 2059511 1237496 882372 1205214 1474063 1104156
43649 1104156 332688 -361743 -902185 -1350887 -1538475 -1407984 -1329456 -1576483 -1779578 -1400184
$$ packed form
43719e7891k70956m89594k85834O24685J113666L15764q53119r98487k81072O7722
43709a115116k71518m67656n1765M98598P03813O53722N31732L38443J75178J51398
43699A146829J2118m91611r33060o66781P0188L58449j5392k68532L7849K86227
43689d63716r7635o32756n28092J25969N93662N39931K03432j96767o01179q06355
43679a863506n83190o1231M09368O84921P62248M96139j24213n75599k83917M95429
43669f43551Q77546N24336K4576r0750p7687l39080o25489m58773L1521L52516
43659d24835M85478P57728R88043N89217l36120q22015l55124L22842K68849l69907
43649A104156p71468o94431n40442m48702j87588J30491P8528k47027k03095L79394
$$ plain form
43639 -1400184 -536793 226454 602146 747486 786628 708092 644564 726686 705689 252282
43629 252282 -385768 -583977 -249281 26142 -163110 -525521 -589240 -264577 254091 704999
43619 704999 767862 339175 -78861 219234 1186636 1966389 1928735 1254052 413317 -274322
43609 -274322 -467826 -15861 418543 -136485 -1448216 -2076812 -1441616 -771758 -1139029
43600 -1139029 -1692259 -1126146 52200 357173 -190164 -261791 300263 178227 -967829
43591 -967829 -1651377 -930072 25018 -157924 -882418 -677643 441310 1149308 875245
43582 875245 337048 151656 85575 -213510 -683227 -1234209 -1906653 -2415222 -2193127 -1194681
43572 -1194681 -166347 190182 -21216 -219667 -133923 26617 -5479 -258630 -607544 -933212
$$ packed form
43639a400184Q63391P63247L75692J45340L9142p8536o3528Q2122k0997m53407
43629B52282o38050j98209L34696K75423j89252l62411o3719L24663N18668M50908
43619G04999O2863m28687m18036K98095R67402P79753l7654o74683q40735o87639
43609b74322j93504M51965M34404n55028j311731o28596O35196O69858l67271
43600a139029n53230N66113J178346L04973n47337p1627N62054j22036j146056
43591i67829o83548P21305R55090j82942p24494K04775J118953P07998k74063
43582H75245n38197j85392o6081k99085m69717n50982o72444n08569K22095R98446
43572a194681J028334L56529k11398j98451Q5744J60540l2096k53151l48914l25668
$$ plain form
43562 -933212 -1123067 -1012743 -462236 449766 1366157 1877998 1801478 1198583 256654 -696828
43552 -696828 -1204350 -1008893 -384934 91995 108319 -231068 -678637 -984047 -922676 -607619
43542 -607619 -627348 -1326319 -2059666 -1864009 -858877 -139621 -143654 -118603 393037 620019
43532 620019 -110595 -1027958 -952949 -62395 499069 358990 128954 149817 229092 526648
43522 526648 1423407 2362611 2100361 548279 -760305 -662091 140271 307484 -250464
43513 -250464 -627652 -457368 -182730 -93153 -51243 -113608 -556142 -1148698 -1133280 -226520
43503 -226520 859492 1233730 845548 391089 424355 864575 1280771 1360860 1048795 451743
43493 451743 -192007 -523473 -281748 377367 929132 1004430 775946 662712 760191 807425
$$ packed form
43562i33212j89855J10324N50507R12002R16391N11841p6520o02895r41929r53482
43552f96828n07522J95457O23959M76929J6324l39387m47569l05410O1371L15057
43542f07619j9729o98971p33347J95657J005132P19256m033K5051N11640K26982
43532F20019p30614r17363P5009Q90554N61464j40079k30036K0863P9275K97556
43522E26648Q96759R39204k62250j552082j308584R8214Q02362J67213n57948
43513b50464l77188J70284K74638Q9577M1910o2365m42534n92556J5418R06760
43503b26520J086012L74238l88182m54459L3266M40220M16196Q0089l12065n97052
43493D51743o43750l31466K41725O59115N51765P5298k28484j13234R7479M7234
$$ plain form
43483 807425 675205 595234 816136 1219464 1384465 990048 201250 -296747 111109 1110172
43473 1110172 1477108 437069 -1172834 -1725488 -792686 384728 597658 94583 -132466
43464 -132466 183226 541927 702268 921311 1239140 1248419 739076 60467 -373996 -586512
43454 -586512 -834591 -1171302 -1403693 -1331902 -888302 -160409 598777 1044580 922976 226171
43444 226171 -756475 -1509518 -1571435 -938436 -152820 179621 -26881 -332006 -305836 44763
43434 44763 345497 229089 -322500 -892883 -934545 -294751 576382 1046222 893318 395657
43424 395657 -72792 -358294 -499558 -612289 -838308 -1210890 -1480744 -1258042 -511004 174039
43414 174039 94688 -719367 -1374697 -1062930 -50263 582693 219228 -618060 -1028891 -807325
$$ packed form
43483H07425j32220p9971K20902M03328J65001l94417p88798m97997M07856R99063
43473A110172L66936j040039j609903n52654R32802J177414K12930n03075k27049
43464a32466L15692L58701J60341K19043L17829R279n09343o78609m34463k12516
43454e86512k48079l36711k32391P1791M43600P27893P59186M45803j21604o96805
43444B26171r82646p53043o1917O32999P85616L32441k06502l05125K6170L50599
43434D4763L00734j16408n51589n70383m1662O39794Q71133M69840j52904m97661
43424C95657m68449k85502j41264j12731k26019l72582k69854K22702P47038O85043
43414A74039p9351q14055o55330L11767J012667O32956l63465q37288m10831K21566
$$ plain form
43404 -807325 -422841 -234360 -201738 -222499 -248013 -138831 79977 -106543 -1129792 -2399110
43394 -2399110 -2674241 -1605965 -195884 602532 976265 1446771 1776115 1516282 1081466
43385 1081466 1257337 1893269 2075321 1561884 1103839 1187335 1317444 889691 95672 -472472
43375 -472472 -656809 -754690 -985097 -1263460 -1374223 -1214059 -971982 -1040576 -1539547 -2034201
43365 -2034201 -2044156 -1697401 -1467201 -1420417 -1279939 -1104288 -1192037 -1319655 -904987 -99665
43355 -99665 160514 -435739 -978001 -707902 -190936 -345920 -960422 -1127889 -747297 -548567
43345 -548567 -776266 -875257 -591313 -461144 -889800 -1472951 -1652128 -1490343 -1358017 -1288572
43335 -1288572 -1139332 -1096813 -1477704 -2085125 -2202035 -1348250 145457 1372685 1575434
$$ packed form
43404h07325L84484J88481L2622k0761k5514J09182K18808j86520j023249j269318
43394b399110k75131J068276J410081P98416L73733M70506L29344k59833m34816
43385A081466J75871O35932J82052n13437m58045Q3496J30109m27753p94019n68144
43375d72472j84337r7881k30407k78363j10763J60164K42077o8594m98971m94654
43365b034201r955L46755K30200M6784J40478J75651q7749j27618M14668Q05322
43355i9665K60179n96253n42262K70099N16966j54984o14502j67467L80592J98730
43345e48567k27699r8991K83944J30169m28656n83151j79177J61785J32326O9445
43335a288572J49240M2519l80891o07421j16910Q53785J493707J227228K02749
$$ plain form
43326 1575434 715056 -493400 -1139164 -903505 -330834 -166065 -420155 -351371 496121
43317 496121 1543457 1839551 1315270 846293 992736 1274782 1058787 617487 654469 1088000
43307 1088000 1121895 510717 -52328 -37483 133675 -213252 -1077831 -2004217 -2772339 -3362086
43297 -3362086 -3555240 -3103795 -2153210 -1132331 -373269 -81111 -372953 -1013349 -1418407
43288 -1418407 -1289710 -954749 -766480 -595032 -325751 -321096 -759553 -1023206 -550423 127532
43278 127532 150532 -230780 -137653 224579 -235849 -1417475 -1674771 -222426 1438203
43269 1438203 1518490 349633 -408574 -217739 46024 -144666 -342674 -292552 -435559 -909173
43259 -909173 -1087076 -615805 -74210 -7959 9900 627833 1488785 1592398 760424 -31026
$$ packed form
43326A575434q60378j208456o45764K35659N72671J64769k54090O8784Q47492
43317D96121J047336K96094n24281m68977J46443K82046k15995m41300L6982M33531
43307A088000L3895o11178n63045J4845J71158l46927q64579r26386p68122n89747
43297c362086j93154M51445R50585J020879P59062K92158k91842o40396m05058
43288a418407J28697L34961J88269J71448K69281M655m38457k63653M72783O77955
43278A27532K3000l81312R3127L62232m60428j181626k57296J452345J660629
43269A438203Q0287j168857p58207J90835K63763j90690j98008N0122j43007m73614
43259i09173j77903M71271N41595O6251J7859O17933Q60952J03613q31974p91450
$$ plain form
43249 -31026 47826 629303 742755 94147 -696552 -1008743 -896827 -726050 -527270 -69099
43239 -69099 607189 1147914 1393775 1538771 1669597 1523820 942074 248402 -138885 -265879
43229 -265879 -502415 -1020643 -1720310 -2469649 -3029228 -2910602 -1823579 -253535 880634
43220 880634 1202415 1091879 917609 619316 220985 142899 577573 996443 790554 129213
43210 129213 -316868 -310415 -188359 -189903 -206189 -217492 -430854 -814308 -945775 -577986 -27491
43199 -27491 245722 188785 68172 83524 301154 719052 1102689 958886 24849 -1293768
43189 -1293768 -2239444 -2382812 -1805276 -840363 16258 166624 -564584 -1474135 -1586109
43180 -1586109 -822691 -78982 2481 -240604 -261348 -175932 -318439 -410669 61952 847193
$$ packed form
43249c1026P8852N81477J13452o48608p90699l12191J11916J70777J98780M58171
43239f9099O76288N40725K45861J44996J30826j45777n81746o93672l87287j26994
43229b65879k36536n18228o99667p49339n59579J18626J087023J570044J134169
43220H80634L21781j10536j74270k98293l98331p8086M34674M18870k05889o61341
43210A29213m46081O453J22056j544j6286j1303k13362l83454j31467L67789N50495
43199b7491K73213n6937j20613J5352K17630M17898L83637j43803r34037j318617
43189a293768r45676j43368N77536R64913Q56621J50366p31208r09551j11974
43180a586109P63418P43709Q1463k43085k0744Q5416j42507r2230M72621P85241
$$ plain form
43170 847193 1084627 504768 -243720 -639577 -957458 -1498905 -1774373 -1140706 19421
43161 19421 512036 -167997 -1142687 -1287504 -664544 -308975 -706643 -1098134 -575649 590735
43151 590735 1282593 1000433 327216 -129851 -489996 -908864 -887159 -39800 924508 966736
43141 966736 294791 152453 938184 1585162 1214015 432579 295350 715835 787538 219866
43131 219866 -448671 -828250 -995990 -905353 -313915 565430 1028376 723480 22340 -622530
43121 -622530 -1177210 -1660268 -1765336 -1207483 -174312 825801 1361883 1208924 412068
43112 412068 -558816 -1017971 -715076 -100231 265526 346834 440684 569199 433696 -52706
43102 -52706 -487677 -354819 414621 1312034 1686254 1344775 723864 411211 541445 763269
$$ packed form
43170H47193K37434n79859p48488l95857l17881n41447k75468O33667J160127
43161A9421M92615o80033r74690j44817O22960L55569l97668l91491N22485J166384
43151E90735O91858k82160o73217m57067l60145m18868K1705Q47359R64308M2228
43141I66736o71945j42338P85731O46978l71147p81436j37229M20485P1703n67672
43131B19866o68537l79579j67740R0637N91438Q79345M62946l04896p01140o44870
43121f22530n54680m83058j05068N57853J033171J000113N36082j52959p96856
43112D12068r70884m59155L02895O14845L65757Q1308R3850J28515j35503m86402
43102e2706m34971J32858P69440Q97413L74220l41479o20911l12653J30234K21824
$$ plain form
43092 763269 728512 420293 28162 -269285 -381713 -400516 -630483 -1246825 -1866575 -1801880
43082 -1801880 -914992 68546 339211 -111753 -619146 -677357 -387566 -172851 -280217 -546746
43072 -546746 -553088 -87833 489754 545848 -49918 -679705 -723468 -335280 -176331 -503319
43062 -503319 -864088 -708015 -23621 728306 1163992 1337033 1537539 1769244 1597316 738379
43052 738379 -307429 -642019 -90288 515416 426198 -94754 -337903 -227273 -242583 -516690
43042 -516690 -693583 -621310 -517620 -391948 28169 610456 714887 132618 -423542 -241277
43032 -241277 396185 684083 481972 400019 766164 1112131 863096 109098 -590468 -918675
43022 -918675 -1005068 -1012374 -847571 -416201 27293 54752 -367129 -701579 -418019 349570
$$ packed form
43092G63269l4757l08219l92131k97447j12428j8803k29967o16342o19750O4695
43082a801880Q86888R83538K70665m50964n07393n8211K89791K14715j07366k66529
43072e46746o342M65255N77587N6094n95766o29787m3763L88188J58949l26988
43062e03319l60769J56073O84394P51927M35686J73041K00506K31705j71928q58937
43052G38379j045808l34590N51731O05704q9218n20952k43149J10630j5310k74107
43042e16690j76893P2273J03690J25672M20117N82287J04431n82269n56160J82265
43032b41277O37462K87898k02111q1953L66145L45967k49035p53998o99566l28207
43022i18675q6393p306J64803M31370M43494K7459m21881l34450K83560P67589
$$ plain form
43012 349570 911663 769544 105428 -443554 -364849 307555 972734 942895 168602 -590035
43002 -590035 -584316 12993 365245 78193 -415107 -627365 -645301 -756206 -910794 -890613
42992 -890613 -657358 -210769 575634 1643638 2591475 3174260 3647756 4258841 4769749
42983 4769749 4941322 5111380 5745381 6773331 7989907 9665356 11841615 13324580 12593642
42974 12593642 9854362 7057966 5518599 4578758 3175421 1621942 884821 904225 808978
42965 808978 400247 287003 662994 966787 836228 559943 455979 544556 957954 1915741
42955 1915741 3066552 3545210 2973763 1835690 686897 -291745 -737595 -49525 1507688
42946 1507688 2478605 1893588 700549 527782 1420527 1979142 1628717 1424658 2222676
$$ packed form
43012C49570N62093j42119o64116n48982P8705O72404O65179k9839p74293p58637
43002e90035N719N97309L52252k87052m93300k12258j7936j10905j54588K0181
42992h90613K33255M46589P86403J068004R47837N82785M73496O11085N10908
42983D769749J71573J70058O34001J027950J216576J675449K176259J482965p30938
42974A2593642k739280k796396j539367r39841j403337j553479p37121J9404r5247
42965H08978m08731j13244L75991L03793j30559k76285j03964Q8577M13398R57787
42955A915741J150811M78658n71447j138073j148793r78642m45850O88070J557213
42946A507688R70917n85017j193039j72767Q92745N58615l50425k04059P98018
$$ plain form
42937 2222676 3219588 3113414 1939291 819426 335035 125282 -45662 183395 952047
42928 952047 1678292 1834413 1711864 1900161 2329354 2405499 1991958 1677549 1921878 2382022
42918 2382022 2407849 1945728 1539337 1476354 1360022 744007 -87502 -363324 171959 870369
42908 870369 964545 457796 -46613 -196817 -172408 -191674 -234894 -379695 -906937 -1733058
42898 -1733058 -2140654 -1574267 -471800 238086 334660 396143 718987 864217 509394 83096
42888 83096 101421 367794 353964 16167 -298598 -464756 -543142 -392169 69061 402760
42878 402760 144258 -350083 -291345 303535 572584 167217 -188157 144376 772180 1021023
42868 1021023 971114 1073462 1213912 900261 122778 -619204 -978657 -914950 -414822 370288
$$ packed form
42937B222676R96912j06174j174123j119865m84391k09753j70944K29057P68652
42928I52047P26245J56121j22549J88297M29193P6145m13541l14409K44329M60144
42918B382022K5827m62121m06391o2983j16332o16015q31509k75822N35283O98410
42908H70369R4176n06749n04409j50204K4409j9266m3220j44801n27242q26121
42898a733058m07596N66387J102467P09886R6574O1483L22844J45230l54823m26298
42888H3096J8325K66373j3830l37797l14765j66158p8386J50973M61230L33699
42878D02760k58502m94341N8738N94880K69049m05367l55374L32533O27804K48843
42868A021023m9909J02348J40450l13651p77483p41982l59453O3707N00128P85110
$$ plain form
42858 370288 926031 932497 843420 1265290 1929720 2029051 1489229 1081193 1214575 1478515
42848 1478515 1569423 1792892 2264295 2431455 1950583 1370856 1319879 1555344 1497651 1244850
42838 1244850 1313867 1696873 1938833 1950758 1993222 1983851 1626840 1234516 1574621 2673222
42828 2673222 3521074 3364737 2689212 2437711 2736111 2977651 2870094 2738729 2829911 2894432
42818 2894432 2630108 2142626 1741080 1539799 1501708 1676410 2078588 2389466 2122612 1218869
42808 1218869 251915 -150859 39826 368301 523122 577010 658049 731401 804701 1049954
42798 1049954 1527956 1994274 2184096 2159272 2199889 2456246 2844248 3166877 3212012 2868945
42788 2868945 2298536 1874864 1832074 2068852 2341629 2444862 2171007 1460804 765173 837223
$$ packed form
42858C70288N55743O466q9077M21870O64430R9331n39822m08036J33382K63940
42848A478515R0908K23469M71403J67160m80872n79727n0977K35465n7693k52801
42838A244850O9017L83006K41960J1925M2464r371l57011l92324L40105J098601
42828B673222Q47852j56337o75525k51501K98400K41540j07557j31365R1182O4521
42818B894432k64324m87482m01546k01281l8091J74702M02178L10878k66854r03743
42808A218869r66954m02774J90685L28475J54821N3888Q1039P3352P3300K45253
42798A049954M78002M66318J89822k4824M0617K56357L88002L22629M5135l43067
42788B868945n70409m23672m2790K36778K72777J03233k73855p10203o95631P2050
$$ plain form
42778 837223 1824308 2926326 3372588 3395036 3698980 4264031 4374581 3753501 2948823 2496506
42768 2496506 2328106 2204807 2204930 2519028 3134793 3888867 4499699 4545575 3917216 3336929
42758 3336929 3784774 5214017 6483427 6830529 6709106 6789191 6930163 6806456 6835858
42749 6835858 7556506 8529483 8870069 8659685 8828463 9679531 10553737 11128071 12045612
42740 12045612 13821754 15953347 17706866 19163485 20824773 22678461 24457465 26604265
42732 26604265 30142086 35445312 41742447 48148322 54857366 63036643 73761798 87392219
42724 87392219 103969384 123912675 148021663 176582806 208202865 239164996 263841214
42717 263841214 276389190 273365252 255816265 228998083 199461549 171761403 147431587
$$ packed form
42778H37223R87085J102018M46262K2448L03944N65051J10550o21080q04678m52317
42768B496506j68400j23299J23L14098O15765P54074O10832M5876o28359n80287
42758C336929M47845J429243J269410L47102j21423Q0085J40972j23707K9402
42749F835858P20648R72977L40586k10384J68778Q51068Q74206N74334R17541
42740A2045612J776142K131593J753519J456619J661288J853688J779004K146800
42732B6604265L537821N303226O297135O405875O709044Q179277J0725155J3630421
42724H7392219J6577165J9943291K4108988K8561143L1620059L0962131K4676218
42717B63841214J2547976l023938j7548987k6818182k9536534k7700146k4329816
$$ plain form
42710 147431587 126357882 108381727 93601768 81901909 72743424 65303069 58705474
42703 58705474 52459574 46847548 42483662 39215410 35908065 31761971 27446726 24312044
42695 24312044 22715145 21814454 20871531 19909680 18978177 17680853 15914837 14361789 13568955
42686 13568955 13020884 11864379 10242124 9097343 8790168 8765903 8648049 8744579 9126704
42677 9126704 9044325 7898963 6239956 5091899 4662000 4413628 4120410 4031370 4114154
42668 4114154 4004060 3781938 3946965 4372744 4146939 2929438 1728014 1649364 2422992
42659 2422992 2915763 2716530 2380689 2324232 2364274 2374026 2568780 2935594 3057275 2784760
42649 2784760 2538384 2669405 3015704 3343140 3696420 3983632 3756392 2880035 1989488
$$ packed form
42710A47431587k1073705j7976155j4779959j1699859r158485p440355o597595
42703E8705474o245900n612026m363886l268252l307345m146094m315245l134682
42695B4312044j596899r00691r42923r61851r31503j297324j766016j553048p92834
42686A3568955n48071j156505j622255j144781l07175k4265j17854R6530L82125
42677I126704q2379j145362j659007j148057m29899k48372k93218q9040Q2784
42668D114154j10094k22122J65027M25779k25805j217501j201424p8650P73628
42659B422992M92771j99233l35841n6457M0042R752J94754L66814J21681k72515
42649B784760k46376J31021L46299L27436L53280K87212k27240q76357q90547
$$ plain form
42640 1989488 1740240 1934206 1943655 1718420 1726239 2050001 2250427 2166987 2203491 2611502
42630 2611502 3008289 2898068 2321250 1732580 1502355 1725693 2248118 2692648 2746491 2627307
42620 2627307 2961082 3925637 4811023 4806450 4017498 3266437 2980387 2761003 2140999 1348067
42610 1348067 1059730 1586657 2498680 2996339 2596083 1569293 752441 788113 1512584
42601 1512584 2227997 2548903 2705087 2966460 3164977 3038851 2709028 2419254 2049522
42592 2049522 1384383 722575 613855 959960 1035676 627315 472806 1094971 1798323 1581597
42582 1581597 691650 346562 947750 1523890 1253951 680084 788009 1501705 1912324
42573 1912324 1701225 1451550 1528400 1501580 1041660 733220 1354264 2614550 3281154 2655491
$$ packed form
42640A989488k49248J93966R449k25235P819L23762K00426q3440L6504M08011
42630B611502L96787j10221n76818n88670k30225K23338N22425M44530N3843j19184
42620B627307L33775R64555Q85386m573p88952p51061k86050k19384o20004p92932
42610A348067k88337N26927R12023M97659m00256j026790q16852L5672P24471
42601A512584P15413L20906J56184K61373J98517j26126l29823k89774l69732
42592B049522o65139o61808j08720L46105P5716m08361j54509O22165P03352k16726
42582A581597q89947l45088O01188N76140k69939n73867J07925P13696M10619
42573A912324k11099k49675P6850k6820m59920l08440O21044J260286O66604o25663
$$ plain form
42563 2655491 1433795 812395 1041251 1281290 825939 -2237 -390658 -132909 235079
42554 235079 293043 254053 481616 882273 1097872 1090337 1181464 1561405 2038977 2296567
42544 2296567 2200329 1875332 1670647 2021078 3077106 4378375 5086194 4699049 3512905
42535 3512905 2347566 1852995 2029480 2311750 2137019 1522225 1046252 1187344 1783769
42526 1783769 2272425 2306837 1940709 1391333 953596 999715 1606353 2212323 2154253 1614866
42516 1614866 1492383 2144515 2848143 2845201 2345086 1973929 1751783 1330008 881956 909232
42506 909232 1304965 1482257 1456681 1896745 2881184 3507148 3178507 2480184 2164871 1993851
42496 1993851 1401594 759888 964131 1985188 2827270 2930646 2698851 2509001 2139087
$$ packed form
42563B655491j221696o21400K28856K40039m55351q28176l88421K57749L67988
42554B35079N7964l8990K27563M00657K15599p535R1127L79941M77572K57590
42544B296567r6238l24997k04685L50431J056028J301269P07819l87145j186144
42535C512905j165339m94571J76485K82270j74731o14794m75973J41092N96425
42526A783769M88656L4412l66128n49376m37737M6119O06638O05970n8070n39387
42516A614866j22483O52132P03628k942n00115l71157k22146m21775m48052K7276
42506I09232L95733J77292k5576M40064R84439O25964l28641o98323l15313j71020
42496A993851n92257o41706K04243J021057Q42082J03376k31795j89850l69914
$$ plain form
42487 2139087 1533683 1280451 1730344 2260769 2069270 1281087 645678 467602 486816 584712
42477 584712 912262 1365111 1545627 1320484 962199 702329 544129 497517 572672 562417
42467 562417 274162 -54653 -50013 149399 111470 -62281 146600 648382 677133 29279
42457 29279 -499431 -386050 -195308 -402061 -274645 962933 2449839 2528576 1112637
42448 1112637 -119296 -44999 675502 1124697 1617724 2798237 4170727 4671977 4280384
42439 4280384 3994902 4326531 4738552 4669592 4287974 3928985 3426603 2494896 1443131
42430 1443131 1003687 1452651 2214368 2476296 2073789 1566722 1379252 1108616 56395
42421 56395 -1593877 -2674281 -2422052 -1537516 -1315384 -1955006 -2389248 -1801651 -655812
$$ packed form
42487B139087o05404k53232M49893N30425j91499p88183o35409j78076J9214R7896
42477E84712L27550M52849J80516k25143l58285k59870j58200m6612P5155j0255
42467E62417k88255l28815M640J99412l7929j73751K08881N01782K8751o47854
42457B9279n28710J13381J90742k06753J27416J237578J486906P8737j415939
42448A112637j231933P4297P20501M49195M93027J180513J372490N01250l91593
42439D280384k85482L31629M12021o8960l81618l58989n02382r31707j051765
42430A443131m39444M48964P61717K61928m02507n07067j87470k70636j052221
42421E6395j650272j080404K52229Q84536K22132o39622m34242N87597J145839
$$ plain form
42412 -655812 38262 -48314 -478792 -826473 -1012117 -992604 -631628 -15066 442010 439310
42402 439310 195726 194585 572605 975982 1069831 960206 905994 785647 248961 -550378
42392 -550378 -829392 -121047 944035 1266284 593064 -254544 -484128 -184553 72063
42383 72063 28123 -166759 -337623 -385543 -189928 234515 584010 603410 526473 832919
42373 832919 1528798 1997289 1714226 875869 123369 -194181 -247499 -298055 -335132 -241782
42363 -241782 -90695 -28143 38481 316843 652487 551622 -72481 -501792 -2422 1152853
42353 1152853 1971281 2026962 1884386 2103723 2445987 2440712 2217843 2215271 2385961 2302359
42343 2302359 1891760 1492128 1235475 927397 566387 463096 726975 1062627 1196554
$$ packed form
42412f55812O94074q6576m30478l47681j85644J9513L60976O16562M57076k700
42402D39310k43584j141L78020M03377R3849j09625n4212j20347n36686p99339
42392e50378k79014P08345J065082L22249o73220q47608k29584K99575K56616
42383G2063m3940j94882j70864m7920J95615M24443L49495J9400p6937L06446
42373H32919O95879M68491k83063q38357p52500l17550n3318n0556l7077R3350
42363b41782J51087O2552O6624K78362L35644j00865o24103m29311M99370J155275
42353A152853Q18428N5681j42576K19337L42264n275k22869k572J70690q3602
42343B302359m10599l99632k56653l08078l61010j03291K63879L35652J33927
$$ plain form
42334 1196554 1134756 923963 566113 261728 304466 609473 795533 871892 1304189 2130442
42324 2130442 2569019 1973950 794713 88876 323314 1075759 1677561 1717698 1138055
42315 1138055 320941 -33738 445916 1342005 1942785 2022710 1777828 1265258 464910 -249676
42305 -249676 -343839 114174 444771 230614 -219090 -379538 -119441 296173 523420 429501
42295 429501 289524 564128 1199766 1442248 827315 26179 2549 600670 873811 646610
42285 646610 621172 877243 575157 -446757 -1094284 -749906 -339329 -668944 -852443 240441
42275 240441 1847818 2278313 1541791 1252261 1926396 2131165 799516 -1078579 -1859487
42266 -1859487 -1247722 -61955 1127484 2174904 2721585 2346675 1238800 112730 -483842
$$ packed form
42334A196554o1798k10793l57850l04385M2738L05007J86060P6359M32297Q26253
42324B130442M38577n95069j179237p05837K34438P52445O01802M0137n79643
42315A138055q17114l54679M79654Q96089O00780P9925k44882n12570q00348p14586
42305b49676r4163M58013L30597k14157m49704j60448K60097M15614K27247r3919
42295D29501j39977K74604O35638K42482o14933q01136k3630N98121K73141k27201
42285F46610k5438K56071l02086j021914o47527L44378M10577l29615j83499J092884
42275B40441J607377M30495p36522k89530O74135K04769j331649j878095p80908
42266a859487O11765J185767J189439J047420N46681l74910j107875j126070n96572
$$ plain form
42257 -483842 -459298 -14435 464023 581666 338389 162587 323819 582817 632278 534672
42247 534672 462652 385310 336759 613835 1293450 1864852 1797174 1269215 930487 1097926
42237 1097926 1526589 1780443 1495622 525823 -733705 -1345557 -666926 800819 1789508
42228 1789508 1561766 575649 -168208 -199439 82640 7067 -542647 -978359 -727600 71405
42218 71405 821460 1207372 1270956 952219 229774 -337985 -76341 641452 664989 -125924
42208 -125924 -384675 617795 1592569 1081295 -176971 -238539 1150491 2282824 2061369
42199 2061369 1255621 893908 850199 616217 276172 -7101 -503236 -1175876 -1277165 -450745
42189 -450745 474643 565252 27540 -386491 -586775 -871858 -984375 -480650 236597 288634
$$ packed form
42257d83842K4544M44863M78458J17643k43277j75802J61232K58998M9461r7606
42247E34672p2020p7342m8551K77076O79615N71402o7678n27959l38728J67439
42237A097926M28663K53854k84821r69799j259528o11852O78631J467745R88689
42228A789508k27742r86117p43857l1231K82079p5573n49714m35712K50759P99005
42218G1405P50055L85912O3584l18737p22445n67759K61644P17793K3537p90913
42208a25924k58751J002470R74774n11274j258266o1568J389030J132333k21455
42199B061369q05748l61713m3709k33982l40045k83273m96135o72640j01289Q26420
42189d50745R25388R0609n37712m14031k00284k85083j12517N03725P17247N2037
$$ plain form
42179 288634 -333166 -725835 -453348 -97377 -204667 -464805 -357172 -46264 -87303 -503809
42169 -503809 -670696 -156824 621899 807329 137330 -645799 -657428 -13667 311721 -179318
42159 -179318 -851670 -882818 -339944 151158 355580 411132 181591 -594894 -1579532 -1990017
42149 -1990017 -1597181 -978671 -661931 -573583 -481294 -392190 -252844 203607 939781 1376279
42139 1376279 1103321 535749 431423 928722 1426611 1307546 478797 -684839 -1616036
42130 -1616036 -1834317 -1275073 -396206 239693 524843 810490 1364807 1993782 2243819
42121 2243819 1878060 1132845 582362 722808 1539768 2429084 2665352 2072973 1211362
42112 1211362 807711 1018418 1351832 1314314 949182 629445 520863 518453 596569 831727
$$ packed form
42179B88634o21800l92669K72487L55971j07290k60138J07633L10908m1039m16506
42169e03809j66887N13872P78723J85430o69999p83129j1629O43761L25388m91039
42159a79318o72352l1148N42874M91102K04422N5552k29541p76485r84638m10485
42149a990017L92836O18510L16740Q8348R2289Q9104J39346M56451P36174M36498
42139A376279k72958n67572j04326M97299M97889j19065q28749j163636r31197
42130a616036k18281N59244Q78867O35899K85150K85647N54317O28975K50037
42121B243819l65759p45215n50483J40446Q16960Q89316K36268n92379q61611
42112A211362m03651K10707L33414l7518l65132l19737j08582k410P8116K35158
$$ plain form
42102 831727 1037547 796835 57206 -662595 -926351 -902522 -904724 -777859 -246575 390747
42092 390747 542964 201053 -92228 -110481 -94229 2019 566032 1332709 1215691 -204206
42082 -204206 -1681353 -1649871 -188112 1223696 1662420 1507699 1267670 765046 -101518
42073 -101518 -699847 -469824 178289 484745 473933 721485 1222351 1311490 734161 38357
42063 38357 -305735 -513806 -864778 -1037871 -601500 171221 540258 248098 -217188 -293392
42053 -293392 73412 533766 734823 569772 216038 -69144 -290029 -704136 -1309771 -1586882
42043 -1586882 -1078095 -50987 785538 1059671 833024 158412 -850034 -1619162 -1520845
42034 -1520845 -763811 -198428 -94274 140998 776435 1124783 592946 -349050 -863888
$$ packed form
42102H31727K05820k40712p39629p19801k63756K3829k202J26865N31284O37322
42092C90747J52217l41911k93281j8253J6252R6248N64013P66677j17018j419897
42082b04206j477147L1482J461759J411808M38724j54721k40029n02624q66564
42073a01518n98329K30023O48113L06456j0812K47552N00866Q9139n77329o95804
42063C8357l44092k08071l50972j73093M36371P72721L69037k92160m65286p6204
42053b93392L66804M60354K01057j65051l53734k85182k20885m14107o05635k77111
42043a586882N08787J027108Q36525K74133k26647o74612j008446p69128R8317
42034a520845P57034N65383J04154K35272O35437L48348n31837r41996n14838
$$ plain form
42025 -863888 -816050 -516053 -6959 624429 774057 82882 -721696 -722593 -254247 -391035
42015 -391035 -1183670 -1589562 -1197604 -801439 -967472 -1189360 -968145 -700922 -834511 -1004632
42005 -1004632 -756996 -387879 -273361 -6708 895120 1899120 2024265 1242983 433694
41996 433694 90498 -56250 -173987 44914 711006 1389981 1686590 1661900 1465511 1043220
41986 1043220 466921 143860 383545 990324 1485835 1535209 1054000 188480 -630312 -876796
41976 -876796 -425020 276999 695503 754520 759106 916848 1112421 1085048 678043 -48436
41966 -48436 -818220 -1257217 -1132568 -538782 182748 741425 1101557 1368859 1515550 1332088
41956 1332088 716603 -83274 -650814 -786697 -597382 -270452 33936 99012 -248960 -834632
$$ packed form
42025h63888M7838K99997N09094O31388J49628o91175q04578q97M68346j36788
42015c91035p92635m05892L91958L96165j66033k21888K21215K67223j33589j70121
42005a004632K47636L69117J14518K66653R01828J004000J25145p81282q09289
41996D33694l43196j46748j17737K18901O66092O78975K96609k4690j96389m22291
41986A043220n76299l23061K39685O06779M95511M9374m81209q65520q18792k46484
41976h76796M51776P02019M18504N9017M586J57742J95573k7373m07005p26479
41966d8436p69784m38997J24649N93786P21530N58677L60132K67302J46691j83462
41956A332088o15485p99877n67540j35883J89315L26930L04388O5076l47972n85672
$$ plain form
41946 -834632 -1139217 -782825 98992 1037865 1649207 1805746 1613509 1376151 1415198 1718936
41936 1718936 1849327 1382229 438656 -329739 -326597 398706 1141047 1221972 743660 470639
41926 470639 813987 1255593 1164486 853574 1129846 1906154 2139816 1380024 530763 567940
41916 567940 1183959 1380110 911950 387073 207221 171263 64343 514 101959 273167
41906 273167 360007 267944 -11413 -264673 -137023 377977 769935 644448 251824 58684
41896 58684 135691 348641 725988 1132865 1052756 355194 -180009 71411 419052 -173773
41886 -173773 -1227356 -1154086 346621 1602730 1192598 -217752 -987780 -647238 -86158
41877 -86158 -97272 -555252 -876257 -688618 -74819 516332 679049 546853 670204 1257127
$$ packed form
41946h34632l04585L56392Q81817R38873O11342J56539j92237k37358L9047L03738
41936A718936J30391m67098r43573p68395L142P25303P42341Q0925m78312k73021
41926D70639L43348M41606r1107l10912K76272P76308K33662p59792q49261L7177
41916E67940O16019J96151m68160n24877j79852l5958j06920o3829J01445J71208
41906B73167Q6840r2063k79357k53260J27650N15000L91958j25487l92624j93140
41896E8684P7007K12950L77347M06877q0109o97562n35203K51420L47641n92825
41886a73773j053583P3270J500707J256109m10132j410350p70028L40542N61080
41877h6158j1114m57980l21005J87639O13799N91151J62717j32196J23351N86923
$$ plain form
41867 1257127 1850242 1955938 1661571 1377125 1252379 1110424 748732 122803 -582204
41858 -582204 -993991 -921471 -684583 -733330 -974565 -949679 -664027 -617947 -902079 -942121
41848 -942121 -407520 252367 496217 319897 -125212 -888912 -1752922 -2033053 -1428144 -587556
41838 -587556 -275517 -387262 -319630 101230 608314 1007782 1142471 725232 -196335 -945522
41828 -945522 -988979 -712060 -842531 -1391188 -1766724 -1682148 -1334189 -903681 -479377 -289019
41818 -289019 -435091 -572816 -355080 37174 287363 503877 811796 816831 231792 -331138
41808 -331138 -67997 774220 1262169 1163767 994851 856482 365124 -236930 -109769 766553
41798 766553 1314211 921490 266289 68640 34589 -236491 -194012 844050 2378532 3217872
$$ packed form
41867A257127N93115J05696k94367k84446j24746j41955l61692o25929p05007
41858e82204m11787P2520K36888m8747k41235K4886K85652M6080k84132m0042
41848i42121N34601O59887K43850j76320m45109p63700q64010k80131O04909Q40588
41838e87556L12039j11745O7632M20860N07084L99468J34689m17239r21567p49187
41828i45522m3457K76919j30471n48657l75536Q4576L47959M30508M24304J90358
41818b89019j46072j37725K17736L92254K50189K16514L07919N035n85039n62930
41808c31138K63141Q42217M87949r8402j68916j38369m91358o02054J27161Q76322
41798G66553N47658l92721o55201j97649l4051k71080M2479J038062J534482Q39340
$$ plain form
41788 3217872 3010128 2456665 2167521 2089129 2025439 1969384 1766271 1076901 -17008 -797351
41778 -797351 -673371 49214 503143 287284 -160180 -245015 77170 485984 847515 1136524
41768 1136524 1028882 240593 -700747 -781920 136166 1039804 1236956 1243672 1544015 1419674
41758 1419674 136297 -1423172 -1742492 -935224 -505083 -922213 -1037089 -158251 870980
41749 870980 1243484 1396110 1853032 2127240 1724277 1168746 1026069 860860 233763 -170499
41739 -170499 364322 1114284 888514 -36558 -328345 358254 1084381 1232907 1120192 1014546
41729 1014546 802998 763034 1437549 2443964 2549867 1387055 93636 -278475 -95710
41720 -95710 -258332 -774404 -994139 -736490 -400386 -237999 -180386 -234630 -505577 -885652
$$ packed form
41788C217872k07744n53463k89144p8392o3690n6055k03113o89370j093909p80343
41778g97351J23980P22585M53929k15859m47464q4835L22185M08814L61531K89009
41768A136524j07642p88289r41340q1173R18086R03638J97152O716L00343j24341
41758A419674j283377j559469l19320Q07268M30141m17130j14876Q78838J029231
41749H70980L72504J52626M56922K74208m02963n55531j42677j65209o27097m04262
41739a70499N34821P49962k25770r25072k91787O86599P26127J48526j12715j05646
41729A014546k11548l9964O74515J006415J05903j162812j293419l72111J82765
41720i5710j62622n16072k19735K57649L36104J62387N7613n4244k70947l80075
$$ plain form
41710 -885652 -1143109 -1271444 -1415513 -1515484 -1354526 -946756 -580718 -420439 -280742 104002
41700 104002 712273 1235731 1397970 1184579 760654 288800 -61752 -57907 362237 799556
41690 799556 708414 161743 -76258 433882 1033844 685401 -675782 -1987662 -2276389
41681 -2276389 -1620782 -823492 -461594 -450677 -404788 -259816 -406901 -1040411 -1498562 -790705
41671 -790705 995816 2400738 2228415 1020026 208715 189792 143073 -381843 -778230
41662 -778230 -512338 2293 144759 -2930 -29884 66731 97811 219248 643105 1077655
41652 1077655 1050760 663355 468745 611777 594753 42635 -677861 -860224 -304509 490213
41642 490213 965355 1111670 1290426 1598950 1753170 1656275 1668559 2005520 2215496 1751415
$$ packed form
41710h85652k57457j28335j44069r9971J60958M07770L66038J60279J39697L84744
41700A04002O08271N23458J62239k13391m23925m71854l50552L845M20144M37319
41690G99556r1142n46671k38001N10140N99962l48443j361183j311880k88727
41681b276389O55607P97290L61898J0917M5889J44972j47085o33510m58151P07857
41671g90705J786521J404922j72323j208389q11311j8923m6719n24916l96387
41662g78230K65892N14631J42466j47689k6954R6615L1080J21437M23857M34550
41652A077655k6895l87405j94610J43032j7024n52118p20496j82363N55715P94722
41642D90213M75142J46315J78756L08524J54220r6895J2284L36961K09976m64081
$$ plain form
41632 1751415 857534 287764 196028 -15150 -579848 -762745 205501 1985656 3380812
41623 3380812 3578980 2852413 2119220 1999660 2251757 2107062 1256209 335621 102297
41614 102297 304637 -16559 -1085496 -1987217 -1973375 -1436502 -1074701 -749509 36407 926601
41604 926601 931346 -110148 -1077441 -872629 314093 1348583 1434822 739974 -66826 -551243
41594 -551243 -752483 -904313 -1091369 -1178377 -974362 -437179 178333 353563 -290880 -1474126
41584 -1474126 -2376677 -2530942 -2328236 -2293551 -2208096 -1580261 -742487 -581316 -1107589 -1244964
41574 -1244964 -403671 606295 807749 451525 430838 876068 1203398 1218983 1283268 1487596
41564 1487596 1457821 1011141 374556 -293293 -1027596 -1631328 -1626786 -752687 830442 2800041
$$ packed form
41632A751415q93881n69770r1736k11178n64698j82897R68246J780155J395156
41623C380812J98168p26567p33193j19560K52097j44695q50853r20588k33324
41614A02297K02340l21196j068937r01721J3842N36873L61801L25192P85916Q90194
41604I26601M745j041494r67293K04812J186722J034490Q6239o94848q06800m84417
41594e51243k01240j51830j87056q7008K04015N37183O15512J75230o44443j183246
41584a474126r02551j54265K02706L4685Q5455O27835Q37774J61171n26273j37375
41574a244964Q41293J009966K01454l56224k0687M45230L27330J5585O4285K04328
41564A487596k9775m46680o36585o67849p34303o03732M542Q74099J583129J969599
$$ plain form
41554 2800041 4745980 6064701 6280708 5540206 4428333 3332830 2356870 1699204 1527812
41545 1527812 1480098 927897 -82240 -696674 -323180 596087 1160841 1030015 583606
41536 583606 302849 251514 90129 -495740 -1325448 -1772096 -1479065 -893313 -761299 -1200986
41526 -1200986 -1676917 -1820503 -1774370 -1688226 -1402090 -816180 -170876 230164 277300 -23733
41516 -23733 -513934 -733392 -293821 486366 815458 458072 18808 3155 179240 199749
41506 199749 266381 661956 1070489 960691 391093 -94484 -198287 -43446 203236 429796
41496 429796 442330 169621 -101832 -99311 -43651 -332617 -872177 -1212682 -1280491 -1422348
41486 -1422348 -1676758 -1583089 -951973 -346999 -417159 -1023073 -1418598 -1200605 -737502 -611828
$$ packed form
41554B800041J945939J318721K16007p40502j111873j095503r75960o57666j71392
41545A527812m7714n52201j010137o14434L73494R19267N64754j30826m46409
41536E83606k80757n1335j61385n85869q29708m46648K93031N85752J32014m39687
41526a200986m75931j43586M6133Q6144K86136N85910O45304M01040M7136l01033
41516b3733m90201k19458M39571P80187L29092l57386m39264j5653J76085K0509
41506A99749O6632L95575M08533j09798n69598m85577j03803J54841K46682K26560
41496D29796J2534k72709k71453K521N5660k88966n39560l40505o7809j41857
41486a422348k54410R3669O31116O04974p0160o05914l95525K17993M63103J25674
$$ plain form
41476 -611828 -885255 -1088056 -870261 -469958 -414131 -851256 -1399780 -1673682 -1688045 -1599585
41466 -1599585 -1317401 -671972 177599 838841 1140632 1199625 1086649 789490 534707 725698
41456 725698 1349643 1766397 1399933 478824 -197013 -144720 398123 900547 1082973 982481
41446 982481 711550 307640 -245601 -905857 -1438291 -1461984 -827069 58652 565505 615252
41436 615252 790486 1410095 1835351 1211583 -238282 -1280024 -1124832 -241127 516973
41427 516973 1001254 1553194 2189215 2613439 2757115 2685356 2159017 964400 -384643
41418 -384643 -976437 -628222 -52974 236881 524025 1106829 1584868 1431115 848520 525353
41408 525353 773152 1328461 1802436 1930214 1552001 762869 18710 -226490 32145 442058
$$ packed form
41476f11828k73427k02801K17795M00303N5827m37125n48524k73902j4363Q8460
41466a599585K82184O45429Q49571O61242L01791N8993j12976k97159k54783J90991
41456G25698O23945M16754l66464r21109o75837N2293N42843N02424J82426j00492
41446I82481k70931m03910n53241o60256n32434k3693O34915Q85721N06853M9747
41436F15252J75234O19609M25256o23768j449865j041742J55192Q83705P58100
41427E16973M84281N51940O36021M24224J43676p1759n26339j194617j349043
41418c84643n91794L48215N75248K89855K87144N82804M78039j53753n82595l23167
41408E25353K47799N55309M73975J27778l78213p89132p44159k45200K58635M09913
$$ plain form
41398 442058 704723 724433 542946 346611 349120 456951 282183 -284354 -805261 -901818
41388 -901818 -799881 -857593 -873109 -456717 87278 -38509 -959273 -1790655 -1720922 -953086
41378 -953086 -242154 137303 531248 1177419 1775465 1879401 1459259 878101 403081 -30781
41368 -30781 -512980 -858921 -865327 -717978 -790929 -1073369 -1200123 -1101496 -1160343 -1556204 -1918914
41357 -1918914 -1887858 -1558623 -1079535 -335066 527167 796208 69187 -974714 -1375756
41348 -1375756 -1163140 -1087247 -1368449 -1586662 -1660221 -1946484 -2307024 -2063277 -1156447 -453721
41338 -453721 -483955 -653112 -231229 548599 964833 849168 533853 150971 -385865 -919890
41328 -919890 -1120199 -933392 -605766 -355271 -264140 -313381 -298537 62519 717103 1221033
$$ packed form
41398D42058K62665J9710j81487j96335K509J07831j74768n66537n20907r6557
41388i01818J01937n7712j5516M16392N43995j25787r20764q31382O9733P67836
41378i53086P10932L79457L93945O46171N98046J03936m20142n81158m75020m33862
41368c0781m82199l45941o406J47349p2951k82440j26754R8627n8847l95861l62710
41357a918914L1056L29235M79088P44469Q62233K69041p27021j043901m01042
41348a375756K12616P5893k81202k18213p3559k86263l60540K43747R06830P02726
41338d53721l0234j69157M21883P79828M16234j15665l15315l82882n36836n34025
41328i19890k00309J86807L27626K50495R1131m9241J4844L61056O54584N03930
$$ plain form
41318 1221033 1300189 1188033 1200577 1292487 1252147 1001670 497700 -277123 -1017922 -1274719
41308 -1274719 -1187576 -1463076 -2219505 -2495537 -1534930 -29999 681872 310796 -258174
41299 -258174 -260221 309497 1156321 1950724 2177983 1527390 529112 136917 576324 1187196
41289 1187196 1426532 1371137 1167307 706191 59918 -382047 -457787 -389476 -231488 240741
41279 240741 864762 942610 132854 -990437 -1621103 -1550218 -1033260 -312336 347424 556405
41269 556405 176984 -436645 -868610 -1059244 -1099388 -973213 -750453 -653242 -664399 -461576
41259 -461576 -10249 230425 29036 -177719 -13743 121339 -370838 -1326453 -2019530 -2101081
41249 -2101081 -1799218 -1369655 -890260 -491581 -292979 -161765 67816 235705 87614
$$ packed form
41318A221033P9156j12156J2544R1910m0340k50477n03970p74823p40799k56797
41308a274719Q7143k75500p56429k76032R60607J504931P11871l71076n68970
41299b58174k047N69718Q46824P94403K27259o50593r98278l92195M39407O10872
41289A187196K39336n5395k03830m61116o46273m41965p5740O8311J57988M72229
41279B40741O24021P7848q09756j123291o30666P0885N16958P20924O59760K08981
41269E56405l79421o13629m31965j90634m0144J26175K22760R7211j1157K02823
41259d61576M51327K40674k01389k06755J63976J35082m92177r55615o93077q1551
41249b101081L01863M29563M79395L98679J98602J31214K29581J67889j48091
$$ plain form
41240 87614 -270755 -519617 -566030 -480344 -202784 290034 746752 970942 1126530 1309603
41230 1309603 1197279 647230 185512 177505 -15262 -1068721 -2228814 -2038674 -495821
41221 -495821 801746 891096 541106 640229 770866 250933 -429312 -323830 424876 823492
41211 823492 482560 -83724 -405043 -475498 -331547 44937 383169 267293 -306500 -883866
41201 -883866 -1027276 -606692 146116 624607 295735 -478697 -575535 436780 1550702
41192 1550702 1693977 1230777 1150494 1309729 763036 -377021 -849670 -228694 323842
41183 323842 -195433 -1223151 -1638769 -1307666 -872061 -665029 -577655 -538132 -472335 -157575
41173 -157575 364498 634321 500028 488309 897274 1082084 401672 -571009 -702842 30094
$$ packed form
41240H7614l58369k48862m6413Q5686K77560M92818M56718K24190J55588J83073
41230A309603j12324n50049m61718q007j92767j053459j160093J90140J542853
41221d95821J297567Q9350l49990R9123J30637n19933o80245J05482P48706L98616
41211H23492l40932n66284l21319p0455J43951L76484L38232j15876n73793n77366
41201h83866j43410M20584P52808M78491l28872p74432r6838J012315J113922
41192A550702J43275m63200q0283J59235n46693j140057m72649O20976N52536
41183C23842n19275j027718m15618L31103M35605K07032Q7374L9523O5797L14760
41173a57575N22073K69823j34293j1719M08965J84810o80412r72681j31833P32936
$$ plain form
41163 30094 428797 -345337 -1833005 -3026461 -3386931 -2959401 -2098385 -1354530 -1165012
41154 -1165012 -1367432 -1341241 -819815 -233725 -65978 -215920 -271222 -134052 -37436 -76317
41144 -76317 -74240 43873 24534 -357606 -812357 -704362 131075 966133 901016 -70379
41134 -70379 -1073391 -1396511 -1075686 -419673 421941 1154126 1228915 548800 -169288 -256674
41124 -256674 66903 230862 232346 345643 347092 -102445 -577840 -365662 275453 338480
41114 338480 -377198 -942723 -754398 -319141 -202828 -138082 258090 681862 710394 522123
41104 522123 412269 192189 -259070 -425132 101531 798953 968907 889325 1284941 1939921
41094 1939921 1886478 947507 76430 -53870 72247 -277712 -986394 -1378259 -1171753 -694710
$$ packed form
41163C0094L98703p74134j487668j193456l60470M27530Q61016P43855J89518
41154a165012k02420K6191N21426N86090J67747j49942n5302J37170R6616l8881
41144g6317K077J18113j9339l82140m54751J07995Q35437Q35058o5117r71395
41134g0379j003012l23120L20825O56013Q41614P32185P4789o80115p18088q7386
41124b56674L23577J63959J484J13297J449m49537m75395K12178O41115O3027
41114C38480p15678n65525J88325M35257J16313O4746L96172M23772K8532j88271
41104E22123j09854k20080m51259j66062N26663O97422J69954p9582L95616O54980
41094A939921n3443r38971q71077j30300J26117l49959p08682l91865K06506M77043
$$ plain form
41084 -694710 -381877 -372079 -484911 -448150 -242185 -183759 -476126 -827887 -882685 -857242 -1181950
41073 -1181950 -1569599 -1191713 18664 986021 846971 73207 -299726 -35163 379335
41064 379335 730131 1142884 1341545 785714 -323786 -1023987 -908308 -726130 -1162822
41055 -1162822 -1680671 -1337957 -343298 153340 -247505 -672191 -388999 162148 327219
41046 327219 464536 1295153 2427155 2608753 1488988 135180 -505473 -747067 -1215903
41037 -1215903 -1584620 -1170518 -334858 -199735 -955832 -1398716 -491908 1263401 2446897
41028 2446897 2278358 1159731 -4780 -566440 -361506 357936 1113497 1522748 1543860
41019 1543860 1397378 1300147 1310089 1339478 1241710 928175 442731 -86608 -521127 -707707
$$ packed form
41084f94710L12833R798j12832L6761K05965N8426k92367l51761n4798K5443l24708
41073a181950l87649L77886J210377R67357j39050p73764l72933K64563M14498
41064C79335L50796M12753J98661n55831j109500p00201J15679J82178m36692
41055a162822n17849L42714R94659M96638m00845m24686K83192N51147J65071
41046C27219J37317Q30617J132002J81598j119765j353808o40653k41594m68836
41037a215903l68717M14102Q35660J35123p56097m42884R06808J755309J183496
41028B446897j68539j118627j164511n61660K04934P19442P55561M09251K1112
41019A543860j46482r7231R942K9389r7768l13535m85444n29339m34519j86580
$$ plain form
41009 -707707 -569756 -362837 -632332 -1575976 -2569274 -2769955 -2175105 -1559047 -1290698 -874365
40999 -874365 13083 718360 507218 -211290 -414741 -23959 6782 -765023 -1586688 -1756110
40989 -1756110 -1675404 -1951694 -2111750 -1228707 403011 1288130 634101 -625810 -1135365
40980 -1135365 -752992 -296370 -171744 -58972 208048 258277 -125464 -497183 -262103 581814
40970 581814 1452285 1750896 1298385 416930 -292782 -444240 -229286 -117939 -214718 -242375
40960 -242375 -169884 -339390 -772391 -941912 -684660 -786659 -1920356 -3330668 -3517432
40951 -3517432 -2252041 -991121 -954869 -1616969 -1711158 -1093505 -703488 -927887 -1010164 -327040
40941 -327040 557323 696699 164582 -65671 460500 1070792 960450 220466 -506784 -944511
$$ packed form
41009g07707J37951K06919k69495r43644r93298k00681N94850O16058K68349M16333
40999h74365Q87448P05277k11142p18508k03451L90782L0741p71805q21665j69422
40989a756110Q0706k76290j60056Q83043J631718Q85119o54029j259911n09555
40980a135365L82373M56622J24626J12772K67020N0229l83741l71719K35080Q43917
40970E81814Q70471K98611m52511q81455p09712j51458K14954J11347r6779k7657
40960b42375P2491j69506m33001j69521K57252j01999j133697j410312j86764
40951c517432J265391J260920L6252o62100r4189O17653L90017k24399q2277O83124
40941c27040Q84363J39376n32117k30253N26171O10292j10342p39984p27250m37727
$$ plain form
40931 -944511 -1193509 -1119944 -473243 375396 563572 -101032 -718378 -464928 302963 640717
40921 640717 335183 13984 146445 562875 900257 945486 531676 -341357 -1189845 -1367760
40911 -1367760 -874384 -411384 -468462 -756965 -737029 -305915 290837 886315 1408233 1683887
40901 1683887 1537129 1019716 393441 -73373 -282027 -401326 -733413 -1275214 -1522319
40892 -1522319 -1053357 -235244 117582 -178357 -444504 -129620 480551 802619 757296 696261
40882 696261 858238 1199817 1492983 1366661 580435 -511358 -1129523 -949409 -420253
40873 -420253 26042 547064 1268820 1667171 1225101 325279 -224722 -310670 -427856 -643168
40863 -643168 -450738 289180 1020427 1308654 1359166 1428798 1255557 477248 -705245 -1646335
$$ packed form
40931i44511k48998P3565O46701Q48639J88176o64604o17346K53450P67891L37754
40921F40717l05534l21199J32461M16430L37382M5229m13810q73033q48488j77915
40911a367760M93376M63000n7078k88503J9936M31114N96752N95478N21918K75654
40901A683887j46758n17413o26275m66814k08654j19299l32087n41801k47105
40892a522319M68962Q18113L52826k95939k66147L14884O10171L22068m5323o1035
40882F96261J61977L41579K93166j26322p86226j091793o18165J80114N29156
40873d20253M46295N21022P21756L98351m42070q99822n50001q5948j17186k15312
40863f43168J92430P39918P31247K88227N0512O9632j73241p78309j182493r41090
$$ plain form
40853 -1646335 -1877558 -1410841 -622389 -35036 -32388 -548744 -1089562 -1180954 -777270 -235905
40843 -235905 -11306 -354953 -1120193 -1806369 -1952815 -1557840 -1017371 -671167 -557385 -572580
40833 -572580 -633260 -622963 -401013 -3825 279980 162253 -345021 -916319 -1146374 -787598
40823 -787598 145244 1391459 2520719 3064697 2772753 1896044 1103186 866160 952816
40814 952816 773142 195325 -309616 -355515 -93740 107013 46449 -334758 -912108 -1177659
40804 -1177659 -646495 287723 522232 -335020 -1327312 -1427334 -813825 -230777 255631
40795 255631 954963 1543192 1467926 1091812 1288352 1967000 2122498 1429786 695458 522479
40785 522479 592185 583451 746856 1091326 974746 124755 -724947 -831840 -393338 44568
$$ packed form
40853a646335k31223M66717P88452N87353K648n16356n40818r1392M03684N41365
40843b35905K24599l43647p65240o86176j46446L94975N40469L46204J13782j5195
40833e72580o0680J0297K21950L97188K83805j17727n07274n71298k30055L58776
40823g87598R32842J246215J129260N43978k91944q76709p92858k37026Q6656
40814I52816j79674n77817n04941m5899K61775K00753o0564l81207n77350k65551
40804a177659N31164R34218K34509q57252r92292j00022O13509N83048M86408
40795B55631O99332N88229p5266l76114J96540O78648J55498o92712p34328j72979
40785E22479O9706q734J63405L44470j16580q49991q49702j06893M38502M37906
$$ plain form
40775 44568 399613 670753 482726 -248932 -821877 -682076 -299829 -331725 -460346 22275
40765 22275 902986 1305215 1018953 640478 524602 495791 538955 875758 1277543 1130543
40755 1130543 372767 -331953 -564597 -679457 -1121153 -1738993 -2061843 -1886040 -1378071
40746 -1378071 -865215 -641369 -768909 -1064219 -1427087 -1966994 -2547700 -2609831 -1962765 -1346360
40736 -1346360 -1452822 -1716292 -1062723 265217 804234 1043 -907752 -666838 351242
40727 351242 1006083 1082843 1215148 1639756 1975397 2023053 1975994 1885839 1557600 977658
40717 977658 359754 -205565 -751429 -1188384 -1439222 -1651339 -1857124 -1653031 -766799 236978
40707 236978 488279 6787 -339435 -154802 -48075 -552431 -1201154 -1192863 -514248 150080
$$ packed form
40775D4568L55045K71140j88027p31658n72945J39801L82247l1896j28621M82621
40765B2275Q80711M02229k86262l78475j15876k8811M3164L36803M01785j47000
40755A130543p57776p04720k32644j14860m41696o17840l22850J75803N07969
40746a378071N12856K23846j27540k95310l62868n39907n80706o2131O47066O16405
40736a346360j06462k63470O53569J327940N39017q03191r08795K40914J018080
40727C51242O54841P6760J32305M24608L35641M7656m7059r0155l28239n79942
40717I77658o17904n65319n45864m36955k50838k12117k05785K04093Q86232J003777
40707B36978K51301m81492l46222J84633J06727n04356o48723Q291O78615O64328
$$ plain form
40697 150080 321138 11274 -639689 -1397128 -1690650 -999427 357538 1323579 1264592 667309
40687 667309 406642 638912 791177 445041 -195734 -687573 -837320 -752239 -668262 -792423
40677 -792423 -1092953 -1211685 -840285 -228663 -4190 -369771 -827339 -890670 -676207 -450594
40667 -450594 -23880 795508 1410513 939111 -412925 -1319515 -1046787 -457610 -695993
40658 -695993 -1492485 -1673151 -1005643 -453083 -558484 -689763 -309002 19651 -332194 -782392
40648 -782392 -350240 681183 1088617 621148 389742 1067010 1821916 1665959 938909
40639 938909 595363 670934 462562 -120725 -416393 -157260 138642 44282 -225315 -279181
40629 -279181 16488 630745 1307635 1425034 612561 -463467 -726995 -192694 65175
$$ packed form
40697A50080J71058l09864o50963p57439k93522O91223J356965R66041n8987n97283
40687F67309k60667K32270J52265l46136o40775m91839j49747Q5081Q3977j24161
40677g92423l00530j18732L71400O11622K24473l65581m57568o3331K14463K25613
40667d50594M26714Q19388O15005m71402j352036r06590K72728N89177k38383
40658f95993p96492j80666O67508N52560j05401j31279L80761L28653l51845m50198
40648g82392M32152J031423M07434m67469k31406O77268P54906j55957p27050
40639I38909l43546P5571k08372n83287k95668K59133K95902r4360k69597n3866
40629b79181K95669O14257O76890J17399q12473j076028k63528N34301K57869
$$ plain form
40620 65175 -374711 -683184 -334586 -81848 -556989 -967504 -371505 536988 341890 -804705
40610 -804705 -1303352 -498311 470649 501704 -45941 -300575 -188435 -63150 182226 801829
40600 801829 1478616 1686655 1499249 1386849 1391619 1117714 499312 36932 159119 706796
40590 706796 1177746 1248619 958678 583259 482381 946726 1941442 2917219 3075531 2097358
40580 2097358 598282 -413632 -579850 -384782 -258997 -3255 577043 990545 644394
40571 644394 -160620 -508500 -81808 520504 703263 537431 406055 508095 873171 1450614
40561 1450614 2024615 2340587 2359993 2118886 1460902 331163 -811103 -1418331 -1595527
40552 -1595527 -1823657 -2056009 -1823236 -1214475 -913577 -1118883 -1253011 -973545 -640867
$$ packed form
40620F5175m39886l08473L48598K52738m75141m10515N95999R08493j95098j146595
40610h04705m98647Q05041R68960L1055n47645k54634J12140J25285K45376O19603
40600H01829O76787K08039j87406j12400M770k73905o18402m62380J22187N47677
40590G06796M70950P0873k89941l75419j00878M64345R94716R75777J58312r78173
40580B097358j499076j011914j66218J95068J25785K55742N80298M13502l46151
40571F44394q05014l47880M26692O02312J82759j65832j31376J02040L65076N77443
40561A450614N74001L15972J9406k41107o57984j129739j142266o07228j77196
40552a595527k28130k32352K32773O08761L00898k05306j34128K79466L32678
$$ plain form
40543 -640867 -467950 -56998 754775 1359777 1242318 729144 347049 43398 -412695 -838897
40533 -838897 -1010791 -1092017 -1178996 -978625 -454876 -181191 -473344 -793103 -624686 -290914
40523 -290914 -239860 -246796 -114396 -394898 -1399877 -2161232 -1580321 -165868 585586 226867
40513 226867 -422203 -823198 -1182695 -1465517 -1270617 -812831 -838752 -1390634 -1761535 -1818397
40503 -1818397 -2175962 -2811412 -2765920 -1696503 -581459 -292654 -481938 -519929 -584000 -1064073
40493 -1064073 -1677205 -1929399 -1823141 -1467705 -660771 470701 1089303 678658 -94642
40484 -94642 -297274 3517 140852 12725 -6145 55480 -156006 -578390 -851729 -1009566
40474 -1009566 -1342930 -1749783 -1923698 -2010898 -2325045 -2546951 -2047016 -1004245 -348594
$$ packed form
40543f40867J72917M10952Q11773O05002j17459n13174l82095l03651m56093m26202
40533h38897j71894q1226q6979K00371N23749K73685k92153l19759J68417L33772
40523b90914N1054o936J32400k80502j004979p61355N80911J414453P51454l58719
40513B26867o49070m00995l59497k82822J94900M57786k5921n51882l70901n6862
40503a818397l57565o35450M5492J069417J115044K88805j89284l7991o4071m80073
40493a064073o13132k52194J06258L55436Q06934J131472O18602m10645p73300
40484i4642k02632L00791J37335j28127j8870O1625k11486m22384k73339j57837
40474a009566l33364m06853j73915q7200l14147k21906M99935J042771O55651
$$ plain form
40465 -348594 -424592 -520310 -45995 546986 521980 -18010 -380984 -356686 -379324 -651141
40455 -651141 -708097 -132284 679275 907831 404624 -63845 165005 780851 1035775 869120
40445 869120 912341 1399396 1696262 1153377 -24007 -1035922 -1287357 -723393 263551
40436 263551 1018634 1074421 672819 503305 726884 725747 114715 -544685 -534394 -35790
40426 -35790 203614 -52700 -407285 -581641 -673746 -731490 -587375 -107695 749822 1976520
40416 1976520 3220514 3686951 2869904 1285874 8043 -420418 -190539 385601 1051736
40407 1051736 1323396 782116 -260066 -998965 -1126735 -1012036 -852190 -344828 579215
40398 579215 1366279 1568405 1445602 1413886 1310471 720867 -181942 -628353 -115502 996315
$$ packed form
40465c48594p5998r5718M74315N92981k5006n39990l62974K4298k2638k71817
40455f51141n6956N75813Q11559K28556n03207m68469K28850O15846K54924j66655
40445H69120M3221M87055K96866n42885j177384j011915k51435N63964R86944
40436B63551P55083N5787m01602j69514K23579j137o11032o59400J0291M98604
40426c5790K39404k56314l54585j74356r2105n7744J44115M79680Q57517J226698
40416A976520J243994M66437q17047j584030j277831m28461K29879N76140O66135
40407A051736K71660n41280j042182p38899j27770J14699J59846N07362R24043
40398E79215P87064K02126j22803l1716j03415n89604r02809m46411N12851J111817
$$ plain form
40388 996315 1833428 1870308 1408091 1174761 1464905 1848620 1829748 1510676 1312236 1292259
40378 1292259 1194669 1030129 1086157 1374226 1558591 1484353 1341251 1271974 1250656 1340261
40368 1340261 1567934 1555820 895710 -27156 -281314 312529 833924 587941 102644 250292
40358 250292 926605 1312117 1134450 953795 1264063 1885634 2302141 2203446 1651874 1011939
40348 1011939 750654 1078695 1736308 2214642 2137748 1434254 379011 -447481 -564814
40339 -564814 -166222 2855 -427359 -956189 -941019 -488969 -188560 -188294 -78709 335603
40329 335603 628692 279568 -647993 -1499115 -1633303 -1044126 -420923 -475805 -1125162 -1517353
40319 -1517353 -1018935 10016 616721 285953 -618087 -1318742 -1357174 -914015 -470986
$$ packed form
40388I96315Q37113L6880m62217k33330K90144L83715j8872l19072j98440j9977
40378A292259r7590j64540N6028K88069J84365p4238j43102o9277k1318Q9605
40368A340261K27673j2114o60110r22866k54158N93843N21395k45983m85297J47648
40358B50292O76313L85512j77667j80655L10268O21571M16507r8695n51572o39935
40348A011939k61285L28041O57613M78334p6894p03494j055243q26492j17333
40339e64814L98592J69077m30214n28830J5170M52050L00409K66J09585M14312
40329C35603K93089l49124r27561q51122j34188N89177O23203n4882o49357l92191
40319a517353M98418J028951O06705l30768r04040p00655l8432M43159M43029
$$ plain form
40310 -470986 -101592 727145 2291499 3711623 3620774 1912388 87160 -553651 -344247
40301 -344247 -273153 -307513 274337 1276673 1546769 655545 -413014 -612759 -77140 431608
40291 431608 643207 765468 804973 576639 260889 380697 1094361 1835068 1870848 1129681
40281 1129681 268583 -131754 -215373 -417466 -570151 -52977 1026383 1537612 759315
40272 759315 -477483 -855987 -389597 -247716 -966424 -1869535 -2329834 -2560012 -2834358
40263 -2834358 -2864124 -2441384 -1938160 -1629258 -1183688 -379913 303254 419462 296763 379461
40253 379461 379034 -129797 -715562 -599515 97812 531864 450604 433479 774000 1012072
40243 1012072 819495 581085 710495 978388 948775 645816 363132 134602 -181447 -489784
$$ packed form
40310d70986L69394Q28737J564354J420124r0849j708386j825228o40811K09404
40301c44247P1094l4360N81850J002336K70096q91224j068559j99745N35619N08748
40291D31608K11599J22261L9505k28334l15750J19808P13664P40707L5780p41167
40281A129681q61098m00337q3619k02093j52685N17174J079360N11229p78297
40272G59315j236798l78504M66390J41881p18708r03111m60299k30178k74346
40263b834358k9766M22740N03224L08902M45570Q03775O83167J16208j22699Q2698
40253C79461m27n08831n85765J16047O97327M34052q1260j7125L40521K38072
40243A012072j92577k38410J29410K67893k9613l02959k82684k28530l16049l08337
$$ plain form
40233 -489784 -523879 -266211 -21146 -52232 -293786 -433677 -234101 202778 506327 452411
40223 452411 241036 200318 279341 87781 -531821 -1213024 -1445441 -1095984 -497423 -147444
40213 -147444 -322802 -830450 -1136352 -896435 -332601 81265 200308 195373 55457 -460863
40203 -460863 -1293913 -1924292 -1972194 -1651532 -1386667 -1234215 -962313 -512934 -81341 179153
40193 179153 280439 264406 143555 -27385 -156686 -196684 -157060 -74592 1866 79093 282844
40182 282844 706020 1150171 1205637 710909 4829 -388322 -239336 246002 607288 427508
40172 427508 -304254 -1026338 -1047592 -310269 509675 803584 652247 450939 262426 -69452
40162 -69452 -404924 -408799 -114220 76208 12846 17667 347469 791127 1008469 990834 916801
$$ packed form
40233d89784l4095K57668K45065l1086k41554j39891J99576M36879L03549n3916
40223D52411k11375m0718P9023j91560o19602o81203k32417L49457N98561L49979
40213a47444j75358n07648l05902K39917N63834M13866J19043m935j39916n16320
40203d60863q33050o30379m7902L20662K64865J52452K71902M49379M31593K60494
40193A79153J01286j6033j20851j70940j29301l9998L9624Q2468P6458P7227K03751
40182B82844M23176M44151N5466m94728p06080l93151J48986M85338L61286j79780
40172D27508p31762p22084k1254P37323Q19944K93909j51337k01308j88513l31878
40162f9452l35472l875K94579J90428o3362M821L29802M43658K17342j7635p4033
$$ plain form
40151 916801 738547 245771 -472059 -916079 -678318 63244 688728 745394 310322 -213867
40141 -213867 -486587 -383373 -18036 198818 -242484 -1341783 -2289001 -2191271 -1105396
40132 -1105396 70874 759220 1217667 1743873 2000338 1586549 802137 253328 -4089
40123 -4089 -330713 -698940 -649526 -47038 632306 838235 436611 -294587 -841368 -762750
40113 -762750 -199252 94407 -367869 -1120042 -1428208 -1340163 -1365062 -1391268 -841612 173578
40103 173578 844734 887173 790807 703894 185002 -600217 -654293 242176 848424 278239
40093 278239 -537864 -314847 538303 672677 6643 -289314 235292 784902 793320 619890
40083 619890 556055 304691 -193053 -407115 -103156 252726 321716 324870 325305 -62667 -798471
$$ packed form
40151I16801j78254m92776p17830m44020K37761P41562O25484N6666m35072n24189
40141b13867k72720J03214L65337K16854m41302j099299r47218R7730J085875
40132a105396J176270O88346M58447N26206K56465m13789p84412n48809k57417
40123d089l26624l68227M9414O02488O79344K05929m01624p31198n46781P8618
40113g62750N63498K93659m62276p52173l08166Q8045k4899k6206N49656J015190
40103A73578O71156M2439r6366q6913n18892p85219n4076Q96469O06248n70185
40093B78239q16103K23017Q53150J34374o66034k95957N24606N49610Q418j73430
40083F19890o3835k51364m97744k14062L03959L55882O8990L154M35l87972p35804
$$ plain form
40072 -798471 -1053747 -292538 925070 1739894 2000486 1978789 1705851 1194915 811902 805302
40062 805302 865611 671409 431698 359226 101676 -657799 -1458873 -1630917 -1291154 -1093103
40052 -1093103 -1227892 -1324279 -1113085 -576458 279439 1126272 1124391 -103451 -1515766 -1646196
40042 -1646196 -540211 290689 -10632 -601654 -402776 358153 743984 556368 368507
40033 368507 473122 571583 420493 169158 -16970 -239469 -636729 -1107550 -1379092 -1276882
40023 -1276882 -928355 -716180 -907273 -1263098 -1185241 -383150 732565 1466455 1543347 1255243
40013 1255243 1000207 869371 708831 443573 217249 207543 402957 653554 864758 972995
40003 972995 811276 324043 -70370 199346 962505 1248301 559041 -266977 -105962 888018
$$ packed form
40072g98471k55276P61209J217608Q14824K60592k1697k72938n10936l83013o600
40062H05302O0309j94202k39711p2472k57550p59475q01074j72044L39763J98051
40052a093103j34789r6387K11194N36627Q55897Q46833j881j227842j412315j30430
40042a646196J105985Q30900l01321n91022J98878P60929L85831j87616j87861
40033C68507J04615R8461j51090k51335j86128k22499l97260m70821k71542J02210
40023a276882L48527K12175j91093l55825P7857Q02091J115715P33890P6892k88104
40013A255243k55036j30836j60540k65258k26324r706J95414K50597K11204J08237
40003I72995j61719m87233l94413K69716P63159K85796o89260q26018J61015R93980
$$ plain form
39993 888018 1574263 1499212 1348362 1663620 2058047 2022265 1681060 1313624 863619 431634
39983 431634 534689 1225233 1581498 860262 -313150 -738304 -274027 194444 182055 36025
39973 36025 -21748 -307334 -904266 -1301502 -1158621 -783674 -470660 55087 1051814 2062428
39963 2062428 2344635 1787695 967379 423152 255260 357763 667113 1071776 1285575
39954 1285575 1016175 342759 -134416 230240 1317559 2131902 1849002 831141 143995
39945 143995 144922 158563 -349542 -972125 -1096380 -834601 -644404 -437544 232996 1249244
39935 1249244 1853455 1574489 764823 104518 -88617 43734 226378 359510 587311
39926 587311 989883 1168033 496108 -922141 -1989317 -1883990 -1245699 -1291986 -1976814
$$ packed form
39993H88018O86245p5051j50850L15258L94427l5782l41205l67436m50005m31985
39983D31634J03055O90544L56265p21236j173412m25154M64277M68471j2389j46030
39973C6025n7773k85586n96932l97236J42881L74947L13014N25747R96727J010614
39963B062428K82207n56940q20316n44227j67892J02503L09350M04663K13799
39954A285575k69400o73416m77175L64656J087319Q14343k82900j017861o87146
39945A43995R27J3641n08105o22583j24255K61779J90197K06860O70540J016248
39935A249244O04211k78966q09666o60305j93135J32351J82644J33132K27801
39926E87311M02572J78150o71925j418249j067176J05327O38291m6287o84828
$$ plain form
39917 -1976814 -2103169 -1343037 -850333 -1273847 -1420707 -70661 1759156 1924600 234449
39908 234449 -1201088 -916999 153741 543799 462630 910402 1512357 860849 -1124335
39899 -1124335 -2644335 -2249732 -581439 713905 1044608 1095687 1448921 1842670 1792947
39890 1792947 1290813 654512 70754 -445312 -802668 -782889 -255670 611082 1371633 1592218
39880 1592218 1225586 706771 578681 963298 1440400 1492692 1053976 564949 457329 636367
39870 636367 599298 98366 -499600 -698784 -568263 -605920 -906006 -882375 -48736 1249388
39860 1249388 2213566 2477864 2245923 1743762 1049557 434439 295350 540864 496845 -262912
39850 -262912 -1301208 -1825592 -1544860 -738997 211897 973596 1198748 832201 357815
$$ packed form
39917a976814j26355P60132M92704m23514j46860J350046J829817J65444j690151
39908B34449j435537K84089J070740L90058q1169M47772O01955o51508j985184
39899a124335j520000L94603J668293J295344L30703N1079L53234L93749m9723
39890A792947n02134o36301n83758n16066l57356J9779N27219Q66752P60551K20585
39880A592218l66632n18815j28090L84617M77102N2292m38716m89027j07620J79038
39870F36367l7069n00932n97966j99184J30521l7657l00086K3631Q33639J298124
39860A249388R64178K64298k31941n02161o94205o15118j39089K45514m4019p59757
39850b62912j038296n24384K80732Q05863R50894P61699K25152l66547m74386
$$ [...]
##END NTUPLES=NMR SPECTRUM
##END=
