##TITLE=31Pdec_LR-696-RMK1
 DMSO-d6, 88 sc
 15.11.2019
##JCAMPDX= 6.0         $$ Bruker NMR JCAMP-DX V2.0
##DATA TYPE= NMR SPECTRUM
##DATA CLASS= NTUPLES
##ORIGIN= UXNMR, Bruker Analytische Messtechnik GmbH
##OWNER= root
$$ XWIN-NMR		Version 3.5
$$ Fri Nov 15 14:36:50 2019 Russian Standard Time (UT+4h)  she@DPX200
##.OBSERVE FREQUENCY= 81.013821
##.OBSERVE NUCLEUS= ^31P
##.ACQUISITION MODE= SIMULTANEOUS
##.ACQUISITION SCHEME= undefined
##.AVERAGES= 88
##.DIGITISER RES= 17
##SPECTROMETER/DATA SYSTEM= spect
##.PULSE SEQUENCE= zgpg30
##.SOLVENT NAME= MeOD
##.SHIFT REFERENCE= (INTERNAL, MeOD, 0, 182.463)
##AUDIT TRAIL= $$ (NUMBER, WHEN, WHO, WHERE, WHAT)
$$ ##TITLE= Audit trail, XWIN-NMR		Version 3.5
$$ ##JCAMPDX= 5.01
$$ ##ORIGIN= Bruker BioSpin GmbH
$$ ##OWNER= she
$$ F:/spectra/data/she/nmr/P31/1/pdata/1/auditp.txt
$$ ##AUDIT TRAIL=  $$ (NUMBER, WHEN, WHO, WHERE, WHAT)
(   1,<2019-11-15 14:35:45.79 +0400>,<she>,<DPX200>,
      <continue with go, POWCHK disabled, PULCHK disabled
       configuration hash MD5:
       00 E9 B6 7A A2 85 ED C7 34 08 36 98 17 FE 4E 26
       data hash MD5: 32K
       60 BD FB A8 BB 71 98 B7 E1 00 6A 00 F7 15 D0 B2>)
(   2,<2019-11-15 14:35:50.39 +0400>,<she>,<DPX200>,
      <Start of raw data processing
       efp BC_mod = 2 LB = 1 FT_mod = 6 PKNL = 1 PHC0 = -966.1348 PHC1 = 155.0007 SI = 64K 
       data hash MD5: 64K
       16 3D 7E E6 9E 14 43 20 3E E9 01 92 57 D0 58 E4>)
(   3,<2019-11-15 14:36:18.12 +0400>,<she>,<DPX200>,
      <pk PHC0 = -390.7433 PHC1 = 363.8003 
       data hash MD5: 64K
       EA DD F4 CC 8A 06 EF 90 B3 56 6C 9F 4D 74 32 D5>)
(   4,<2019-11-15 14:36:23.57 +0400>,<she>,<DPX200>,
      <abs ABSG = 5 
       data hash MD5: 64K
       DC CC C4 97 03 19 A9 6D 86 51 2F 1D E1 17 CA A4>)
$$ ##END=
$$ 
$$ hash MD5
$$ 7D E9 5F 3B F3 33 91 0B 8A DE EC 93 3D C0 96 A3
##$RELAX= 
##$RELAX= 
##$RELAX= 
##$RELAX= 
##$RELAX= 
##$RELAX= 
##$RELAX= 
##$RELAX= 
$$ Bruker specific parameters
$$ --------------------------
##$DU= <F:/spectra>
##$EXPNO= 1
##$NAME= <P31>
##$PROCNO= 1
##$TYPE= <nmr>
##$USER= <she>
##$AMP= (0..31)
100 100 100 100 100 100 100 100 100 100 100 100 100 100 100 100 100 100 
100 100 100 100 100 100 100 100 100 100 100 100 100 100 
##$AQSEQ= 0
##$AQ_mod= 1
##$AUNM= <au_zg>
##$AUTOPOS= <>
##$BF1= 81.014009
##$BF2= 200.13
##$BF3= 200.13
##$BF4= 200.13
##$BF5= 200.13
##$BF6= 200.13
##$BF7= 200.13
##$BF8= 200.13
##$BYTORDA= 1
##$CFDGTYP= 0
##$CFRGTYP= 5
##$CHEMSTR= <none>
##$CNST= (0..31)
1 1 145 1 1 1 1 1 1 1 1 1 1 1 1 1 1 1 1 1 1 1 1 1 1 1 1 1 1 1 1 1 
##$CPDPRG= <waltz16>
##$CPDPRG1= <>
##$CPDPRG2= <waltz16>
##$CPDPRG3= <>
##$CPDPRG4= <mlev>
##$CPDPRG5= <mlev>
##$CPDPRG6= <mlev>
##$CPDPRG7= <mlev>
##$CPDPRG8= <mlev>
##$CPDPRGB= <>
##$CPDPRGT= <>
##$D= (0..31)
0 1 0 0 0 0 0 0 0 0 0 0.03 2e-05 3e-06 0 0 0 0 0 0 0 0 0 0 0 0 0 0 0 0 
0 0 
##$DATE= 1573813982
##$DBL= (0..7)
120 120 120 11 120 120 24 19 
##$DBP= (0..7)
150 150 150 150 150 150 150 150 
##$DBP07= 0
##$DBPNAM0= <>
##$DBPNAM1= <>
$$ [...]
##$SUBNAM3= <"">
##$SUBNAM4= <"">
##$SUBNAM5= <"">
##$SUBNAM6= <"">
##$SUBNAM7= <"">
##$SUBNAM8= <"">
##$SUBNAM9= <"">
##$SW= 369.568048894756
##$SWIBOX= (0..15)
0 1 3 0 0 0 0 0 0 0 0 0 0 0 0 0 
##$SW_h= 29940.119760479
##$TD= 32768
##$TD0= 1
##$TE= 0
##$TE2= 300
##$TE3= 300
##$TEG= 300
##$TL= (0..7)
0 120 53 12 22 120 120 120 
##$TP= (0..7)
150 150 150 150 150 150 150 150 
##$TP07= 0
##$TPNAME0= <>
##$TPNAME1= <>
##$TPNAME2= <>
##$TPNAME3= <>
##$TPNAME4= <>
##$TPNAME5= <>
##$TPNAME6= <>
##$TPNAME7= <>
##$TPOAL= (0..7)
0.5 0.5 0.5 0.5 0.5 0.5 0.5 0.5 
##$TPOFFS= (0..7)
0 0 0 0 0 0 0 0 
##$TUNHIN= 0
##$TUNHOUT= 0
##$TUNXOUT= 0
##$USERA1= <user>
##$USERA2= <user>
##$USERA3= <user>
##$USERA4= <user>
##$USERA5= <user>
##$V9= 5
##$VALIST= <valist>
##$VCLIST= <CCCCCCCCCCCCCCC>
##$VD= 0
##$VDLIST= <DDDDDDDDDDDDDDD>
##$VPLIST= <PPPPPPPPPPPPPPP>
##$VTLIST= <TTTTTTTTTTTTTTT>
##$WBST= 1024
##$WBSW= 4
##$XGAIN= (0..3)
0 0 0 0 
##$XL= 0
##$YL= 0
##$YMAX_a= 9153
##$YMIN_a= -11291
##$ZGOPTNS= <>
##$ZL1= 120
##$ZL2= 120
##$ZL3= 120
##$ZL4= 120
##$ABSF1= 182.463
##$ABSF2= -187.1042
##$ABSG= 5
##$ABSL= 3
##$ALPHA= 0
##$AQORDER= 0
##$ASSFAC= 0
##$ASSFACI= 0
##$ASSFACX= 0
##$ASSWID= 0
##$AUNMP= <proc_1d>
##$AZFE= 0.1
##$AZFW= 0.5
##$BCFW= 0
##$BC_mod= 2
##$BYTORDP= 0
##$COROFFS= 0
##$CY= -3
##$DATMOD= 1
##$DC= 0
##$DFILT= <>
##$DTYPP= 0
##$F1P= 0
##$F2P= 0
##$FCOR= 1
##$FTSIZE= 65536
##$FT_mod= 6
##$GAMMA= 0
##$GB= 0
##$INTBC= 1
##$INTSCL= 5.30512e-09
##$ISEN= 30
##$LB= 1
##$LEV0= 0
##$LPBIN= 0
##$MAXI= 10000
##$MC2= 0
##$MEAN= 0
##$ME_mod= 0
##$MI= 50
##$NCOEF= 0
##$NC_proc= -8
##$NLEV= 6
##$NOISF1= 182.463
##$NOISF2= 159.3651
##$NSP= 0
##$NTH_PI= 0
##$NZP= 0
##$OFFSET= 182.463
##$PC= 4
##$PHC0= -1356.878
##$PHC1= 518.801
##$PH_mod= 1
##$PKNL= yes
##$PPARMOD= 0
##$PSCAL= 0
##$PSIGN= 0
##$REVERSE= no
##$SF= 81.0140089999434
##$SI= 65536
##$SIGF1= 159.3651
##$SIGF2= -187.1042
##$SINO= 113.3802
##$SIOLD= 16384
##$SREGLST= <1H.CDCl3>
##$SSB= 0
##$STSI= 65536
##$STSR= 0
##$SW_p= 29940.119760479
##$SYMM= 0
##$S_DEV= 0
##$TDeff= 32768
##$TDoff= 0
##$TI= <>
##$TILT= no
##$TM1= 0
##$TM2= 0
##$TOPLEV= 0
##$USERP1= <user>
##$USERP2= <user>
##$USERP3= <user>
##$USERP4= <user>
##$USERP5= <user>
##$WDW= 1
##$XDIM= 65536
##$YMAX_p= 311082731
##$YMIN_p= -87092563
$$ End of Bruker specific parameters
$$ ---------------------------------
##NTUPLES= NMR SPECTRUM
##VAR_NAME=  FREQUENCY,     SPECTRUM/REAL,   SPECTRUM/IMAG
##SYMBOL=    X,             R,               I
##VAR_TYPE=  INDEPENDENT,   DEPENDENT,       DEPENDENT
##VAR_FORM=  AFFN,          ASDF,            ASDF
##VAR_DIM=   65536,         65536,           65536
##UNITS=     HZ,            ARBITRARY UNITS, ARBITRARY UNITS
##FACTOR=    0.456856943014862, 1,           1
##FIRST=     14782.0589164792, 0,            0
##LAST=      -15158.0608439998, 0,           0
##MIN=       -15158.0608439998, -87092563,   0
##MAX=       14782.0589164792, 311082731,    0
$$ Real data points
##PAGE= N=1
##DATA TABLE= (X++(R..R)), XYDATA
$$ [...]
##PAGE= N=2
##DATA TABLE= (X++(I..I)), XYDATA
8830 -16777410 -19095122 -18904429 -19170689 -17605521 -7131183 13212641 31351442 34630410
8822 34630410 26820409 22176484 23788433 21269203 11754623 7472068 15231283 22884827
8814 22884827 17589250 5972100 2401755 5874016 4016793 -5115517 -11121956 -9257587
8806 -9257587 -5479420 -3163505 1329834 7734279 9476562 6048917 6360512 14725589
8798 14725589 23227115 23499599 17825537 13108185 11369025 11958151 16342402 24019305
8790 24019305 28490982 23679432 11882512 1359585 -1895447 1544277 5004249 465092
8782 465092 -11626018 -18131366 -7660838 10360320 13185594 -4612773 -21306711 -17104371
8774 -17104371 -281011 8301301 6027580 7052526 16005182 22039204 19292394 16049175
8766 16049175 18966236 22180862 18906046 13209308 12873134 18321673 25201522 31324938
8758 31324938 34663250 30259125 16167256 -1076440 -12621350 -16323199 -15687662 -13586418
8750 -13586418 -11553201 -11724746 -14208671 -14792542 -9864561 -1852387 3953864 5883823
8742 5883823 5693811 4452446 2524891 1201741 191567 -4048945 -12768653 -19845036
8734 -19845036 -17660778 -6974456 4195668 10525638 12465565 9965493 709263 -12620857
8726 -12620857 -19873675 -14064227 -1634560 3713126 -2637356 -10707763 -8505520 3241962
8718 3241962 12353897 10157605 1314375 -2759157 2532762 10854259 13191306 7262278
8710 7262278 -1196469 -4404150 -83422 5451907 3472180 -5582309 -9852647 -140713
8702 -140713 16920711 27130879 28022842 29843890 37060920 41333062 37230314 32079557
8694 32079557 31467274 26436734 7798284 -14922621 -23426033 -15147026 -3660235 2653563
8686 2653563 7591450 13588952 16549581 16208431 17490319 18615473 11950269 404643
8678 404643 -2265149 6541897 11728811 4608890 -2387781 2593155 9477798 3235014
8670 3235014 -9753681 -12190461 -5156219 -5361709 -15971336 -22045307 -17106403 -13594645
8662 -13594645 -20458386 -28214971 -25548750 -16139897 -8635834 -2321123 5778126 9917192
8654 9917192 4397192 -4301566 -6423237 -3699244 -2861655 -487785 10626018 23025357
8646 23025357 19444714 -1756886 -21192251 -23713535 -15687907 -9646050 -4535339 6698808
8638 6698808 18770324 18477399 5072385 -7338987 -9092930 -5497166 -5349335 -9230730
8630 -9230730 -13761829 -18105235 -19900353 -13312663 349798 7454210 -1336762 -14086223
8622 -14086223 -10449923 9780614 24860351 19655839 1838943 -15378956 -31381916
8615 -31381916 -48145675 -55213296 -41877090 -18640191 -8587583 -16856079 -24421277 -16201742
8607 -16201742 -1214162 2941122 -5174736 -11708919 -6877067 6133818 18386638 22880161
8599 22880161 16338005 940804 -14526440 -20154814 -13384494 -386133 10187996 12809389
8591 12809389 6686686 -3882601 -10915576 -8459533 1359072 9605239 9187076 2212321
8583 2212321 -1520923 5676790 19725404 26169956 14893007 -6291168 -17573661 -9310008
8575 -9310008 6027190 8343345 -6678836 -23952689 -27147666 -14531769 3644694 17466612
8567 17466612 23710745 23710536 19880773 14638143 9960578 6508491 3761033 1618592 1245384
8558 1245384 3375669 6272241 7247296 6698495 8232711 13075315 17050446 16491880 14804912
8549 14804912 17822500 23524690 23218271 14618155 6836379 8125229 14325616 15327218
8541 15327218 8826560 764684 -5213179 -10616776 -14651233 -12258662 -2640761 6754171
8533 6754171 9582886 9568071 14204942 21727716 21489577 8997325 -5524697 -8796675
8525 -8796675 -1741263 1863421 -5373717 -13927462 -10781453 2366392 12266178 12818323
8517 12818323 11015812 13303244 15898839 13626762 10540321 14210799 23679030 30227051
8509 30227051 28071134 18823213 7727830 993291 4167836 16191111 26120422 22941981
8501 22941981 9441921 277564 4735847 16620201 23429384 21234947 17248220 19656692
8493 19656692 27589622 31687088 24828799 11456212 3046506 3735509 5881801 3025544
8485 3025544 166227 3619093 6584153 -3305782 -23439885 -35877140 -30245872 -15648887
8477 -15648887 -4654480 3719727 16141901 28082199 27035909 11167160 -5503036
8470 -5503036 -9253828 -1920716 3459941 -979276 -9783312 -12504361 -7445079 -3701748
8462 -3701748 -8668850 -17542642 -19702238 -13128430 -6004892 -4050763 -3233740 2853081
8454 2853081 14470019 27175015 35834812 34450303 19186600 -3379348 -17648453 -15452992
8446 -15452992 -5966544 -2052522 -2364525 2790070 11526232 10097408 -4977188 -16903762
8438 -16903762 -8636002 14234723 29445778 24030534 6659146 -5253634 -3673833 6425232
8430 6425232 15422372 16679819 9161523 -2102904 -8130918 -2756766 10869120 22333931
8422 22333931 23178942 12587265 -4711663 -21449737 -28693733 -21178738 -5976217 879646
8414 879646 -6815429 -15788948 -11283657 682445 1749219 -10587286 -19142440 -14127931
8406 -14127931 -7452676 -11559344 -18671982 -14260735 -364968 10101053 15135947 22431990
8398 22431990 29749124 25385405 10374323 2221676 9314230 16966463 10096111 -2312073
8390 -2312073 -484148 14877116 21523781 6600184 -16163645 -26208022 -21750638 -15797408
8382 -15797408 -13815447 -8833469 1520700 6487284 -2688065 -18107855 -25319773 -23058672
8374 -23058672 -22127244 -26417656 -26903895 -16842793 -2272235 7731959 12515452 15231157
8366 15231157 14317158 7491188 -1025388 -5272912 -6064971 -7839214 -10487291 -11311244 -11811690
8357 -11811690 -14931639 -17860812 -15089360 -7283441 -529498 1937488 1399620 -952329
8349 -952329 -4423859 -6833458 -7538783 -9303999 -12144593 -10783825 -4668658 -2841575 -9143437
8340 -9143437 -11041019 2813974 21001471 23041457 10328075 2801911 5797345 3771744
8332 3771744 -8452045 -12905573 1371955 16773506 12176463 -6584575 -18733530 -18176024
8324 -18176024 -13225658 -7568351 -777638 217228 -9560891 -17242125 -6014313 16804248
8316 16804248 25775021 12745885 -3130186 -4859456 1654722 4076612 3846598 7762375
8308 7762375 11561347 6177783 -5751919 -12381130 -9442761 -4348711 -3794227 -5803133
8300 -5803133 -5757776 -3571817 -1230652 2589451 10410835 19389919 22074280 16153992 9307433
8291 9307433 9266218 11964413 7575520 -2189259 -3789641 6872917 14311452 4343421
8283 4343421 -13464178 -17665587 -5235665 4397536 -3876971 -23112707 -36952956 -39151893
8275 -39151893 -34760749 -29727296 -25784644 -21455605 -13660421 -1050535 12258458 19594072
8267 19594072 19244639 15060768 9491827 1585655 -7162875 -11137792 -7385557 344635
8259 344635 6339021 8179926 6722295 4862713 6291935 11127426 13765602 10332751
8251 10332751 6357467 9810262 18232141 22092994 20481531 22288168 29615545 31630861
8243 31630861 20427458 3589255 -5783239 -4795214 -735512 -997745 -7634896 -16775121
8235 -16775121 -20404886 -14491973 -6678299 -7800811 -14727491 -12887113 1179319 13196194
8227 13196194 12955130 8577209 9998137 12276793 7743755 2155863 3697020 6397436
8219 6397436 1320426 -4268470 2528029 16325134 19441514 8781786 -2092205 -5927013
8211 -5927013 -7330863 -5867463 4997221 18822346 17522136 -1028748 -16143970 -14160747
8203 -14160747 -6711727 -8069301 -12271253 -7734975 884092 3472125 5341273 17569684
8195 17569684 33904029 37444267 27195824 18904048 19609921 19596471 12616711 6956279
8187 6956279 9329260 11684637 4073993 -8142996 -10024418 4112304 24938598 38982405
8179 38982405 40208089 32545512 24829874 22587236 23254176 20709698 14202148 9441228
8171 9441228 10728513 16255455 21940381 25354946 24793796 19623658 13498744 12160490
8163 12160490 15759179 18573517 18595066 20632219 25897859 26291562 16389727 4585167
8155 4585167 2215679 5809780 2304825 -9005956 -13160505 -1756278 13652007 17644094
8147 17644094 11053622 5856394 6675103 7679058 4140454 -2906604 -11471100 -18410761
8139 -18410761 -15735507 2136078 26089205 37407253 28672166 11604513 1226791
8132 1226791 918707 6834479 16774400 26882559 27563383 12829138 -9813334 -26566116
8124 -26566116 -31512823 -27727312 -19277565 -9956420 -5436265 -7383482 -8374806 -1787906
8116 -1787906 6169154 4407475 -5586746 -12087801 -12111237 -14789897 -23596930 -28444051 -21081330
8107 -21081330 -7344827 2953287 9342086 16267288 22627532 24019345 21027419 18525083
8099 18525083 19442523 23084890 25947795 22139908 9044345 -5257378 -8323208 -490281
8091 -490281 3861235 -2822238 -9995438 -6263746 3318540 8148803 10208919 17275871
8083 17275871 25343687 23633364 13401242 6400284 6181543 5507875 1788699 283638
8075 283638 848247 -4013578 -15164245 -24313422 -28435404 -33098298 -37679777 -31839052
8067 -31839052 -13044123 6013197 15303229 19955914 26103227 27463899 18176560 7790107
8059 7790107 8549598 15052727 11919254 -2123908 -12405721 -9552811 211808 6744257
8051 6744257 7195161 4082275 1086545 2255251 8010867 11362248 5151338 -6871937
8043 -6871937 -13353089 -9512538 -729951 7379597 13923315 17481342 15167174 9183022
8035 9183022 6325165 8364888 9831893 7048808 1971973 -4177378 -12190581 -17707868
8027 -17707868 -13083888 -585920 6740980 3379138 -89271 5115158 10161417 2576219
8019 2576219 -12329043 -18615815 -13607880 -9074614 -10043038 -8768551 -2394939 -736436
8011 -736436 -9339260 -17719583 -14181009 -2888814 4085430 4362851 3980433 4294780 2495134
8002 2495134 2078086 9550804 20212022 19719997 3308139 -16998927 -28634346 -31939532
7994 -31939532 -31911335 -27432541 -18401465 -14673559 -24246819 -36687254 -33125025 -13293151
7986 -13293151 1560533 -2907297 -15592740 -17569685 -7593970 882641 761519 -3666999
7978 -3666999 -9257546 -17550277 -24718353 -21334923 -7746309 855996 -6920190 -21831963
7970 -21831963 -24900760 -11186772 6317022 14645750 13543774 9496550 5533110 501933
7962 501933 -6886288 -16524395 -25574679 -27100886 -15506388 3784571 15967806 12918950
7954 12918950 2545970 -3386993 -5045504 -9561870 -14776550 -10587341 2582618 9542474
7946 9542474 726388 -13119759 -15609199 -7254373 -2566077 -7731207 -12627250 -6656692
7938 -6656692 6721577 15930684 16252724 13572901 14956794 19553317 20157730 12991148
7930 12991148 3739339 1090942 5298985 8690658 8577740 11727457 21404447 28845764
7922 28845764 26426191 21182111 22631958 23945764 12516347 -3950060 -3410215 15250613
7914 15250613 25608988 12448909 -4196988 -133743 15950076 18557158 5971785
7907 5971785 -900758 5185040 8987405 1605815 -5936344 -4273082 -417984 -2136134
7899 -2136134 -5000499 -4936980 -7979640 -16003739 -16751387 -1790019 16485493 20124827
7891 20124827 9683515 -1003354 -6965381 -13227895 -17720725 -10098362 10075169 26980642
7883 26980642 25590019 7829803 -11438732 -19240192 -13375968 -1023556 9106136 13929990
7875 13929990 14507302 8878125 -6418319 -25392065 -33073129 -24195706 -12581857 -12274956
7867 -12274956 -18013004 -17107306 -12397071 -15819598 -23702284 -19580184 -3543977 2129679
7859 2129679 -15227318 -38361609 -42632822 -25688472 -3027227 14719195 26563244
7852 26563244 31422476 28425199 23937000 26242038 33922270 37950742 33575505 22901846
7844 22901846 8961827 -4549883 -10838605 -6615090 775360 1942410 -316766 5005057
7836 5005057 19430686 31454872 32044730 24235779 14977524 6673204 528597 -505987
7828 -505987 2172948 749818 -8532293 -18048335 -18675966 -13142393 -12132019 -18641268 -23247813
7819 -23247813 -16051573 1421051 18050397 24251363 20060435 13668444 12546306 15370485
7811 15370485 13445114 1388632 -14768082 -22661773 -16878887 -4899912 1197010 -2646916
7803 -2646916 -9615912 -10779342 -4467688 3692960 8067935 7887732 5095484 304393
7795 304393 -6933628 -15009674 -20061688 -19719169 -15854287 -12485503 -10907752 -7718937 1053316
7786 1053316 13550483 21871771 20654054 14629475 14016067 22491314 33940940 41634483
7778 41634483 44855585 43810785 34748827 16859823 -197985 -4282958 4329465 13480154
7770 13480154 14948481 12201348 10534472 7533058 -1407794 -13421383 -20467992 -19181758
7762 -19181758 -13323470 -7402494 -2257797 2942199 7845362 11178116 12092144 10620243
7754 10620243 7859202 5915906 6680917 10072159 13776098 15363613 14995464 15012714 15243745
7745 15243745 10189104 -4340300 -20795360 -22927693 -4961192 17310465 22890649 10365671
7737 10365671 -3049238 -5851267 -3858931 -5503101 -8563691 -8815750 -11309735 -22437900
7729 -22437900 -36987718 -43475898 -38904103 -29585629 -20839852 -14489686 -12886580 -15628315
7721 -15628315 -15035417 -5171921 7018633 10962892 10651717 19214511 34545271 36885510
7713 36885510 16981527 -8221764 -17919398 -13216341 -8577369 -7986268 -4974426 -212712
7705 -212712 -2084892 -10319817 -14098813 -9056404 -3404311 -2971152 -1682125 6772214 17415599
7696 17415599 22261994 23090167 26684281 31272220 27382696 12213152 -4551485 -11759108
7688 -11759108 -8977604 -4711204 -4876746 -6343830 -2392952 7458758 15905789 16867057
7680 16867057 12788505 9707950 8086032 4679809 2080038 7367843 18735252 22812565
7672 22812565 12054799 -2472144 -4840799 3812087 7323547 -3831800 -23514146 -41751235
7664 -41751235 -53721813 -55115236 -41456072 -18370276 -1743200 977276 979947 10119224
7656 10119224 21383477 20556188 11436156 12429225 27780553 39063772 31216213 13132758
7648 13132758 3198705 5205517 10104305 13979259 20600562 28804416 30481100 23083471
7640 23083471 14468508 12028800 13939675 14140676 10243159 3700776 -2839963 -5730217
7632 -5730217 -2533127 3458859 5581225 3230286 3859514 12139994 22212530 25359089
7624 25359089 21043798 15050113 10550952 7455936 7863781 14700848 25359833 33060222
7616 33060222 34774876 32452250 27137370 18764753 11938828 13609982 22238011 26860501
7608 26860501 21202502 11957046 7949785 7860636 5731122 2647692 3483900 5575803 1369137
7599 1369137 -8024670 -12166696 -6259314 2017746 3832107 -362038 -5389927 -8835266
7591 -8835266 -9127177 -3206789 7611402 15185171 14842059 13429390 19854968 31677030
7583 31677030 38893990 37462653 30382130 18713273 2526372 -10276723 -8677798 4876638
7575 4876638 13657381 7789677 -2791496 -2785585 8762303 20407247 23931112 20557184
7567 20557184 16003932 16017228 22619821 28677679 21609871 161879 -18180356 -16544838
7559 -16544838 -1016199 8236904 5170702 2598542 8110175 11641077 3796482 -7318779
7551 -7318779 -8343418 -22407 7495228 11772693 17526919 22895356 20134786 10186065
7543 10186065 3871127 5552903 6624887 243330 -7184819 -6458549 20874 3173339
7535 3173339 1676435 1797382 5024071 5887080 2770476 1336549 3832420 3418380 -5078504
7526 -5078504 -15390980 -18374760 -15771726 -16247357 -19607926 -15422899 422571 17042358
7518 17042358 21633953 14651160 5966600 1375018 415477 3934021 14429464 28292054
7510 28292054 35302895 28833579 12392510 -5408510 -18271533 -23493871 -20874808 -13465353
7502 -13465353 -6384935 -2137865 1062634 4919059 7684758 7280759 5739256 8039949
7494 8039949 16663656 27835339 33091500 26131699 9799023 -5870333 -15072243 -22020339
7486 -22020339 -30314116 -31416094 -14199913 15077018 35222103 36320943 31163639 33439469
7478 33439469 36853353 28123491 11581965 4729188 12676693 23074276 27196742 30535218
7470 30535218 37499507 39443158 27377213 7782890 -4479454 -4493805 170602 2404877
7462 2404877 2591529 2985196 2431467 -729110 -4558381 -5426670 -3082642 -1920314 -6153558
7453 -6153558 -13815516 -17624481 -13916921 -8700735 -10516762 -17979376 -20208833 -11271935
7445 -11271935 1484388 7023601 3884383 -853970 -2463072 -2548226 -3045910 -1653999
7437 -1653999 4905872 15284876 22700620 20147744 7470532 -6896407 -13360456 -10322554
7429 -10322554 -2999515 6057534 19053029 33835703 40589950 33655784 20584213 11452142
7421 11452142 4079152 -9564187 -24915254 -26548134 -11627395 907325 -7123441 -29759956
7413 -29759956 -45738636 -45233055 -36712246 -29191857 -19864885 -3130681 16800873 28802011
7405 28802011 26710098 14219553 1014497 -2759908 7653145 25939144 37238279
7398 37238279 32119817 17395733 8073751 9433696 13224534 11703988 7397175 5292516
7390 5292516 2777929 -5438949 -16536260 -21886660 -19050572 -13902656 -10228989 -4816858
7382 -4816858 3952226 9215952 3586103 -8699142 -14066194 -5355466 8692261 12803539
7374 12803539 2919352 -8958920 -9319619 677477 8395493 7691115 5676074 8532227
7366 8532227 9398382 -1090352 -17909982 -26506144 -22476993 -14783951 -9292552 -1980232
7358 -1980232 8164806 12557387 6500595 -1688336 -4024791 -5895042 -14951631 -24595990
7350 -24595990 -21267170 -4092189 14596303 25680005 29075637 25764749 16259231 6331879
7342 6331879 2545145 2008618 -2108745 -5677054 1913949 17459545 24395601 18517048
7334 18517048 16725159 30822536 47767272 49449191 39819124 35515342 37530386 31172554
7326 31172554 11830015 -7576041 -17113887 -21477726 -25423184 -21933405 -4924678 15717854
7318 15717854 23629462 17010679 10432271 15774814 28769746 36488235 33075351 24036371
7310 24036371 16441903 9518721 -1658080 -14718906 -18559179 -7333506 8561869 12808096
7302 12808096 3608402 -4050168 1326014 12743958 15322671 6473246 -2214372 -1766307
7294 -1766307 3085563 1932353 -7264804 -16373933 -17470520 -10893137 -2350776 4670081
7286 4670081 10733452 15939483 17578962 14077653 8749932 6758944 9277795 13124983
7278 13124983 15554954 16917771 18892169 22449950 27222105 30523922 27891228 17953810
7270 17953810 6209700 -331283 -2370151 -6977444 -15789671 -20860706 -16182504 -7613872
7262 -7613872 -4891195 -7360178 -5447856 4609062 15303981 18512073 14786469 9150840
7254 9150840 3492158 -2621147 -8016707 -11762752 -15826268 -20838695 -21641341 -12883536
7246 -12883536 1853664 12226723 12530297 5682945 -4007276 -14916703 -22843041 -19800171
7238 -19800171 -4579883 10575011 11849652 362972 -10726711 -14557698 -17129303 -23652092
7230 -23652092 -27513787 -19422752 -2243988 11052099 12658606 6572480 48213 -5162757
7222 -5162757 -10529947 -14382200 -12361173 -3311267 8368599 16787127 19414983 17292839
7214 17292839 11867800 3915909 -3578528 -3962046 7399635 24771332 33523968 24727350
7206 24727350 7490796 1628993 15891753 37278916 45829879 37618418 27312641 27644441
7198 27644441 33554051 32009095 22417878 17643431 24334003 32106809 27614901 12152917
7190 12152917 -2124184 -8368205 -8906797 -6905237 -4436238 -6911929 -17899599 -29325144
7182 -29325144 -29233365 -21262345 -22265131 -35557793 -42403428 -30372737 -14958660 -17109111
7174 -17109111 -31237476 -35588081 -26594088 -19585782 -17931364 -7454174 13551549 24018023
7166 24018023 11935161 -4630311 -4769197 3975413 1116372 -12715189 -19570019 -14766184
7158 -14766184 -10458867 -10719088 -5977646 4821849 8225263 -189591 -5705304 902481
7150 902481 5600409 -6574099 -24209483 -23619272 -3957294 11362411 8254801 -1038395
7142 -1038395 323637 10084622 14537443 9865866 4324894 3770071 5760861 7124893
7134 7124893 8218666 8184365 3448156 -5834553 -13255562 -13762024 -9654878 -5160173 1002481
7125 1002481 12062704 24413204 29063903 22846254 13015106 8423190 9754688 11171064
7117 11171064 9065279 6031779 6797341 12216363 17677002 17446467 10834425 2738981
7109 2738981 -3306389 -10170050 -21434417 -32553642 -33587836 -21065395 -1392358 18199440
7101 18199440 35277894 47264907 49602526 43649625 38357634 37306347 31549982 14148696
7093 14148696 -5064824 -10958975 -4969651 -2154271 -8061716 -13041673 -11088598 -9077314
7085 -9077314 -11503035 -10321794 5164 8650134 2612278 -12155560 -17611254 -8722423
7077 -8722423 1496559 2257635 -2175094 -3601067 -3234262 -6855675 -13140999 -15147403
7069 -15147403 -11567929 -9544335 -14751453 -22785180 -23490570 -13096296 440957 5745192
7061 5745192 929211 -4179463 146254 11369969 16811275 7707500 -10979207 -25738067
7053 -25738067 -28393017 -23223515 -19666794 -19657867 -15919739 -4183776 7630882 8349773
7045 8349773 -239112 -4149029 3845291 13833456 12703758 2412392 -3494829 1344306
7037 1344306 9379938 11496196 8396136 6535443 7920269 8411021 4225987 -3294103
7029 -3294103 -9405906 -10904620 -8905178 -6749448 -5600798 -3744179 -1010467 -1514013
7021 -1514013 -9318852 -22365237 -33188919 -35325532 -27573669 -13596388 121631 7399847
7013 7399847 6922718 3512954 2451627 3342921 2183122 -1850992 -5300513 -5478476 -3030593
7004 -3030593 202840 2332362 791750 -5534648 -13478859 -18579936 -20775254 -23060349
6996 -23060349 -24833080 -21889569 -13845361 -5837756 -738428 4728595 12711050 18201351
6988 18201351 15357535 6831338 1768524 5697168 15869446 25215358 27787829 22080513
6980 22080513 12731676 7988915 11995731 20071491 24427371 23369809 21187923 19771750
6972 19771750 15267614 4496594 -9207350 -19240226 -22538735 -20557918 -15162838 -7086758
6964 -7086758 1302989 5104879 1403511 -6208824 -10105950 -6218601 2163368 8491784
6956 8491784 9516064 7522958 7650059 12996989 20076356 19454592 5559734 -12679753
6948 -12679753 -17321346 -2596221 15051931 16253005 3998296 -1613998 6875190 13882495
6940 13882495 5826529 -6235208 -1329285 20563600 36620833 30567132 11954752 1101667
6932 1101667 3162238 5504397 -1828735 -11781757 -10181852 4423448 17693771 17663252
6924 17663252 10018890 9759860 21064387 33288706 36623349 33098883 29493299 27569223
6916 27569223 26217710 26111345 25986040 20705508 10550337 6527902 16685652 31064882
6908 31064882 31618075 16250147 1772254 1306018 9391129 13680586 12120912 11734498
6900 11734498 16291923 22440561 25630184 24567860 20701407 16343957 12463424 7310386
6892 7310386 -476549 -7254480 -7592932 -3778440 -6020018 -18318155 -28994703 -22949244
6884 -22949244 -2206313 13626403 10388822 -2415350 -1867298 21129488 50260334 61860556
6876 61860556 50969897 34486020 29324181 33851080 33808763 21118340 1151001 -15579761
6868 -15579761 -22636692 -19892824 -12734287 -8904732 -10672466 -10444289 -126546 15526349
6860 15526349 22629872 16765348 9472338 11941310 19796169 20857332 12608847 3431845
6852 3431845 -1450330 -6502008 -16275323 -25309769 -22394836 -4005636 19435270 32160707
6844 32160707 27685547 13899429 3823954 3640341 10777821 19975547 27203622 29971698
6836 29971698 28684887 26642462 24688899 18383295 5971064 -4117560 -2087631 8646534
6828 8646534 15350342 13716215 10423104 7347992 -2736289 -19757534 -29469337 -21926400
6820 -21926400 -5870209 4954473 9657880 13594935 14073543 6671266 -1449230 330265
6812 330265 9000137 13390946 13121487 16879254 24094945 24864870 18380474 14544124 14508900
6803 14508900 6835035 -10811872 -22444336 -16102661 -2154363 2551499 -1482831 -1639741
6795 -1639741 4636258 6980505 -684026 -12102992 -18871044 -19829864 -18299500 -16389209
6787 -16389209 -14742836 -14061867 -14380194 -14100222 -10634051 -2104523 10281724 21115319
6779 21115319 24078725 17484942 5307149 -6976955 -15356971 -17378508 -13603260 -8978086
6771 -8978086 -8252839 -9722945 -8169992 -3971958 -3296705 -8191590 -12823624 -11877935 -7226968
6762 -7226968 -3949869 -4478151 -7943299 -10271086 -5135282 8179821 18619860 14994100
6754 14994100 4068883 3989699 16466487 21139087 6004767 -12051175 -10894971 5047366
6746 5047366 13589182 6592170 -5936549 -17926886 -31951393 -42117950 -34427950 -10901828
6738 -10901828 5132032 -1481627 -16746073 -17801053 -3486598 8572635 8272247 2130610
6730 2130610 -1568364 -3568490 -7526746 -12999124 -18751174 -26480892 -36273212 -42187382
6722 -42187382 -37561932 -23687624 -9118313 97140 6254402 14589021 24814111 31190736
6714 31190736 29980565 23372368 15640898 8390869 744347 -7684310 -14670080 -15243348
6706 -15243348 -5498755 10524925 20778130 18196680 11831829 16479777 31471629 40223348
6698 40223348 32752772 16609742 1173937 -14599647 -29637739 -30463067 -9179428 17564895
6690 17564895 25238018 12487245 -878423 -3525320 -2572720 -4854456 -6851899 -6631465
6682 -6631465 -9089716 -13750796 -11912778 -2396555 2902951 -3761705 -14705952 -19595594
6674 -19595594 -18780268 -17110061 -14879016 -12121045 -12415597 -15666424 -16222787 -13714008 -14990841
6665 -14990841 -19406713 -15140556 1168629 14283419 11394249 1703280 2004814 12998706
6657 12998706 24230453 33327727 43867473 50764306 45499044 33083197 27492130 30917409
6649 30917409 32217112 26068612 19512735 17600673 15096018 6003354 -7564650 -18219681
6641 -18219681 -18755021 -6495163 10526278 16038007 4302353 -8300701 -3249085 12873724
6633 12873724 17217406 4898747 -4516381 1976258 11812161 7463737 -8088320 -17182023
6625 -17182023 -10184488 6087977 16944474 11932553 -5765031 -19588385 -16139920 -1800555
6617 -1800555 6499967 6178267 10830785 25565046 36976066 33784332 21883929 10696002
6609 10696002 -199636 -10749124 -12284318 -3256927 596558 -11933606 -26499261 -21712575
6601 -21712575 -474169 15789715 18328265 16721343 16117716 9831749 -2684652 -9297774
6593 -9297774 -3370689 5846092 8258267 6570703 7301826 8414057 5138550 1107889
6585 1107889 3840417 11862969 14315784 3882997 -14292116 -27699119 -28682166 -20738574
6577 -20738574 -12937118 -9653590 -8518037 -7772155 -9784393 -14533802 -15574377 -7870950
6569 -7870950 4438454 13139482 14646141 9062724 -3234228 -17230312 -21832865 -11799955
6561 -11799955 3930500 14756697 22799179 33332545 37929514 23739445 -3192846
6554 -3192846 -21766242 -24064191 -22620531 -26634946 -28918563 -22876249 -15249297 -12268717
6546 -12268717 -8100869 1526679 7430989 1717047 -6845959 -6588088 -3085324 -9925917
6538 -9925917 -25270842 -33422240 -27213074 -14719932 -4655003 2068884 6121278 7113193
6530 7113193 8644726 15713265 25297022 28483458 23422968 17501491 15071485 11812198
6522 11812198 3974629 -4660787 -8518979 -6660434 -696562 7755463 14743107 14820710
6514 14820710 7615347 -862442 -6149296 -10221389 -15694402 -19409870 -15897671 -5473521
6506 -5473521 4123311 4433177 -5284674 -15745089 -15561562 -3353583 10457937 16284116
6498 16284116 15708726 14898012 12925381 4860233 -6492953 -11910450 -8854572 -4104719
6490 -4104719 -2300586 -1014375 871741 -375269 -4581663 -4373201 3899660 13560337
6482 13560337 17926791 20392300 27277305 36152396 38931170 33291406 24488568 18310201
6474 18310201 17614059 22936220 30829770 33900865 28019463 17993344 11711510 10819047
6466 10819047 11542164 11870329 12229767 10871387 4940468 -3411448 -6738306 136267 13873037
6457 13873037 24264060 22553143 10676745 1886296 7230607 20704486 24647032 12160273
6449 12160273 -4304438 -11172136 -10682877 -11656391 -13196741 -9865055 -5730110 -8123479
6441 -8123479 -11360147 -3347691 11982788 16230259 4120222 -7135814 -3469551 6025728
6433 6025728 5657133 -2157576 -2490123 8667044 20132676 22071847 15571788 6422812
6425 6422812 -1400717 -5648927 -6480368 -7895014 -13025069 -18296834 -17391112 -10178940 -2373985
6416 -2373985 2905883 7573140 12928866 17461354 20889335 24907835 28441277 27063645
6408 27063645 19676649 12247919 11659913 16862205 18320315 7421587 -12631928 -26038440
6400 -26038440 -18116617 8164655 32661217 38307912 28183527 18775401 19469359 24398237
6392 24398237 23209621 13606674 1976859 -4260015 -3394329 -523461 -1758299 -6033709
6384 -6033709 -5265382 4597239 16447347 20776707 17827080 14270427 11055009 3906958
6376 3906958 -4883304 -5830199 3795230 14486981 17438017 15490426 16219126 20834936
6368 20834936 26028732 31531022 38999110 46343394 48930764 44952300 36251614 26473472
6360 26473472 20922119 23693346 31061213 32477177 23001765 10304410 4361197 5587777
6352 5587777 9581229 17369466 30956870 42672141 41174256 28061558 17080956 14652027
6344 14652027 12079550 1536203 -10322418 -12080954 -3947848 3591100 3403459 -3025514
6336 -3025514 -10830216 -15177309 -11128660 2756010 19811085 29193699 26011655 15333405
6328 15333405 6578600 6205011 14042556 22797385 22385220 9826787 -4856993 -7509355
6320 -7509355 3967891 16535285 17074440 6468380 -4094837 -6911173 -3394293 1663429
6312 1663429 5921626 9141134 11086617 11377857 9421019 4161873 -3745014 -9647217
6304 -9647217 -8387726 -1158998 4841288 5520202 4799246 7541069 11783061 12780799 11219987
6295 11219987 10916373 10805434 7483252 5016189 12021152 26226923 32431713 22384775
6287 22384775 7756143 4108095 9217617 9293546 2088837 -898561 4665025 8006909
6279 8006909 1451562 -6267507 -3724282 5332146 8073706 1005213 -7515739 -9947365
6271 -9947365 -6044043 1031066 6874194 5910671 -2481629 -9100312 -4531786 7103238
6263 7103238 13010810 10149990 8170416 11924238 12891337 4159841 -6389419 -7197668
6255 -7197668 -129840 4089233 3116839 4327781 9970170 11753761 2695254 -13216469
6247 -13216469 -25958605 -28773713 -21363834 -9758348 -4484712 -12393202 -27298060 -33972469
6239 -33972469 -24404806 -5643080 10228419 17823645 17719165 11794401 4777464 3619296
6231 3619296 8037877 7078875 -6714525 -24219652 -30179024 -23295160 -15203989 -11535808
6223 -11535808 -6823543 768794 3667507 -654022 -1887454 7501934 18441418 17662720
6215 17662720 6983021 -1486314 -4638805 -9810543 -18410592 -21715281 -15772039 -8716092
6207 -8716092 -7642436 -7734717 -2168050 4268577 1372295 -9448149 -14337723 -5082960
6199 -5082960 9195837 12932897 2927784 -9032526 -11768597 -7653991 -6971319 -12598913
6191 -12598913 -15945367 -8675743 6785533 21321225 29268595 30144614 24174871 12890213
6183 12890213 2705346 401186 3978173 4581372 -660118 -4583289 -1951062 2000433
6175 2000433 1156629 237444 7164628 16465737 12215833 -9060736 -28216007 -24180801
6167 -24180801 102153 21361057 24194657 16123652 12114407 13715567 11754683 4161933
6159 4161933 -475953 2345115 5442029 1775580 -4584960 -6543280 -6673301 -12219737
6151 -12219737 -20272419 -18468112 -2145036 17290059 24858036 18092148 7670475 5357857
6143 5357857 13698151 25597468 32631037 33992307 35277726 37319629 31886476 14120690
6135 14120690 -6342051 -16202739 -16786306 -19535960 -25115696 -22302644 -10098760 -3977160
6127 -3977160 -11906886 -19550130 -12062427 1782782 3294106 -6913144 -11797651 -6381645
6119 -6381645 -4265008 -13492470 -22886501 -19456922 -7146569 519208 -1211685 -5523785
6111 -5523785 -5264526 -21744 6564718 11864595 15882849 18750409 17365936 7777822
6103 7777822 -6617551 -13880955 -6868927 5227641 6825076 -3658683 -12294446 -9363468
6095 -9363468 -1183394 1644498 125229 4611589 19695785 36167307 38614300 21223864
6087 21223864 -3577364 -15816652 -10357492 -3294805 -10014457 -23558876 -25706306 -14480811
6079 -14480811 -5381684 -5969625 -6179976 1926651 10882143 12156839 9987319 11043635
6071 11043635 12014238 8570243 6824933 13725944 23553173 25883302 21040934 16637762
6063 16637762 14868632 14857732 21543472 38564872 56063410 59591773 49708540 39601888
6055 39601888 34010123 24386692 6813580 -8499933 -10462712 -213493 13393742 23369035
6047 23369035 25681790 18239807 4052026 -8583740 -12370516 -5771179 7405126 19301333
6039 19301333 21540654 13790417 6844581 10448192 20576174 26454410 26608206 27696005
6031 27696005 30378578 28852297 23081881 17869024 10414981 -5053827 -18987806 -12359019
6023 -12359019 12515554 26734019 12739013 -9760798 -12061652 3933581 14857228
6016 14857228 14391030 18174286 32528474 42369810 35807560 21458635 12093098 6077740
6008 6077740 -3437744 -11849930 -9003273 3797563 15161916 20267553 24954244 31910967
6000 31910967 33173028 22135330 6217994 -760798 3634273 9041827 9257587 10787738
5992 10787738 19329807 27190428 24868245 19021478 24055969 36806402 36577155 15822202
5984 15822202 -5190166 -5197386 9383617 16789008 11251756 4677233 2118799 -5083717
5976 -5083717 -20351943 -33374338 -36163256 -33954155 -33337666 -31452280 -25374679 -22055451
5968 -22055451 -28258860 -37335726 -37067220 -27172388 -18703447 -17193251 -16004355 -8009626
5960 -8009626 3554441 9086684 3199828 -10665015 -22522721 -21430859 -3622621 21219386
5952 21219386 34973888 27410176 7163413 -7466203 -8504160 -4397956 -5362662 -9628013
5944 -9628013 -9756913 -7009191 -9676893 -18303109 -23012640 -17920921 -8592968 -1216401
5936 -1216401 5600193 11988308 10467657 -1318228 -10407048 -4319162 8988044 11615180
5928 11615180 2176687 -4561132 -2815774 -2030775 -5573162 -2564082 11423738 22886287
5920 22886287 20446167 11387162 5601268 -2657550 -20667954 -36508793 -32372357 -12483553
5912 -12483553 2152970 4247688 5539098 11271715 10513854 -1622989 -10624079 -2534228
5904 -2534228 15951964 29015672 33153250 35045045 36062965 32454442 26755278 25745485
5896 25745485 27789430 24081494 14241999 10188093 19931267 35083426 40292091 30586187
5888 30586187 13732325 -1849275 -14995442 -26879546 -33531347 -27981695 -9767115
5881 -9767115 11016567 21556929 17637715 5705931 -5239904 -11232814 -13389194 -14428927
5873 -14428927 -16879984 -21596995 -25577283 -23888680 -16746739 -11984234 -15954779 -23463417
5865 -23463417 -22495583 -9846316 3436592 5237210 -3082088 -9631918 -7085556 362084
5857 362084 4988001 5450326 6246763 10296012 15625294 19034567 20214153 20816689 20569242
5848 20569242 16511366 7469968 -1678484 -3059914 5534760 17350089 24364978 25899631
5840 25899631 25576716 21999352 9819292 -8522839 -20152860 -16568935 -5778096 -2475803
5832 -2475803 -9239863 -15414758 -13634037 -9024832 -9974827 -16186175 -19224936 -11613607
5824 -11613607 5807086 22545844 25632614 13399219 727729 3022347 15588087
5817 15588087 19099480 7320785 -2922021 4243238 21198475 28735050 22223048 13389139
5809 13389139 10471333 9508301 5039214 -1030275 -2907687 3386459 17412504 31646174
5801 31646174 34331526 22806020 11013144 14288312 28902865 37379507 32625711 24350879
5793 24350879 20938817 18532982 12195047 5757503 4346335 6539917 9693229 14541401
5785 14541401 19388186 18556437 12174343 8645953 11353815 12025775 4573535 -3100835
5777 -3100835 468775 14995883 30939420 40160435 37412499 20625084 -1002958 -8419847
5769 -8419847 6027132 25947603 31257247 23871659 19810319 22840478 22737493 16205410
5761 16205410 11757692 13123361 13620890 9641208 6059368 5355225 3822831 1375596
5753 1375596 3298267 9863432 15856258 21673672 31394321 38302383 28808979 5650929
5745 5650929 -9804463 -6532176 987549 -3025143 -12040705 -11813538 -4995465 -3816641
5737 -3816641 -7438136 -4995700 3618302 7553220 4186153 2983450 9295863 17220122
5729 17220122 20199599 17867505 11095905 335097 -9676123 -12719705 -9959244 -7761261
5721 -7761261 -6415831 -227396 10300559 16224484 12779905 5739049 2142322 2303768
5713 2303768 4194084 8592117 15764953 22191348 23982651 20255649 12466033 4620069
5705 4620069 3306344 11525679 23225038 30545819 34714122 40844832 43712706 31455359
5697 31455359 5699424 -15006086 -17594140 -9318556 -3659569 -2215506 628841 4463168
5689 4463168 5150315 3931174 3685999 836577 -8919231 -20456175 -24650038 -21314253
5681 -21314253 -17470218 -15157729 -10642323 -4300179 -1407339 -2963250 -4527595 -4592233
5673 -4592233 -5824629 -7717580 -6766061 -4845730 -8072152 -14946420 -14853606 -2620119 13081936
5664 13081936 20556503 17896581 10844579 4783645 4096737 12563306 26885457 34561063
5656 34561063 26379353 8791750 -3107190 -3081011 2633090 7570809 12494673 19336755
5648 19336755 25299044 26912853 25277454 23391859 21335352 17476555 12225184 7489806
5640 7489806 3988020 1671816 1184094 2137749 1516900 -2766713 -7416757 -6401318 1656415
5631 1656415 11545450 16985896 15280187 7154525 -3460140 -9165322 -4688097 4626518
5623 4626518 6071223 -4164781 -14323245 -13645392 -9226258 -14885179 -26626990 -24655596
5615 -24655596 -3112808 17248630 15494736 -1692639 -11467940 -7042657 -3396515 -12047973
5607 -12047973 -24504767 -25415425 -12589835 2275490 7821537 3120365 -3946774 -5188396
5599 -5188396 717540 9599406 20176535 36168449 55887476 65790702 54049602 28348606
5591 28348606 9620290 7771948 13959870 17818430 19870366 22590040 21816552 15287963
5583 15287963 9750093 10186271 10225670 3177304 -5155745 -6248908 -4652798 -9991411 -17268310
5574 -17268310 -11057497 10310899 29793152 34403955 29694522 26119566 23368710 16774236
5566 16774236 9757271 9302639 14045151 16122930 12295004 5789670 -911484 -8230670
5558 -8230670 -15259566 -19217384 -19325798 -17275650 -14243840 -10553576 -7054508 -3771671
5550 -3771671 1015248 7053585 9858616 6365872 667677 -814277 1800605 3261173
5542 3261173 2177977 2080970 3336202 1076993 -6344541 -12778913 -11953194 -5518077 368759
5533 368759 3020646 3598685 2239543 -2047008 -7062882 -7395291 -258668 10469401 17247553
5524 17247553 15795603 9194963 4756974 5654188 6470616 -48124 -12080399 -19284324
5516 -19284324 -16111890 -9492795 -9344622 -16054008 -22924839 -26843872 -28696297 -25982722
5508 -25982722 -15359711 -3137265 -2171465 -13810365 -22755956 -17159502 -5692503 -5018238
5500 -5018238 -16217594 -25321732 -24473303 -19826690 -17485239 -13975775 -5419848 3923210
5492 3923210 9048728 12622370 18719295 24140158 23989831 21433105 23037759 26927319
5484 26927319 24855504 15842844 8727444 8966705 10721874 6351935 -1782764 -4260725
5476 -4260725 3409962 16016048 24437450 23037668 12599405 -459271 -7455717 -2958042
5468 -2958042 10832966 25259837 31880398 28809277 20477748 11346209 1834818 -7612284
5460 -7612284 -11133859 -2249962 14899119 25832785 21668058 9644265 2405424 2012911
5452 2012911 2137787 1546912 4877904 11608314 15556659 16122374 18552114 20718006 12424939
5443 12424939 -6389970 -19209187 -13873643 291098 7027033 5557259 5308688 6053795
5435 6053795 54489 -9435253 -9822379 -610418 3796163 -2925802 -9562588 -8384603
5427 -8384603 -9563882 -21791269 -31211599 -17445082 14692355 37097085 32837933 14180356
5419 14180356 2439869 2641276 5782140 6776959 8951647 13760238 16583782 15028450
5411 15028450 14073975 17967644 21227763 14749482 609045 -6766685 1674024 16508713
5403 16508713 21547708 15187041 10748571 16046545 23752171 25940482 27202493 34584451
5395 34584451 42528070 39675771 27380487 19710211 24677224 35269621 40713579 37716763
5387 37716763 28001225 13575175 -624596 -6422818 -1158536 7023183 7616539 -1136528
5379 -1136528 -12809957 -20720586 -21520892 -14957609 -5446902 -1487109 -7830823 -18549724
5371 -18549724 -22043667 -13256491 1624794 12246576 13776189 10247359 9873860 16106479
5363 16106479 22875645 21411057 12436171 6707118 10593352 16656902 14129801 4234294
5355 4234294 -2588351 -2060990 454954 1879500 7003087 18166682 26989469 23022297
5347 23022297 7208321 -8789553 -15076934 -11241596 -3065826 4011959 7832484 9248944
5339 9248944 10623148 13722716 18219285 21831550 21532897 15434173 5413702 -2062177
5331 -2062177 -471616 9487574 18584346 17463377 6795707 -2258315 1031943 15320927
5323 15320927 27567450 26501557 14821575 5238962 5151443 10517871 16067531 23578384
5315 23578384 33853714 37819617 26942160 9513657 3343461 10844140 14669888 3349728
5307 3349728 -11238475 -11099797 2919783 14731421 15048729 8018378 82261 -5597941
5299 -5597941 -5695591 245585 3746384 -3891279 -16165154 -16837711 -2937298 10582183
5291 10582183 13541365 14255568 22276838 30047961 24743153 10166794 2070419 5291772
5283 5291772 9870883 9213368 7772954 7786568 1895096 -13887768 -29923045 -34633214
5275 -34633214 -29714270 -24375908 -19325549 -7661581 9328358 18975243 14256530 5898696
5267 5898696 10404018 29461347 47611962 49518002 34464650 13420070 -3591157 -14740982
5259 -14740982 -23483714 -31298658 -34001458 -25610885 -6416366 14244895 25707480 25879672
5251 25879672 20569304 13775818 3778077 -9618945 -19755404 -20016095 -12982996 -7430343
5243 -7430343 -7616283 -10366651 -11904527 -12543838 -14318811 -18071457 -23090993 -26048499 -21256628
5234 -21256628 -7116545 8148423 13568312 9162075 5876252 9829865 14128010 10518719
5226 10518719 2060774 -2165593 425740 5635726 10167161 11872066 6238829 -7856870
5218 -7856870 -20702585 -20456680 -10142767 -5818812 -14783394 -25377946 -24092066 -14234804
5210 -14234804 -9170983 -12724861 -16327808 -13634262 -8215748 -5442823 -4892690 -4444750
5202 -4444750 -6033208 -12331284 -20565262 -23943946 -18508967 -6603933 4770897 7534172
5194 7534172 -2099414 -17946361 -26082647 -18202355 -2377275 4721019 -3092217 -15457120
5186 -15457120 -19640594 -14401383 -6446488 254174 5176578 6142588 2051519 -1169541
5178 -1169541 4049922 15376314 22414075 21208620 18523767 18967469 16798291 6491455
5170 6491455 -5582063 -8248037 -994498 5207181 1968184 -6998673 -10894206 -3602802
5162 -3602802 9378830 15241656 7501802 -4902879 -7298806 1660737 8690675 5955888
5154 5955888 1754077 4787546 9330572 7499300 6481553 17553126 33475615 34987352
5146 34987352 19280045 4621328 4136928 11527295 17330525 22547753 28124743 26550778
5138 26550778 15436874 6879382 10274522 15766298 8781038 -6598427 -13721577 -8057943
5130 -8057943 -653300 1454993 3770517 11462823 19855764 21757275 16570723 9311131
5122 9311131 5796571 8861852 13824855 9663282 -7718291 -25414144 -26470093 -12617287
5114 -12617287 -3268588 -9791091 -21559526 -22196953 -10131042 3660271 10951474 11441982
5106 11441982 7345128 892546 -4133635 -4409201 -903330 2444799 3293205 1897815
5098 1897815 -1013356 -4569757 -6550886 -4364179 1922844 8148911 8667404 1939747
5090 1939747 -6125109 -6891514 1186957 9919043 10866827 4910585 15499 3030478 16161339
5081 16161339 35492975 48039065 38172602 6869365 -21405005 -23670963 -6746956
5074 -6746956 3363572 -2386061 -8307826 -3212568 3565819 3149978 4093239 14560020
5066 14560020 23921224 19726095 10928028 14534749 27091780 30148331 20085636 11618257
5058 11618257 12129366 13464023 12502260 19139928 35368775 44195483 31776033 7991644
5050 7991644 -7622197 -10964349 -11912582 -15351517 -17243119 -15844295 -14332974 -13395361
5042 -13395361 -11820168 -14091917 -26799563 -45412002 -53821782 -41701430 -16921714 3046942
5034 3046942 8200658 1590005 -8151013 -15293591 -18977480 -20286178 -19258651 -15173139
5026 -15173139 -9216724 -4801278 -3849811 -4710396 -5892854 -9399064 -16409899 -21682360
5018 -21682360 -18461167 -9501175 -6418835 -14693059 -25152122 -25866291 -17900623 -11537327
5010 -11537327 -9334872 -3025278 10794532 21741862 18844335 5946075 -4104537 -6245657
5002 -6245657 -5170198 -3552723 243721 2171644 -7028551 -25388736 -34203552 -18884654
4994 -18884654 10443339 29306631 27106402 15587843 10208027 12673975 14088248 8050757
4986 8050757 -2982150 -10395894 -6691646 6550851 17614666 15557385 2392560 -9577922
4978 -9577922 -11888345 -6419359 964157 6103594 5358887 -3351747 -15373358 -21473362
4970 -21473362 -18393429 -12257003 -9703309 -11674503 -17314971 -25751056 -31051072 -25047161
4962 -25047161 -10617431 -2308534 -5874963 -7221387 6775785 25155253 26583380 12137496
4954 12137496 6095745 21539512 42037918 45379827 32248406 20028531 16774875 14445473
4946 14445473 5215568 -7035240 -13184577 -9458369 566135 9725069 11697902 5978534
4938 5978534 -237351 669454 5885844 3509900 -11365261 -26352471 -24759501 -7798413
4930 -7798413 4876350 22811 -12103290 -12958851 -1537560 6794038 4987013 3062193
4922 3062193 8169722 10609024 424773 -13124416 -13786962 -4110125 -1911855 -11533251
4914 -11533251 -16335229 -5552546 6917640 1853934 -17161835 -28180111 -19120175 498985
4906 498985 15200085 20040801 18999404 15492810 9979311 3054506 -3907980 -10368028
4898 -10368028 -16343824 -20945072 -22684904 -20953851 -16134152 -8551518 1347411 11252759
4890 11252759 16735123 14693944 7220863 128078 -3117927 -4071627 -5133471 -5681477
4882 -5681477 -4436215 -2358856 384846 7297547 20310620 33609274 38404198 33041398
4874 33041398 22998312 12155101 810298 -8382473 -10854915 -7798379 -5367658 -4391210
4866 -4391210 364967 7920831 8423397 -1471690 -10468822 -8253223 -728107 526654
4858 526654 -3242544 -2400472 3022922 3800512 -1394818 -3548434 300677 1716752 -3361174
4849 -3361174 -5560822 3563114 17270380 22847708 18934681 14109657 11722299 6148419
4841 6148419 -5689689 -17644649 -22332388 -20246896 -16894300 -14242771 -9798371 -3190047
4833 -3190047 1318213 677369 -2304016 -3456455 -3613689 -5727129 -7393905 -2915243 6605515
4824 6605515 12314704 9241463 1974227 -4564883 -11825539 -19471067 -19549557 -8583484
4816 -8583484 1499296 -3024279 -17009520 -22665170 -14955537 -6962607 -8916229 -15841164
4808 -15841164 -19730331 -20736837 -20208986 -14469958 -3617530 2854315 -2257542 -13408697
4800 -13408697 -20290770 -19308668 -11271688 3559170 20212233 27164771 19398444 6894146
4792 6894146 1124998 -217048 -5366790 -12563514 -14040819 -10838004 -11085499 -16684458
4784 -16684458 -23122016 -28860027 -32788021 -26652041 -4946918 19929303 28735030 21654160
4776 21654160 16701991 20374405 18849446 4061516 -10867283 -12938104 -8917845 -9490314
4768 -9490314 -8239907 5758296 24319107 28664852 16825101 3986274 -2667739 -10838419
4760 -10838419 -23219975 -29312135 -23885067 -18092922 -22004715 -27609468 -20979816 -3577030
4752 -3577030 10673162 14758463 12946404 8266289 -1492989 -13919514 -20117095 -17584104
4744 -17584104 -15184569 -18468472 -18674350 -6428936 9496098 10516937 -4840966 -15416980
4736 -15416980 -3662674 22720038 42316363 44922230 36037671 22892768 7826927
4729 7826927 -5843402 -12249815 -9665115 -2126665 6430794 13587448 15009296 8310100
4721 8310100 907832 4062487 16071250 21295322 11062132 -3816173 -8512600 -3633802
4713 -3633802 196012 216153 1817277 4181307 -979282 -14237344 -23008118 -16987590
4705 -16987590 -2433927 5098015 -842944 -11568497 -14619556 -7114589 3215439 7833064
4697 7833064 5561827 835210 -3095089 -6139957 -8342985 -9512901 -11588958 -15973748
4689 -15973748 -17874984 -10049493 5230494 15323336 13400559 8757753 13834656 26402075
4681 26402075 33567013 30198010 23675069 21055044 20633918 17702039 11471216 4249261
4673 4249261 -979326 -1123072 3881770 8000798 4180597 -6940876 -17570375 -21123047
4665 -21123047 -15347951 203671 21753501 37185583 34203563 15569418 -1222740
4658 -1222740 -2764648 7668922 18312169 22575367 21126304 16882754 12770294 10654753
4650 10654753 9494376 7684734 7668641 13013633 20728113 23321056 19314112 14242200
4642 14242200 10759090 7140259 6484896 15023349 27512043 28147936 13472624 789062
4634 789062 3230816 9643984 3764745 -8039832 -7199747 5609863 10735594 708942
4626 708942 -9179094 -5953263 2924699 4373188 -1398226 -6592203 -10092817 -15369899
4618 -15369899 -20384065 -19367622 -12028417 -3969127 880045 3798083 7899256 13115670
4610 13115670 13871887 3487902 -15432289 -28321379 -24207742 -11912253 -9887381 -19846149
4602 -19846149 -24127149 -13200246 -660152 -1527632 -9393846 -9358684 -3390968 -4922146
4594 -4922146 -13496545 -14637416 -5707465 -2417523 -12716261 -21101580 -11365638 6877805
4586 6877805 10456401 -3592093 -13201802 -2244103 18039059 26462403 21103549 19239958
4578 19239958 31036630 45572973 46836234 34645915 22183285 17597226 17087564 15321515
4570 15321515 13523714 14064396 14125614 10369172 5744738 5367814 7156395 2714377 -11096111
4561 -11096111 -25638587 -28579705 -17393646 -2390420 4507773 2340862 -235454 1373240
4553 1373240 534194 -9895750 -23747948 -26431422 -13807112 1591216 5977514 -464556
4545 -464556 -7418537 -7632802 -1652508 5562096 7345634 -1304300 -17389224 -29806645
4537 -29806645 -30442446 -22407155 -13105669 -4102501 5559138 10750949 4815405 -7967799
4529 -7967799 -13364205 -2951836 16145605 28323251 23026264 2921291 -16948810 -20610980
4521 -20610980 -7242994 6817580 7663709 680006 -304898 5132206 5982040 483432
4513 483432 -1234363 3648949 5535598 1366875 1923877 11297426 14717191 76982
4505 76982 -20518796 -25925093 -14100517 209016 8906244 14729426 16304246 7626549
4497 7626549 -6780494 -12930839 -7221821 -1151489 -2325266 -4733435 -3577050 -5722073
4489 -5722073 -16107556 -25253110 -22244471 -12902487 -12879523 -26084801 -40553748 -44701683
4481 -44701683 -38969181 -30944402 -25654569 -22001816 -15031106 -1981915 11409799 13661921
4473 13661921 1042487 -14987973 -20122099 -14583724 -10449292 -12611675 -12028663 -922523
4465 -922523 13950499 19839562 14651153 7426061 4305275 1997812 -3532269 -8976769
4457 -8976769 -8867005 -4603057 -2291034 -2939673 -1112668 5528735 11361955 10984845 7419180
4448 7419180 6988113 9530132 10226087 9180268 11352163 16403619 16446939 7023010 -5800196
4439 -5800196 -13082963 -12771447 -8047950 -947271 7417542 13928048 15842656 13967540
4431 13967540 10178859 5037821 844607 2004229 7684426 9573580 3361225 -2822616
4423 -2822616 411843 8828920 11090635 6822854 5834584 10090735 10349777 3872385 1781636
4414 1781636 11351746 21861183 18090463 1157857 -13640432 -15567599 -6918219 3713911
4406 3713911 9022492 6606193 1822668 4148606 14156690 18087584 3952428 -19949146
4398 -19949146 -32887801 -27426277 -16424959 -12367979 -10672051 265966 20250616 36805469
4390 36805469 40315465 32896806 23167281 17620443 17888860 22529419 28783755 33206200
4382 33206200 32808743 27676566 22264749 21190006 22519556 19038662 9373254 3632707
4374 3632707 11726523 28216309 36354635 27522241 9596356 -5198781 -13149442 -16684052
4366 -16684052 -16557259 -12229082 -5734363 43745 4034480 4128131 -4203756 -20961166
4358 -20961166 -36061342 -37037535 -22503071 -4245731 4225954 -558043 -10107424 -11741769
4350 -11741769 -246604 16446477 25617858 24421855 21223517 20937350 17489193 6858671
4342 6858671 -891986 6135858 21634759 25956083 10924853 -11677687 -27852937 -35697647
4334 -35697647 -37799128 -31167001 -13707466 6521422 18286982 20520204 21393395 26088664
4326 26088664 31718583 33153226 28591898 20057758 12365310 10324179 13292203 14181750
4318 14181750 7478846 -3808936 -12703445 -16580247 -16323084 -11127449 -1471269 5160001
4310 5160001 676294 -11045722 -16962509 -12603391 -8183159 -12405572 -18464140 -13833312
4302 -13833312 1584556 16034727 21839314 21715309 19794380 15630935 9560277 5985593
4294 5985593 6629690 6413723 1586851 -2667741 490195 7594782 8216522 184700 -6480451
4285 -6480451 -3476144 4801208 8896541 7576819 6979182 9653525 12077829 12644911 14348300
4276 14348300 17120155 14446760 3008121 -8654411 -8277836 3724608 12432433 5778544
4268 5778544 -10292462 -18494179 -10916958 1795567 4139800 -5083308 -12593658 -9322807
4260 -9322807 -2729128 -5931769 -18612193 -25980259 -17078845 1913207 14983113 12758998
4252 12758998 -448134 -12178145 -11941427 376490 13214600 13922177 3606854 -2988013
4244 -2988013 3293932 12221227 7434155 -9535091 -18911259 -8022442 12384561 22252257
4236 22252257 15705649 3541391 -3265299 -3937157 -2270168 1238083 7910002 15962442
4228 15962442 21584505 23483811 22741529 18645792 8756155 -5211333 -15078526 -13944928
4220 -13944928 -5304674 135669 -2122219 -4426265 2600137 17004129 27115805 24486422
4212 24486422 11000559 -5608900 -18210833 -22376726 -18052243 -11601835 -11589428 -18997803
4204 -18997803 -24710553 -20122071 -7589844 3526067 8868517 11800964 14597699 13119519
4196 13119519 3549503 -9270768 -15212412 -10496519 -2315777 -379078 -6288760 -13603830
4188 -13603830 -16881650 -17309260 -19128603 -23609264 -28160617 -29329462 -25053549 -15846078
4180 -15846078 -5579347 648102 1275556 -906259 -4156022 -10455379 -19434006 -23750612
4172 -23750612 -17201086 -5750214 -2457515 -10029683 -16066286 -9735075 2876010 6125129
4164 6125129 -5578650 -21512307 -27189370 -18340745 -2018864 12107290 19536238 22240311
4156 22240311 25016191 31087960 39778097 46605123 45954199 36522700 25305502 22724326
4148 22724326 30879660 39884513 39832403 32736175 26805934 22920003 16062353 8288334
4140 8288334 8188323 15062815 15700562 3233453 -10774280 -11438150 -99123 10267221
4132 10267221 12965627 10933230 6559082 -1127404 -10421408 -17040881 -20126493 -21579824
4124 -21579824 -20858886 -16843293 -12566934 -10998082 -8563240 -522803 9883382 16244302
4116 16244302 20095979 26862777 32495467 26392399 8691204 -7217564 -12355421 -11455294
4108 -11455294 -11082995 -9699590 -5301133 -2830366 -6207387 -10379391 -8919199 -3952785
4100 -3952785 -1756951 -3278296 -5272993 -6721816 -8464668 -10162299 -12405660 -17774285
4092 -17774285 -25151598 -27415589 -20034001 -8222811 -510772 1477160 2021652 3118787
4084 3118787 2144962 -3565023 -12229116 -16412446 -7601677 12634811 27605325 21242843
4076 21242843 49047 -12259827 -5721414 3540424 -881208 -11990618 -14262934 -9970617
4068 -9970617 -12908274 -22423197 -22924676 -8949090 6148326 10037188 6770823 7319690
4060 7319690 14446393 22274154 24869610 21575022 16968839 15743470 15247169 7168880
4052 7168880 -8734582 -19343128 -15116631 -5461376 -5183632 -11320626 -8742681 4029764
4044 4029764 11920714 7419818 921641 2816541 10345637 17989953 26999896 37190794
4036 37190794 41083172 34165712 21845999 10376807 295147 -6564107 -4926534 3135943
4028 3135943 6768131 2275962 -1101636 1822989 2484870 -5263618 -12706839 -11492327
4020 -11492327 -8737849 -13143636 -17116804 -8794740 6412715 13075964 8817172 3758752
4012 3758752 1315558 -3464830 -8487316 -4633589 7693161 16831509 16825750 13358511 11026680
4003 11026680 7416397 2480168 1492799 4474609 3264380 -6046774 -16206813 -18378335
3995 -18378335 -11540543 322009 13250115 23158943 27365784 28120676 28776611 26765029
3987 26765029 17820704 6335083 2208497 7296485 14638500 20929944 28163309 32192104
3979 32192104 23983023 6976661 -666183 10538576 26919834 30193075 21487653 16148145
3971 16148145 20929695 27652965 26913607 18690100 9549022 5558165 7971169 12383147
3963 12383147 13313418 11399848 12615599 18307492 21035616 14068281 752955 -9519212
3955 -9519212 -11222972 -5562227 2554928 7317790 5690427 996829 -971070 -850255
3947 -850255 -5203912 -15260103 -22878307 -21071285 -12270458 -2682050 5111490 10239556
3939 10239556 10893137 7513838 2368261 -6416791 -21646081 -35126724 -31210091 -9176172
3931 -9176172 10151458 10264136 107411 -3269843 -2200487 -10774747 -25955415 -26897905
3923 -26897905 -4997547 22035483 31867609 22086556 7720909 2378141 6652709 10578312
3915 10578312 5524273 -3602962 -978240 19768899 42922643 48147381 36477486 26365005
3907 26365005 26196846 26015010 17766831 7197918 -415342 -11008153 -27821730 -38705924
3899 -38705924 -30726500 -10872690 910666 -3088164 -11433933 -11651889 -4780862 1403226
3891 1403226 5522224 12120907 21039313 24633366 18052775 7466820 2565130 3014856
3883 3014856 35182 -7902536 -10854619 -4141580 719749 -7724958 -20765086 -19292847
3875 -19292847 -755235 17717856 23153855 19715203 15424762 10028284 2109552 -3555335
3867 -3555335 -3869904 -4135621 -9311223 -15255063 -15429372 -10552437 -5429792 -1114349 4482925
3858 4482925 12254687 21469883 28969198 27698538 13942036 -2213376 -4084981 9744683
3850 9744683 21762331 19591812 12013703 12659761 19492795 22070172 19493208 17668974
3842 17668974 15774221 9327840 2013342 1248099 5429278 7800092 9332700 14942682
3834 14942682 20167222 15777711 4446805 -1072302 3324586 9083582 10076633 8525451
3826 8525451 4884294 -4167569 -14645635 -15696969 -5743560 3884536 6025280 6130984
3818 6130984 8447571 7179029 -309301 -3983168 3713765 12644303 8055520 -6531082
3810 -6531082 -12418237 -328916 18557963 26993633 19649380 5431325 -3016377 -516887
3802 -516887 7474888 11909178 9370916 1866005 -10218773 -27310799 -42168382 -42325972
3794 -42325972 -26207320 -7931260 1076929 6792117 19349787 32915664 32715266 19400612
3786 19400612 11655068 21546954 38810330 45176215 36216106 22602768 14978890 14285072
3778 14285072 15071140 12736426 6452648 -2352212 -12007111 -19949174 -21140267 -11199201
3770 -11199201 6280505 19092731 18134145 8367052 3185383 8770987 19404803 27600974
3762 27600974 31772615 32274732 27397802 17941511 10062655 7556156 5335752 -2528797
3754 -2528797 -11133302 -9823976 917691 7096057 -294066 -12451326 -15306115 -8529081
3746 -8529081 -2432572 112128 5968191 15423692 17700039 9185926 3767677 13910668
3738 13910668 30558935 35791539 29482677 26661779 30150769 24851761 4112635 -15750376
3730 -15750376 -17614798 -6929158 -275128 -358780 3288760 14479492 25642906 30764363
3722 30764363 30395556 24511209 12451635 852583 -1857 9077333 14787546 8840809
3714 8840809 -1143235 -3023041 3843672 8994284 3335405 -12291641 -27768902 -30790110
3706 -30790110 -16977253 4999333 21223972 25692984 21856240 12604965 -3136878 -21925017
3698 -21925017 -32799534 -29108653 -18189452 -12765035 -15438679 -17520881 -12174724 -3761277
3690 -3761277 -2931497 -14120246 -28723688 -32032345 -18883545 -463031 8785956 9057463
3682 9057463 12639142 23630010 30362393 22661667 7544399 -273174 2837380 9198575
3674 9198575 13905467 18558568 22175093 19022363 8355990 -1186718 -1001452 7869314
3666 7869314 17254092 20676342 17561663 11444900 6110416 2251049 -2418931 -8374563
3658 -8374563 -10999554 -5554488 5197364 12611581 11850126 5750872 -1617843 -9834571
3650 -9834571 -17655298 -18780046 -8194183 8570244 18461466 15127566 6290998 3660637
3642 3660637 7715731 7590298 -2924689 -14779110 -14471379 -2800528 5278327 1387187
3634 1387187 -3884756 4116116 22305436 32809075 27104640 17130675 17939609 26763856
3626 26763856 27365602 12784052 -4696896 -9171804 -1313903 3160492 -5200007 -16046189
3618 -16046189 -11642472 9847849 29932644 29953017 10540489 -11620528 -21610161 -16917188
3610 -16917188 -4972198 3655245 1947990 -7245704 -12337919 -5751566 5914865 10624408
3602 10624408 7855291 7888309 13884676 15581964 5679127 -6976634 -8734829 529030
3594 529030 9488499 12131608 12919729 16084654 19088895 19193092 19593342 24807242 33552509
3585 33552509 39714874 38838405 31821516 23459257 18362567 17213043 16669350 13918894
3577 13918894 10531413 9756548 10843109 9269144 2918775 -5161461 -11175390 -14654498
3569 -14654498 -16323279 -14862013 -9380254 -4243573 -7338517 -21031623 -36162893 -38487227
3561 -38487227 -23400240 -3153305 3707069 -9030160 -29590132 -42219723 -43338488
3554 -43338488 -40565384 -38950140 -34589610 -22707339 -6487313 5763370 9666511 7654880
3546 7654880 4131536 1210117 -231367 1930423 9694048 20729979 27753494 24826921
3538 24826921 14470456 6034816 6146274 13366964 23117510 33040271 39714782 35277142
3530 35277142 15528333 -9912095 -24415024 -23160345 -17470747 -17587374 -19555350 -14898916
3522 -14898916 -5585026 -240575 115839 2322470 7998878 9814458 2703087 -8757284
3514 -8757284 -17071821 -20069654 -19479847 -16325780 -11076965 -4765894 2404007 10095812
3506 10095812 14376496 10532155 1501557 -2831850 1175433 4768814 -105923 -7059947
3498 -7059947 -2944223 13564348 29451485 32533562 21841738 4042690 -12047004 -17297846
3490 -17297846 -8059147 7129850 14517067 11761526 9679069 14300889 17030578 9074812
3482 9074812 -3612517 -9261816 -7054990 -4093119 -1300396 4603831 8323413 404638
3474 404638 -14492015 -18870773 -7020058 5205039 3054728 -6764826 -9133747 -3845573
3466 -3845573 -1975428 -5149347 -4256248 2337837 4629608 -1816868 -7797369 -5691243
3458 -5691243 -1572685 -3329825 -5247322 3859830 20773562 28308591 17486624 16691
3450 16691 -6299453 1161665 9495238 8699907 3199685 2783924 7578513 8327773 793665
3441 793665 -7216887 -7035544 -2106636 -2621610 -9098880 -10344166 -520862 10018329 8038695
3432 8038695 -3365667 -8371118 -850563 6558124 407513 -13819308 -18384230 -7193953
3424 -7193953 6599415 9509414 5704070 8481025 18369131 20490210 5417578 -16713659
3416 -16713659 -28623145 -25838906 -16836894 -7998752 1764262 12413951 18965023 19098589
3408 19098589 16865378 15153578 11303384 4647297 1625434 6705309 13154573 10883646
3400 10883646 1127640 -4602683 12286 8755911 12323497 9254246 4912149 3636302
3392 3636302 4729320 4256937 -658949 -8008485 -11441788 -6902536 1584186 5687911
3384 5687911 2321323 -3847702 -7650238 -9212866 -10987018 -12622739 -11826302 -8768643
3376 -8768643 -7101310 -10521860 -18834678 -26895809 -27903353 -19498340 -6843900 1870454
3368 1870454 3204191 712577 193886 4423650 11563284 16283913 13328702 2981904
3360 2981904 -7527293 -11153275 -8799604 -6414430 -5723286 -3466531 166826 -647667
3352 -647667 -8395278 -17134406 -20669354 -21059136 -23924633 -28879805 -30375424 -26043180 -18506657
3343 -18506657 -9631761 1369539 13039144 19616156 16931369 8462645 2683073 4072994
3335 4072994 8486284 9142797 6470395 8238207 17913835 27439410 27383253 21389249 22013132
3326 22013132 32102459 39790931 34888421 20871569 5791310 -8753786 -21615758
3319 -21615758 -24625727 -13305748 743607 1701736 -8492084 -13158270 -5581090 2831584
3311 2831584 1764468 -3223517 -664309 11694143 27247107 37970275 36953748 22240734
3303 22240734 3655375 -2820858 5889762 14508934 9924675 -1597063 -6769449 -6165667
3295 -6165667 -10078478 -19064052 -23060622 -18611572 -13378042 -11937535 -9226171 -1651524
3287 -1651524 5741587 8010232 7451295 6681044 2399974 -7370951 -15899041 -15078415 -6875028
3278 -6875028 -922542 -2379465 -7465000 -10130366 -8586507 -4936892 -1233313 3276296
3270 3276296 11116520 21624657 27962410 23405237 11627524 5387608 11662537 22732195
3262 22732195 26537526 21786939 16823019 16359333 16770474 14501227 12127363 13295121
3254 13295121 16138285 15370935 9375972 2907719 2811351 11270046 22790285 28539127
3246 28539127 24702767 15667545 7976065 2918710 -3224557 -13737740 -28488082 -43682168
3238 -43682168 -51422774 -42959051 -18258748 9086319 23112087 22293808 19361368 23372668
3230 23372668 28552622 24195723 10094753 -3092320 -6376315 -1267742 2881043 -1805963
3222 -1805963 -13687549 -21786268 -16292205 275954 15322758 19880507 15535593 6985356
3214 6985356 -5308446 -20831316 -33357018 -36063703 -29497646 -19661538 -11119101 -5875492
3206 -5875492 -4409802 -2565010 7180576 24219797 35031300 29141343 15057095 8750573
3198 8750573 10139645 5945616 -4873644 -6544306 7604584 22179826 23181662 19419833
3190 19419833 25694706 35986327 32085178 13596321 -90510 1854565 9320706 11786875
3182 11786875 14922033 27127632 41499537 44016187 34125388 25276707 26080900 30535714
3174 30535714 28428092 18002137 4868073 -6627869 -15948147 -22205612 -23002857 -19350966
3166 -19350966 -17729292 -22429680 -27185888 -20811860 -2898136 12991415 16645867 15008349
3158 15008349 19837058 26346667 17593733 -8323243 -29198545 -25026258 -4030994 8505885
3150 8505885 2335122 -9144466 -11906086 -10333310 -17146368 -32339874 -41848046 -36183503
3142 -36183503 -22439408 -14488134 -16135746 -19382859 -17392192 -12242974 -8000836 -2874962
3134 -2874962 5920544 13727612 12769250 3982312 -3193210 -3846041 -2978820 -5391207 -7501994
3125 -7501994 -3841741 4033002 10345132 12481937 10920328 6330377 1760122 2686204
3117 2686204 8638898 9784745 -317798 -13228921 -16896087 -14913952 -21544553 -37293870
3109 -37293870 -43824419 -28815442 -3814996 11428133 13143913 11489042 11223398 7446626
3101 7446626 -1480707 -9237187 -11574359 -11153414 -9538074 -3633196 5172683 6925920
3093 6925920 -3954383 -17177040 -17299919 -3866383 8403064 10164434 8856464 15070546
3085 15070546 25079245 25345217 11717530 -4688604 -12214898 -11884333 -11695643 -13459672
3077 -13459672 -12584379 -8800164 -8415868 -13334860 -15075944 -6013675 7380491 10649429
3069 10649429 858408 -7669102 -803772 17615853 30906828 29434000 19209724 11226668
3061 11226668 8405112 5529942 -1730741 -11094297 -15805065 -10750896 2940630 18622530
3053 18622530 29660177 33684662 31122146 22710095 11821127 6035140 9804450 16340280
3045 16340280 14404533 4210301 -1925384 2253213 7751071 5631065 2111220 7758419
3037 7758419 18063300 18340472 6495434 -2321792 3669065 18471471 28877619 30509952
3029 30509952 27292010 21171655 9620384 -7894762 -24903436 -30555762 -19096656 1303855
3021 1303855 12971314 7163240 -5589937 -10401101 -8357409 -11158870 -19418369 -21533279
3013 -21533279 -14486662 -9273333 -11712809 -14593974 -15484521 -24408207 -42527806 -50388628
3005 -50388628 -33931090 -8932329 -500232 -7827885 -9881049 41940 7478579 3098147
2997 3098147 -5345481 -10063510 -13558037 -16956182 -14480518 -6259520 -2829648 -9452487
2989 -9452487 -17123907 -15982446 -8035939 -683761 3346922 4152990 1321331 -2499932
2981 -2499932 -2584301 -521283 -3102169 -9553345 -9905956 -566162 8724318 9109197 4291992
2972 4291992 2186967 4021329 7513322 11924344 14544528 11603037 7634550 12818441
2964 12818441 25212320 28532697 15662176 843523 -1891431 1416008 -468646 -2901704
2956 -2901704 3629173 12439351 10625717 3100936 5961216 19458337 27954456 25662071
2948 25662071 22267831 21871615 16613930 5271851 -1416912 -1002916 -6778678 -25095457
2940 -25095457 -40800248 -37500571 -20487273 -7056277 -3295676 -2930082 -1984257 -1521378
2932 -1521378 253043 6487610 13321475 12963294 5942385 2873248 11999148 28960430
2924 28960430 40127231 34962330 16728373 1845021 4860181 22069018 34485232
2917 34485232 29626905 14982140 6087132 7379393 11271684 11588843 9782284 9253426
2909 9253426 10632154 13176885 15861630 16534920 13520275 7834315 1049197 -7393891
2901 -7393891 -17056931 -22768455 -19303433 -9126564 -10715 5387701 11934866 22416303
2893 22416303 31173924 30941977 21797719 8803137 -5707733 -20968317 -30467327 -24639254
2885 -24639254 -4440567 14864241 20229132 16529588 17308924 23019774 20597090 6424093
2877 6424093 -3669184 4475598 22317578 30086297 22807697 12233437 6601935 2548252
2869 2548252 -3014266 -6975853 -9184266 -15100301 -24247319 -26924718 -18654605 -8242638
2861 -8242638 -4629718 -4827183 -2636820 -421415 -2580628 -5022635 -2426663 -203682
2853 -203682 -6712966 -16853617 -16401548 -2518833 11524206 13269553 2825644 -12943507
2845 -12943507 -27135461 -31827746 -22354634 -7727762 -5982386 -21398550 -35097532 -27843400
2837 -27843400 -5947685 6158493 -4252785 -26361880 -42282301 -44321836 -34459779
2830 -34459779 -17778093 -2192872 3064094 -3760047 -13401781 -16393995 -13564168 -10090592
2822 -10090592 -4226819 8428787 21669163 21945648 8209342 -2326503 4532118 20814511
2814 20814511 27637532 20214569 10837106 9092416 10795993 8560000 2923220 -2329781
2806 -2329781 -8146888 -16252528 -21665112 -17001406 -3701527 7085161 6727412 -993669
2798 -993669 -4787345 188103 6288029 3923738 -3376685 -636404 18455257 39009146
2790 39009146 40352922 21378136 1286914 -4937924 -1672889 -399571 -2843200 -3601821
2782 -3601821 -1959882 -1490835 -1448239 2216458 7743173 7167652 -3279461 -17439381 -25923558
2773 -25923558 -25664348 -21488596 -19963102 -22491974 -23912822 -18123764 -5042602 9282595
2765 9282595 19015480 22469443 20281256 13849466 6265703 328485 -5488973 -14188067
2757 -14188067 -22305483 -21562511 -11515744 -3379227 -5736431 -12435986 -11593940 -2297727
2749 -2297727 5029602 2488460 -7423775 -16109817 -16154242 -6689442 4233856 6119259
2741 6119259 -888983 -4506388 2758138 11904654 10744497 2070496 -2513468 -1266574
2733 -1266574 -941818 -70366 9939162 25992700 32214596 22804018 11265931 9463812
2725 9463812 10868596 4333957 -7129843 -13207352 -12941541 -11847849 -9085216 -915830
2717 -915830 7328663 6312078 -2193089 -7911592 -8555302 -10524602 -13398081 -8865820 1805696
2708 1805696 5096842 -2770427 -6299059 5221720 17335244 10556737 -7951226 -12863382
2700 -12863382 1834467 15078099 12229806 5739237 11471294 21404706 16946772 -389819
2692 -389819 -10531520 -4310279 5942084 7665694 5477862 10838235 23794721 32657292
2684 32657292 28072598 13073508 770666 2401548 15012679 23048118 16646556 4600184
2676 4600184 1721541 7623038 9472434 3578993 -231395 2688911 3994780 -1397319
2668 -1397319 -5324863 -621805 6823282 9245173 9273096 11373767 11418600 5614603 583608
2659 583608 3114661 8157281 8398860 7222701 9678167 9338789 -1117565 -13636878
2651 -13636878 -15302294 -9417371 -9049454 -13988817 -12816418 -5829794 -5884439 -14682521 -17518300
2642 -17518300 -6703489 6756312 11495396 10877343 12391977 15352365 17361020 21408925
2634 21408925 27985721 30214714 25494271 23034023 30534018 40438257 39010033 24704476
2626 24704476 9050795 1487134 207620 -1994397 -7131570 -9200212 -2429679 8591293
2618 8591293 11901046 3834628 -4986712 -4931935 -464259 1270073 5757610 20047303
2610 20047303 32751263 24167767 -4252385 -28382505 -30991803 -16772015 2623795
2603 2623795 19967158 26552967 15456066 -2917190 -7485115 3781127 9466102 -1605978
2595 -1605978 -12530330 -6316173 7498551 9986658 593572 -9237259 -16729950 -24073748
2587 -24073748 -24629127 -11280254 7888089 18045563 16928334 13062685 10543596 7553677
2579 7553677 4354597 1990652 -1196031 -3286389 2467978 14029863 16903031 5061525
2571 5061525 -6038510 -318099 15999715 26154972 26757959 24837056 21082322 12421499
2563 12421499 3264779 -1177719 -4982033 -10899652 -9760184 3768284 15671378 11130599
2555 11130599 -1095419 -2327701 6772376 11334665 9000096 9269888 11473729 5956337
2547 5956337 -5198743 -9329034 -3621497 3977932 11623685 23365387 35370201 40123081
2539 40123081 40850333 45182616 49991218 49037780 47424906 50583733 49943390 39969507 35687405
2530 35687405 48551614 60212117 50261585 34459994 39593912 55269795 53082995 40785476
2522 40785476 47828444 67093973 69939437 74409891 125073338 192158050 172223173 30428088
2514 30428088 -126518213 -176341873 -128214112 -82045291 -83502043 -93101437 -77589789
2507 -77589789 -55683409 -48951463 -47462537 -39399840 -33011882 -35535249 -40767733 -45795833
2499 -45795833 -54702510 -62300925 -57875745 -45174127 -35876117 -27048543 -10116499 3665885
2491 3665885 -3844951 -23075905 -26732883 -13776039 -11001835 -27887184 -42009659 -36325842
2483 -36325842 -21370056 -11322179 -4793104 770065 140119 -4219154 -192773 11530195
2475 11530195 14964684 6761888 3324147 10854754 12842337 -183796 -12215409 -8819101
2467 -8819101 -1295933 -5433310 -13825236 -9482025 5709872 15498052 13730340 7393285
2459 7393285 1112807 -6738346 -15884837 -23243693 -27680673 -28423596 -22530366 -9268435
2451 -9268435 7521589 24517625 40149182 49543975 47717772 39852213 37417137 41226372
2443 41226372 40275505 30664031 22129948 20813416 19518922 11813383 2356832 -4302885
2435 -4302885 -11962481 -21455498 -24249087 -16995432 -10320450 -12704473 -16742527 -12246981
2427 -12246981 -2745999 2277143 2390866 2205853 602430 -4599484 -7829646 -2453927
2419 -2453927 8473768 16575867 18501284 15681251 10054590 5660825 7217087 12218779
2411 12218779 12974076 10203173 12883806 19936592 17218459 999720 -11784610 -8817548
2403 -8817548 -2358307 -8510119 -20565793 -21724322 -13471409 -10499581 -14152795 -11933160
2395 -11933160 -728157 8663488 9941858 7606090 4601381 -1155069 -7511229 -9857846
2387 -9857846 -12775818 -25326997 -43016906 -49022353 -37264108 -21247701 -14748742 -15115639
2379 -15115639 -12440675 -6298596 -5199869 -13745040 -26665074 -34674338 -33408878 -26444313
2371 -26444313 -19505571 -12896438 -3813922 3956497 1009922 -12895293 -23963810 -21794653
2363 -21794653 -13771266 -12614360 -16655695 -13985484 -1180707 14176137 26283900 34579376
2355 34579376 36917635 31240449 22914674 19467161 19004482 14153798 5677838 812566
2347 812566 -559976 -5699400 -14849701 -19576482 -16867479 -13617462 -14741870 -17019646
2339 -17019646 -17113900 -16155967 -13986986 -7920824 140995 3342243 -1262034 -10154114 -19658872
2330 -19658872 -27412480 -29130637 -23363550 -18027884 -21314563 -27220197 -22653387 -8676697
2322 -8676697 -245382 -2904534 -5201975 1045163 8421275 9448423 10024170 16766547
2314 16766547 22867630 19260109 11583987 12882113 23891297 32285983 29653092 19856740
2306 19856740 11324612 8462893 10433410 12684822 9873413 1473389 -6142760 -6434313
2298 -6434313 -328329 5635204 7347541 6563760 7008506 8965473 8050148 -66659 -13170484
2289 -13170484 -23161433 -25307558 -23228899 -20877176 -14551761 -24237 16425615 23615513
2281 23615513 20386188 15475736 13772918 12909820 12671561 16105375 20574915 19691826 15511653
2272 15511653 16046347 18915022 12618883 -1652439 -6312622 6121022 19037693 16398302
2264 16398302 6835334 7454188 15485758 15386352 7196163 6662586 17718398 24805625 17875752
2255 17875752 8764246 13107638 26711178 31295504 19092700 1306393 -8116693 -8874149
2247 -8874149 -10015316 -13881871 -12326208 -779529 11216876 10719431 -840083 -9396827
2239 -9396827 -7186626 -473913 3472882 7164208 15246850 23844711 24960455 17776752
2231 17776752 9884994 9087846 16770157 27023056 31262196 26807671 19978874 15985566
2223 15985566 9211952 -7072630 -24162970 -25227256 -10439528 778935 -2545456 -8943541
2215 -8943541 -6151536 -728535 -3955554 -11651047 -12296144 -4884564 5072642 17354248
2207 17354248 30315045 32290581 16679063 -1943880 -4446511 5813526 10370414 5193930
2199 5193930 3279617 9692696 14040112 9725821 3193753 840226 1905169 6817473
2191 6817473 17726299 28416610 28758587 21666257 20034013 24086931 19214433 1595482
2183 1595482 -11873200 -7778799 5672809 14714640 19300882 24276479 24410689 12982966
2175 12982966 -3107737 -10514842 -6667891 555171 4847145 3678627 -5349612 -20046968
2167 -20046968 -30466338 -30003745 -25203147 -25159001 -26146744 -17727215 -877852 11368787
2159 11368787 10688612 1197207 -9441266 -17617351 -21483160 -19003569 -10929470 -1079106
2151 -1079106 7426844 13056057 14477197 12767060 13161592 19018743 25250714 23845747
2143 23845747 15591864 9975080 12284953 16551685 14055014 4994388 -1870942 -220482
2135 -220482 5606716 4649462 -8148400 -24990554 -33308936 -29808714 -22147438 -16714190
2127 -16714190 -11364395 -3338500 2351063 -945907 -10534733 -16219540 -11939881 -700385
2119 -700385 10476973 15660828 12030659 2899727 -1743433 6084525 21778588 31180468
2111 31180468 26367209 14797250 10264339 17227431 26784636 27060980 15159242 -1225990
2103 -1225990 -11835521 -11900823 -3833925 5296080 7148067 -2294780 -16545230 -21712787
2095 -21712787 -11698397 2059668 3234964 -8146309 -15762623 -9129395 3725275 9044519
2087 9044519 4069381 -3935302 -7605988 -2687297 11468677 27836897 34217736 26760060
2079 26760060 15948385 13260845 18182978 24841817 33220327 43912043 48955219 40537085
2071 40537085 24790448 14577942 11449485 7358359 1837735 2867348 10310858 13455883
2063 13455883 8521550 4958616 8778716 11632897 3615834 -12567010 -26979320 -33685067
2055 -33685067 -30707197 -17818850 -1694317 5093002 -1067341 -7473528 -1349579 11970713
2047 11970713 16025183 4383350 -13743192 -26179139 -28223544 -22608057 -16166057 -15057883
2039 -15057883 -17927152 -16511732 -7778169 -233687 -1315931 -4601705 386265 10464747
2031 10464747 13605599 9414767 10448421 21002475 28328307 20883662 4304878 -8327050
2023 -8327050 -13402698 -15436342 -15430837 -10404757 -1890684 3367789 1519103 -3862914 -4798102
2014 -4798102 5127417 23990008 38475298 33996880 13237648 -1784622 5480194 23869069
2006 23869069 27421150 8430644 -14065931 -20052801 -10944588 -1129802 2437681 2784535
1998 2784535 1065990 -6418290 -18998781 -28061293 -26597828 -18079414 -11986257 -12511115
1990 -12511115 -15553684 -16772593 -18148269 -23123471 -28050191 -25091145 -14687066 -7624033
1982 -7624033 -9588810 -10531466 1356673 19275250 23737598 9041885 -9003341 -15605789
1974 -15605789 -14474813 -15236070 -15287200 -6532758 7372137 14377433 11278139 4966341
1966 4966341 -1393962 -10234028 -17948300 -15568946 -4199445 3116099 24712 -4400852
1958 -4400852 -1920993 1527891 -2129554 -7826795 -5833880 1640089 5191411 5107922 9761005
1949 9761005 18403828 19532318 9027719 -2200295 -3734769 1256527 4904167 7795540
1941 7795540 14270424 20386864 17148624 4414188 -7322716 -9765461 -4179832 4880496
1933 4880496 14878147 20906122 14596162 -4377328 -20243825 -14494811 12381624 40231136
1925 40231136 51532651 46811179 35568765 21190632 2304769 -16819203 -27117834
1918 -27117834 -25429847 -17539267 -10439149 -6601802 -5076503 -2874719 3951832 15031824
1910 15031824 22352278 18391814 6992154 -494856 636821 5691920 11532741 20494408
1902 20494408 31187483 35646234 31001265 25696093 27455376 31359836 26795750 12042940
1894 12042940 -3790838 -10165269 -2835743 13201708 25136651 22390682 8949874 -506664
1886 -506664 -17677 602916 -7062143 -16166841 -16349820 -9857407 -4997395 -1386975 5676668
1877 5676668 12294176 11356971 7005138 9432218 16982222 17364530 6730856 -5569127
1869 -5569127 -12303892 -16058306 -19819066 -21348267 -19243289 -14605316 -5795196 7973197
1861 7973197 18153319 14822312 3763992 1213144 9398854 13109011 5033750 -2261703
1853 -2261703 2572936 12603891 16995832 17835458 20128940 18289997 7670809 -1017867
1845 -1017867 4358898 15881712 14761091 -1623507 -17259135 -20555936 -16024682 -12920072
1837 -12920072 -14150258 -17233644 -16848561 -7220396 9126460 17874382 9247651 -4793821
1829 -4793821 -3193232 14605939 26226546 16640523 -2716777 -11075850 -3188471 10610781
1821 10610781 20330960 23451381 21421602 17198439 14387689 13909862 13060160 10404051
1813 10404051 8665568 10351965 13801818 16098633 16823807 16427220 13529128 6346781
1805 6346781 -4438679 -15019914 -19768646 -15155724 -5556237 -2486891 -12290689 -26075441
1797 -26075441 -28852209 -18263139 -6515418 -3258573 -5453601 -6523216 -5964248 -4805743
1789 -4805743 -111285 8622240 13835207 8748277 -2198104 -9404244 -11705874 -16055421
1781 -16055421 -24781806 -30767577 -26735488 -14422475 -3002151 -1066572 -9964543 -22225678
1773 -22225678 -27090469 -20409404 -8643022 -1232880 -986422 -4503485 -8744384 -12068272
1765 -12068272 -10974890 -2750823 7940421 11308068 3923009 -6240942 -8790103 -1555272
1757 -1555272 9803903 18772423 21200071 15285866 3541354 -6714684 -9764645 -8147021
1749 -8147021 -8678575 -12398263 -13979028 -11652038 -10635002 -13255431 -12706843 -3381135 7829195
1740 7829195 9799069 4379675 4840328 16135139 27122343 26657700 18587392 14327137
1732 14327137 16978741 19905057 17116480 9155884 1465052 392999 6295102 8168693
1724 8168693 -6561197 -32010936 -44289286 -31402831 -12192780 -11390013 -24232723 -24445828
1716 -24445828 -3809263 16934304 19277863 10129506 6887032 14651425 26872129 36763584
1708 36763584 39606804 32735753 19777691 7502641 -3709500 -15729759 -19206867 -1433718
1700 -1433718 28656087 43904252 36009722 27762582 35636091 43552646 33286479 18208645
1692 18208645 20095900 32420067 40929130 64727630 130979111 209746423 223419464
1685 223419464 140335318 22790550 -43246880 -40121416 -15213490 -9329552 -21565400
1678 -21565400 -34796731 -42379745 -44792550 -41266769 -33076568 -25295598 -21970293 -24669582
1670 -24669582 -32998458 -40563765 -36462500 -19346987 -3773289 -2584284 -9051635 -7702872
1662 -7702872 2860089 10726977 9937556 5546127 2098856 162391 2292739 9021983
1654 9021983 10421517 -3525720 -23467380 -26600833 -5412577 22684450 38189992 38975158
1646 38975158 32207249 20681574 6062034 -4442632 -4675598 2580950 10639634 16171394
1638 16171394 16912332 9986860 -946157 -3957607 7779141 25262084 32794134 24512188
1630 24512188 7786602 -4691706 -2287964 16946381 40720661 49763894 37673961
1623 37673961 18640199 9482606 10232447 9557011 2440138 -7132481 -15721731 -22186241
1615 -22186241 -23633911 -19740852 -17546404 -21387785 -22144096 -9627836 7052818 7735252
1607 7735252 -8679188 -19253952 -8613150 9592705 13191058 1519398 -8272970 -7448462
1599 -7448462 -4016527 -7394706 -16997367 -26433750 -29553772 -21836126 -4720674 10249608
1591 10249608 10623419 -802371 -7468278 -912905 7369469 3141115 -8718420 -10767626
1583 -10767626 1113612 11150008 6410156 -4786361 -5249507 7487134 20661444 26336777
1575 26336777 29706496 35178612 35755688 24054354 6662326 -2676921 -1989685 -3495405
1567 -3495405 -15343697 -28660940 -27959244 -11020065 7099972 10583338 26118 -9924513
1559 -9924513 -9521732 -5757618 -11236972 -24794729 -31667447 -24023290 -11974424 -8760477
1551 -8760477 -13000048 -14138270 -9730061 -6841977 -9209768 -13817580 -19304066 -26745479
1543 -26745479 -31203767 -23764768 -5405362 11023817 16967950 17293825 18680049 18759213
1535 18759213 14068593 10049131 13210232 18854346 16899081 7337672 542531 2581929
1527 2581929 7859215 7232472 -1790396 -13407406 -18391531 -11431435 2905511 12830187
1519 12830187 10869277 604917 -10178924 -18019621 -21168544 -15116268 522118 14563386
1511 14563386 14105883 1209674 -9676418 -11075224 -9026358 -8255098 -2373996 13825089
1503 13825089 30601045 32441718 18819236 6408153 8648251 19784903 23699382 14832353
1495 14832353 3895172 2428680 8291162 11129640 7353292 1574561 -4694348 -14859652
1487 -14859652 -25555575 -24843939 -9136537 7959620 13489049 13367963 20189314 29688209
1479 29688209 26098721 9148276 -2482333 1178772 6463149 -2831673 -22153643 -34646158
1471 -34646158 -33763662 -26100181 -17764451 -9782826 -4628828 -6479173 -13723105 -18409467
1463 -18409467 -15038050 -5880356 2784082 6390057 4307670 -620568 -4633816 -6400728
1455 -6400728 -6617122 -4046371 4143534 16143871 24200928 23417665 18292899 16292263
1447 16292263 18230123 19872187 20022689 20809120 21279585 17342165 9202513 3665557 6279621
1438 6279621 13815296 17202112 11605606 2358540 2923 8722101 20309762 21485891
1430 21485891 7468177 -13179000 -26710247 -25156773 -10634529 6905085 16115296
1423 16115296 13119996 5392253 3475831 8704782 13214871 11314376 4618108 -3948126
1415 -3948126 -13135993 -18746865 -14944864 -3893837 4275953 5364657 6075930 10085749
1407 10085749 9740596 -7112 -9378341 -6820295 3409246 9080989 8997120 10236370
1399 10236370 11139700 3007114 -12175057 -21108255 -17927594 -9675703 -909164 12233946
1391 12233946 27455655 30535538 14091355 -7901559 -15130224 -4893669 7746700
1384 7746700 9674212 1562338 -7733624 -11639903 -10380849 -8543538 -8678556 -7696096 -2045576
1375 -2045576 4931539 6251358 1535635 -2932145 -5192833 -10401654 -19751589 -24950326
1367 -24950326 -19076088 -6726403 2037024 3058850 -895936 -5474860 -6902891 -3731414
1359 -3731414 -178145 -2554284 -9325308 -11365039 -5547570 195411 300171 417933 5247818
1350 5247818 7364142 -797943 -11800529 -13206556 -6834462 -3275951 -1196067 10374286
1342 10374286 28541530 33807614 17616109 -2501104 -5638631 5695035 13216268 9342277
1334 9342277 2705605 962447 1945084 3408244 9650927 22401882 32719155 30125955
1326 30125955 17337337 8743006 13527751 25804019 33927892 34950325 34967769 37601460
1318 37601460 38717016 33767941 24824776 16950830 11245994 5358971 -1329184 -6729641
1310 -6729641 -8996646 -7598340 -2725331 3982938 9843559 14540240 20638388 27856974
1302 27856974 30098452 22821629 11101076 4962111 7628255 13315617 15920517 14742198
1294 14742198 11899295 9474519 9788087 13604720 17313909 16397313 11993850 8895838
1286 8895838 6680754 -727432 -14714833 -27748551 -33180883 -33717275 -35526000 -38781837
1278 -38781837 -39861624 -39302255 -40393744 -40745561 -32247191 -11861296 11384166 23124898
1270 23124898 16828612 -125973 -12811526 -11914996 -2011058 3858584 -1101512 -9952478
1262 -9952478 -11658801 -6234268 -5376220 -17122524 -34528301 -43008022 -36338195 -21344458
1254 -21344458 -8004081 9858 3775335 3263648 -2235469 -9386231 -11253447 -3994760
1246 -3994760 8660070 18259148 18344886 9726283 921099 1290169 10431970 16745940 11745476
1237 11745476 3530690 7565239 23778117 33767673 25926413 13017605 14990691 31319365
1229 31319365 42663502 37326211 23846940 16409882 18334810 23300869 24952030 21480563
1221 21480563 16085466 15124074 21107979 27227459 24764890 15458280 8622211 6190816
1213 6190816 959815 -8410085 -12600500 -7149779 -1288337 -3122556 -6136841 -964112
1205 -964112 7739843 8897775 3994360 4428429 11597141 13336371 2513010 -11813822
1197 -11813822 -16124113 -8069843 3185982 7289033 1610968 -5857224 -2747974 13456718
1189 13456718 29112055 29578197 19036155 15158563 23631467 30011818 21299810 4076752
1181 4076752 -6882655 -8958587 -10322845 -14213927 -16102138 -14525616 -14067146 -16312221
1173 -16312221 -16164963 -9896463 -1020569 4586564 5124346 2127315 -2841007 -7852595
1165 -7852595 -9600233 -5880865 1610586 8694817 12398715 12294006 9201142 4299682
1157 4299682 -438855 -2660321 -1918463 -763038 -1206536 -108692 7842133 19926050
1149 19926050 22935187 7753208 -15769382 -27671319 -22848304 -17095728 -23400950 -32645006
1141 -32645006 -28025794 -11347640 -1064453 -5982124 -14957390 -15479620 -9876918 -6746549
1133 -6746549 -6449567 -4100614 -380040 398969 -224772 3650450 12176007 18813055 19893199
1124 19893199 18520611 17804239 16315229 12742471 10005114 10804890 11798620 6242648 -7587199
1115 -7587199 -22757241 -29461468 -24594786 -15152548 -10641439 -11746986 -9306302 3292947
1107 3292947 19768887 27512882 23059022 15560262 14563785 20039515 26615142 32020888
1099 32020888 36459189 36843019 27888695 9804886 -8743121 -17427525 -13450906 -3647461
1091 -3647461 2209068 496136 -3401871 -1578206 7210661 15798008 15990459 6454396
1083 6454396 -6666004 -15276925 -15334792 -9459129 -4499778 -5176718 -9776512 -13323610 -14012006
1074 -14012006 -13552954 -11870717 -6283586 2600888 8805531 7740589 1635804 -4553407
1066 -4553407 -9129923 -12318005 -12778178 -10028997 -7475532 -8116823 -9535887 -8183321 -6202785
1057 -6202785 -7858211 -11040611 -9768847 -4686868 -2727220 -4867545 -3149300 5806286
1049 5806286 12459958 6778221 -6464467 -13328040 -9034046 -2112887 -703406 -3276558
1041 -3276558 -5070090 -5890700 -6925148 -6042115 -2788602 -3721141 -14362794 -27272545
1033 -27272545 -27500542 -12072493 4714827 10194092 9108253 12310536 16836836 10152246
1025 10152246 -7755966 -20786937 -18429201 -8297354 -876641 6126085 18221170 28805088
1017 28805088 26932973 15460692 8126789 10374854 15050280 16303850 15790145 14646645
1009 14646645 11350718 9280320 14368854 22224021 19795231 4659286 -9151643 -10802621
1001 -10802621 -6619407 -6442070 -7181427 -841945 9586675 14232071 10821628 4297614
993 4297614 -3252770 -11778870 -16668314 -13599477 -6572817 -1405945 4059979 12377684
985 12377684 15282063 5206746 -5788820 2944066 29389095 46808618 38140691 16031383
977 16031383 1464387 -1331118 1573255 9662765 22221312 28020965 18302134 4068723
969 4068723 3693883 16254981 23449510 17446728 10245167 12212795 16898072 14171534
961 14171534 5753988 -1566667 -8280404 -16842618 -20991898 -12835818 1963871 7919110
953 7919110 -229901 -10846069 -11724638 -4830002 181742 619440 1855660 6951324 12493610
944 12493610 14850658 14936419 15357784 17001439 20111302 25137473 30367432 31656350 26724755
935 26724755 17087455 3845952 -14535961 -36544752 -53340651 -56022010 -45846715 -31819181
927 -31819181 -19327498 -7769105 973228 775874 -8181394 -14843796 -9976986 1297704
919 1297704 6674183 3221325 -626240 2063586 9684184 17966319 25008619 28419768
911 28419768 24754423 15882984 10403288 13897485 21657149 25457292 23696525 19713897
903 19713897 13743026 3510142 -8707609 -16732401 -18384464 -16440147 -11450830 -1038093
895 -1038093 11664001 16988494 11201606 3406321 3220410 6593783 2350102 -9802412
887 -9802412 -17252481 -11303666 1839726 9399452 5435256 -6476266 -18513910 -23544222
879 -23544222 -19445554 -11974699 -10003930 -15398451 -21014436 -20460058 -15055756 -8587292
871 -8587292 -1124405 7043036 10617781 5561065 -2618928 -4141412 2025635 6649988
863 6649988 2314081 -8088448 -15984980 -15992205 -8595845 2734467 14686948 25070740
855 25070740 31779927 32219483 26138234 18644964 15910692 16293262 10934680 -3578838
847 -3578838 -18634113 -24484911 -22387273 -19616609 -17643980 -13601656 -9412924 -9342979 -10345555
838 -10345555 -5404748 3439177 5688568 -2424007 -12911585 -18539909 -21127726 -24173382
830 -24173382 -26217960 -26150110 -27432085 -32005558 -36181307 -36788277 -35464455 -33253310 -27305568
821 -27305568 -16721212 -5548217 3182757 9820184 12280009 6628939 -3311586 -7323581
813 -7323581 -4764599 -7623096 -20022949 -26887455 -14760507 6046001 14337838 6408824
805 6408824 -2912149 -2862828 4522747 15559961 29207174 39573945 38059095 25765562
797 25765562 13114366 5785455 1469043 495131 6627376 15058342 13303952 -530369
789 -530369 -12108929 -10027763 -487639 4303740 3325218 4027398 9186512 14671561 16021585
780 16021585 11146023 746786 -8986398 -9197597 801698 10385572 10504423 4827066
772 4827066 2792570 6762433 12025719 14657147 12840358 4907567 -6619265 -12583785
764 -12583785 -6520642 5726320 12852367 12781281 13130672 17837271 21138323 16530031 5684775
755 5684775 -4562294 -10853958 -16280412 -25314613 -36494829 -41335419 -33436905 -18727763
747 -18727763 -11554253 -18191227 -29475094 -33324882 -28601963 -21261936 -13380304 -4622774
739 -4622774 164603 -4298295 -12936766 -15004206 -10102592 -9203829 -17635737 -27466832 -31062152
730 -31062152 -32142532 -36178779 -37981302 -28803134 -11719154 81856 -46353 -5288881
722 -5288881 -6241258 -1926307 2792954 5715617 8986234 14263363 19562017 20915201 15922086
713 15922086 6026608 -4006681 -9511133 -9546480 -6793437 -3754951 -170900 5093313
705 5093313 10689711 12811912 8609139 -1070635 -11948053 -18560053 -17135834 -8269353
697 -8269353 2723220 9438660 9263032 4456064 -955412 -4190615 -4813492 -5381605 -9994885
688 -9994885 -18308455 -21865662 -12972802 1313145 2628115 -15374964 -34710700 -33545074
680 -33545074 -13980024 2134003 2584258 -3421888 -3685549 1335765 6881170 14715392
672 14715392 25904691 32188991 25802034 12485031 4661872 5206911 6551842 2537262
664 2537262 -6886086 -19183957 -29378525 -30581368 -22998720 -18009051 -23242437 -28218629
656 -28218629 -17635254 3945507 15801076 9802265 -244662 -1462466 1765932 1475241
648 1475241 1205317 5963061 8404691 -1111900 -17166886 -25185539 -21374390 -14994484
640 -14994484 -12481076 -10509761 -5274823 1164372 5894922 9013755 10487031 9350826
632 9350826 7644413 9389961 14167191 17331767 18088344 21016807 26781024 27774837 18287012
623 18287012 4619352 -1360593 2966723 8746699 8431337 4914083 5290760 10074492
615 10074492 13456326 12382634 9913387 9080333 8688097 7638610 8569391 12799136 15367705
606 15367705 10884553 2013103 -4272085 -7271683 -11647229 -16210130 -13101314 -1099349
598 -1099349 9239408 9054766 2074417 -4469333 -12252986 -25829332 -39488645 -41666970
590 -41666970 -31417361 -20101320 -15412312 -12771887 -5378718 5176719 12959057 16725063
582 16725063 19671951 23039572 24269507 20675737 12710348 4018341 -1415963 -3398690
574 -3398690 -6242121 -13248219 -21396937 -24371285 -19742927 -9679655 3673833 17996295
566 17996295 26850848 23384800 10208542 -741965 -1791776 2130341 2694017 835983
558 835983 4459590 15854108 26980061 27535088 15027688 -2640683 -13240084 -11163281
550 -11163281 -4423385 -7566425 -24167355 -39681649 -37242770 -18854821 -3948323 -5790697
542 -5790697 -16305654 -18804190 -10534320 -4508217 -9247740 -15386906 -8123680 11714973
534 11714973 27392847 27028509 16593368 9014197 7840365 8337460 9161769 13271686
526 13271686 18838665 19137852 13340444 9372560 12982852 20606327 26159072 28260057
518 28260057 26942444 20254361 9939658 4640557 10198156 20431164 24483301 20550759
510 20550759 15201690 11017998 3065480 -11340690 -25905267 -31310441 -24840614 -12625631
502 -12625631 -4215269 -4934509 -11586980 -15944131 -13694157 -8536022 -6477763 -9166076
494 -9166076 -14675915 -20707462 -23823409 -20138149 -11322694 -5501411 -6862091 -9092036
486 -9092036 -5673077 -1643849 -6328657 -18200158 -27153390 -29480268 -29684255 -28713049 -22422991
477 -22422991 -12235915 -4999951 -585045 7328853 15301487 10141748 -8433953 -20212446
469 -20212446 -10670025 7494412 12288684 2118890 -7484285 -9670959 -11833318 -18097283
461 -18097283 -22703895 -22053376 -19591055 -16421058 -9349812 -993738 309876 -5111592
453 -5111592 -5473393 4961133 15802428 15269106 6357535 -63803 -1332103 -2881940
445 -2881940 -7016694 -11550322 -16924606 -24883178 -30462614 -24824830 -8745156 4051234
437 4051234 1600363 -12214144 -22075201 -17169393 320135 19993353 32157603 32822110
429 32822110 24566869 14412610 8333731 6093560 3305011 -562352 -120592 6932276
421 6932276 13325051 11426822 6109058 8783481 18334114 19764257 6913909 -5034741
413 -5034741 404047 17471065 27579325 26194707 24766916 27932141 26005886 13731736
405 13731736 1124439 -1629573 2056747 4505833 6030580 8614053 7256328 -858078
397 -858078 -6017920 2320001 17760613 23423280 14230566 1141055 -6179338 -9355282
389 -9355282 -12670103 -15180727 -14905623 -12527425 -7434269 2796344 15731672 23727439
381 23727439 23821421 21638068 21636519 20021991 12548668 3514540 66356 1200923 -185638
372 -185638 -5613291 -8341705 -3411820 4841571 7611569 989216 -11343005 -22586265
364 -22586265 -27970589 -26798212 -21830080 -17068417 -14857912 -14444562 -13851449 -13088301 -13828750
355 -13828750 -15046680 -11658582 -949042 11190944 15599941 11769966 8521849 10689602
347 10689602 12011556 6418045 36849 3329018 14444679 20123036 13325145 1310394
339 1310394 -5558989 -5137909 -713823 5735512 12801555 17331850 17423620 14220223 7972036
330 7972036 -2813881 -14835866 -18341083 -7903020 8819734 19090847 19467781 16627583
322 16627583 15998657 15966253 13173024 7977850 3459156 2640079 7277102 16200086 24339094
313 24339094 26061287 19988371 9084985 -2793461 -12169872 -15772366 -13042001 -8076577
305 -8076577 -5380852 -4283165 -1364699 2399608 1972186 -3671627 -8805238 -8389880 -4532571
296 -4532571 -3252908 -7617837 -15875460 -23590652 -25885303 -20645181 -11897277 -7351989
288 -7351989 -9993035 -14422137 -14069290 -9277977 -4703608 -1235163 4285636 11865126 16326782
279 16326782 14170752 8495914 4683529 4055303 4484165 5044782 6702411 9259155 10727974
270 10727974 9910918 7372486 3772582 -567079 -4211837 -5101745 -3186429 -402526 2585352
261 2585352 6761749 10521292 8603645 -1321499 -13332050 -18774593 -16138547 -11234135
253 -11234135 -8076442 -4629285 1419299 7700194 10630643 10071666 7715079 4262936
245 4262936 1446672 3424145 11591938 20080684 21267739 15034759 8380868 6418594
237 6418594 7903261 9276715 8585948 5149418 -8861 -2597132 1222486 8021025 9021035
228 9021035 1434824 -6846818 -7426984 -1793146 3156342 5991066 10668867 17522333 21358126
219 21358126 18990286 12767661 5499494 -2424893 -8866378 -8798513 -1565883 4787594 1554694
210 1554694 -10029877 -20337217 -22313099 -17154602 -9987656 -4208846 -877864 -326235
202 -326235 -2235910 -5068047 -6675630 -6097675 -5361860 -8577109 -16565956 -22585833 -18019805
193 -18019805 -4167370 7099348 8374653 6341973 9572169 12779235 4627963 -11377331
185 -11377331 -17983465 -8836343 1615699 -439090 -9063014 -11071656 -7588370 -9431335
177 -9431335 -16776184 -18528980 -11057437 -3624183 -2691894 -2697883 2907637 11011296 15064252
168 15064252 14809498 13722206 11814721 6786849 -702118 -7363858 -10902320 -10764854 -7803379
159 -7803379 -4892938 -4634774 -4979270 -1086387 6873424 12463880 11850386 9106429 9570593
150 9570593 12450577 13779376 12820797 11519222 10682294 10389528 11512975 13708698 14613737
141 14613737 13653366 13465373 15129368 15907302 14476818 13840570 15480982 15445977 10803578
132 10803578 5411541 3853083 3712721 61552 -5675388 -8121340 -7058493 -7162663 -9372177
123 -9372177 -9103243 -3948403 1895921 2653907 -2188716 -7119220 -6273386 -976232 -806084
114 -806084 -12702249 -28829573 -32472286 -18827420 -1941127 3845281 557684 -2310011
106 -2310011 -3590203 -6314478 -6187658 1240261 7053480 -1096128 -17403303 -23079059
98 -23079059 -14041501 -6175695 -8825060 -10434904 823809 17285089 24597247 22965801
90 22965801 22315391 23933982 20574405 11060288 2736674 599176 3442580 9738878 18589432
81 18589432 25114521 23113555 13708530 5320307 3684003 6374734 8019041 6987716
73 6987716 5836482 7529148 11702567 13896577 10132152 3098390 297700 4010869 7574299
64 7574299 5237263 1025254 2372303 8787252 13599959 14539328 15068943 15865733 12630897
55 12630897 3943636 -5098316 -9886009 -12125653 -15447903 -18848618 -18257247 -12623176 -4855431
46 -4855431 2593731 9693432 15586531 16320293 8900798 -2827871 -9774741 -6926040 1138148
37 1138148 6280263 6040865 3636682 1282528 -1116402 -1477634 3950923 14121547 22284277
28 22284277 23514513 19207999 13115635 7511516 4119906 3354114 1462675 -5336147 -12502606
19 -12502606 -10760582 -904165 3924098 -3736828 -13928088 -13511049 -5048702 -1645418
11 -1645418 -7603070 -14668416 -15527192 -11380329 -6261834 -1925445 981415 2988124 7196404
2 7196404 15284088 22991635
0 22991635
##END NTUPLES=NMR SPECTRUM
##END=
