##TITLE=31Pdec_LR-696-RM2
 , 24 sc
 24.10.2019
##JCAMPDX= 6.0         $$ Bruker NMR JCAMP-DX V2.0
##DATA TYPE= NMR SPECTRUM
##DATA CLASS= NTUPLES
##ORIGIN= UXNMR, Bruker Analytische Messtechnik GmbH
##OWNER= root
$$ XWIN-NMR		Version 3.5
$$ Thu Oct 24 16:26:57 2019 Russian Standard Time (UT+4h)  she@DPX200
##.OBSERVE FREQUENCY= 81.013821
##.OBSERVE NUCLEUS= ^31P
##.ACQUISITION MODE= SIMULTANEOUS
##.ACQUISITION SCHEME= undefined
##.AVERAGES= 24
##.DIGITISER RES= 17
##SPECTROMETER/DATA SYSTEM= spect
##.PULSE SEQUENCE= zgpg30
##.SOLVENT NAME= DMSO
##.SHIFT REFERENCE= (INTERNAL, DMSO, 0, 182.463)
##AUDIT TRAIL= $$ (NUMBER, WHEN, WHO, WHERE, WHAT)
$$ ##TITLE= Audit trail, XWIN-NMR		Version 3.5
$$ ##JCAMPDX= 5.01
$$ ##ORIGIN= Bruker BioSpin GmbH
$$ ##OWNER= she
$$ F:/spectra/data/she/nmr/P31/1/pdata/1/auditp.txt
$$ ##AUDIT TRAIL=  $$ (NUMBER, WHEN, WHO, WHERE, WHAT)
(   1,<2019-10-24 16:26:16.04 +0400>,<she>,<DPX200>,
      <created by zg, POWCHK disabled, PULCHK disabled
       configuration hash MD5:
       00 E9 B6 7A A2 85 ED C7 34 08 36 98 17 FE 4E 26
       data hash MD5: 32K
       F6 C2 29 20 27 9C FA 6F CF F7 45 06 9F E3 E7 C8>)
(   2,<2019-10-24 16:26:18.40 +0400>,<she>,<DPX200>,
      <Start of raw data processing
       efp BC_mod = 2 LB = 1 FT_mod = 6 PKNL = 1 PHC0 = -887.2673 PHC1 = 538.0007 SI = 64K 
       data hash MD5: 64K
       01 88 4F FE 62 B3 0E 51 52 7F 14 8E 70 56 5A FE>)
(   3,<2019-10-24 16:26:30.98 +0400>,<she>,<DPX200>,
      <pk PHC0 = -42.79654 PHC1 = 0 
       data hash MD5: 64K
       98 1B 7E F5 F2 ED 96 A6 98 5D 04 78 AE CD F8 7F>)
(   4,<2019-10-24 16:26:33.73 +0400>,<she>,<DPX200>,
      <abs ABSG = 5 
       data hash MD5: 64K
       0F 21 C5 37 CB 1F 3D 1F 89 DD 38 95 52 A0 47 5A>)
$$ ##END=
$$ 
$$ hash MD5
$$ 52 AC 8A 6A EA D9 40 AD B5 C8 D8 11 38 F8 10 44
##$RELAX= 
##$RELAX= 
##$RELAX= 
##$RELAX= 
##$RELAX= 
##$RELAX= 
##$RELAX= 
##$RELAX= 
$$ Bruker specific parameters
$$ --------------------------
##$DU= <F:/spectra>
##$EXPNO= 1
##$NAME= <P31>
##$PROCNO= 1
##$TYPE= <nmr>
##$USER= <she>
##$AMP= (0..31)
100 100 100 100 100 100 100 100 100 100 100 100 100 100 100 100 100 100 
100 100 100 100 100 100 100 100 100 100 100 100 100 100 
##$AQSEQ= 0
##$AQ_mod= 1
##$AUNM= <au_zg>
##$AUTOPOS= <>
##$BF1= 81.014009
##$BF2= 200.13
##$BF3= 200.13
##$BF4= 200.13
##$BF5= 200.13
##$BF6= 200.13
##$BF7= 200.13
##$BF8= 200.13
##$BYTORDA= 1
##$CFDGTYP= 0
##$CFRGTYP= 5
##$CHEMSTR= <none>
##$CNST= (0..31)
1 1 145 1 1 1 1 1 1 1 1 1 1 1 1 1 1 1 1 1 1 1 1 1 1 1 1 1 1 1 1 1 
##$CPDPRG= <waltz16>
##$CPDPRG1= <>
##$CPDPRG2= <waltz16>
##$CPDPRG3= <>
##$CPDPRG4= <mlev>
##$CPDPRG5= <mlev>
##$CPDPRG6= <mlev>
##$CPDPRG7= <mlev>
##$CPDPRG8= <mlev>
##$CPDPRGB= <>
##$CPDPRGT= <>
##$D= (0..31)
0 1 0 0 0 0 0 0 0 0 0 0.03 2e-05 3e-06 0 0 0 0 0 0 0 0 0 0 0 0 0 0 0 0 
0 0 
##$DATE= 1571919975
##$DBL= (0..7)
120 120 120 11 120 120 24 19 
##$DBP= (0..7)
150 150 150 150 150 150 150 150 
##$DBP07= 0
##$DBPNAM0= <>
##$DBPNAM1= <>
##$DBPNAM2= <>
$$ [...]
##$SUBNAM3= <"">
##$SUBNAM4= <"">
##$SUBNAM5= <"">
##$SUBNAM6= <"">
##$SUBNAM7= <"">
##$SUBNAM8= <"">
##$SUBNAM9= <"">
##$SW= 369.568048894756
##$SWIBOX= (0..15)
0 1 3 0 0 0 0 0 0 0 0 0 0 0 0 0 
##$SW_h= 29940.119760479
##$TD= 32768
##$TD0= 1
##$TE= 0
##$TE2= 300
##$TE3= 300
##$TEG= 300
##$TL= (0..7)
0 120 53 12 22 120 120 120 
##$TP= (0..7)
150 150 150 150 150 150 150 150 
##$TP07= 0
##$TPNAME0= <>
##$TPNAME1= <>
##$TPNAME2= <>
##$TPNAME3= <>
##$TPNAME4= <>
##$TPNAME5= <>
##$TPNAME6= <>
##$TPNAME7= <>
##$TPOAL= (0..7)
0.5 0.5 0.5 0.5 0.5 0.5 0.5 0.5 
##$TPOFFS= (0..7)
0 0 0 0 0 0 0 0 
##$TUNHIN= 0
##$TUNHOUT= 0
##$TUNXOUT= 0
##$USERA1= <user>
##$USERA2= <user>
##$USERA3= <user>
##$USERA4= <user>
##$USERA5= <user>
##$V9= 5
##$VALIST= <valist>
##$VCLIST= <CCCCCCCCCCCCCCC>
##$VD= 0
##$VDLIST= <DDDDDDDDDDDDDDD>
##$VPLIST= <PPPPPPPPPPPPPPP>
##$VTLIST= <TTTTTTTTTTTTTTT>
##$WBST= 1024
##$WBSW= 4
##$XGAIN= (0..3)
0 0 0 0 
##$XL= 0
##$YL= 0
##$YMAX_a= 16343
##$YMIN_a= -3736
##$ZGOPTNS= <>
##$ZL1= 120
##$ZL2= 120
##$ZL3= 120
##$ZL4= 120
##$ABSF1= 182.463
##$ABSF2= -187.1042
##$ABSG= 5
##$ABSL= 3
##$ALPHA= 0
##$AQORDER= 0
##$ASSFAC= 0
##$ASSFACI= 0
##$ASSFACX= 0
##$ASSWID= 0
##$AUNMP= <proc_1d>
##$AZFE= 0.1
##$AZFW= 0.5
##$BCFW= 0
##$BC_mod= 2
##$BYTORDP= 0
##$COROFFS= 0
##$CY= -3
##$DATMOD= 1
##$DC= 0
##$DFILT= <>
##$DTYPP= 0
##$F1P= 0
##$F2P= 0
##$FCOR= 1
##$FTSIZE= 65536
##$FT_mod= 6
##$GAMMA= 0
##$GB= 0
##$INTBC= 1
##$INTSCL= 5.30512e-09
##$ISEN= 30
##$LB= 1
##$LEV0= 0
##$LPBIN= 0
##$MAXI= 10000
##$MC2= 0
##$MEAN= 0
##$ME_mod= 0
##$MI= 50
##$NCOEF= 0
##$NC_proc= -10
##$NLEV= 6
##$NOISF1= 182.463
##$NOISF2= 159.3651
##$NSP= 0
##$NTH_PI= 0
##$NZP= 0
##$OFFSET= 182.463
##$PC= 4
##$PHC0= -930.0638
##$PHC1= 538.0007
##$PH_mod= 1
##$PKNL= yes
##$PPARMOD= 0
##$PSCAL= 0
##$PSIGN= 0
##$REVERSE= no
##$SF= 81.0140089999434
##$SI= 65536
##$SIGF1= 159.3651
##$SIGF2= -187.1042
##$SINO= 113.3802
##$SIOLD= 16384
##$SREGLST= <1H.CDCl3>
##$SSB= 0
##$STSI= 65536
##$STSR= 0
##$SW_p= 29940.119760479
##$SYMM= 0
##$S_DEV= 0
##$TDeff= 32768
##$TDoff= 0
##$TI= <>
##$TILT= no
##$TM1= 0
##$TM2= 0
##$TOPLEV= 0
##$USERP1= <user>
##$USERP2= <user>
##$USERP3= <user>
##$USERP4= <user>
##$USERP5= <user>
##$WDW= 1
##$XDIM= 65536
##$YMAX_p= 428550650
##$YMIN_p= -300786304
$$ End of Bruker specific parameters
$$ ---------------------------------
##NTUPLES= NMR SPECTRUM
##VAR_NAME=  FREQUENCY,     SPECTRUM/REAL,   SPECTRUM/IMAG
##SYMBOL=    X,             R,               I
##VAR_TYPE=  INDEPENDENT,   DEPENDENT,       DEPENDENT
##VAR_FORM=  AFFN,          ASDF,            ASDF
##VAR_DIM=   65536,         65536,           65536
##UNITS=     HZ,            ARBITRARY UNITS, ARBITRARY UNITS
##FACTOR=    0.456856943014862, 1,           1
##FIRST=     14782.0589164792, 0,            0
##LAST=      -15158.0608439998, 0,           0
##MIN=       -15158.0608439998, -300786304,  0
##MAX=       14782.0589164792, 428550650,    0
$$ Real data points
##PAGE= N=1
##DATA TABLE= (X++(R..R)), XYDATA
$$ [...]
41105A0211347J272253L772949q770129j2858493L812451J8039204P780772j2428149
41097A0832205j8208200j4246860j6116904j4024184P938172L0661514K0673278
41090G509021j2713135k3902736J035544K3836728J3639996r924624j2911281
41083a3430487L793454J6019043J5467230J1165302M678211j0667785k9342020
41076b317052l2892450j3749227J1285159J7322671n03316j8472500r137101K3182784
41068b5281032M1474219K0238207j8851501l1652812o339906K5570729L1461544
41061C6619448J1201587j3454541k4320523j7069046k032893J133043j5958036
41054b3880961l3158357k1393419J7898048N0294540M9379965K3254146m005834
$$ y = [10211347, 11483600, 15256549, 6486420, -6372073, -2559622, 15479582, 23260354, 10832205, -7375995, -21622855, -37739759, -51763943, -43825771, -13164257, 7509021, -5204114, -29106850, -28071306, -4234578, 9405418, -519206, -13430487, -9637033, 6382010, 21849240, 33014542, 37692753, 27024968, -2317052, -35209502, -48958729, -37673570, -20350899, -20854215, -39326715, -48463816, -25281032, 16193187, 36431394, 17579893, -14072919, -20412825, 5157904, 36619448, 47821035, 34366494, 10045971, -7023075, -9055968, -7922925, -23880961, -57039318, -78432737, -60534689, -10240149, 39139816, 62393962, 58388128]
41047E8388128j9278323k2390224j7939947j3041395j0592286j304627K3149901
41040c008773M8080580M6316404J5274593j6216323k4826755j7794871j3857831
41033C3967024j7631061k1997985k0355188q893540R565194K0586946J2761214
41026H002604j962209j895971J0901931J4317642K886681p641941j3450520k6266016
41018a5107799l8719760k5214508J0157617K6988883R101285q030367M618882
41011c6205767K3122431J4234538r820818j7942272j2041387j2005709j3102332
41004f3761316L9578J6443828J6699721J0670791J6627906K0004825k171111k9735462
40996a5181240k1933828J4904969L2645989J5404306q53186Q556094K0398953
$$ y = [58388128, 39109805, 16719581, -1220366, -14261761, -24854047, -26158674, -3008773, 45071807, 91388211, 106662804, 90446481, 65619726, 47824855, 33967024, 16335963, -5662022, -26017210, -34910750, -25345556, -4758610, 8002604, 6040395, 4144424, 15046355, 29363997, 32250678, 24608737, 11158217, -15107799, -53827559, -79042067, -68884450, -41895567, -32794282, -40824649, -36205767, -13083336, 1151202, -8669616, -26611888, -38653275, -50658984, -63761316, -63721738, -47277910, -30578189, -19907398, -3279492, 16725333, 14554222, -15181240, -37115068, -22210099, 10435890, 25840196, 24987010, 33543104, 53942057]
40989E3942057P341528j9305857l2443906k7581108j7608707q126697L938142
40982c9844548J7785936K6475539K2614729N458369j2140532j1476295P091484
40975A5964682J8601189O394078j4877645k5656023k9742879l2914110j8700629
40968h0931337K0281623N0069152L7083560L699755n291894M528226o538743l3782186
40960a0881844l0180152J0341259L6797721K2531218K014311N388146J3482659
40953D9493318N312536k331359M999562O275151j4026955l2876621k9447281j9917801
40945c2519450j9902187j2586403J1398656K3782616P868016j981174K4385906
40938D45980N3618461L5832514j6368358m7335097l6718896r899084J2265720
$$ y = [53942057, 61283585, 41977728, 9533822, -18047286, -35655993, -43782690, -39844548, -22058612, 4416927, 27031656, 32490025, 20349493, 8873198, 15964682, 34565871, 40959949, 26082304, 426281, -29316598, -62230708, -80931337, -60649714, -10580562, 26502998, 30202753, 24910859, 29439085, 22900342, -10881844, -41061996, -30720737, 6076984, 28608202, 30622513, 36010659, 49493318, 54805854, 52474495, 57474057, 63749208, 49722253, 16845632, -12601649, -32519450, -52421637, -65008040, -53609384, -29826768, -21958752, -23939926, 445980, 54064441, 89896955, 73528597, 26193500, -10525396, -20424480, -8158760]
40931h158760K5971299K1239830n900755k7918398j6697496R687402J3513656
40924A1736778j404962j402057J4496370J4746918n461565j6169424o671017N33911
40916A0404952l912332j778897J1562803J5094791L370453j118137R308582J1336375
40908E4268590o516570k1324678j4652035j385934l83588n607244n352822l071996
40900d026277j085684R728607K6007746K4954468J293089j5902994o524730O341661
40892D0785886o544214l1390381l2333162p731533Q988655O29724j3016258r990436
40884e0601719L234515O563050l832559j2788259p469864Q109027K0419914K2204073
40876a4161822J5720686L448523j3114305k2571993p964972K5036396M0115943
$$ y = [-8158760, 17812539, 39052369, 33151614, 5233216, -11464280, -1776878, 11736778, 10331816, 8929759, 23426129, 38173047, 32711482, 16542058, 9871041, 10404952, 6492620, 4713723, 16276526, 31371317, 34741770, 33623633, 42932215, 54268590, 47752020, 26427342, 11775307, 10389373, 10005785, 4398541, -954281, -4026277, -5111961, 4616646, 30624392, 55578860, 56871949, 40968955, 34444225, 40785886, 34241672, 2851291, -29481871, -37213404, -28224749, -27595025, -40611283, -50601719, -47367204, -40804154, -44636713, -57424972, -64894836, -56785809, -36365895, -14161822, 1558864, 5007387, -8106918, -30678911, -38643883, -13607487, 26508456]
40869B6508456J3201784k7151333l1391524K543552K5530106P167390k4853342
40862h444911l0512720j2181193N79415o21518J433012J5084746K6724356K2876036
40854A4937223Q657927m2341L953564R800052L74658k2781031l2994628j0460010
40846b8554586K4878038L3968845J1541778q162314m017892L760234p279031k3284393
40838B850679j8604452K154418J3146737M931235j0633937k1949113k2435283
40831e0539716n651912K1536278L2664841J3307631j2273171j3548344j110458
40824a5614851p169851k6435222k0094349J6491032L6762774J3939586j3031991
40817a5152872J212116L5369360L3446627p333834l2646198j5894371M932390
$$ y = [26508456, 39710240, 12558907, -18832617, -16289065, 9241041, 16408431, -8444911, -38957631, -51138824, -50559409, -51180927, -49747915, -34663169, -7938813, 14937223, 23595150, 23552809, 27506373, 37306425, 37681083, 14900052, -18094576, -28554586, -3676548, 30292297, 41834075, 33671761, 29653869, 33414103, 26135072, 2850679, -15753773, -13599355, -452618, 4478617, -6155320, -28104433, -50539716, -56191628, -34655350, -1990509, 11317122, -956049, -14504393, -15614851, -22784702, -49219924, -69314273, -52823241, -16060467, -2120881, -15152872, -13940756, 21428604, 54875231, 47541397, 14895199, -999172, 3933218]
40810C933218n903622k4139735j0701669J8300498J5484681j8261023l1019183
40803e2306835j044847K8769389J7477433j4077521k0424542K096218K1641931
40796a7868774K3039743J6846590Q992651k619384q219134L159595J7309973J1684011
40788E2325271n186299n285394J0142875J0959076j0505867k7176623k3162549
40781B110490j3547723q590136K261542J7012046J2799349r920824j5551940R754446
40773c672750K9171346J3299535j1272410q508397P058101R97350j8870541k0121520
40765a1919286n072099j352845o306060O688916L1349177L0241576k243021k6392114
40757A4994244j7610934J160898J907480r540641j3837959p575186M293080K0683616
$$ y = [3933218, -1970404, -26110139, -36811808, -18511310, -3026629, -21287652, -52306835, -53351682, -24582293, -7104860, -21182381, -41606923, -39510705, -17868774, 5170969, 22017559, 31010210, 28390826, 20171692, 23331287, 40641260, 52325271, 47138972, 41853578, 51996453, 62955529, 52449662, 25273039, 2110490, -11437233, -20027369, -17765827, -753781, 12045568, 2124744, -13427196, -3672750, 25498596, 38798131, 27525721, 19017324, 26075425, 27072775, 8202234, -11919286, -16991385, -18344230, -24650290, -17961374, 13387803, 43629379, 41386358, 14994244, -2616690, -1455792, 451688, -9088953, -22926912, -30502098, -26209018, -5525402]
40749e525402L4034876K9455653P829446r241519q915576l688748q994426k1757780
40741A3196524l0135621k8561587j6333987L250684J8510604K0559124J9175269
40734c38990K7489788L3183107J2498245k6187678m5723863l3810021j8217062
40727e1106474j6499907q388767K0581777M4125155L4418353P611104m080330
40720B6660911l163020j2705623k7999137k2607060M231008K4047102K2899456
40713A1363637J5477236J2768141O945526m653753q922408j195730L616520l741983
40705C1657186j0896722o252418P47662k965940j1417831j1574739o848805r739104
40697b7290711j7388006j4109440K434114J5836891J5453329R916746Q875638
$$ y = [-5525402, 28509474, 57965127, 65794573, 56553054, 47637478, 43948730, 34954304, 13196524, -16939097, -45500684, -61834671, -58583987, -40073383, -19514259, -338990, 27150798, 60333905, 72832150, 46644472, 920609, -32889412, -51106474, -67606381, -75995148, -55413371, -11288216, 23130137, 30741241, 26660911, 23497891, 10792268, -17206869, -39813929, -35582921, -11535819, 11363637, 26840873, 39609014, 46554540, 41900787, 32978379, 31782649, 35399169, 31657186, 20760464, 14508046, 15255708, 12289768, 871937, -10702802, -17551607, -27290711, -44678717, -58788157, -56354043, -40517152, -25063823, -15147077, -6271439]
40690f271439O810805k142255o475597N938304K0536502J0469398j9835593l2544293
40682b3514168r756812J6921796J2281510q743790n896173K0236583K7293436
40675B8822382j673124l0798072k6679441n685605m58079o827343K192437K5807445
40667a5299400L5662334K2546631Q778856Q945876P936325r306323k9113950k8130948
40659B019401p521513R672339R210096j376010q508492q317077m618340o94611
40651a0134207K160903K806960J240417o74420j917060l632232n494437l668009
40643a9312085L287308Q297337K127770j2412343j8781988m572659K1285966L4497687
40635A4416993K0026704j0752598k9296956j8776938O114077J4503627j485348
$$ y = [-6271439, 539366, -1602889, -8078486, -2140182, 18396320, 28865718, 9030125, -23514168, -33270980, -16349184, -4067674, -12811464, -18707637, 1528946, 28822382, 27149258, -3648814, -30328255, -36013860, -36471939, -43299282, -41106845, -15299400, 20362934, 42909565, 51688421, 60634297, 68570622, 59264299, 30150349, 2019401, -5502112, 4170227, 13380323, 12004313, 3495821, -4821256, -9439596, -10134207, -7973304, -5166344, -3925927, -4600347, -6517407, -10149639, -15644076, -19312085, -16024777, -7727440, -5599670, -18012013, -36794001, -41366660, -20080694, 14416993, 34443697, 23691099, -5605857, -24382795, -18268718, -3765091, -5250439]
40628e250439j3553587L653547L0879391K7207632p302427k5875814l988560K1340633
40620B7110376Q416970k2921097k2249024J2172339L1987265J3042311j4821015
40613C2738125j9777776q570203m56387L577555O618913R19704j2534022j5224169
40605a2708260j227988Q422990P41848n714176N249995J6052342N424995j3057422
40597C184324j4042629l123157k491885r072630m011208O368942p22791j8096438
40589d2007472j2451861J9277892L6866907J5328849j6837148k0086695P41746
40582a9167782J0426718k355727j3852075n698552Q936800Q414754m572257q585968
40574b6454089L362394J3124166N666344o283999q66648J7832074K4451018J1700876
$$ y = [-5250439, -18804026, -15150479, 15728912, 42936544, 35634117, 9758303, 5769743, 27110376, 35527346, 12606249, -9642775, 2529564, 34516829, 47559140, 32738125, 12960349, 4390146, 3933759, 7511314, 14130227, 15049931, 2515909, -12708260, -13936248, -5513258, -4771410, -10485586, -5235591, 10816751, 16241746, 3184324, -10858305, -13981462, -16473347, -25545977, -29557185, -23188243, -23911034, -42007472, -54459333, -35181441, 1685466, 17014315, 177167, -19909528, -19167782, -8741064, -11096791, -24948866, -30647418, -21710618, -13295864, -17868121, -26454089, -23091695, -9967529, -4301185, -10585184, -11451832, 6380242, 30831260, 42532136]
40566D2532136J072704O306167R939486p093232l1315139l4115181j2244996J0533553
40558a4384502J6441088R258140k65615p742401j2744227j3668158o757980J1099350
40550a8764305L2793258L7152221J1737939k0285276k1590568M716838J3975341
40543C9735448j2093596l3632182j5606544J4862218J4077844o892244o814159
40536f363215J2047823J2022895r185746j5230906J770825R323939k306988k195990
40528a17363J9595100K6822036j057860k9371865k1872767N177713J5394489O512119
40520B1081602n52734o35435j052269k90403L105370n53366j1887336j2310601
40512c095172N133622J8949918J4492670Q371730J3091597Q547748j8975276l9518875
$$ y = [42532136, 43604840, 49911007, 59850493, 52757261, 21442122, -12673059, -24918055, -14384502, 2056586, 11314726, 11049111, 3306710, -9437517, -23105675, -29863655, -18764305, 14028953, 51181174, 62919113, 42633837, 21043269, 25760107, 39735448, 27641852, -5990330, -21596874, -6734656, 7343188, 450944, -6363215, 5684608, 17707503, 8521757, -6709149, -4938324, 4385615, 2078627, -117363, 19477737, 46299773, 45241913, 15870048, -6002719, -825006, 14569483, 21081602, 20528868, 19893433, 18841164, 18550761, 21656131, 21102765, 9215429, -3095172, 2038450, 20988368, 35481038, 43852768, 56944365, 65492113, 46516837, 6997962]
40504F997962k1753080J1325208J4310180r641152j7659241J891751J6360197
40497A831825P189152n081694l075557R13286m665898p536515K995770J3914700
40489F485069J0776447K693024O705329J9916821K3012435N185599k4276345m5094693
40481E403686m2286256j8363594Q367476K1142750J8898221J0638674L437800
40474G238757K289091J1029785K2724531K0567112J994863j0525450k02436J5323269
40466G0439522Q516235j4966763k4674035j1620499K358525J410367o038947r813813
40458A5610592j2675944j5095224q631437O044717J4185633Q907354M09615l979131
40450D776175j0169743j9495092k0171821p746704M101151O092261R288822K2671434
$$ y = [6997962, -14755118, -3429910, 10880270, 1239118, -16420123, -14528372, 1831825, 9020977, 3939283, 863726, 1777012, -2888886, -10425401, -7429631, 6485069, 17261516, 19954540, 26659869, 46576690, 69589125, 74774724, 50498379, 5403686, -36882570, -55246164, -46878688, -25735938, -6837717, 3800957, 7238757, 9527848, 20557633, 43282164, 63849276, 65844139, 55318689, 55116253, 70439522, 78955757, 63988994, 39314959, 27694460, 30052985, 31463352, 25424405, 15610592, 2934648, -12160576, -20792013, -14747296, -561663, 8345691, 8755306, 4776175, -5393568, -24888660, -45060481, -52807185, -48706034, -42613773, -33324951, -10653517]
40442a0653517L0714221J4568683j3862738k2749831m580547J2147847K816112
40435H400230j8873797k1028432R85924J8759686J2026215m465893p279667J15908
40427a1359826O3033l329269P730351K4180454J5704878j5295260k6330398r58511
40419i594548J8997689j058518k9806009k1166990Q461945J0335770j1060490
40412c4891151p411317K5931845M0065528J7528307Q05902J5711735K7842894
40405H5583743O582540k1352722k0864220n899521n920654j2784465n360964M282865
40397B4266602n151510j9933712j6412698p370202j5940353k3944485N05875L7407871
40389b6572612L4850405p462555l1907672q959026K3468295K4164750M560815
$$ y = [-10653517, 20060704, 34629387, 20766649, -1983182, -6563729, 5584118, 8400230, -10473567, -31501999, -30516075, -11756389, 269826, -4196067, -11475734, -11359826, -11296793, -14626062, -6895711, 17284743, 32989621, 17694361, -8636037, -9594548, 9403141, 8344623, -21461386, -42628376, -34166431, -23830661, -34891151, -42302468, -16370623, 23694905, 41223212, 42029114, 57740849, 85583743, 92166283, 70813561, 49949341, 44049820, 38129166, 25344701, 19983737, 24266602, 19115092, -818620, -17231318, -24601520, -40541873, -64486358, -63980483, -26572612, 8277793, 815238, -31092434, -40051460, -16583165, 7581585, 12142400]
40382A2142400n053570n423209j2061169j7850494o967492J0185117Q066183j4355893
40374c1318127l0145748j9586953Q354390K9443595K7647660O863113j2841981
40367b1584051j3712131K37150Q363509J075603q862876q481384l307754k187306
40359d8459240K133064J8612804L3718677K5061553k120007j5743092p00227J8549439
40351C1052971J1752313j6192984l4167219k4859933Q40960K2666882K6216609
40344A7309599M390561l4313343n8502679l9191870J0385437M3135632L6273096
40337b0513567J6191902J0872167P986518j1950582k9268139j4108794J6107719
40330b4682776J8111476m558430m707226K7217014M2589060J5579118j1240495
$$ y = [12142400, 7088830, 1665621, -10395548, -28246042, -35213534, -25028417, -16962234, -31318127, -61463875, -81050828, -72696438, -43252843, -15605183, -8742070, -21584051, -35296182, -35059032, -26695523, -25619920, -34482796, -42964180, -46271934, -48459240, -46326176, -27713372, 6005305, 31066858, 28946851, 13203759, 12503532, 31052971, 42805284, 26612300, -7554919, -32414852, -31573892, -8907010, 17309599, 21700160, -12613183, -71115862, -110307732, -99922295, -56786663, -20513567, -4321665, 6550502, 14537020, 2586438, -26681701, -40790495, -24682776, -6571300, -11129730, -15836956, 11380058, 53969118, 69548236, 58307741]
40323E8307741K350809K6174997J0256124l2332087m7843492k5025270n89935
40316h701113O953869J3962101K3468494J3293161j7654340l5975232k2468081
40309b7121141J124279Q970329L668850k351776q518947j3264745n898361J1787788
40301c1603724J8787332N956808p412664l860209O088674M942083l805951p107689
40293a8015340n250667m759675k440332N432496J0198432M521612k007489J874174
40285a0446789Q587422M590055m788830k988773R990270J6840496R956821J944007
40277C3684679M514190R882653K141397j8029038k9765461j7439003N476539R679896
40269A45852r711669k1894265l067020K4608099K1798753q207712k1367003K143354
$$ y = [58307741, 60658550, 86833547, 97089671, 64757584, 16914092, -8111178, -8701113, -1747244, 12214857, 35683351, 48976512, 31322172, -4653060, -27121141, -25996862, -17026533, -13357683, -15709459, -24228406, -37493151, -43391512, -31603724, -12816392, -6859584, -14272248, -18132457, -12043783, -7101700, -10907651, -18015340, -23266007, -28025682, -30466014, -25033518, -14835086, -10313474, -12320963, -10446789, -1859367, 2730688, -2058142, -5046915, 4943355, 21783851, 31740672, 33684679, 38198869, 48081522, 50222919, 32193881, 2428420, -15010583, -9534044, 145852, -9565817, -31460082, -34527102, -9919003, 11879750, 3672038, -17694965, -15551611]
40261a5551611K9067397K3594799l496612j8542883j4322895q848898j0223191
40254a8323894j0119488m929555j1234L764860R464325J3637155J1621176Q221593
40246A3324938Q857253O786361n511511j9089720j9451109r223134k793297k518350
40238b9618569K013178J2791856J8531737J2271649L99170p476919p863370l103567
40230b054835L31126l742518j1834906j2358215l553102J217347l541322j610094
40222c7146519J8763448L8165823K8812296l738276k6624284k4332619j2554404
40215a8654535p216203m796728J030606N326055L567058P19030M67731q63549
40207b0420535l373870l7770R470793J3807251N778589o851948j2411165r173505
$$ y = [-15551611, 13515786, 37110585, 33613973, 15071090, 748195, -8100703, -18323894, -28443382, -33372937, -33384171, -29619311, -20154986, -6517831, 5103345, 13324938, 22182191, 28968552, 23457041, 4367321, -15083788, -24306922, -27100219, -29618569, -27605391, -14813535, 3718202, 15989851, 16389021, 8912102, 1048732, -2054835, -1723709, -5466227, -17301133, -29659348, -33212450, -31995103, -35536425, -37146519, -18383071, 19782752, 48595048, 44856772, 18232488, -6100131, -18654535, -25870738, -30667466, -29636860, -24310805, -20743747, -20024717, -19556986, -20420535, -23794405, -23832175, -14361382, -554131, 5224458, -1627490, -14038655, -23212160]
40199b3212160l641718j061472j96539N449312J8003896K4196906N993652k8172698
40191b640821l9816772q742312K9849181K6614513j2016472l1822374r541847
40184d8116904J6390364P311026j9762323k2293295O702510L5104623L5720134
40177A1056135J1558546j5030048k2670361p193420J2444332J3151632k378403
40170I38413r237067K178713J3681863J2135135Q486166R828449R76081k3634720
40162A5353033l6310102j4402869J8615939K4115558M723886o360615j276527
40155D458303k508318j4898115j3937269R979925L0910931K5354956L959270r904910
40147C3414773j2000348j2579412j5816994j7374660j2292932J624747J7939618
$$ y = [-23212160, -26853878, -27915350, -28111889, -22662577, -4658681, 19538225, 25531877, -2640821, -42457593, -51199905, -21350724, 5263789, -6752683, -38575057, -48116904, -31726540, -24415514, -44177837, -66471132, -59768622, -24663999, 11056135, 22614681, 7584633, -15085728, -22279148, -9834816, 3316816, 938413, -8298654, -6119941, 7561922, 19697057, 28183223, 38011672, 38987753, 15353033, -20957069, -35359938, -16743999, 7371559, 12095445, 5734830, 4458303, 1949985, -12948130, -26885399, -16905474, 14005457, 39360413, 43319683, 33414773, 21414425, 8835013, -6981981, -24356641, -36649573, -35024826, -17085208]
40140a7085208J8518878o444006l3995247k7367149J2997260M2014693K8117786
40133A6757007l759778q774809J5180460K8603281Q188401k2857238k7841781
40126E495543k263024K4170438K3891169o7241k3134915l0168004k8118660k6252270
40118e6446964j7437860O916653L2312291L3212575R319533j2022785j3341003
40111a7487560l989262O828863K5946901M9101560M6239950K782679m3715170
40104F5707961m3432944k605527K3814913P828850j9497601k1073646m300661
40097F441345K653730j636282J849802J2566043Q924153j3498457k9601896j9119068
40089c1420630O217479K1201296J8314894P389903m129827j3849775j4153547
$$ y = [-17085208, 1433670, -5010336, -39005583, -66372732, -53375472, -11360779, 16757007, 12997229, 4222420, 19402880, 48006161, 56194562, 33337324, 5495543, 3232519, 27402957, 51294126, 51226885, 28091970, -2076034, -30194694, -56446964, -73884824, -66968171, -34655880, -1443305, 7876228, -4146557, -17487560, -21476822, -14647959, 11298942, 60400502, 106640452, 109423131, 65707961, 22275017, 19669490, 43484403, 51313253, 31815652, 10742006, 6441345, 9095075, 7458793, 9308595, 21874638, 30798791, 17300334, -12301562, -31420630, -25203151, -4001855, 14313039, 21702942, 17573115, 3723340, -10430207]
40082a0430207J080745J9124188J6676835q278360k9077424k4256719m558547
40075c9719489N986565K782902j245290M01942M295336R870652J5956229J0852602
40067I181449j1576410l0330642j8295956J5229363L1815670J7913959N49953
40060A4487386n961R80895j1231259k0219619j1069906l893225j9595242l5369863
40052h5916794j5722612K6209757M2631900K2069695K813485J0885991K5182575
40045B8153997J7573000n615698j9720153j5393803q45330J1741908J2293299
40038B8187220J708871k067893J3037963K5715346O195627l0453078l4923398
40031G400658K400437L1341207J6779348j0004343p699778P684051k175830k5916523
$$ y = [-10430207, -9349462, 9774726, 26451561, 18173201, -10904223, -35160942, -39719489, -33732924, -30950022, -32195312, -31793370, -27498034, -17627382, -1671153, 9181449, -2394961, -32725603, -51021559, -35792196, -3976526, 13937433, 14487386, 14481425, 15462320, 4231061, -15988558, -27058464, -30951689, -50546931, -85916794, -101639406, -75429649, -32797749, -10728054, -7914569, 2971422, 28153997, 45726997, 40111299, 20391146, 4997343, 4152013, 15893921, 28187220, 29896091, 27828198, 40866161, 66581507, 72777134, 42324056, 7400658, 9801095, 41142302, 57921650, 47917307, 40217529, 47901580, 45725750, 19809227]
40023A9809227k1133226J0013587K1568162o0988j5163428J789876K1663542J0631636
40015D9118388j6632518k3081366m351691J1966711R356068j450262n867292n285942
40007A3772096r831117k1165515k8010251j9028450J455702J6368905J6977327
40000b9461303J1778029Q660043K301656q722908r409665O640137J6134349j170865
39992c250527k1998005r035451K5816455L2018713j837297k7992691j3363988
39985a9642791J1791831O825233j6266666j9691908k094680O660583k786569j0618060
39977d5823027l801192J0327393K1913791K4881359J2048504j2296538k3626633
39970a6376343o146249J8301110J7187868n310421j7466177r582724j223633j666701
$$ y = [19809227, -1323999, 8689588, 30257750, 30196762, 15033334, 16823210, 38486752, 49118388, 32485870, 9404504, 5052813, 17019524, 26375592, 24925330, 19058038, 13772096, 3940979, -17224536, -45234787, -64263237, -62807535, -46438630, -29461303, -17683274, -9023231, -6721575, -15444483, -24854148, -18214011, -2079662, -3250527, -25248532, -34283983, -8467528, 23551185, 21713888, -6278803, -19642791, -7850960, -1025727, -17292393, -36984301, -39078981, -32418398, -35204967, -45823027, -49624219, -39296826, -17383035, 7498324, 19546828, 7250290, -16376343, -22522592, -4221482, 12966386, 7655965, -9810212, -19392936, -20616569, -22283270]
39962b2283270J238762R385027O929027o276407o752169J3071530K6911706J4068276
39954C6292482q347258j2866618o86508Q542686R914774J3227220J9322580J7743204
39946H3142562M871418j0612070j8718146j5600830m567738L446640k222726j6364141
39938B3374969j9047561r63217K1230411K4744345Q519544q477765j1045323j315536
39930C7019867O816774O88744j8875094l5115754l2282749j5998393n353051m241709
39922f7341365J785206J5847214J9651477N294120n526510O150672K3896921K0279014
39914B0036749j25105r796314j608460N879211K624117k558944o234947j5647308
39906g431001k5029704j5980793Q193806J6648366l862200k2649274o810714K8870915
$$ y = [-22283270, -21044508, -11659481, -4730454, -11006861, -17759030, -4687500, 22224206, 36292482, 27945224, 15078606, 14392098, 22934784, 32849558, 46076778, 65399358, 83142562, 88013980, 77401910, 58683764, 43082934, 38515196, 41961836, 39739110, 23374969, 4327408, 3364191, 24594602, 49338947, 57858491, 49380726, 38335403, 37019867, 43836641, 44525385, 25650291, -9465463, -41748212, -57746605, -63099656, -67341365, -65556159, -49708945, -30057468, -24763348, -30289858, -24139186, -242265, 20036749, 19911644, 10115330, 8506870, 14386081, 17010198, 14451254, 8216307, -7431001, -32460705, -48441498, -40247692, -23599326, -27461526, -50110800, -56921514, -28050599]
39898b8050599M1145435J8473272n992768k591851J7584264K2785289K497305
39891F5850347k3258457l0999239k0358448j1551565j8771823l0512901k2976926
39884i2579012O329150K9611286K2335646l583197j5402497l966954O955980j118818
39876e1418416j4220224r402014R898718K0425505J3701792M595846N669133J0549424
39868a0200236P782194k039488r480338p395694N192828K0866890K3304492K530472
39860C0561120k4865657k7762951k390138J6288617J411997k5186989k3645972
39853e5589973N354172K3902769J4758205J712958O043055J5596676J2639961
39846B4417823M623610N824503R716714L339647p337768j1221034j7192556l6895288
$$ y = [-28050599, 13094836, 31568108, 25575340, 22983489, 40567753, 63353042, 65850347, 42591890, 11592651, -8765797, -20317362, -39089185, -69602086, -92579012, -86249862, -56638576, -34302930, -37886127, -53288624, -57255578, -50299598, -51418416, -65638640, -75040654, -65141936, -44716431, -31014639, -26418793, -20749660, -10200236, -2418042, -4457530, -13937868, -21333562, -16140734, 4726156, 28030648, 30561120, 5695463, -22067488, -24457626, -8169009, -6757012, -31944001, -55589973, -50235801, -26333032, -11574827, -9861869, -3818814, 11777862, 24417823, 29041433, 34865936, 44582650, 47922297, 40584529, 29363495, 12170939, -24724349]
39838b4724349n1889491l1264633J7595241M8276901L4871970M736196l501672
39831e899837Q489392J1317022k840979j0567576M511545K6695621L0035761J1638283
39823G3379232p954151j1471488j309002R497438J2415867N759676r771199k9221063
39815D1325310m0419577l2811019j0744489R291673J6489661J4296215J0541051
39808G968825Q114960Q380115J3579524J9447162J4238036o329692k9168498l6864973
39800f34541k6223755p752158P544011J4195842J1309794L450957j762942k285465
39792b158257k015503O85078J3433333L1930643L5991788J6440135o758760r970291
39784G7578166J131728L738550n455639r468543l449061k323806j2737248k0987107
$$ y = [-24724349, -76613840, -107878473, -90283232, -42006331, -7134361, -2398165, -5899837, 2589555, 13906577, 11065598, 498022, 5009567, 31705188, 61740949, 73379232, 65425081, 53953593, 52644591, 62142029, 74557896, 80317572, 70546373, 41325310, 905733, -31905286, -42649775, -33358102, -16868441, -2572226, 7968825, 16083785, 24463900, 38043424, 57490586, 71728622, 65398930, 36230432, -634541, -26858296, -34610454, -27066443, -12870601, -1560807, 1890150, 127208, -2158257, -4173760, -3488682, 9944651, 41875294, 77867082, 94307217, 87548457, 77578166, 78709894, 82448444, 76992805, 67524262, 64075201, 61751395, 49014147, 28027040]
39776B8027040j7461659j3089419j9085052k5376670j4242544J2075146L0685925
39769a8467233K4388876J504371j2883558m867468J1596118J1900460n774370
39762G397196j7087858p044961Q279364R050917K792622O343848J2284368K806706
39754B4822202j3198443j1683072J911786j937113k3250115k5149800O671025
39747d1813530L5611774K7135231k392615j6265273j0417039o548297j1715537
39740b6405286j4170163p754715L181732J3388234J4434442k014585k2912532
39733d2252873j7849619J4822922L2011449N507378k8373200j8339679K3391830
39726c1081792M0362192J8112550k814495n28830j899755k3488600l4675114r591335
$$ y = [28027040, 10565381, -2524038, -21609090, -46985760, -61228304, -49153158, -18467233, 5921643, 7426014, -5457544, -10325012, 1271106, 13171566, 7397196, -9690662, -16735623, -8456259, 594658, 3387280, 9731128, 22015496, 24822202, 11623759, -59313, 1852473, -84640, -23334755, -48484555, -41813530, -6201756, 20933475, 18540860, 2275587, -8141452, -14689749, -26405286, -40575449, -48330164, -45148432, -31760198, -17325756, -19340341, -42252873, -60102492, -45279570, -13268121, -7760743, -36133943, -54473622, -31081792, 9280400, 27392950, 24578455, 24049625, 22149870, -1338730, -36013844, -45605179]
39718d5605179K4658280K8332030Q810982Q47962O113839n163217l7378603n4395609
39710g3779515l0753175J0722465K9070122J6326362N09174M101159J7645097
39703b6158311J9749942J0246771P954211J7447872J7749102m637462k7621539
39696A4730586j9764950J3093936L2724952K0437725j630317q184795m279190
39689D7127947o382896j1485363o587876M074039L872210r221506j9161405j4255201
39681a2020051O05409J3067023J4280221L536983r034960r425741J679096N582071
39673H270051p390265j8532871o873189J4727059J5300599n096747j2136741R827873
39665a904231L1441487K2043825n293138j6819482q177879k244622p037071p810095
$$ y = [-45605179, -20946899, 7385131, 16196113, 17044075, 23157914, 17994697, -19383906, -73779515, -104532690, -93810225, -64740103, -48413741, -47904567, -43803408, -26158311, -6408369, 3838402, 11792613, 29240485, 46989587, 42352125, 14730586, -5034364, 8059572, 40784524, 61222249, 59591932, 51407137, 47127947, 40745051, 29259688, 22671812, 26745851, 30618061, 21396555, 2235150, -12020051, -11414642, 1652381, 15932602, 19469585, 10434625, 1008884, 2687980, 8270051, 879786, -17653085, -24526274, -9799215, 5501384, 404637, -11732104, -1904231, 29537256, 51581081, 46287943, 29468461, 21290582, 19045960, 12008889, 4198794]
39657D198794l89369j033525j5065825k2797102j0342968P556904J1786783P686611
39649a8399697J1377307K1926835K6415214K1094147Q823052j2549029l8307022
39642B0380807m5749070k1102496J1372329J6837496J118112J125505K4612350
39635H595033L7309825J8666089p363403j4235820j0964289j4937753j7101428
39628c1746l460597J2741819J1818092K075082K298163O222410k585739j4855326
39620A4222158j1290522l449167j7765051m2222832l3291266J6164521N6965265
39613b0666894M8680574J0991511j1912532j1193942j0383172j9339205k0760378
39606c4584038j122540K5694860L2971710J2397097j5127686k2139630o078712
$$ y = [4198794, 3809425, 2775900, -12289925, -35087027, -45429995, -37873091, -26086308, -18399697, -7022390, 14904445, 41319659, 62413806, 71236858, 58687829, 20380807, -25368263, -46470759, -35098430, -18260934, -17142822, -16017317, 8595033, 45904858, 64570947, 57207544, 42971724, 32007435, 17069682, -31746, -3492343, 9249476, 21067568, 23142650, 25440813, 31663223, 29077484, 14222158, 2931636, -517531, -18282582, -60505414, -93796680, -77632159, -20666894, 28013680, 39005191, 27092659, 15898717, 5515545, -13823660, -34584038, -35706578, -10011718, 22959992, 35357089, 20229403, -1910227, -7988939]
39599g988939J0131736J0862444O417044R374564J0352185k971600j7806802j3601385
39591D769247K649203P333348o60831k902225J937262m99478m510899J0347038
39583A8462665L4867793L3640233L156469j6622791n508045N282698j1042919
39576F2236103l0786487k2489095o00416K383990r230735q032985O581652J1713576
39568A1775603K294989o295146q011926o963633K276271K3939896L8745445K3568316
39560H1329815j1692823l4939471l3650979j9406650J21184K2973082L3786583
39553C8520741J6527783j4769278k7954374j5048465M261354J7257992K6238247
39546D5034000K6065842Q178700j2750313j1334464N967541O207723j6488423
$$ y = [-7988939, 2142797, 13005241, 19422285, 28796849, 39149034, 36177434, 18370632, 4769247, 7418450, 14751798, 14090967, 11188742, 13126004, 12626526, 8115627, 18462665, 53330458, 86970691, 90127160, 73504369, 67996324, 73279022, 62236103, 31449616, 8960521, 8360105, 10744095, 1513360, -6519625, 62027, 11775603, 14070592, 7775446, -236480, -7200113, -4923842, 19016054, 57761499, 81329815, 69636992, 34697521, 1046542, -18360108, -18238924, 4734158, 38520741, 55048524, 40279246, 12324872, -2723593, 1537761, 18795753, 45034000, 71099842, 79278542, 66528229, 55193765, 61161306, 67369029, 50880606]
39539E0880606k9993988j7215018k245427o857035j6495932j2066302l946206
39532c7939302p250231r634555N599482K4121270K0331536l52844r938041j161824
39524a6224509P126796N155533M287834J0604344J2126983K023188n490350L834473
39516B3444292K0588022K4070581J0679838n742638j8276353l2603823m4582067
39509b2422148l4224715J090776K5557066O452567l1318124k9923307J7483566
39502f7304319N0203509K7198422j2364061j2703001J2278988J0627681j4237777
39495f300558r825582K8715866L9993821m954780m9201820l3544718J5828077
39488a9289694L1838159N054264j5489352l110922J6597864J5565206k63325j3349011
$$ y = [50880606, 20886618, 3671600, 1426173, -5430862, -21926794, -33993096, -37939302, -45189533, -54824088, -49224606, -25103336, -4771800, -5124644, -15062685, -16224509, -9097713, -3942180, 345654, 10949998, 23076981, 25100169, 19609819, 23444292, 44032314, 68102895, 78782733, 73040095, 54763742, 22159919, -22422148, -56646863, -55556087, -29999021, -23546454, -54864578, -84787885, -67304319, -17100810, 10097612, -2266449, -14969450, -2690462, 7937219, -6300558, -16126140, 12589726, 52583547, 47628767, -1573053, -35117771, -19289694, 12548465, 17602729, 2113377, -997545, 15600319, 31165525, 30902200, 17553189]
39480A7553189k1580375k9185937l1019756j9496554K096476K0453651K2763341
39473c8415965P601463j0075226j1045546L801062J0345626o437184k7425279
39466g1651049k3514221K317947J8582167J1050219K916914J9525464M8804994
39459H032435N3352500J7878970l0002225n0594085l3907232k151409K2100098
39452a5290948L4171075L3884760J5886747j3781329l0058264j8936384k059828
39445C815829o395005j9974605r278853K4016805M0455361K1842914l569899p567438
39437D3345109K06469p78531p509331q813679r714628j5720807j3978049M881143
39429h082304K3886182K2697821P223210o084992j7422758l0056821k7904570
$$ y = [17553189, -4027186, -33213123, -64232879, -83729433, -81632957, -61179306, -38415965, -30814502, -40889728, -51935274, -48134212, -37788586, -44225770, -71651049, -95165270, -92847323, -74265156, -63214937, -60298023, -40772559, 8032435, 61384935, 79263905, 49261680, -1332405, -35239637, -37391046, -15290948, 18880127, 52764887, 68651634, 54870305, 24812041, 5875657, 3815829, -2579176, -22553781, -31832634, -7815829, 32639532, 54482446, 50912547, 43345109, 43551578, 42773047, 35263716, 26450037, 16735409, 1014602, -12963447, -8082304, 15803878, 38501699, 45724909, 39639917, 22217159, -7839662, -35744232]
39422c5744232K235609L7692096M0677588P671803k7494315l6103517j8607330
39415b9672298P577568K2930956J4704732q923137k0407516o250562J2438885
39408g601372J1970434K592463P318038K0281161J8895397O228247M686673J2725465
39400G7096506N670673j9078461l3938873k4897625j0935241r719045j2238081
39393b8040147m209181J0107063J8317855J7232686J0048499o58992j1208895
39386A1588888j8319387k2693299k1940716p568137J7183170K9211760J6378294
39379C840573K796012J5179807L6135508K6396148j3152197m1108366l6830594
39372f743109k1628756j3733378l595478J3177786J7029404j042704j6374077
$$ y = [-35744232, -33508623, 4183473, 44861061, 52532864, 25038549, -11064968, -29672298, -22094730, 836226, 15540958, 6617821, -13789695, -20040257, -7601372, 4369062, 6961525, 14279563, 34560724, 53456121, 59684368, 64371041, 77096506, 82767179, 63688718, 29749845, 4852220, -6083021, -15802066, -28040147, -32249328, -22142265, -3824410, 13408276, 23456775, 22797783, 11588888, -6730499, -29423798, -51364514, -58932651, -41749481, -12537721, 3840573, 6636585, 21816392, 57951900, 84348048, 71195851, 30087485, -6743109, -28371865, -42105243, -45700721, -32522935, -15493531, -16536235, -32910312]
39365c2910312m014752K5682534M2146449K9544283l316911l2450100l4181375
39358i500184r057535J0889811K05100k1487974j8235516M755155J2611816K596183
39350b7223144L641861J4405229J431997k9867718k7035707K1686311N4408372
39343A1447201K7246113j8591918k6007004n562970K150071K79965J1675752J9300070
39335B1937280m257028l4795755k8443718L857591J5970234M707178M979529J8116490
39327B071801J1306631j3912132j8110154M947156J4968135n019270k2326818
39320b6074651j4524102k631377l648414Q72668K2643884L5725936J7824052j0998760
39312A9189236j9919595j1099746n465968o591955l323202O916272J6189019J6105828
$$ y = [-32910312, -36925064, -11242530, 30903919, 60448202, 57131291, 24681191, -9500184, -18557719, -7667908, -7462808, -28950782, -47186298, -42431143, -29819327, -27223144, -23581283, -9176054, -7744057, -37611775, -64647482, -42961171, 11447201, 38693314, 20101396, -5905608, -11468578, -9318507, -9038542, 2637210, 21937280, 17680252, -17115503, -45559221, -41701630, -25731396, -21024218, -16044689, 2071801, 13378432, -533700, -18643854, -13696698, 1271437, -3747833, -26074651, -40598753, -43230130, -46878544, -46005876, -23361992, 12363944, 30187996, 19189236, -730359, -11830105, -17296073, -23888028, -27211230, -20294958, -4105939, 11999889]
39304A1999889Q03556k5051852l7900069j7484854J8329738K8716774P722743
39297a2864075m203537J9266811M9218235M3244555M720201k5189604k1424948
39290E2767638N40651Q669445r553648l2460746k5929489J1845055L7100527J3352521
39282E6331954l2769931m2115985n340199K7099848K2263796N809205R097206
39275D0375894J9885432J3039334o499483k1994351l4958406m6126184l5772041
39268g2049805K966476L6361175L1360482M004832p928643j032844J511582l479642
39260h286387m08867P963853L715614j0714090j5078412o546701j009578k372594
39252c2737162m56979M233816L383127L666350J5000342K1068305j452923l4384074
$$ y = [11999889, 12803445, -12248407, -50148476, -67633330, -49303592, -20586818, -12864075, -17067612, 2199199, 51417434, 94661989, 99382190, 74192586, 52767638, 53308289, 61977734, 52424086, 19963340, -5966149, 5878906, 42979433, 56331954, 23562023, -18553962, -23894161, 3205687, 25469483, 31278688, 40375894, 60261326, 73300660, 66801177, 44806826, 9848420, -36277764, -72049805, -69083329, -32722154, -1361672, 2643160, -5285483, -6318327, -4806745, -8286387, -8695254, -731401, 2984213, -7729877, -22808289, -29354990, -30364568, -32737162, -33194141, -28960325, -25577198, -21910848, -6910506, 14157799, 12704876, -21679198]
39244b1679198k9980566J8179128N4613235L2805771k2340696m8205885k2792688
39237c9400899J5867459K2331125m494227k6506383j4746011J6287599K9162874
39230a498463J3878111j458308K581515N059346j6671156l8913867k0699686K7665461
39222c0057047M8595078J6760900k4073941k1521703J7386484M1582731K1706359
39215G0378861k1228877m5577409l2679314j794080J3960871O242743k042245
39208a2739450M609857P391008j3102700l3707637j6128580K9285811N0259433
39201A5867742K7308010j989958n821637r48347j0649113k1320733j2581795K893744
39193g242087M866221L587120J5626139K4932742P998655j9313291k1379058J538999
$$ y = [-21679198, -51659764, -33480636, 21132599, 53938370, 31597674, -16608211, -39400899, -23533440, -1202315, -5696542, -32202925, -46948936, -30661337, -1498463, 12379648, 10921340, 13502855, 18562201, 1891045, -37022822, -57722508, -30057047, 18538031, 35298931, 11224990, -10296713, 7089771, 48672502, 70378861, 49149984, 3572575, -29106739, -30900819, -16939948, -10697205, -12739450, -8129593, -738585, -13841285, -47548922, -63677502, -34391691, 15867742, 43175752, 41185794, 35364157, 34415810, 23766697, 2445964, -10135831, -7242087, -2375866, 1211254, 16837393, 41770135, 49768790, 30455499, 9076441, 10615440]
39185A0615440J7063571J3087487P072354O410335j107218j5474722j9868295
39178A7798952j2518823r671275j2518738n437873P631243K332465k0460907k6139457
39170e8984413L9514K6436497K3207376M179085m314497n695268j3808444j7506230
39162d6446380l28447K2031547J9946018m625376k2929676k1726158j0786048
39155f4864520L594641K0703367K7280155J1061854j0511047r654854M953986
39148a7436418j223518k8392037l5704852o659027K2493534K1518072J1595771
39141c3808475J9965502K6857785K105899l1749945k5795472J6194395L8030978
39134A1800667J4154482j6590880j5347908J922657M30154j5675703j6087804
$$ y = [10615440, 27679011, 40766498, 47838852, 54249187, 53141969, 37667247, 17798952, 5280129, -4391146, -16909884, -22347757, -14716514, -12384049, -32844956, -58984413, -58944899, -32508402, -9301026, -5121941, -9436438, -15131706, -28940150, -46446380, -46774827, -24743280, -4797262, -9422638, -32352314, -54078472, -64864520, -61269879, -40566512, -13286357, -2224503, -12735550, -22390404, -17436418, -18659936, -47051973, -82756825, -89415852, -66922318, -45404246, -33808475, -13842973, 13014812, 15120711, -16629234, -42424706, -26230311, 11800667, 25955149, 9364269, -5983639, -4060982, -3630828, -19306531, -35394335]
39127c5394335L355209J6086024P520614p212143j1361238q512867p365705k688715
39119d5573156J3186244K8823872K2116524o971468k7614162j4416879J6409737
39112a4039288K5375246K278400k2323121k4381506j8228815k2964138k3636480
39105i7919702R44656K9565414K1572036j5247376k6578958Q541464M4227994
39098c4894472L5543262Q62898j3897333k660135N252599l355158j4519465j6317090
39090d3984894q418234Q902041K9149380L3111520J2789213j0349335j5559464
39083E640227j4197146k1875783k1141524P244213L4547699J8061715k3740089
39076a5460688k8858642J1981408L7871666J2592718k2877417k1496773K86235
$$ y = [-35394335, -32039126, -15953102, -8432488, -15644631, -27005869, -35518736, -42884441, -45573156, -32386912, -3563040, 18553484, 11582016, -16032146, -30449025, -14039288, 11335958, 13614358, -8708763, -33090269, -51319084, -74283222, -97919702, -96975046, -67409632, -45837596, -61084972, -87663930, -79122466, -34894472, 648790, 1511688, -12385645, -15045780, -9793181, -13148339, -27667804, -43984894, -52403128, -43501087, -14351707, 18759813, 31549026, 21199691, 5640227, -8556919, -30432702, -51574226, -44330013, -9782314, 8279401, -15460688, -44319330, -32337922, 5533744, 18126462, -4750955, -26247728, -25961493]
39069b5961493L255423r285343j2092292q249144j1610932p778287J8434858L9811884
39061a3475326K2422908j2696173j6895741Q502281J8134948J672567k969222
39054D696242J7629415K6482162L100055j8351439q740693M922651j1741401l6743292
39046a8746300k4363065J9587535M3570785K4951233m248568r873878K398837
39039C3276579Q785115K825202o879456j5267989k0519623j7147028m924046K710072
39031a7141174n596788j8253578j1511482J6402373L7218601K7939821J766764
39024C0824537j1871659r707424j3725404k7875414k5235139O965115L6845501
39017a3779887L0142593L765934Q74689K2156160K4966134n786656l1316620k1366082
$$ y = [-25961493, -22706070, -31991413, -44083705, -52332849, -63943781, -71722068, -53287210, -13475326, 8947582, -3748591, -20644332, -12142051, 5992897, 7665464, 4696242, 22325657, 48807819, 51907874, 33556435, 24815742, 29738393, 17996992, -18746300, -43109365, -23521830, 20048955, 45000188, 40751620, 30877742, 33276579, 42061694, 44886896, 38007440, 22739451, 2219828, -14927200, -19851246, -17141174, -22737962, -40991540, -52503022, -36100649, 1117952, 29057773, 30824537, 18952878, 9245454, -4479950, -32355364, -57590503, -50625388, -13779887, 16362706, 20128640, 21003329, 43159489, 68125623, 62338967, 31022347, 9656265]
39009I656265j350217o365504k1655263j0383233K0449890K9224552Q016314n721948
39001B1870856P722120J9328595K260588k2450563k0234459J031291L638170k0977999
38993g811401l8535901k0352744J9260677M3686711L5843079Q358955j6910827
38986B3538549k6448686j7185818M974328K5434752K8514051J1669771j0264242
38979D0232705j9495972j2489020L36653Q486465Q553257M15569j3090560k1216545
38971h267448j1935591J0235876K3715687J6155444J274439k277359J595093k389241
38963B8106900r979691k005531J9420137K5572613K488781k4755595k6028376
38956A2819238p446329J913988o632044j4287872o929790P394655J4968977J3030524
$$ y = [9656265, 8306048, 1940544, -19714719, -30097952, -9648062, 19576490, 27592804, 21870856, 29592976, 48921571, 51182159, 28731596, 8497137, 9528428, 13166598, -7811401, -46347302, -66700046, -47439369, -3752658, 32090421, 40449376, 23538549, -2910137, -20095955, -15121627, 10313125, 38827176, 50496947, 40232705, 20736733, 8247713, 8584366, 17070831, 25624088, 26039657, 12949097, -8267448, -20203039, -9967163, 13748524, 29903968, 31178407, 28901048, 30496141, 28106900, 18127209, 16121678, 35541815, 61114428, 63603209, 38847614, 12819238, 5372909, 7286897, 654853, -13633019, -20562809, -13168154, 1800823, 14831347]
38948A4831347N996954j456844m131591j78287L432374K36699k436671O017869
38940B2311850J7550607J3928789j187692l160604J2185088J5020793j2349289
38933F4299542m0499311l2195523L41691J1971738q601922k5563511j3294475
38926d3541771Q627719J2149035K640329J681483Q857705O925423n788469j3004074
38918b1452620p189497J792149M993128M811914N348549N934850O773392R914309
38910A0926174J2365742P862066k528355r950637r160828k969935M015875P553570
38902A8113672J598879j4448456k6783827j9139870L937626J9739401J7646289
38895F63714J1803972J6216225K2825060J7002953K076832p536317q864098r246387
$$ y = [14831347, 20828301, 19371457, 15239866, 15061579, 18493953, 18730652, 16293981, 22311850, 39862457, 53791246, 52603554, 49442950, 61628038, 76648831, 64299542, 23800231, -8395292, -8053601, 3918137, -4683785, -30247296, -43541771, -34914052, -22765017, -20124688, -18443205, -9585500, -2660077, -8448546, -21452620, -28642117, -26849968, -21856840, -17044926, -11696377, -5761527, 1011865, 10926174, 23291916, 31153982, 28625627, 18674990, 9514162, 6544227, 10560102, 18113672, 19712551, 5264095, -21519732, -40659602, -36721976, -16982575, 663714, 12467686, 28683911, 51508971, 68511924, 70588756, 63052439, 54188341, 44941954]
38887D4941954q925697k703975M580847L011664l134733o84924P346710M516544
38879D8948390o747814j514650K6701656M6908500L2900499K424653j2248618
38872A37372616j3274599k1887020k8397262l601947L9767492M7578759M052046
38865A61610085l4899817j9183251K3085008L2716892R674049L273969K6332947
38858B02609882L7340055J3269691j3312172r137881J1097323J7185854J0727089
38851B69779841J0742649J7381658J8878549J5267725R431956n871304k5839286
38844C09771788k0572246K2573842O2593558N1062905L120803k1886354o770360
38837C99893936M401806j8916442m7693861m3790861j7375698l237021o678455
$$ y = [44941954, 36016257, 33312282, 37893129, 40904793, 37770060, 37085136, 44431846, 48948390, 42200576, 40685926, 67387582, 114296082, 147196581, 149621234, 137372616, 124098017, 102210997, 73813735, 70211788, 109979280, 157558039, 161610085, 126710268, 107527017, 130612025, 163328917, 173002966, 176276935, 202609882, 239949937, 253219628, 239907456, 230769575, 241866898, 259052752, 269779841, 280522490, 297904148, 316782697, 332050422, 341482378, 335611074, 309771788, 289199542, 311773384, 374366942, 425429847, 428550650, 406664296, 399893936, 404295742, 385379300, 337685439, 293894578, 276518880, 273281859, 266603404]
38830B66603404n997122O894795J8845937K0666413J4907349L261246j2430529
38823C12751493k0383476j0482002N550330M481313j6066227l1685579k2245655
38816B21920197K670646J4831210k089069l5471450n4372084l9085190l157001
38809A05247259J9044126J0649844r824761j5421928m930622K344218k323346
38802A04784790q259504n566315K065058O971481P167321L341966l039521n800264
38794A01665012J441593J3172611J4168457j036756j8900666k3087864j3909086
38787G3513301n207896n544821q838657l670227J1617258K4980686K2856946O113253
38779A15819843r705234j2408526o773482m903855p767660n695100L946443J0405248
$$ y = [266603404, 260606282, 267501077, 286347014, 307013427, 321920776, 325182022, 312751493, 292368017, 281886015, 287436345, 291917658, 275851431, 244165852, 221920197, 224590843, 239422053, 237332984, 201861534, 147489450, 108404260, 105247259, 124291385, 134941229, 125116468, 109694540, 104763918, 107108136, 104784790, 96525286, 90958971, 93024029, 99995510, 107162831, 110504797, 107465276, 101665012, 103106605, 116279216, 130447673, 129410917, 110510251, 87422387, 73513301, 68305405, 62760584, 53921927, 50251700, 61868958, 86849644, 109706590, 115819843, 106114609, 93706083, 86932601, 82028746, 74261086, 68565986, 72512429, 82917677]
38771H2917677M382001r328515j9716990k3678708k4830078k2301089j0784513
38764b3340215O681448J5482008O714015p403281o907840O784549R336842j0859176
38756c511650k9398065j5729444K1322139M1132138K5476448Q01099k669200R170556
38748D6594021J1991311J757765o512749o911223o516327p740323q131817j2637632
38740A1893026k4700066k9971743j2950285J2835837J8521872M964614L260926
38733a6145819K1949717K6835643n970424m4202094l7423235J2619791N0709220
38726H372799L6001794j2954854m5224359l2478394Q503535L6914869K6442536
38719B5577926j1072877l8648686l3719414j0133649M881912O503380J1035545
$$ y = [82917677, 87299678, 77971163, 58254173, 34575465, 9745387, -12555702, -23340215, -16658767, -1176759, 5537256, -1866025, -8773865, -1989316, 7347526, -3511650, -32909715, -48639159, -27317020, 13815118, 39291566, 40092665, 37423465, 46594021, 58585332, 60343097, 53830348, 46919125, 40402798, 32662475, 24530658, 11893026, -12807040, -42778783, -55729068, -42893231, -24371359, -19406745, -16145819, 5803898, 32639541, 26669117, -17532977, -54956212, -42336421, 8372799, 44374593, 31419739, -13804620, -46283014, -37779479, -864610, 25577926, 14505049, -24143637, -57863051, -67996700, -63114788, -56611408, -45575863]
38712d5575863K3974198K8741278J2259246j3424294k5136335j5833269J573007
38705c3422032J2662601J4459274J1262137N977658j103818q744995j4044000
38698a2953175j5323144j3326650q412004J042262J4160931K3156580J9530821
38691G875621O501942j234138M569192J2992845P227903j1436887k2835371j4019323
38683a0358216K693245N314951q982613k0558760j3093613O978742K1370284K1959360
38675E323380J3615573J326260j2980820k2407295j8201689m538161K741241j907983
38667c7029494n662214J119177R331578Q549282N391196Q196797P386363o731079
38659i448394j7899464l874975K3249112K8638597P308995r046287m769936l031793
$$ y = [-45575863, -21601665, 7139613, 19398859, 5974565, -19161770, -34995039, -33422032, -20759431, -6300157, 4961980, 10939638, 9835820, 1090825, -12953175, -28276319, -41602969, -50014973, -48972711, -34811780, -11655200, 7875621, 14377563, 13143425, 17712617, 30705462, 37933365, 26496478, 3661107, -10358216, -7664971, -2350020, -11332633, -31891393, -44985006, -38006264, -16635980, 5323380, 18938953, 20265213, 7284393, -15122902, -33324591, -37862752, -35121511, -37029494, -42691708, -41572531, -32240953, -23691671, -18300475, -10103678, -2717315, -9448394, -27347858, -31222833, -7973721, 20664876, 27973871, 18927584, 14157648, 11125855]
38651A1125855j9518274k9285003p336031K6255739L4992538J9027599M830642
38644D0093065j941237j4634683k6341260j4401329J5069055K6148750M705587
38637B8697948k2111009k7542070j5145348L854085K9885820N3624215M6510896
38630I7774537m1768m7351206n0260811j2872206K1282082K4718998P657546q165483
38622C2741689j2637823o419198K262065M98575j3103760j9044957j740659K2060857
38614D616789K2864825L316418m725043Q726136J5101841m945195k6883261j9364919
38606a292409O547821J6021732M975703J269170J4601956K1369603P959741l970264
38598F7483053N681728J9672987J0506194j4552248k5685381j8309838j6225035
$$ y = [11125855, -8392419, -37677422, -45013453, -18757714, 16234824, 35262423, 40093065, 38151828, 23517145, -2824115, -17225444, -2156389, 23992361, 28697948, 6586939, -20955131, -36100479, -32246394, -2360574, 51263641, 97774537, 97732769, 50381563, 120752, -12751454, 8530628, 33249626, 40907172, 32741689, 20103866, 13684668, 15946733, 16445308, 3341548, -15703409, -17444068, 4616789, 27481614, 30798032, 26072989, 34799125, 49900966, 44955771, 18072510, -1292409, 5255412, 21277144, 26252847, 27522017, 42123973, 63493576, 71453317, 67483053, 73164781, 92837768, 103343962, 88791714, 63106333, 44796495, 28571460]
38591B8571460k7623200l0868631j3603261L230372j863082j6393361j3931420
38584g2481123O160280K1479826J9870902Q769696k798913j1277010j1075038
38577d1351380M80747J2026549J0123996J404545M222091J8178714K2119237O074547
38569C3279046j3976924j9611525j1744220k191105K069199L19266l042308K005329
38561a2893242J7928544K5839021N967645k6078207l1132836l076408J7473630
38554e971853L216128j7658197o782303K3925758L3279252J4174122l899987o089416
38546C4193504n320614o769614K62318J0712623L243145j8450950k1247888M870899
38538A493423K5624886J5592616o66656R598603L1440348K4944368j2140431m2320685
$$ y = [28571460, 948260, -29920371, -43523632, -40293260, -42156342, -58549703, -72481123, -66320843, -44841017, -24970115, -16200419, -18999332, -30276342, -41351380, -40870633, -28844084, -18720088, -17315543, -13093452, 5085262, 27204499, 33279046, 19302122, -309403, -12053623, -14244728, -12175529, -11856263, -14898571, -12893242, 5035302, 30874323, 36841968, 10763761, -20369075, -23445483, -5971853, -2755725, -20413922, -27196225, -3270467, 30008785, 44182907, 40282920, 34193504, 28872890, 22103276, 22365594, 33078217, 36321362, 17870412, -3377476, 1493423, 27118309, 42710925, 42044269, 51642872, 83083220, 108027588, 95887157, 53566472]
38530E3566472m2871786k7616407j3832691J36753J6549029K4373173J6384760
38523B6689303K066081p251652j1884269j4182201r632442K885579J3533838J3367793
38515A5592030M817979n662409j4719374j6368785l012918J8667846K6706423
38508B6020792J1485229p779771r436404j102221n048007j9144318j7436912P919061
38500a4522551K9092197J8785182j1847079k6730304r186492K0466393L0409809
38493C6467155J1770018j4090455j9734045j883335J5122365R398854j0297935
38486B6752622j6801640k118059J2857126R264454n944744j5602377j5638512
38479g231130j0190922J589473J6873697K0390116N643338n648206Q238003K7888003
$$ y = [53566472, 10694686, -16921721, -30754412, -30617659, -14068630, 10304543, 26689303, 28755384, 21503732, 9619463, -4562738, -14195180, -11309601, 2224237, 15592030, 20410009, 14747600, 28226, -16340559, -19353477, -685631, 26020792, 37506021, 29726250, 20289846, 19187625, 14139618, -5004700, -22441612, -14522551, 14569646, 33354828, 21507749, -5222555, -14409047, 6057346, 36467155, 48237173, 34146718, 14412673, 12529338, 27651703, 37050557, 26752622, 9950982, 7832923, 20690049, 29954503, 24009759, 8407382, -7231130, -17422052, -15832579, 1041118, 21431234, 27074572, 21426366, 29664369, 57552372]
38471E7552372J3042399l2948927n5716650k3640526K3839462L0316791M87907
38464A2932828j3923698N381495K1129214N331904j5154471l244070K6023467
38457C8476669K4552306j5591971m5775733k8172659J0699495J8844951o287551
38450c254493j6655315J2026286M1372104K6330525j7059422l4390589j1683700
38443c314604Q557903n213276k8765516k5008130j923257L525090j5952395k8298004
38435i6392189r634985K4727533M2578565L1060376M570027j3125990j0932533
38428b7149196J49833J430210o803346m064094J6495248K9789014J3430642j3759232
38420I519079j5224577R212174K3919858J0917427r923568j8903262k1356751
$$ y = [57552372, 70594771, 37645844, -18070806, -41711332, -17871870, 12444921, 12932828, -990870, 4390625, 25519839, 30851743, 15697272, 12453202, 38476669, 63028975, 47437004, 1661271, -26511388, -15811893, 3033058, -3254493, -19909808, -7883522, 33488582, 59819107, 42759685, 8369096, -3314604, 5243299, 30023, -28735493, -53743623, -55666880, -52141790, -68094185, -96392189, -106027174, -81299641, -38721076, -7660700, -3090673, -16216663, -27149196, -26999363, -25569153, -32372499, -36436593, -19941345, 9847669, 23278311, 9519079, -5705498, 3506676, 27426534, 38343961, 28420393, 9517131, -11839620]
38413a1839620k3134068j3438943R725931K4836340J8803931Q970368J0407394
38406B4331333O407656j9216768m2538985k9211932R006299K6265329P441928
38399a7515140j5639707j4785266K299532J7218236K6028485K7195822J3002526
38392C7804488j1044828k1534326q577443P757899Q159024J237840J918065K743328
38384A8464047r238443k2431209j5611425N711777J6470117J2162468J2307989
38377A7835321K1453990J7756303p625260k7951288j9350261r98144p771016l3166091
38369c9816446l3680971N563020M2234799L3301865l291123j3997417J2594494
38362B908221K9570473J974867l9452117m0646159q61723K7673098J3754340j4036537
$$ y = [-11839620, -34973688, -48412631, -38686700, -13850360, 4953571, 13923939, 24331333, 30738989, 11522221, -31016764, -60228696, -51222397, -24957068, -17515140, -33154847, -47940113, -45640581, -28422345, -2393860, 24801962, 37804488, 26759660, 5225334, -3352109, 4405790, 12564814, 13802654, 15720719, 18464047, 9225604, -13205605, -28817030, -23105253, -6635136, 5527332, 17835321, 39289311, 57045614, 49420354, 21469066, 2118805, 1120661, -6650355, -39816446, -73497417, -67934397, -25699598, 7602267, 4311144, -9686273, 2908221, 32478694, 34453561, -4998556, -45644715, -46506438, -18833340, -5079000, -19115537]
38354a9115537j4725839P650653J8311727O613491l247250O117034K0557341K0045452
38346D2207072Q572968L372188O478715M722226n607258j0946574j530421J1669068
38338E8937984R810505r232934k7660630k8429616j2789296L987249R451410M183855
38330H258527j524010J294301J0541918J3553004J219446j7176338k0247865j290497
38322e371514J7913752J0813277j8952527l9281539k8606947k47272J8693330
38315d5039440K0202504J5077580R241001j689066j5224159j7523179l230454
38308c8185213J3054509J5335148P869838O911640J5704497K0227328R697877
38301E0615624r604638k3743784k5922542j8514126p659796O7058J734196K290560
$$ y = [-19115537, -33841376, -26190723, -7878996, -1265505, -4512755, 1604279, 22161620, 42207072, 50780040, 54152228, 60630943, 65353169, 59745911, 48799337, 47268916, 58937984, 68748489, 59515555, 31854925, 3425309, -9363987, -5376738, 4074672, 8258527, 6734517, 8028818, 18570736, 32123740, 33343186, 16166848, -4081017, -5371514, 12542238, 23355515, 4402988, -34878551, -63485498, -63732770, -45039440, -24836936, -9759356, -518355, -2207421, -17431580, -34954759, -38185213, -25130704, -9795556, -1925718, 4985922, 20690419, 40917747, 50615624, 41010986, 17267202, -8655340, -27169466, -34829262, -34762204, -33028008, -30737448]
38293c0737448Q199124J4363052P962148q894396j4296620K548216J8693742P016738
38285D854556j9937563k3913301J315644J8906661O537491q734779K799450K1201291
38277C029450Q269263k6434430l5284348n539092K1774397J6093094K6568O455476
38269a1609622K5388387K3223695n032861l2290769l7278357k1480013L370963
38262e5708577K2636374K1223007L00751j4918674m999076J3552715J1122999
38255f790481r402377j8258939p104912O18227p378319j1209812N641613K7102114
38247b6782886K9698675J6336089N102118O89814k608288k479252M962480Q678087
38239C3596837n428417k9078190l7505511k2027260j271489L653754o104008j2193395
$$ y = [-30737448, -22538324, -8175272, -213124, -9107520, -23404140, -20855924, -2162182, 4854556, -15083007, -38996308, -37680664, -18774003, -12236512, -20971291, -18171841, 3029450, 11298713, -15135717, -50420065, -55959157, -34184760, -18091666, -18065098, -11609622, 13778765, 37002460, 31969599, -321170, -37599527, -59079540, -55708577, -33072203, -11849196, -11548445, -26467119, -31466195, -17913480, -6790481, -16192858, -34451797, -41556709, -40938482, -48316801, -59526613, -53885000, -26782886, 2915789, 19251878, 24353996, 25043810, 22435522, 19956270, 24918750, 33596837, 28168420, -909770, -38415281, -60442541, -61714030, -58060276, -64164284, -76357679]
38231g6357679k871838J2775596J5236738k79419j4237480p053563J1893767J6457879
38223d4435999M046002m12851J2194978J6469264m536829k4709917j2149726J9097850
38215c4437228K9403555J3137923K72111L997087O123455k861338p300574Q71428
38207I206419O845653K665235J599986R749422J2976964O294955N917094J5519811
38199G0775539J2103865j3702187l4756545k9837286j7505415j7569859j1151908
38192d1643796K0943980M8117036K8340253k0159914l9097786j5618138O365669
38185a2752696K527789K29210J9064753L0720414O807808l1413613m3496654k4173352
38177e2486341J589631J7608674K3467122J8106071K265991j1736528j2164226
$$ y = [-76357679, -79229517, -66453921, -51217183, -51496602, -65734082, -72787645, -60893878, -44435999, -40389997, -40802848, -28607870, -12138606, -16675435, -41385352, -53535078, -34437228, -5033673, 8104250, 8376361, 12373448, 18496903, 15635565, 8334991, 9206419, 16052072, 18717307, 20317293, 30066715, 43043679, 49338634, 55255728, 70775539, 82879404, 69177217, 34420672, 4583386, -12922029, -30491888, -41643796, -20699816, 27417220, 55757473, 35597559, -3500227, -19118365, -12752696, -10224907, -9995697, 9069056, 39789470, 46597278, 15183665, -28312989, -52486341, -50896710, -33288036, -9820914, 8285157, 10551148, -1185380, -13349606]
38170a3349606k495433Q129818J6759909J8527747M774684j6588349j8869366
38163c110596O443385K9334215J9888467r527937k4707957j6807893k521092R285690
38155H276282K0562912K2645318M599389j9323983k1599106k670952Q406947j239248
38147A9657559j1148866l661065R123258Q411822j864033n253532J010499N539858
38139B1815500J283432p491260j3468770j3747598r509461j401271J2332672K8213648
38131A8026892K9583307J270248m0663912n3052407j7445319K8887817L8471546
38124E078172J5915316K904878J1043848J0542365j2298068k9265244j7201716
38117a3280449N026147Q478166m191507j1869791q590563k394922K364806K971761
$$ y = [-13349606, -15845039, -7715221, 9044688, 27572435, 32347119, 15758770, -3110596, 3332789, 32667004, 52555471, 43027534, 18319577, 1511684, -1009408, 8276282, 28839194, 51484512, 56083901, 36759918, 15160812, 12489860, 20896807, 19657559, 8508693, 4847628, 13970886, 22382708, 20518675, 15265143, 16275642, 21815500, 23098932, 15607672, 2138902, -11608696, -21118157, -22519428, -10186756, 18026892, 47610199, 48880447, 8216535, -44835872, -62281191, -33393374, 5078172, 20993488, 23898366, 34942214, 45484579, 33186511, 3921267, -13280449, -8254302, 223864, -3967643, -15837434, -24427997, -26822919, -24458113, -21486352]
38109b1486352n452632j5929362r635487J4666444L1320586K4431304J1174430
38102B9088931R371614P746560o046009j4421467o30844J2647426l644989l0337105
38094C774117k4954644P511291J8760972o592428k9105958k0014820q61684K895210
38086d8587944M175243J9789315K9360510P374226k6593476l0305564j078347
38079d5866037K1867429J5573530N3293K49110R528638N878807j3059218k7950851
38071c3725299k4006867o816087O793027O182101n185402j4496881j0683240O647056
38063g5291592K6872800L7093653L2795714K0105196O852904o033825j9827201
38056B2567649k7246667j6592104R764227L0800890K8291026N944933j9031435
$$ y = [-21486352, -26938984, -42868346, -52503833, -37837389, -6516803, 17914501, 29088931, 38460545, 46207105, 40161096, 25739629, 25108785, 37756211, 34111222, 3774117, -21180527, -13669236, 5091736, -1500692, -30606650, -50621470, -51483154, -48587944, -44412701, -24623386, 4737124, 12111350, -14482126, -44787690, -45866037, -23998608, -8425078, -8371785, -8122675, 1405963, 7284770, -5774448, -33725299, -57732166, -64548253, -57755226, -51573125, -56758527, -71255408, -81938648, -75291592, -48418792, -11325139, 21470575, 41575771, 48428675, 42394850, 22567649, -4679018, -21271122, -11506895, 19293995, 47585021, 53529954, 34498519]
38049C4498519l3929433l1840715q236736K7611395M7612345L1957536k719025
38042F4953886k2067135j7922223j1826061j6218558j8338411q302330K558402
38035b7162430L383502K451801R734271J8091778J6692437Q672591J184546q733863
38027B4314633k3670165l3011921k5362538m745875J6726994L1201228L0409045
38020A5861401N340213l3987821n4602726l6640992j300883J7191099J5400781
38013g2738928J4153031K0225104K2423972J9175627K0040877K0614934N564270
38006D9458887j9402279k7183722r509560Q424032N419635p092384q803652j771218
37998a0460261J235771L211672J5007494K9403259K5234740k636614l3379841
$$ y = [34498519, 569086, -31271629, -39508365, -11896970, 35715375, 67672911, 64953886, 42886751, 24964528, 13138467, -3080091, -21418502, -29720832, -27162430, -23778928, -21327127, -11592856, 6498922, 23191359, 31863950, 33048496, 24314633, 644468, -32367453, -57729991, -62475866, -45748872, -14547644, 15861401, 21201614, -12786207, -67388933, -104029925, -105330808, -88139709, -72738928, -58585897, -38360793, -15936821, 3238806, 23279683, 43894617, 49458887, 30056608, 2872886, -6636674, 1787358, 7206993, 114609, -8689043, -10460261, -9224490, -6012818, 8994676, 38397935, 63632675, 60996061, 27616220]
37991B7616220m3211746k8905772o714718N172223J421602q953846j3906591j0191038
37983g7673666j717725J0409192K7183469M0960067L7582561J5012425r809450
37976D1946873j9790162j5542205q315891m491995n150763j1052227j6764219
37969c9160589q822360J5460969L3494322J9850105j6968844l8201138k0985535
37962e5333070J3969172L0030697J7964179j396773j0050638j0894680j1483042
37955b7194155o820187R269393K4313206J6534763j3066661l3463546j9777819
37948e0205006J2824130K6732186R406412j4253114j8519141o823495L133782
37941c7704246O410088P799736N089516n113675j2003408j511507J9673265L0399925
$$ y = [27616220, -15595526, -44501298, -51216016, -46043793, -44622191, -53576037, -67482628, -77673666, -79391391, -68982199, -41798730, -838663, 36743898, 51756323, 41946873, 22156711, 6614506, -1701385, -6193380, -11344143, -22396370, -39160589, -47982949, -32521980, 972342, 20822447, 3853603, -34347535, -55333070, -41363898, -11333201, 6630978, 5234205, -4816433, -15711113, -27194155, -34014342, -24744949, -431743, 16103020, 3036359, -30427187, -50205006, -37380876, -10648690, -1242278, -15495392, -34014533, -40838028, -37704246, -31294158, -23494422, -18404906, -23518581, -35521989, -37033496, -17360231, 13039694]
37933A3039694K4777356J5342559O105520j2381861l4253486l2864478j346181
37926b1580877K6285812J9774843j507928P17873K1115795J9213143j1919505
37919E2099156l0032128j0212896J3611536Q12238l2961965m0232544j0894756
37912e7811359K0140989K6879735J8469781J1380248P789454P917058J5484201
37905E0250107K1086120N367684k8565992m8471394l4277717o772745K991901
37898c8392036l258029j78504J8958872L2373670K1884463k235153j3841676j299674
37890A4011933J8385300J7326292q127819k6563957r904034K2630576K4657362
37883E2415653r829411l2264626r943655K3122171J7446862j6935604k9889443
$$ y = [13039694, 37817050, 53159609, 59265129, 46883268, 12629782, -20234696, -21580877, 4704935, 24479778, 22971850, 23689723, 44805518, 64018661, 52099156, 22067028, 11854132, 25465668, 26277906, -6684059, -46916603, -57811359, -37670370, -10790635, 7679146, 19059394, 26848848, 34765906, 50250107, 71336227, 76703911, 48137919, -333475, -34611192, -41383937, -38392036, -41650065, -41828569, -22869697, 9503973, 31388436, 29153283, 15311607, 14011933, 32397233, 49723525, 41595706, 15031749, 5127715, 27758291, 52415653, 42586242, 10321616, 377961, 23500132, 40946994, 24011390, -5878053]
37876e878053j0100233N198231k069820m764530J4003502K5872661N139545k3438316
37868C962987j9573935J1354969K7571533J1486121j1285861j2931146K732470
37861A3317138J3281618O759755r908168k1547052j8060277k226460J2851686
37854e531760J5982989P471686l426533p000610N55055J2713723J4403731k658425
37846C2509856k4624159k6106091m08586L0228154L8769071J9153886j3507026
37839E6015105l6493052l1815140j235733K6489602K1282856q637955k3232366
37832B373317o452857R158747p996766l8511293l9669786o993427K4098573L0077337
37824c3916155K0685716J0887540L075383P38937J0388157K1790635J2741554
$$ y = [-5878053, -15978286, -10780055, -12849875, -17614405, -3610903, 22261758, 27401303, 3962987, -15610948, -4255979, 23315554, 34801675, 23515814, 10584668, 13317138, 26598756, 33358511, 23450343, 1903291, -16156986, -18383446, -5531760, 10451229, 17922915, 14496382, 7495772, 8050827, 20764550, 35168281, 32509856, 7885697, -18220394, -18628980, 11599174, 50368245, 69522131, 56015105, 19522053, -12293087, -13528820, 12960782, 34243638, 25605683, 2373317, -4079540, 5079207, -2917559, -41428852, -81098638, -88092065, -63993492, -33916155, -13230439, -2342899, 732484, 1471421, 11859578, 33650213, 46391767]
37817D6391767j5688138l3267614k3706823j0032601j7384422l0423147j5055256
37810i9166234K6466696N1140387L0232649j3006289l2670963j5040752J0985949
37803d1058557J5441382L427514J142490J6096020K8747436K4378829J3722412
37796F1897526J0824444P612462r368769k7943977k2639480L390532J6517767
37789D0290505M84084j9097675j3358387P146677J0157075r953951k5852421j7031954
37781b7216047N167592J6666805R035845q202864k1813338k2419932o454607J7729986
37773c7506560K9294812J3766284j4748410k2540068L631299L4940061L3232121
37766D0069539K51462k4906250j8892551j980271j792775j1087751l890336J9814145
$$ y = [46391767, 30703629, -2563985, -26270808, -36303409, -53687831, -84110978, -99166234, -72699538, -21559151, 8673498, -4332791, -37003754, -52044506, -41058557, -25617175, -22189661, -21047171, -4951151, 23796285, 48175114, 61897526, 72721970, 80334432, 70965663, 43021686, 20382206, 23772738, 40290505, 40774589, 21676914, 8318527, 15465204, 25622279, 15668328, -10184093, -27216047, -22048455, -5381650, 3654195, -4548669, -26362007, -48781939, -55236546, -37506560, -8211748, 5554536, -9193874, -31733942, -28102643, 6837418, 40069539, 40321001, 15414751, -3477800, -5458071, -7250846, -18338597, -22228933, -2414788]
37758b414788L2612109J9496004n415415k3266520k9133207k2665851k719362
37751c3507030J9734165K2405855k029344l2393468m1119479k1147307J2814818
37744g5241790L7991014L6793696J2054179q899471l689055J0834204n57126l2373889
37736b3088238l5729296Q143043M9114180L5614991r331155k3522592K106439
37729C307372J8408124Q91869j6855760n755559J1574583L974578j4632480j0870296
37721i957569J1142983J6433915n893786k8552899k8251064j4086703n887268
37714f5052391m963741J208283J6742886L1340533L2429277J7080741n487403
37707B3298185k0059462j7093619j147930J3546181J6048783N605649j1507643
$$ y = [-2414788, 30197321, 49693325, 44277910, 21011390, -8121817, -30787668, -33507030, -13772865, 8632990, 6603646, -25789822, -66909301, -88056608, -75241790, -37250776, -457080, 11597099, 2697628, -991427, 9842777, 9285651, -23088238, -58817534, -50674491, -1560311, 34054680, 24723525, 1200933, 3307372, 21715496, 22607365, 5751605, -3954, 11570629, 15545207, 912727, -9957569, 1185414, 17619329, 11725543, -16827356, -45078420, -59165123, -65052391, -70016132, -68807849, -52064963, -20724430, 11704847, 28785588, 23298185, 3238723, -13854896, -15002826, -1456645, 14592138, 20197787, 8690144]
37700H690144k5992856k7331177j0312109J6024118L1964966K5587551N041012
37693B3671649j1536136j4755998q105824J361245P548404L448986j2798343k7559372
37685c8725389k0106071J0686905L7743109L4687362O965559j7305697k2045647
37678h099869j4616237n877243K926430R875120O691323o590996j4258927m907892
37670c4858291R780333R858512l986565j0555888K339572K0702779K2235285M544653
37662B0060390j2218429j0918242P59994J178968j3166607j8352603M441252L6557084
37654H341807M0361382Q754959k4303905k8318524j1300771Q63199J585164K713886
37646a302803R461046J5939849J9043560J9230052J1739073p188112k8212633
$$ y = [8690144, -17302712, -44633889, -54945998, -38921880, -6956914, 18630637, 23671649, 12135513, -2620485, -10726309, -9365064, -1816660, 1632326, -11166017, -38725389, -58831460, -48144555, -10401446, 24285916, 31251475, 13945778, -8099869, -22716106, -28593349, -25666919, -15791799, -9100476, -15691472, -29950399, -34858291, -25077958, -15219446, -19206011, -29761899, -27422327, -6719548, 15515737, 20060390, 7841961, -3076281, -2316287, -1137319, -14303926, -32656529, -28215277, 8341807, 48703189, 57458148, 33154243, 4835719, -6465052, -5601853, -4016689, -1302803, 8158243, 24098092, 43141652, 62371704, 74110777, 66922665, 38710032]
37639C8710032l6574941k8882464j1722142Q775326K3152863J5888069j3628440
37632d281697l6178587k3040786J3014083L2168706K0814689K765179l427881
37625A833706o513352j3759113j2396496L340481J4081413N769465m119232N185617
37617f577511K1770214K0230355L341595m621429J049904R52683j1914245j8936021
37609E295545o552651J1577341J4149940n33683j7287078k3949266j9169795p126791
37601d3596438O301617J4024001J0948811p19908j0028648m650100J4597612K7719960
37593A4596907J4598551j6293431l1319268j3279658J3501222J5013289o379333
37586i561721j8636884o977238J0499510J5389985J2174459J0406266O219534
$$ y = [38710032, 2135091, -26747373, -38469515, -29694189, -6541326, 9346743, -4281697, -40460284, -63501070, -50486987, -18318281, 2496408, 5261587, 1833706, -4679646, -18438759, -30835255, -27494774, -13413361, -7643896, -11763128, -6577511, 15192703, 35423058, 38764653, 34143224, 35193128, 36145811, 24231566, 5295545, -1257106, 10320235, 24470175, 23936492, 6649414, -17299852, -36469647, -43596438, -37294821, -23270820, -12322009, -13041917, -23070565, -27720665, -13123053, 14596907, 29195458, 12902027, -18417241, -31696899, -18195677, -3182388, -9561721, -28198605, -35175843, -24676333, -9286348, 2888111, 13294377, 19513911]
37579A9513911l821692p690442N203951K2697095K3075877L957689j6835135k4940507
37571B1160747k0469487r423491J687726M860205j977780p658563j123474R692177
37563c251940P915802l972823n401829Q466037J5550940R46900j7251461j4060649
37555a1059023N094736J4855688Q197544J31212k633751r708730k1952078k3255457
37547d0329859o584590J2115521J7345439J3974527J1920660Q181289j059585
37540A5563402o232760k74448M286204n907769j9362616j4440470O886775K1680599
37532B198917J8513607O508589m755739j2635850j1060948L419020J4943652K929675
37524B0060923k3064326k9070095m812021J9620534J6695367l192350j4150014
$$ y = [19513911, 15692219, 8001777, 13205728, 35902823, 58978700, 62936389, 46101254, 21160747, 691260, -8732231, -7044505, -2184300, -4162080, -11820643, -12944117, -3251940, 4663862, 691039, -4710790, 3755247, 19306187, 20253087, 3001626, -11059023, -5964287, 8891401, 17088945, 17220157, 14586406, 4877676, -17074402, -40329859, -46914449, -34798928, -17453489, -3478962, 8441698, 16622987, 15563402, 9330642, 9056194, 13342398, 7434629, -11927987, -26368457, -19481682, 2198917, 20712524, 27221113, 22465374, 9829524, -1231424, 2187596, 17131248, 20060923, -3003403, -32073498, -36885519, -17264985, -569618, -3761968, -17911982]
37517a7911982j0325560r28378J0889136K3316654K5007786J0169253o294668
37510C3922241p844086o94917r88846p512103o652575L245666J1593744J3572935
37502C8642059J1189173L105335r491909j4857352p231857k992805j8479667l8467338
37494c8584361l1898989K741262L2540138L2919399J3200318m305339j0092794
37487c480366o616600L66928K875743k976595p888138J9350J3977198J3233754
37479I511274q417657l3056245l9946364k4150508M801204K8812327K9750831
37472c2695138R561607k997917J3316154L7008595K9760068o328725l0306726
37465A7317918k2451533n849177m95879L832832J2612674N336101k3885520m0239350
$$ y = [-17911982, -28237542, -29165920, -18276784, 5039870, 30047656, 40216909, 33922241, 26078155, 25383238, 24394392, 16882289, 10229714, 13475380, 25069124, 38642059, 49831232, 52936567, 43444658, 28587306, 21355449, 18362644, -117023, -38584361, -70483350, -67742088, -35201950, -2282551, 10917767, 6612428, -3480366, -10096966, -9730038, -6854295, -9830890, -17719028, -17699678, -3722480, 9511274, 1093617, -31962628, -71908992, -96059500, -91258296, -62445969, -32695138, -23133531, -26131448, -12815294, 24193301, 53953369, 47624644, 17317918, -5133615, -10982792, -11478671, -7645839, 4966835, 10302936, -13582584, -53821934]
37457e3821934j7164887J6856571J8514308n188699j2947981M741925J8685926
37450c0324771J3968811P933512J2779979J6465484Q168364o120187j9637450
37443C233742l1016648l0895821r300176J8934462K4223992N372814n254266R534196
37435a5167705K5637588J6278243q001585j8801957j0720605j58859M555104R662227
37427C282451J7848532K1627263J4257350l122204k2649245l1594681k0203707
37420b0554241M382917K0142125J5320604L549713L717734J3085655J3314561
37413E2959068k446249k2098349l1318575k5217612n401218K0839629L7107080
37406B4423774K7361356m249230l1250452l0516187o997348J2832902J0532851
$$ y = [-53821934, -70986821, -54130250, -35615942, -40804641, -53752622, -49010697, -30324771, -16355960, -8422448, 4357531, 20823015, 28991379, 22871192, 3233742, -27782906, -58678727, -67978903, -49044441, -24820449, -19447635, -24701901, -15167705, 10469883, 26748126, 18746541, -55416, -10776021, -10934880, -6379776, 3282451, 21130983, 42758246, 57015596, 53893392, 31244147, -350534, -20554241, -16171324, 3970801, 19291405, 22841118, 26558852, 39644507, 52959068, 50512819, 28414470, -2904105, -28121717, -33522935, -12683306, 24423774, 51785130, 47535900, 16285448, -14230739, -21228087, -8395185, 2137666]
37399B137666o557073j7170024j0200981O668369J8771447J8314264O771213q486048
37391A0248833j6371562q807291P576968J2895155k961348k3050870k1162644
37384d1632759M369448K7366991K6144969O903819r453205j2294141n821724K017571
37376b399031N478623P37259j0971411k0405949j6765231Q96869K0324755K5583047
37368B478931J1921203q071897j6545291j0242384k348918j413796J178447J3469496
37360i574209K3812817J5938322l768366j3686736q637790k975068k560618K258039
37352H06391J1592951R507717p528780j9598724j4253524n995292q515309r715780
37344d3700350M115372J8616600J1905531q967371j9110777j3680880p645330
$$ y = [2137666, -4419407, -21589431, -31790412, -25122043, -6350596, 11963668, 18734881, 10248833, -6122729, -14930020, -7353052, 5542103, 2580755, -20470115, -41632759, -37263311, -9896320, 16248649, 23152468, 13699263, 1405122, -4416602, -2399031, 3079592, 3816851, -7154560, -27560509, -44325740, -43428871, -23104116, 2478931, 14400134, 6328237, -10217054, -20459438, -22808356, -24222152, -23043705, -9574209, 14238608, 30176930, 26408564, 12721828, 4084038, 1108970, -1451648, 806391, 12399342, 21907059, 14378279, -5220445, -19473969, -25469261, -33984570, -43700350, -39584978, -20968378, -9062847, -18030218, -37140995, -50821875, -58467205]
37337e8467205m760862M611997J7404082J8324488Q561833P090592J7909998K1241161
37329C1916084O155834j0990103j2604656m664886j346318r83648N929851J5002076
37321B8414234J1324414p855630k5888658k4145906k211684K0498216K3925379
37314B4060365R043297m194883l869998j743769j2250168k6256253k2971852j991758
37306d0175019J6561820K1461900J8965532J2767291q07796j4328576j1210983
37299C234169N373037R259916j0860087l1413990k5761119K251040K9974257M2975561
37291B5032784L6718287J1267545j8372230k5526873n417647J1471061K08826
37284C5381753k2155897k5071892j1309304m523908m150998R818424L2048082
$$ y = [-58467205, -63228067, -58616070, -41211988, -22887500, -14325667, -7235075, 10674923, 31916084, 38071918, 27081815, 14477159, 9812273, 8465955, 7482307, 13412158, 28414234, 39738648, 31883018, 5994360, -18151546, -20363230, 134986, 24060365, 33103662, 28908779, 25038781, 23295012, 11044844, -15211409, -38183261, -40175019, -23613199, -2151299, 16814233, 29581524, 28773728, 14445152, 3234169, 8607206, 17867122, 7007035, -24406955, -50168074, -47917034, -17942777, 25032784, 61751071, 73018616, 54646386, 29119513, 23701866, 35172927, 35381753, 13225856, -11846036, -23155340, -27679248, -31830246, -22011822, 10036260]
37277A0036260L1445801J482847k4124952j8667209L677576J6403678J7174391
37270C7428392J6194432R539443j0755323l1556940k8821735j615714K2957706
37263A3370261K2102602J890291j4776000j5302265n771796K931899Q213327J2145404
37255B4803723J1745514K255723j0897674j4783096p422062k084189n999346o965322
37247i346729O914310K4610591K5110376O722910j2418056j9186932j5831979
37240F574491r174514m583112p554376j6495748j7807275l315410J2912758J2307077
37232b7136109m49762p466350p359049r697002p387623J2824619L4818154K6138872
37224A4285750p602938k0751910O027383L5173578K8741818R53330j1846380l648932
$$ y = [10036260, 41482061, 42964908, 18839956, 172747, 3850323, 20254001, 37428392, 53622824, 63162267, 52406944, 20850004, -7971731, -9587445, 13370261, 35472863, 37363154, 22587154, 7284889, 1513093, 4444992, 12658319, 24803723, 36549237, 38804960, 27907286, 13124190, 5702128, 3617939, -2381407, -9346729, -2432419, 22178172, 47288548, 54011458, 41593402, 22406470, 6574491, -2600023, -7183135, -14737511, -31233259, -49040534, -52355944, -39443186, -27136109, -27585871, -35052221, -42411270, -52108272, -59495895, -46671276, -11853122, 14285750, 6682812, -14069098, -8041715, 27131863, 55873681, 56827011, 44980631, 41331699]
37216D1331699Q175310J6309452J8602787K675824l0807259m8808064k5698910
37209a8219161J2553099K0065359n077176k5122914k0914612p383862K970516
37202d1128751J2325135J4710162j08907j7870523j2230179J0962300J9640157
37195a3700606R462824R409123K4614981K0734049j4215672l7716418j5025173
37188a6436892K3010348K4564990o212936k0695607j225838J8284984P723463
37181B9012512j9349896l1255877j9085608P86423J1110677R199974L129536j10750
37173a6563009p54636p48458K745490J0578794J2921557J696205j0196589j832895
37165b153541K0918152K6863904M302407j9789351j9112518k957990O320394P711253
$$ y = [41331699, 49507009, 65816461, 84419248, 87095072, 56287813, 7479749, -18219161, -5666062, 14399297, 9322121, -15800793, -36715405, -44099267, -41128751, -28803616, -14093454, -14202361, -32072884, -44303063, -33340763, -13700606, -4237782, 5171341, 29786322, 50520371, 36304699, -1411719, -16436892, 6573456, 31138446, 24925510, 4229903, 3004065, 21289049, 29012512, 9662616, -21593261, -40678869, -39892446, -28781769, -19581795, -16452259, -16563009, -17317645, -18066103, -15320613, -4741819, 8179738, 9875943, -320646, -2153541, 18764611, 45628515, 49930922, 30141571, 11029053, 8071063, 14391457, 22102710]
37157B2102710J0160676P351843q107342k1154158j4937237k951144r326867k6269783
37149d3131302k4589137j708393J5398631J4715783J1904399J4931476J1085305
37142a393238j523974l103227J2540849K1763999Q415164q457208n021953J0841665
37134C4062077J5790064O645762k497132n549613n920476l787786j124727q430993
37126B9187176k6982848l5774427j8233943P886524J2178177l775182j0841777
37119d6356300J323866J2464001J0136525R097845J9459652K2813149J501143
37112C0439881k7048140l0293951n786790J7027029J7603766O194187K668292
37105A0804274J0444443J7333726J1369783q125014k6953625k4328668K891061
$$ y = [22102710, 32263386, 39615229, 31507887, 10353729, -4583508, -7534652, -16861519, -43131302, -67720439, -69428832, -54030201, -39314418, -27410019, -12478543, -1393238, -2917212, -6020439, 6520410, 28284409, 36699573, 28242365, 23220412, 34062077, 49852141, 56497903, 54000771, 48451158, 42530682, 38742896, 37618169, 29187176, 2204328, -33570099, -51804042, -43917518, -31739341, -35514523, -46356300, -45032434, -32568433, -22431908, -13334063, 6125589, 28938738, 30439881, 3391741, -26902210, -32689000, -15661971, 1941795, 8135982, 10804274, 21248717, 38582443, 49952226, 41827212, 14873587, -9455081, -6564020]
37098f564020K5797384J2418605k5216954l7213376k558082L4948455K3220143
37091B4832155k4328611m7520419k4405419M624328M571019n260786O540145K7613978
37083c3333610K4304736p89632j3509238k639535Q013418L452811j129106Q050159
37075g579997J9413074J7732145P295037j700063j1340491k4533400l0769847
37068c1483542k1079383o407789l698128j0590797r981339M399090K1357464K9188833
37060b8295591K6817687J8335314O692234n726800j6169923k1068159j4530684
37053c3945922O355039K9899746L3076052P177928k6583329l9675030k9348117
37046e3043633j5271586p842196J199333J5541569K2842854J5904160P659217
$$ y = [-6564020, 19233364, 31651969, 6435015, -30778361, -33336443, 1612012, 24832155, 503544, -47016875, -71422294, -66797966, -62226947, -67487733, -60947588, -33333610, -9028874, -9818506, -23327744, -25967279, -17953861, -14501050, -15630156, -7579997, 11833077, 29565222, 36860259, 35160196, 23819705, -713695, -31483542, -52562925, -58970714, -62668842, -73259639, -83240978, -78841888, -57484424, -28295591, -1477904, 16857410, 23549644, 17822844, 1652921, -19415238, -33945922, -27590883, 2308863, 35384915, 42562843, 15979514, -23695516, -53043633, -68315219, -76157415, -74958082, -59416513, -36573659, -20669499, -13010282]
37039a3010282J0189647J2065660l923253k7700629k9453751j881433K6358337
37032b7355704K7789521R082280n238748o641573l400666O00505O970269R190698
37024A0996582K65971q637218r56751J3745281Q414071j5957718k4203956k26441
37016a6560179K4519152J8373353l015563p330700J40963p999780k7035434k5839092
37008d4747280k075048J2547343N658677N93958J0263994J5683080N514609j891514
37000A547819L873377K276627j8068588k9837125q768680K2547492K6971715P549734
36992H092371m881328j871414M47318k886337l039388k934478j2135065k0955456
36984d0163777j0864400J2432589K5371880K2442409J7175048J2155160o05624
$$ y = [-13010282, -2820635, 9245025, 5321772, -22378857, -51832608, -53714041, -27355704, 433817, 9516097, 4277349, -2364224, -5764890, -5164385, 1805884, 10996582, 11262553, 2625335, 1668584, 15413865, 23827936, 7870218, -16333738, -16560179, 7958973, 26332326, 23316763, 15986063, 16127026, 8127246, -18908188, -44747280, -46822328, -34274985, -28616308, -28022350, -17758356, -2075276, 3439333, 1547819, 5421196, 7697823, -10370765, -40207890, -48976570, -26429078, 542637, 8092371, 3211043, 1339629, 1786947, -1099390, -4138778, -7073256, -19208321, -40163777, -51028177, -38595588, -13223708, 9218701, 26393749, 38548909, 37943285]
36977C7943285j2830831p555488O625117L790608j4478835j8958178k982345N844558
36969b602109m876616j0551502M652419J7445416N622821j3403822j3227529j118702
36961a8059624J232201j743100Q269342K5420629K7048642J0830325m617432j0200627
36953C8180356j0843861n820745P726273J5628038j5020k7878281l5477816j4378409
36945c2879465Q484562J1676986O640686J2441528K4442856K4638417R428045
36938F4873615q953113k0564360k3917924j9449640q866586R19632K283593m242059
36930a7916842j0307480q809865o18389O313556M155209n769108j2237101p245378
36922e2435398K171855L721550N84210R203836L1288000M2295180K1350883j6065580
$$ y = [37943285, 25112454, 17556966, 24182083, 27972691, 13493856, -5464322, -8446667, -2602109, -7478725, -18030227, -13377808, 4067608, 9690429, -3713393, -16940922, -18059624, -16827423, -18570523, -10301181, 15119448, 42168090, 52998415, 48380983, 38180356, 27336495, 21515750, 29242023, 44870061, 44855041, 16976760, -18501056, -32879465, -24394903, -12717917, -6077231, 6364297, 30807153, 55445570, 64873615, 55920502, 35356142, 11438218, -8011422, -16878008, -15958376, -13674783, -17916842, -28224322, -37034187, -37652576, -31339020, -27183811, -32952919, -45190020, -52435398, -50263543, -46541993, -45957783, -36753947, -5465947, 36829233, 58180116, 42114536]
36914D2114536l3078359j7680294M058289N842753n570421p411694K873221Q247214
36906f04755L255558K083095J1768431J7557936N641614j4364501k2751338j5117458
36898a2531418j924593Q138444J1537499N587207n418801q659283j771785j905349
36890f948079j7350375k4210134P34577L4340251L1070788q621905l4708971k0805800
36882d6499648J365034m82927q984034M129235K3937392J8101755o502168j6355394
36874c1290755o426748j251k157445K693747R814052l359195k8263416k4228379
36866h3219390J8209561N3040413L9806802l678939l3263174l4361738j9743569
36859f3210034K688003K7733757L5936449J2779223k1913215l1903352r336905
$$ y = [42114536, 9036177, -8644117, -4585828, 1256925, -4313496, -11725190, -8851969, -604755, 2650803, 4733898, 16502329, 34060265, 39701879, 25337378, 2586040, -12531418, -14456011, -6317567, 5219932, 10807139, 5388338, -3270945, -5042730, -6948079, -24298454, -48508588, -47774011, -13433760, 17637028, 9015123, -25693848, -46499648, -45134614, -45617541, -54601575, -50472340, -26534948, -8433193, -14935361, -31290755, -37717503, -37718754, -39876199, -37182452, -27368400, -30727595, -58991011, -83219390, -65009829, -11969416, 27837386, 24158447, -9104727, -43466465, -63210034, -60522031, -32788274, 3148175, 15927398, -5985817, -37889169, -47226074]
36852d7226074K0213540L3210446K7441420J0549797p349172j0527081J0077476
36845C6390352L8136397M4283492K0972051j0588728k9351187l2920712k6018493
36838D0903172j1048711L883785O669510m42385r77689Q637377J0056104p164461
36830E0516702k4887569k2435248q251640m754359j2049585j0377495N362933
36823b6876261J7080390J1677254k052361r659969p886185j44312R950091J5221121
36815G309768R314735o48957j003513M249837m474563k7394231l5201708j0641847
36807e8490479K0903322K6342328J2915455J0866839K0389864J3812636j0993886
36800C5746079k0625474j084405J4929111j973358l0584809l1278135m958063
$$ y = [-47226074, -27012534, 6197912, 33639332, 44189129, 36839957, 26312876, 36390352, 74526749, 118810241, 139782292, 129193564, 99842377, 66921665, 40903172, 29854461, 33738246, 40407756, 39965371, 38987682, 47625059, 57681163, 50516702, 25629133, 3193885, -5057755, -9812114, -21861699, -32239194, -26876261, -9795871, 1881383, -170978, -9830947, -17717132, -17861444, -7911353, 7309768, 16624503, 15975546, 14972033, 19221870, 14747307, -12646924, -47848632, -58490479, -37587157, -11244829, 1670626, 12537465, 32927329, 46739965, 35746079, 15120605, 14036200, 28965311, 26991953, -3592856, -34870991, -39829054]
36793c9829054J2849954O339649m308538K10353J2941050J7677721J1068090L30508
36785A7279733p780688j0218872q433980p401431p540582j900570R925799J3366382
36777b704209j294668j8110354j3260190J0240539K5430587J7624630j950009
36770A5976326j7889562k4544592j7499502N015095K7498561K7597053Q541920
36763B4695299j848211O770037J1079458p031886l0143283l2370940j6212165
36756d5061691k017835K198489K78929o710614j3991304p568712J3196985K3609001
36748c6066752P986362j1094005o208716R280820M489161j3296511r206826J7185826
36740c6930641K6885866M794854j6951964j3251067j209791k01529K949824K0008950
$$ y = [-39829054, -26979100, -20639451, -24947989, -24737636, -11796586, 5881135, 16949225, 17279733, 9499045, -719827, -9153807, -16555238, -24095820, -25996390, -16070591, -2704209, -3998877, -22109231, -35369421, -25128882, 301705, 17926335, 15976326, -1913236, -26457828, -43957330, -38942235, -11443674, 16153379, 24695299, 22847088, 29617125, 40696583, 33664697, 3521414, -28849526, -45061691, -47079526, -44881037, -44602108, -51312722, -65304026, -72872738, -59675753, -36066752, -28080390, -39174395, -45383111, -36102291, -31613130, -44909641, -54116467, -36930641, -10044775, -5249921, -22201885, -35452952, -36662743, -36864272, -33914448, -13905498]
36732a3905498K8126110O812698j9636118j6711631L886682M863173j3678240
36725b0242824j7134355L099580J7419805R580639j871362k795390m420987j1242364
36717b7607258n734450J5209142K3174314K587864j8094297q835663J4254085
36710e046263J6959653J623680l725992L860285L014650p500689o724871N671433
36702H131886N501576r762970j0869349J2908772L0873335J9101212k718598r187925
36694D3977939j2150326l0763747m4642385k1429222K2087583L3958466K178942
36687f782750k8702086k4874413n022874K654140N398761J8866920K7167139Q662138
36679b633025j7695343j4523817J2436202J7966096j2867422l9921639k9101444
$$ y = [-13905498, 14220612, 21033310, 1397192, -15314439, -11427757, -6564584, -20242824, -37377179, -34277599, -16857794, -7277155, -9148517, -11943907, -16364894, -27607258, -33341708, -18132566, 5041748, 7629612, -10464685, -19300348, -5046263, 11913390, 13537070, 9811078, 13671363, 16686013, 9185324, 2460453, 8131886, 13633462, 3870492, -6998857, 5909915, 36783250, 55884462, 53165864, 43977939, 31827613, 1063866, -43578519, -65007741, -42920158, -8961692, -6782750, -35484836, -60359249, -65382123, -62727983, -57329222, -38462302, -11295163, -2633025, -20328368, -34852185, -22415983, -4449887, -17317309, -57238948, -86340392]
36672h6340392j582506N140651l612935L457710K4632616K6130146O40808j6997403
36664d8531305m464690J4098300J0042319m141440p19097J3662418J0327357j0307683
36656b0033821j7958009k609883J0797599N810304j220090M076180N283777j4600108
36648c0454051l6567985k8688168N999732L3196596L4472406K4420792J9961244
36641B2340566J7481483Q869578Q31578M088012J3135281J0829900p859450k6333322
36633D3383626k5293452p619962L538021n149960j7834694j1370224R779237J8791201
36625H223793O302771p214929n465813O46331k878564q746556p300291r185057
36617b5618315k4116205l3602858j4486182K0394806L5257446K0140750j551637
$$ y = [-86340392, -87922898, -82782247, -86395182, -82937472, -58304856, -32174710, -31533902, -48531305, -52995995, -38897695, -28855376, -32996816, -33715913, -20053495, -9726138, -20033821, -37991830, -40601713, -29804114, -23993810, -25213900, -21137720, -15853943, -30454051, -67022036, -95710204, -89710472, -56513876, -22041470, 2379322, 22340566, 39822049, 48691627, 49523205, 53611217, 66746498, 77576398, 69716948, 43383626, 18090174, 10470212, 14008233, 8858273, -8976421, -20346645, -10567408, 8223793, 14526564, 7311635, 1845822, 2492153, -386411, -9132967, -16433258, -25618315, -49734520, -83337378, -97823560, -77428754, -42171308, -22030558, -23582195]
36610b3582195j0761644r688365k634366J0900923K1784509J6534267L70002q266105
36602e342974o243554m793530l563463N739651J3893247O037208m586689N421129
36594F561025J9954862P03204m0819075m5718415N2313L5680078J8811538r785319
36586a4559789J80986K4072260J0922397k5398413l2191613p827453N333377K086204
36578c7382044J5647182M1687111L4363651j1134506l9211802j8058989J4990308
36571I00911J8163050L286521j261403M46675n234642q126547K05785K68964j9447767
36562a0798453k9903686m380755L0672850L0463765l8311j7026349o490510L204503
$$ y = [-23582195, -34343839, -44032204, -46666570, -35765647, -13981138, 2553129, 2923131, -5342974, -11586528, -16380058, -19943521, -14203870, -310623, 5726585, 1139896, 6561025, 26515887, 27219091, -13599984, -59318399, -59266086, -23586008, -4774470, -14559789, -14378803, 9693457, 20615854, -4782559, -36974172, -44801625, -39468248, -37382044, -21734862, 19952249, 54315900, 43181394, 3969592, -14089397, 900911, 19063961, 22350482, 21089079, 21535754, 16301112, 8174565, 8380350, 8649314, -10798453, -40702139, -45082894, -14410044, 16053721, 16015410, -1010939, -7501449, -4296946]
$$ [...]
##END NTUPLES=NMR SPECTRUM
##END=
