##TITLE=31Pdec_LR-696-RM1
 , 48 sc
 22.10.2019
##JCAMPDX= 6.0         $$ Bruker NMR JCAMP-DX V2.0
##DATA TYPE= NMR SPECTRUM
##DATA CLASS= NTUPLES
##ORIGIN= UXNMR, Bruker Analytische Messtechnik GmbH
##OWNER= root
$$ XWIN-NMR		Version 3.5
$$ Tue Oct 22 16:26:33 2019 Russian Standard Time (UT+4h)  she@DPX200
##.OBSERVE FREQUENCY= 81.013821
##.OBSERVE NUCLEUS= ^31P
##.ACQUISITION MODE= SIMULTANEOUS
##.ACQUISITION SCHEME= undefined
##.AVERAGES= 48
##.DIGITISER RES= 17
##SPECTROMETER/DATA SYSTEM= spect
##.PULSE SEQUENCE= zgpg30
##.SOLVENT NAME= CDCl3
##.SHIFT REFERENCE= (INTERNAL, CDCl3, 0, 182.463)
##AUDIT TRAIL= $$ (NUMBER, WHEN, WHO, WHERE, WHAT)
$$ ##TITLE= Audit trail, XWIN-NMR		Version 3.5
$$ ##JCAMPDX= 5.01
$$ ##ORIGIN= Bruker BioSpin GmbH
$$ ##OWNER= she
$$ F:/spectra/data/she/nmr/P31/1/pdata/1/auditp.txt
$$ ##AUDIT TRAIL=  $$ (NUMBER, WHEN, WHO, WHERE, WHAT)
(   1,<2019-10-22 16:25:31.78 +0400>,<she>,<DPX200>,
      <continue with go, POWCHK disabled, PULCHK disabled
       configuration hash MD5:
       00 E9 B6 7A A2 85 ED C7 34 08 36 98 17 FE 4E 26
       data hash MD5: 32K
       71 C3 64 BB 56 98 FF A4 CA 5F 47 F0 CD 94 4C 75>)
(   2,<2019-10-22 16:25:34.00 +0400>,<she>,<DPX200>,
      <Start of raw data processing
       efp BC_mod = 2 LB = 1 FT_mod = 6 PKNL = 1 PHC0 = -926.6346 PHC1 = 511.2007 SI = 64K 
       data hash MD5: 64K
       F3 B0 F7 E7 88 F9 CC 79 AD 94 33 6F 7E 4E 53 16>)
(   3,<2019-10-22 16:25:58.51 +0400>,<she>,<DPX200>,
      <pk PHC0 = -19.55925 PHC1 = 67.99999 
       data hash MD5: 64K
       AE 7C 8A 17 16 64 2B 82 42 CC 84 AB 78 11 10 DB>)
(   4,<2019-10-22 16:26:02.70 +0400>,<she>,<DPX200>,
      <abs ABSG = 5 
       data hash MD5: 64K
       B1 52 95 C6 16 02 98 C3 83 CC 4D 1D 63 50 CA D5>)
$$ ##END=
$$ 
$$ hash MD5
$$ B3 8E C0 E1 43 AE EE 99 35 E7 FA B9 26 A0 2E FB
##$RELAX= 
##$RELAX= 
##$RELAX= 
##$RELAX= 
##$RELAX= 
##$RELAX= 
##$RELAX= 
##$RELAX= 
$$ Bruker specific parameters
$$ --------------------------
##$DU= <F:/spectra>
##$EXPNO= 1
##$NAME= <P31>
##$PROCNO= 1
##$TYPE= <nmr>
##$USER= <she>
##$AMP= (0..31)
100 100 100 100 100 100 100 100 100 100 100 100 100 100 100 100 100 100 
100 100 100 100 100 100 100 100 100 100 100 100 100 100 
##$AQSEQ= 0
##$AQ_mod= 1
##$AUNM= <au_zg>
##$AUTOPOS= <>
##$BF1= 81.014009
##$BF2= 200.13
##$BF3= 200.13
##$BF4= 200.13
##$BF5= 200.13
##$BF6= 200.13
##$BF7= 200.13
##$BF8= 200.13
##$BYTORDA= 1
##$CFDGTYP= 0
##$CFRGTYP= 5
##$CHEMSTR= <none>
##$CNST= (0..31)
1 1 145 1 1 1 1 1 1 1 1 1 1 1 1 1 1 1 1 1 1 1 1 1 1 1 1 1 1 1 1 1 
##$CPDPRG= <waltz16>
##$CPDPRG1= <>
##$CPDPRG2= <waltz16>
##$CPDPRG3= <>
##$CPDPRG4= <mlev>
##$CPDPRG5= <mlev>
##$CPDPRG6= <mlev>
##$CPDPRG7= <mlev>
##$CPDPRG8= <mlev>
##$CPDPRGB= <>
##$CPDPRGT= <>
##$D= (0..31)
0 1 0 0 0 0 0 0 0 0 0 0.03 2e-05 3e-06 0 0 0 0 0 0 0 0 0 0 0 0 0 0 0 0 
0 0 
##$DATE= 1571747078
##$DBL= (0..7)
120 120 120 11 120 120 24 19 
##$DBP= (0..7)
150 150 150 150 150 150 150 150 
##$DBP07= 0
##$DBPNAM0= <>
##$DBPNAM1= <>
$$ [...]
##$SUBNAM3= <"">
##$SUBNAM4= <"">
##$SUBNAM5= <"">
##$SUBNAM6= <"">
##$SUBNAM7= <"">
##$SUBNAM8= <"">
##$SUBNAM9= <"">
##$SW= 369.568048894756
##$SWIBOX= (0..15)
0 1 3 0 0 0 0 0 0 0 0 0 0 0 0 0 
##$SW_h= 29940.119760479
##$TD= 32768
##$TD0= 1
##$TE= 0
##$TE2= 300
##$TE3= 300
##$TEG= 300
##$TL= (0..7)
0 120 53 12 22 120 120 120 
##$TP= (0..7)
150 150 150 150 150 150 150 150 
##$TP07= 0
##$TPNAME0= <>
##$TPNAME1= <>
##$TPNAME2= <>
##$TPNAME3= <>
##$TPNAME4= <>
##$TPNAME5= <>
##$TPNAME6= <>
##$TPNAME7= <>
##$TPOAL= (0..7)
0.5 0.5 0.5 0.5 0.5 0.5 0.5 0.5 
##$TPOFFS= (0..7)
0 0 0 0 0 0 0 0 
##$TUNHIN= 0
##$TUNHOUT= 0
##$TUNXOUT= 0
##$USERA1= <user>
##$USERA2= <user>
##$USERA3= <user>
##$USERA4= <user>
##$USERA5= <user>
##$V9= 5
##$VALIST= <valist>
##$VCLIST= <CCCCCCCCCCCCCCC>
##$VD= 0
##$VDLIST= <DDDDDDDDDDDDDDD>
##$VPLIST= <PPPPPPPPPPPPPPP>
##$VTLIST= <TTTTTTTTTTTTTTT>
##$WBST= 1024
##$WBSW= 4
##$XGAIN= (0..3)
0 0 0 0 
##$XL= 0
##$YL= 0
##$YMAX_a= 7064
##$YMIN_a= -12204
##$ZGOPTNS= <>
##$ZL1= 120
##$ZL2= 120
##$ZL3= 120
##$ZL4= 120
##$ABSF1= 182.463
##$ABSF2= -187.1042
##$ABSG= 5
##$ABSL= 3
##$ALPHA= 0
##$AQORDER= 0
##$ASSFAC= 0
##$ASSFACI= 0
##$ASSFACX= 0
##$ASSWID= 0
##$AUNMP= <proc_1d>
##$AZFE= 0.1
##$AZFW= 0.5
##$BCFW= 0
##$BC_mod= 2
##$BYTORDP= 0
##$COROFFS= 0
##$CY= -3
##$DATMOD= 1
##$DC= 0
##$DFILT= <>
##$DTYPP= 0
##$F1P= 0
##$F2P= 0
##$FCOR= 1
##$FTSIZE= 65536
##$FT_mod= 6
##$GAMMA= 0
##$GB= 0
##$INTBC= 1
##$INTSCL= 5.30512e-09
##$ISEN= 30
##$LB= 1
##$LEV0= 0
##$LPBIN= 0
##$MAXI= 10000
##$MC2= 0
##$MEAN= 0
##$ME_mod= 0
##$MI= 50
##$NCOEF= 0
##$NC_proc= -9
##$NLEV= 6
##$NOISF1= 182.463
##$NOISF2= 159.3651
##$NSP= 0
##$NTH_PI= 0
##$NZP= 0
##$OFFSET= 182.463
##$PC= 4
##$PHC0= -946.1938
##$PHC1= 579.2007
##$PH_mod= 1
##$PKNL= yes
##$PPARMOD= 0
##$PSCAL= 0
##$PSIGN= 0
##$REVERSE= no
##$SF= 81.0140089999434
##$SI= 65536
##$SIGF1= 159.3651
##$SIGF2= -187.1042
##$SINO= 113.3802
##$SIOLD= 16384
##$SREGLST= <1H.CDCl3>
##$SSB= 0
##$STSI= 65536
##$STSR= 0
##$SW_p= 29940.119760479
##$SYMM= 0
##$S_DEV= 0
##$TDeff= 32768
##$TDoff= 0
##$TI= <>
##$TILT= no
##$TM1= 0
##$TM2= 0
##$TOPLEV= 0
##$USERP1= <user>
##$USERP2= <user>
##$USERP3= <user>
##$USERP4= <user>
##$USERP5= <user>
##$WDW= 1
##$XDIM= 65536
##$YMAX_p= 414972653
##$YMIN_p= -273603669
$$ End of Bruker specific parameters
$$ ---------------------------------
##NTUPLES= NMR SPECTRUM
##VAR_NAME=  FREQUENCY,     SPECTRUM/REAL,   SPECTRUM/IMAG
##SYMBOL=    X,             R,               I
##VAR_TYPE=  INDEPENDENT,   DEPENDENT,       DEPENDENT
##VAR_FORM=  AFFN,          ASDF,            ASDF
##VAR_DIM=   65536,         65536,           65536
##UNITS=     HZ,            ARBITRARY UNITS, ARBITRARY UNITS
##FACTOR=    0.456856943014862, 1,           1
##FIRST=     14782.0589164792, 0,            0
##LAST=      -15158.0608439998, 0,           0
##MIN=       -15158.0608439998, -273603669,  0
##MAX=       14782.0589164792, 414972653,    0
$$ Real data points
##PAGE= N=1
##DATA TABLE= (X++(R..R)), XYDATA
$$ [...]
41226B0964905r803235j3033840j4172284l895866J1765212J3416573k244392
41219B997073j3355765n074402P177144L580292p537131n624983O122256P316913
41211d398603m004808j0089939n458790k161958j855889Q382705K6341598K9458051
41203C6212367J0528354p522451p052945j639840q657049j8088966j1440328N182445
41195b478413J1929806P916196P975461J3176594R445180n232810j4709010r749452
41187A8273552j230080j795040p940408q524644k495213O00418m577409j0151456
41179a7840280m272229J1092180J7933600M713736j4296588j5809088j929477
41172b0408146J312619j5344937k6984139j1318225J6331331K4995242J1369753
$$ y = [20964905, 11161670, -1872170, -16044454, -19940320, -8175108, 5241465, 2997073, -10358692, -15433094, -8255950, -4675658, -12212789, -17837772, -11715516, -4398603, -8403411, -18493350, -23952140, -26114098, -27969987, -19587282, 6754316, 36212367, 46740721, 39218270, 32165325, 30525485, 21868436, 3779470, -7660858, -2478413, 9451393, 17367589, 25343050, 38519644, 47964824, 42732014, 28023004, 18273552, 17043472, 15248432, 7308024, -1216620, -3711833, -3111415, -7688824, -17840280, -22112509, -11020329, 6913271, 11627007, -2669581, -18478669, -20408146, -19095527, -34440464, -61424603, -72742828, -56411497, -31416255, -20046502]
41165b0046502j807986k491158k38105k567901l170194K705044Q622405P867757
41157a1126640J818539n353175j0307436q708954J50783P986373O711238N30621
41149a8298651j104068K062134N125684R788654J7462094J7806253K728823j3682918
41141B1888005j0828098N585654R878292m384078j6677566j4685597j0744907
41134a9968295j4227092j2844255L812789K2429650K4522743J2368309J667826
41127A7761675R1200N156079J1938703J2437979o81176k0172360k6899445j5086146
41119a5453491l62779N285217Q160609J2386805P172600r416839j6322169p10261
41111i260308J6592031J1884010l340857l848290O183822N509645j059724Q320601
$$ y = [-20046502, -21854488, -24345646, -24583751, -27151652, -30321846, -27616802, -18994397, -11126640, -9308101, -14661276, -24968712, -33677666, -33526883, -25540510, -18829272, -18298651, -19402719, -17340585, -12214901, -2426247, 15035847, 32842100, 35570923, 21888005, 11059907, 16645561, 26523853, 22139775, 5462209, -9223388, -19968295, -34195387, -47039642, -43226853, -20797203, 3725540, 16093849, 17761675, 17852875, 23008954, 34947657, 47385636, 46704460, 26532100, -367345, -15453491, -15816270, -10531053, -2370444, 10016361, 17188961, 7772122, -8550047, -9260308, 7331723, 19215733, 15874876, 12026586, 18210408, 23720053, 22660329, 30980930]
41103C0980930K5202749J6076236j9222189l6665345j1726936K2675919K4735119
41096E2056483L71885j5748434j2631566n961305l595259R53518O648220L816363
41088B5909905n613161q740550l445797n22729k800226n74134Q555914J2583120
41080B5352342M455293n748000o192271M48508M762910N354672O080235N095399
41072C9609088k780261j5166640k2175187j7489592m434615P984361J1315200
41065c137646K936947r615178j2789478k260280R096608P462754n70585L439034
41057e437824J8838281K1432694m37512k2664423j6777457P200909J4166803l704795
41049A2616676j6479622m189436J3238181R863766n703950p367996N894210J1608843
$$ y = [30980930, 56183679, 72259915, 53037726, 16372381, 4645445, 27321364, 52056483, 52428368, 36679934, 24048368, 18087063, 14491804, 15445322, 22093542, 25909905, 20296744, 11556194, 8110397, 7587668, 4787442, 4213308, 12769222, 25352342, 29807635, 24059635, 17867364, 18315872, 23078782, 28433454, 34513689, 39609088, 36828827, 21662187, -513000, -18002592, -22437207, -14452846, -3137646, -200699, -9815877, -22605355, -24865635, -15769027, -8306273, -8876858, -5437824, 13400457, 34833151, 34395639, 11731216, -5046241, 2154668, 16321471, 12616676, -3862946, -8052382, 5185799, 15049565, 9345615, 1977619, 7871829, 19480672]
41041A9480672J512876q774234q219139m834091o445034o962615j85592Q081467
41033f345690J0507196R000056P352047L422536m043736r397974p430895j32357
41025B931183P766167J3077869J2208535L635685o187488q844389o083042m860837
41017A3643683k142614R168920J9563274R730381j6883021l1370473j9380613
41010a7670463j046040L008554K028598J1564507K1365248J3253484m967906j2230238
41002A5305744r366441j1932272j6654742p508493Q818955Q104996q608909j1733187
40994c3574349R051437K6049903J6535661l997307r318535N21302Q990039J0194194
40986B4452345O536827l916603j7982851j9968422l584568J1771961O492441r837162
$$ y = [19480672, 20993548, 12219314, 4000175, -833916, -7278950, -14241565, -14427157, -6345690, 4161506, 13161562, 20513609, 23936145, 19892409, 10494435, 3063540, 2931183, 10697350, 23775219, 35983754, 39619439, 33431951, 24587562, 18504520, 13643683, 11501069, 20669989, 40233263, 49963644, 33080623, 1710150, -17670463, -18716503, -15707949, -13679351, -2114844, 19250404, 32503888, 27535982, 15305744, 5939303, -5992969, -22647711, -30156204, -21337249, -13232253, -21841162, -33574349, -24522912, 1526991, 18062652, 14065345, 4746810, 5268112, 14258151, 24452345, 30989172, 27072569, 9089718, -10878704, -14463272, -2691311, 3801130, -6036032]
40978f036032j5200269r037408n625876m020487P540748K2212645J8880898k384899
40970F329320j6129044q549589N126534Q021378M060287K950432L253100K885537
40962G947955P937327J6599088J1622716j3341402l4452197k6129382J032352
40955b8783543J4263208N599295r18492Q620638J5215342m93371k3426597k3365396
40947c3288916M74486J7536390R337812o754652o927594L164858M18355j5872816
40939c1912077j9366762L767863L0713087L0945251O695319j2428259r091396
40932f76974N252292J2651388R916136L089503m286677r153240o371435K579586
40924A3000579O554618q75054j1124948j3261293r472492p443146m464575O500383
$$ y = [-6036032, -21236301, -30273709, -35899585, -39920072, -32379324, -10166679, 8714219, 6329320, -9799724, -18349313, -13222779, -5201401, -1141114, 1809318, 5062418, 7947955, 15885282, 32484370, 44107086, 30765684, -3686513, -29815895, -28783543, -14520335, -8921040, -9839532, -1218894, 13996448, 13503077, -9923520, -33288916, -32814430, -15278040, -5940228, -12694880, -19622474, -16457616, -16039261, -31912077, -51278839, -47510976, -16797889, 14147362, 20842681, 8414422, -676974, 4575318, 17226706, 27142842, 30232345, 25945668, 16792428, 10420993, 13000579, 19555197, 18680143, 7555195, -5706098, -15178590, -22621736, -27086311, -20585928]
40916b0585928J8353283J4346188o118102k1588118j6300067j566943J857636
40909c1602051o066086p248963M699028J4048361P222296o873792j1745792q574996
40901d6141995j1110766j9328637j6530534L262097K1918795K1546704R270921
40894c7113415M023447Q324427R859743N263310L504107O616051N609405j902810
40886D184265p251505p623206r760453j1715353j019886J9533582K5412506N127719
40878A6887669j7371103j5204290K294066O985151l643768p702953J475385P184029
40870i095814J905168j117554M330035M911296n614800j1177396j93820J2427223
40862c625662Q167348n785672r401219o21082O049584L981212j322699p462738
$$ y = [-20585928, -2232645, 12113543, 5995441, -15592677, -31892744, -33459687, -31602051, -37668137, -44917100, -40218072, -26169711, -18947415, -25821207, -37566999, -46141995, -57252761, -76581398, -93111932, -89849835, -67931040, -46384336, -37113415, -33089968, -24765541, -14905798, -9642488, -6138381, 477670, 6087075, 4184265, -3067240, -10690446, -20450899, -32166252, -33186138, -13652556, 11759950, 16887669, -483434, -15687724, -13393658, -6408507, -10052275, -17755228, -16279843, -9095814, -7190646, -8308200, -3978165, 933131, -4681669, -15859065, -16052885, -3625662, 4541686, -1243986, -10645205, -11266287, -5216703, -1235491, -2558190, -10020928]
40854a0020928j6341451k1934142j3910183N078470J9517185K0494194J3572567
40847c544288O077191j285219o986915m571929P283537J7962368J5382676N68474
40839C0885895j3081511j4868088q737070q148907j7852538k4423439j2230284
40832f8455942J2283614K4303212J3049456k772825j752636J0472660J3174345
40825C01884K691116o145026n632050j768630L952229J7857587L4737597L5242198
40817H1236905J2113754j6297394k8878907k5738430j9870359j6724078j3051902
40810b7210411o724860K967364J7129548L0196589K9485052J1772433p713978
40803D9901737j3435636q958363p031276q423385m920342K051832J680372q340352
$$ y = [-10020928, -26362379, -48296521, -62206704, -57128234, -37611049, -17116855, -3544288, 2532903, 1247684, -5739231, -10311160, -3027623, 14934745, 30317421, 30885895, 17804384, 2936296, -5800774, -13949681, -31802219, -56225658, -68455942, -56172328, -31869116, -18819660, -21592485, -23345121, -12872461, 301884, 2993000, -3152026, -8784076, -10552706, -6600477, 11257110, 45994707, 81236905, 93350659, 77053265, 48174358, 22435928, 2565569, -14158509, -27210411, -33935271, -30967907, -13838359, 16358230, 45843282, 57615715, 49901737, 36466101, 27507738, 20476462, 12053077, 7132735, 9184567, 10864939, 2524587]
40795B524587j7678506j7788446r675473K190045J2770757J4090744K087267j3314511
40787b4793536j6522652o085004N062556J0109090J5561077K4130889K4913295
40780C2375715R759574j0749934j8255218q219353P242429J3922497P169173o126109
40772B7118774j1931963j016607J8086923K4363384R100317j1125062j4442623
40765D0153143q00964J0821712P863463m565311j5622687j9629580j4434404j058070
40757B727302J1417728J1185535o30908q429115k272055Q746521J0852149N302458
40749C8899615K937638M445262j78150j2614816k0176350j3580818m51024N809024
40741E090381K959875j837781m443827n255885k414136O079513J4157369J1325385
$$ y = [2524587, -15153919, -32942365, -42617838, -40427793, -27657036, -13566292, -11479025, -24793536, -41316188, -47401192, -42338636, -32229546, -16668469, 7462420, 32375715, 42135289, 31385355, 13130137, 4910784, 12153213, 26075710, 33244883, 27118774, 15186811, 14170204, 32257127, 56620511, 65720828, 54595766, 40153143, 39352179, 50173891, 58037354, 53472043, 37849356, 18219776, 3785372, 2727302, 14145030, 25330565, 24699657, 16270542, 13998487, 22745008, 33597157, 38899615, 41837253, 46282515, 46104365, 33489549, 13313199, -267619, -718643, 5090381, 8050256, 6212475, 1768648, -3487237, -5901373, 178140, 14335509, 25660894]
40733B5660894l371288j8103431k1165560j1786384K399432J2207812J0945984
40726c212541k91687r597964m872397R959300J8106954J2250879L218173J444853
40718B7005570J945702l208342q720503n258803L148307N039860r4800l092857
40710A6764134j372504m74515j790040j987063k787898q005665j2393600p054724
40702a9101875N183915J3020353J2912457Q254240k242189j6990341j8978125
40695a7941565L509665K7107599J6893780j7507871k7560562N12885J9851356
40688D865287m042030l5106731k1512009K2662711M0473295J8566267l169213
40681B2737577k323829K02496q867838j0093868N964413J5536303L834559p677977
$$ y = [25660894, 22289606, 4186175, -16979385, -28765769, -26366337, -14158525, -3212541, -3504228, -13102192, -17974589, -8015289, 10091665, 22342544, 25560717, 27005570, 28951272, 25742930, 17022427, 11763624, 14911931, 19951791, 19856991, 16764134, 15391630, 14917115, 13127075, 11140012, 8352114, 346449, -12047151, -19101875, -13917960, -897607, 12014850, 20269090, 18026901, 1036560, -17941565, -14431900, 12675699, 29569479, 12061608, -15498954, -14986069, 4865287, 823257, -34283474, -55795483, -33132772, 7340523, 25906790, 22737577, 20413748, 20616244, 11748406, 1654538, 7618951, 23155254, 26989813, 19311836]
40673A9311836j382317M147817q993088k0925191q502137R906638L942732j4346276
40665a6839986r234105J6935111K6036627O459128j0723397m864100N175281l90710
40657A2553849r342807l730410Q218162R905778N742502Q363554J1023265j939137
40649D0794756k4342456l1337981j2981147J2986331K3795276J4489880l088334
40642B0316325j3694191r640169L534534J1360877N859154n227458j0266513r912367
40634g669808j1972194j4415389p182875Q801667J8798465J5041599P275339M977745
40626A3654549J856853r310001j6576913k238359K6247193L8894396K2168499
40619G4696217k288229q413018O0527J741088p828535j4344413j1841523q922425
$$ y = [19311836, 17929519, 22077336, 13084248, -7840943, -16343080, -6436442, -2493710, -16839986, -26074091, -9138980, 16897647, 23356775, 12633378, 7769278, 12944559, 12553849, 3211042, -519368, 7698794, 17604572, 23347074, 31710628, 42733893, 40794756, 16452300, -14885681, -27866828, -14880497, 8914779, 23404659, 20316325, 6622134, -3018035, 516499, 11877376, 17736530, 12509072, 2242559, -7669808, -19642002, -34057391, -41240266, -32438599, -13640134, 1401465, 8676804, 13654549, 15511402, 6201401, -10375512, -12613871, 13633322, 52527718, 74696217, 72407988, 63994970, 64055497, 65796585, 57968050, 43623637, 31782114, 22859689]
40611B2859689p889529r64237Q009031K550425j5311912j7618971Q085505L2232695
40603C1952696K2630668p392821k0027260r641969l541239j1201746j1530615
40596h752286L720985J1675355j205310j3144927l318965J2849231J0564837l503345
40588H885575o276514J222378o34317j2948906j7582170j0482501o182954p658855
40580e1658264l41032J7309533K3876540P678957j2333062j3415147k25974O863832
40572b2244617K440073j714114K055815Q828487J0927037M835667q923338k3125204
40564b6920194k4420776p177102J5047074K2595345J4190386P231029J1381228
40557A1926990J4153433J152958j8623267k2058549n115683Q835200J073098j4939418
$$ y = [22859689, 14970160, 14005923, 22014954, 24565379, 9253467, -8365504, -279999, 31952696, 54583364, 47190543, 27163283, 17521314, 13980075, 2778329, -8752286, -5031301, 6644054, 5438744, -7706183, -11025148, 1824083, 12388920, 8885575, 2609061, 3831439, 3197122, -9751784, -27333954, -37816455, -43999409, -51658264, -51999296, -34689763, -10813223, -3134266, -15467328, -28882475, -29108449, -22244617, -19804544, -21518658, -19462843, -10634356, 292681, 5128348, -3794990, -26920194, -51340970, -58518072, -43470998, -20875653, -6685267, 545762, 11926990, 26080423, 27233381, 8610114, -13448435, -18564118, -9728918, -8655820, -23595238]
40549b3595238j2595417Q185675J9790449P077507j1205181j0885440M404333
40542a8823312J3504881R106550R87696m390881q559324r200710k359181M828132
40534a4906149J569258o890474n576904L989273M602528o894066j3014062m699270
40526d1819866O133268J1908387K2192586L7153007L4108682K635256k8591684
40519D3719636k7521186n571711J105616j3657594k2460213j0910213N285422
40512c0010243J2164943J5559665J9831244J6292302L948410k300019K999343
40505C8485645L838931r891384k3159490k0209083j0082714q859515j1707406
40498d1585016m184128R500701J2385600L507251o24205P798529J8358452J9750292
$$ y = [-23595238, -36190655, -28004980, -8214531, -1137024, -12342205, -23227645, -18823312, -5318431, 3788119, 4775815, 384934, -8174390, -17375100, -19734281, -14906149, -13336891, -20227365, -25804269, -21814996, -17212468, -24106534, -37120596, -41819866, -35686598, -23778211, -1585625, 35567382, 69676064, 72311320, 43719636, 16198450, 10626739, 11732355, -1925239, -24385452, -35295665, -30010243, -17845300, -2285635, 17545609, 33837911, 37786321, 35486302, 38485645, 42324576, 32433192, 9273702, -10935381, -21018095, -29877610, -41585016, -45769144, -36268443, -23882843, -20375592, -20999797, -13201268, 5157184, 24907476]
40490B4907476J1304877l509429k0481367k9729284k1258584L61879J7357047
40483b1047385J8449237R135632Q13476j753395n12990L96143k187093n715555
40475b421930k029778J0443739J8691389J0389202o477564j3326454p926118m642717
40467B699769p924708n914017M736526R136008l33473q449113j602161R301280
40459A650111P793991j001828k180728K132808K86118l910595J080622P528694
40451A3379193k618637k2041168k1466189L945219K0804774N235536k0225246
40444b2986518j8604283J0122399L3124434K9844438J0243706p088411j3990646
40437B0665119j0317158l38558N820924K25708j1415744j6264959j1287202l277615
$$ y = [24907476, 36212353, 32702924, 12221557, -17507727, -38766311, -38404432, -21047385, -2598148, 6537484, 7350960, 5597565, 5084575, 5480718, 3293625, -2421930, -4451708, 5992031, 24683420, 35072622, 28595058, 15268604, 7342486, 2699769, -5224939, -11138956, -6402430, 2733578, 2400105, -6049008, -7651169, 1650111, 9444102, 8442274, 6261546, 8394354, 8680472, 4769877, 5850499, 13379193, 10760556, -11280612, -32746801, -28801582, -7996808, -2761272, -22986518, -41590801, -31468402, 1656032, 31500470, 41744176, 34655765, 20665119, 10347961, 10009403, 15830327, 16056035, 4640291, -11624668, -22911870, -26189485]
40429b6189485M788142J3842990J7616710Q103666o938802r394227K258136Q739149
40421A2826279m17677j0434159n343847P228216J0163321L685611R58921M507533
40413B3174198M811419q04540m517153l235990k847409n387053m961428K07836
40405F439880K976853j072927o463373o734596k611888K661139Q288409J1791025
40397A5274522P682970l808658j2992183j2167365n950166l452584m171532R0078
40389a9494918J0146010J4672678M526477j2438903j7173227j896376J7659777
40382c998482J8925225J145771j1513836n40894K2071413K9797777J5962587k169330
40374F9680231j0822557j3533340j4772105q554095O741980J7383510J1596567
$$ y = [-26189485, -21401343, -7558353, 10058357, 18162023, 11223221, 1828994, 4087130, 12826279, 12408602, 1974443, -3369404, 3858812, 14022133, 17707744, 18666665, 23174198, 27985617, 27181077, 22663924, 19427934, 16580525, 11193472, 6232044, 6439880, 9416733, 8343806, 1880433, -4854163, -7466051, -4804912, 3483497, 15274522, 22957492, 19148834, 6156651, -6010714, -11960880, -15413464, -19584996, -19494918, -9348908, 5323770, 9850247, -2588656, -19761883, -21658259, -3998482, 14926743, 16072514, 4558678, 4017784, 26089197, 55886974, 71849561, 69680231, 58857674, 45324334, 30552229, 21998134, 28740114, 46123624, 57720191]
40367E7720191k765146j1081465j2943724j5915023j7366291j0115638k92675
40360a2759771l58558o742400m040633Q203871J3189433M885659j957638K733679
40352C153642P984061J903457q182215q995758j695109M122649N479668K786040
40344F556435o413026j7180979j3906597O457336K1232983J2264494l436665R44851
40336F518832J5990954Q434298k1924906l4587832q256703K5295110K7441258
40329A8911011O044580l660314O944932J4634230M772025j0951796j7452522j4979554
40321D262592j0819356p846789n695967l041000K896123J1190121J3616999M965899
40313I528622o925248j1397306r963637r368347o522572L878115J2714386P460973
$$ y = [57720191, 54955045, 43873580, 30929856, 15014833, -2351458, -12467096, -12759771, -13118329, -19860729, -23901362, -15697491, -2508058, 2377601, 419963, 3153642, 11137703, 13041160, 4858945, -4136813, -5831922, -1709273, 3770395, 6556435, 143409, -17037570, -30944167, -24486831, -3253848, 9010646, 5573981, 6518832, 22509786, 30944084, 9019178, -25568654, -33825357, -8530247, 18911011, 24955591, 21295277, 28240209, 42874439, 47646464, 36694668, 19242146, 4262592, -6556764, -14403553, -20099520, -23140520, -20244397, -9054276, 4562723, 9528622, 2603374, -8793932, -18757569, -28125916, -34648488, -30770373, -18055987, -10595014]
40305a0595014k843396L355945K4000943L0668833J0017070j4800069j7200144
40298B2604168k307870P008562L499697k938817n163618k009027R147192K4689549
40290E4529836K7216758N807361k0368905k0251502O157491K3697577P734394
40283H4523010k3350796l3290206j4508768N224569N36048j9972206k6142847
40276b6981196m941245K3020160K9170818J1343603p352247j0029097k312293
40269A1918503M231236R043576J5219450J8499595J4218042N450778m630365j7401624
40261E6549191k7063838j9526686L439406J5253461r33521k3309579k0862436
40254a6454002O88830J1145894M820902K844991R161144K809253j8648970k5940455
$$ y = [-10595014, -13438410, -10082465, 13918478, 44587311, 54604381, 39804312, 22604168, 20296298, 27304860, 30804557, 27865740, 22702122, 20693095, 29840287, 54529836, 81746594, 87553955, 67185050, 46933548, 53091039, 76788616, 84523010, 61172214, 27882008, 13373240, 18597809, 19133857, -838349, -26981196, -31922441, -8902281, 20268537, 31612140, 24259893, 14230796, 11918503, 16149739, 25193315, 40412765, 58912360, 73130402, 78581180, 73950815, 56549191, 29485353, 9958667, 13398073, 28651534, 27718013, 4408434, -16454002, -15765172, -4619278, 201624, 3046615, 12207759, 15017012, -3631958, -29572413]
40246b9572413m708309J7832147J4809011j87578r51232P671879M967292m546599
40238E314198J07783J5118499J4076810p663392k1269192n780856K1359077K7495755
40230D8758682N081638k2528040k9692410j5297570j075238m507636j6630371
40223c5890945j4432843N403046J9775495J1978914n249038j1101079n322559
40216c4839009K50280M355205J1507011J6564834J4137144J2149570J5488639
40209C9613674R896140j2436717k6097569n192101K7568574K5520995j0468474
40202D8404522k9889395q935856J6848802J3198880l648972n294349J35230o796790
40194B4022072j3511949J354819K1699980J3914582j7131442l2818718j8621806
$$ y = [-29572413, -34280722, -16448575, -1639564, -1827142, -2778374, 4893505, 9860797, 5314198, 5421981, 20540480, 34617290, 26953898, 5684706, -96150, 21262927, 48758682, 53840320, 31312280, 1619870, -13677700, -14752938, -19260574, -35890945, -50323788, -44920742, -25145247, -13166333, -18415371, -29516450, -34839009, -34588729, -30233524, -18726513, -2161679, 11975465, 24125035, 39613674, 49509814, 37073097, 10975528, 5783427, 33352001, 58872996, 48404522, 18515127, 9579271, 26428073, 39626953, 35977981, 30683632, 30818862, 24022072, 10510123, 11864942, 33564922, 47479504, 30348062, -2470656, -21092462]
40187b1092462P5895K309980k501234l12010N281173P371647Q946578J1036437
40179A1116004P037359j858100l517907L980196N463243p308413k1012246k1069030
40171b7168894j1864317m761605R06520J1094993K1151540K1142161J1977489
40164B2477887M392417M405072Q220900R250962L986308o468344j6057620j7860048
40156A2347534j1547489l407296J918714M285100L010450k551605p143141m936809
40148h024542j668330p939896j7745638j1081636J3947174L0051531J6477919
40141A4016582r683042j7033639l004840R112869R059768R540924J6852291J7211038
40133D6071951J148540j8089233k2207833j0373039N678875J6610717J6396502
$$ y = [-21092462, -21016567, -18706587, -21207821, -21519831, -16238658, -8867011, 79567, 11116004, 18153363, 16295263, 12777356, 16757552, 22220795, 14912382, -6099864, -27168894, -39033211, -43794816, -42888296, -31793303, -10641763, 10500398, 22477887, 26870304, 31275376, 39496276, 48747238, 52733546, 46265202, 30207582, 12347534, 800045, -2607251, -688537, 3596563, 6607013, 4055408, -3087733, -8024542, -9692872, -17632768, -35378406, -46460042, -32512868, -2461337, 14016582, 4333540, -12700099, -15704939, -6592070, 2467698, 12008622, 28860913, 46071951, 47220491, 29131258, 6923425, -3449614, 2229261, 18839978, 35236480]
40126C5236480J764333j7381349j9734552K08113J7640634Q258145j5036784j8620776
40118g665756K408427J7439207P364183q223437m538793J0407979J2757097K108448
40110C2057355k034574M344459N293184l805977o884855L276427R420687l115573
40102C8551133k2092433k7066826j8222901r144654k032168J0000563K2293648
40095g713638K0971991N578217p646522p058953K836890J1591965J2376857K411771
40087C3348578j2888355j7860867l913124J2746358R127681q842012j1421573
40080B96686R038805K2840472P250120j7196082j6474614O952098J9913983P386236
40072D0007704r830282q118978Q413463J7703381P961280j1264661k1117465j2832738
$$ y = [35236480, 37000813, 19619464, -115088, 93025, 17733659, 25991804, 10955020, -7665756, -5257329, 12181878, 19546061, 11322624, 6783831, 17191810, 29948907, 32057355, 30022781, 34367240, 39660424, 35854447, 28969592, 32246019, 41666706, 38551133, 16458700, -10608126, -28831027, -37975681, -40007849, -30007286, -7713638, 13258353, 18836570, 11190048, 4131095, 6967985, 18559950, 30936807, 33348578, 20460223, 2599356, -1313768, 11432590, 20560271, 11718259, 296686, 9335491, 32175963, 39426083, 22230001, 5755387, 12707485, 32621468, 40007704, 30177422, 22058444, 30471907, 48175288, 56136568, 44871907, 23754442, 10921704]
40064A0921704L436093J0224602L516967m108265l000238Q74135j174334n545358
40056A5145306l916857K717332P760999R201282O863423j458321j1551667j1752512
40048A3008985j618824K023352q088088j3171842J302239J6058528O537588j3123846
40040B928092r572966J3991756K1273478K607543j0541323j93150J0154878M81915
40032C1130223j0120279J129476J9779367J8762944J805406p657763m453194m98755
40024D9877425J078286M371214M601794k039431l948623O682638J3190596p79475
40016G3034424j8777832j4025487N961928J0702021l423242j0323564n60297N548860
40008D8136811l166075j0396871l485112O459626Q148415Q009150J1102564P613315
$$ y = [10921704, 14357797, 24582399, 28099366, 23991101, 20990863, 21864998, 20690664, 15145306, 11228449, 13945781, 21706780, 30908062, 37771485, 36313164, 24761497, 13008985, 11390161, 13413513, 5325425, -7846417, -6544178, 9514350, 16051938, 2928092, -6644874, 7346882, 28620360, 31227903, 20686580, 20493430, 30648308, 31130223, 21009944, 22139420, 41918787, 60681731, 62487137, 54829374, 50376180, 49877425, 50955711, 55326925, 59928719, 57889288, 53940665, 60623303, 73813899, 73034424, 54256592, 40231105, 46193033, 56895054, 53471812, 43148248, 42587951, 48136811, 44970736, 34573865, 31088753, 37548379, 45696794, 53705944, 64808508, 72421823]
40000G2421823o764797j6958039r771463P322591K0242343K4653457J8779734
39993A09925649o52667k3491904k7057114o504315J3641799J3182349L532418
39986H2576215M608699J1901869P190917j0399073k4347208k3998218j2270932
39979C5262269J927404O970992m527429k0502096j6124285J0942646L0355609
39972D4305110K1736285O745916J3745548K9946550K2183329o949931k1647364
39965A10065443q670004O584430M464293k858218n13008M018970P54604j921022
39957A11925488N858869J5456578J3923768N054371P24387J446484l07547n073041
39949A49009357p063670m372284J084883Q566100J5593830J5627423N957636p054806
$$ y = [72421823, 65657026, 48698987, 38927524, 46250115, 66492458, 91145915, 109925649, 109272982, 85781078, 58723964, 52219649, 65861448, 79043797, 82576215, 87184914, 99086783, 106277700, 95878627, 71531419, 47533201, 35262269, 37189673, 44160665, 39633236, 19131140, 3006855, 13949501, 44305110, 66041395, 72787311, 86532859, 116479409, 138662738, 131712807, 110065443, 101395439, 107979869, 112444162, 109585944, 109072936, 113091906, 113846510, 111925488, 117784357, 133240935, 147164703, 152219074, 152943461, 154389945, 154082398, 149009357, 141945687, 137573403, 138658286, 147224386, 162818216, 178445639, 184403275, 177348469]
39941A77348469j6374247k1857236k3828011j7007509L8217J4939310J2499610
39934A25758603m507145j5468471p271500P232030M924437j4392136k2796898
39927G3478920j131274K9222027L0187770j10722k2889847j3836013M445916K536872
39919A01903649r195909k998631J5946622J7835045j442261j5360068j1392152
39912I5296295m967331n056018r00622Q759205P445031n952613q679416O086568
39904I2031099J3214979j715549j5363284o103709Q518869K386313j5688422k0316525
39896E6963771j1687874p156850o342626K673438J3846538J1821471J912024J513789
39888F3543681Q504204O999781k046525n074320m513224j2938404k3421227j7005020
$$ y = [177348469, 160974222, 139116986, 115288975, 98281466, 98319683, 113258993, 125758603, 121251458, 105782987, 98511487, 105743517, 110667954, 96275818, 73478920, 72347646, 101569673, 131757443, 131646721, 108756874, 94920861, 99366777, 101903649, 92707740, 89709109, 105655731, 123490776, 122048515, 106688447, 95296295, 90328964, 85272946, 84372324, 93131529, 100576560, 94623947, 85944531, 92031099, 105246078, 103530529, 88167245, 82063536, 90582405, 92968718, 77280296, 56963771, 45275897, 38119047, 31776421, 34449859, 48296397, 60117868, 62029892, 63543681, 72047885, 79047666, 77001141, 71926821, 67413597, 54475193, 31053966, 14048946]
39880A4048946K762541J3869674J2484379J3383347J5385499K505992j7894987
39873E6545391j6863899P385445K0249373M061972j5533723j4573114p248361
39866C4023084j3663656k2274903j3530599L460826Q480417N674610J0955243
39859A3125022J8333055R867517r612727j7330960q322927k13390k957961o508963
39851c621334k83401J3224299K5676743K9345428J7506024p579013k8843476k9953292
39843A5471978j4678601O29536Q647979J2116646J0432459K145538m358779r85604
39835B9421152L059861o115331k0355938j7837755R41257R789030l908541j9423274
39827b4429539j4108696M720386J5040753J2583918R672566J0306602N686843
$$ y = [14048946, 16811487, 30681161, 43165540, 56548887, 71934386, 74440378, 56545391, 39681492, 47066937, 67316310, 71378282, 55844559, 41271445, 34023084, 20359428, -1915475, -15446074, -11985248, -3504831, 2169779, 13125022, 31458077, 41325594, 31712867, 14381907, 6058980, 5845590, 2887629, -3621334, -3904735, 9319564, 34996307, 64341735, 81847759, 74268746, 45425270, 15471978, 793377, 1422913, 10070892, 22187538, 32619997, 34765535, 30406756, 29421152, 32481013, 26365682, 6009744, -11828011, -10886754, -1097724, -5006265, -24429539, -38538235, -33817849, -18777096, -6193178, 3479388, 13785990, 19472833]
39820A9472833o524279j4371428p613833P446243J4303857M075817j5344327k6466322
39812b5021439j8302523L370532K1880364K5793328J7834642Q434439M080393
39805C8069736L363933J332523m577460j1429359j2696390n248728N258059R089339
39797B3161653L746303k671834j742392M397267O132934p14835r535617j2112230
39789A0661249r122033o711506m775193L021946J4879845J6241577j048745k1572955
39781A574185k2295130m009758R037260L774293m767936K71493J1188964J0772811
39773E546182J094723k307956J852233P7910r571589j1673298O81144J2007251
39765b293400O135955j0636454j8623071r154716Q935033K1668321K1537541J1026632
$$ y = [19472833, 12948554, -1422874, -9036707, -1590464, 12713393, 16789210, 1444883, -25021439, -43323962, -39953430, -18073066, 7720262, 25554904, 33989343, 38069736, 41433669, 42766192, 38188732, 26759373, 14062983, 8814255, 14072314, 23161653, 26907956, 24236122, 22493730, 26890997, 33023931, 32309096, 22773479, 10661249, 1539216, -5172290, -9947483, -6925537, 7954308, 24195885, 23147140, 1574185, -20720945, -24730703, -15693443, -11919150, -16687086, -16415593, -5226629, 5546182, 6640905, 4332949, 6185182, 6263092, -3308497, -14981795, -14300651, -2293400, 3842555, -6793899, -25416970, -34571686, -25636653, -3968332, 17569209, 28595841]
39757B8595841P5981l337698k499356o120043j2309885r212485L864757R773162
39749H830274r71946j0846261N10252K0784069J7456293j3239727l5098036k1062389
39741c3637471P952655J3212555p423939k0906210r396268Q823516J3517536J0873971
39733a6983655J3672017J4916543K651103j3047718j2604046R2621K392695r945282
39725a8855722j5243884j353515J4347473J2174469q42098m200077O538783J8871220
39717A1436649K3423717K0176598J0144110n114093j7490313j7241086m946922
39710B0388660P615500Q562140m067430j9570415k1406919m570613J3209440R470445
39702I630808j1509645k1230949o994628R838967P657002l383575k347677O781193
$$ y = [28595841, 28671822, 25334124, 22834768, 16714725, 4404840, -4807645, -942888, 8830274, 7858328, -2987933, -2477681, 18306388, 35762681, 22522954, -12575082, -33637471, -25684816, -12472261, -19896200, -40802410, -50198678, -41375162, -27857626, -16983655, -3311638, 11604905, 14256008, 1208290, -11395756, -11303135, -8910440, -18855722, -34099606, -35453121, -21105648, -8931179, -9773277, -13973354, -7434571, 11436649, 34860366, 55036964, 65181074, 60066981, 42576668, 25335582, 20388660, 28004160, 36566300, 32498870, 12928455, -8478464, -13049077, 160363, 9630808, -1878837, -23109786, -30104414, -20265447, -12608445, -15992020, -18339697, -11558504]
39694a1558504N804339k782637k67854J3383948J7726381O542170j973558M033737
39686C0908022J1956692O748282p051022j5483443j3746866n799177L901715J1168434
39678B2602637J2594101R356150M551899j780195p155236k547901J2757429J9618331
39670F9997215J603650k6013373l2726447j5736161p02235L64382K246018J2200377
39662A1233426J4237984N62195j0415402n117290J734517n096483j3141348n083227
39654a1085628R306491R430042k031080o178322Q64558O755487N848729L026286
39646A5936563M41095k355744j497324L203924K424688n961336o688854Q964646
39638A4467658K2489511J2729081j0465453k0437472j1719262M05575Q854304
$$ y = [-11558504, -5754165, -8536802, -8804656, 4579292, 22305673, 28847843, 26874285, 30908022, 42864714, 49612996, 42561974, 27078531, 13331665, 7532488, 11434203, 22602637, 35196738, 44552888, 49104787, 47324592, 40169356, 37621455, 50378884, 69997215, 71600865, 45587492, 12861045, -2875116, -3577351, -3212969, -966951, 11233426, 25471410, 26033605, 15618203, 10500913, 12235430, 7138947, -6002401, -11085628, -1779137, 7650905, 5619825, -558497, 306061, 7061548, 12910277, 15936563, 16377658, 14021914, 12524590, 15728514, 18153202, 12191866, 5503012, 14467658, 36957169, 49686250, 39220797, 18783325, 7064063, 7469638, 16323942]
39631A6323942J6264098J5215130k816122k2152314j7950904K867699P561070
39624A5312599j1193262k2937396q786054Q909010M463781j0381023p928698J1182148
39616b1358895K1256075J0813769m652684q265886j974229K941571L652382O533283
39608H945386J3875259J7011079O931741j0735117j9505221j2944761k217830
39601A360536K143854L912264P836683O883426k945142r084684k524624K267911
39593I850224q701075j8374213k986756K2547388K1562360m208326j3711723P225988
39585A3203867K2535878N853322j7619008j5565713R54912M426387p16771N981168
39577A9054042J7844737J3140885l134505p832607j881710o443888k0357517j8904660
$$ y = [16323942, 32588040, 47803170, 44987048, 22834734, 4883830, 7751529, 15312599, 4119337, -18818059, -27604113, -18695103, -14231322, -24612345, -32541043, -21358895, -102820, 10710949, 6058265, -2207621, -4181850, -1240279, 2412103, 8945386, 22820645, 39831724, 46763465, 36028348, 16523127, 3578366, 1360536, 3504390, 7416654, 15253337, 22136763, 19191621, 10106937, 7582313, 9850224, 1149149, -17225064, -20211820, 2335568, 23897928, 19689602, 5977879, 13203867, 35739745, 41593067, 23974059, 8408346, 9363258, 13789645, 13072874, 19054042, 36898779, 50039664, 46905159, 39072552, 37190842, 30746954, 10389437, -8515223]
39569h515223J945164J5036841M629738j0491656q763658L912125R375388L405930
39561A0534649o228723j2888464j1830211j159731J0043309Q105811m062247p138984
39553a4624591N980217J7896878J2621121k019331r828835r837104j0447886j1656148
39545b1915679q159968k013268J579812M593579J0426355J4724834J3261130J0998790
39537B3495585J1302208N694587j0453510k1584238j1088250R515898J3368019
39530B0250299j732052j0786019j879791P106447J352134o674718j993861N794012
39522A1436451J948825m012362N224538J9743294J3486653j2247852k5804772
39515I774775j0673319J2104246J6875167O052614l537592p554040j0518105r987448
$$ y = [-8515223, -6570059, 8466782, 13096520, 2604864, -6158794, -2246669, 7128719, 10534649, 4305926, -8582538, -20412749, -21572480, -11529171, -3423360, -7485607, -14624591, -8644374, 9252504, 21873625, 19854294, 10025459, 188355, -10259531, -21915679, -30075647, -32088915, -30509103, -25915524, -15489169, -764335, 12496795, 23495585, 34797793, 40492380, 30038870, 8454632, -2633618, 6882280, 20250299, 18518247, 7732228, 5852437, 12958884, 14311018, 7636300, 5642439, 11436451, 13385276, 9372914, 14597452, 34340746, 47827399, 35579547, 9774775, -898544, 11205702, 28080869, 34133483, 30595891, 23041851, 12523746, 2536298]
39507B536298k738570K849428k211816j0835980r617643N48431Q347212J0745325
39499c77315J2185499J0189547o75411j2756260j1324260K302456J0311630M226188
39491A4082074l910353j009985R434411J5225686J1025285Q49857p458396p442199
39483C0796380o07856K065228o726997j7749977j6191669l460388N415001N407349
39475a052929O603519J3339028J4783649L011538j2839078j8325988j0517637
39468d997898K054385Q526562L086718q307295j0029017L804317J6706370J1791621
39460B2635763j79674L108220J6431939J3636651o262028j4613808k889736J098647
39452C2965974j6088842k5160687m179158J8069423O625291j8999114j3919105
$$ y = [2536298, -202272, 2647156, 435340, -10400640, -20018283, -19469852, -11122640, -377315, 11808184, 21997731, 21322320, 8566060, -2758200, -455744, 9855886, 14082074, 10171721, 9161736, 18596147, 33821833, 44847118, 45696975, 38238579, 30796380, 30188524, 32253752, 25526755, 7776778, -8414891, -11875279, -6460278, -1052929, 5550590, 18889618, 33673267, 36684805, 23845727, 5519739, -4997898, -2943513, 5583049, 8669767, 362472, -9666545, -5862228, 10844142, 22635763, 22456089, 25564309, 41996248, 55632899, 49370871, 34757063, 31867327, 32965974, 16877132, -8283555, -12462713, 5606710, 12232001, -6767113, -20686218]
39445b0686218J8785872L2180457Q635310j7459279j6248361r67768L480925k823408
39437D897530p390864r613492j3810025j4819714o560737N962430J4024760J5468348
39429a1841764J1414920K824377n410311p714595p734711j2939463j8172228r796999
39421e9370774J0686490K3738398J8545113P061475L163403K344723o287121j8243603
39413a8361896j7389547J392948K2628370K5583568P407083j1504666j0125983
39406c70123N811538J0456502m313734j5352779n148243P791629r80588j8260233
39398b0366031j3019364R246228J1796515j1900471k3348821R12540L1793260
39391a4886144L2425886J0172676l345613j441824j620540r902672j5123975j2661334
$$ y = [-20686218, -1900346, 30280111, 38915421, 21456142, 5207781, 4240013, 7720938, 4897530, -2493334, -12106826, -25916851, -40736565, -47297302, -41334872, -27310112, -11841764, -426844, 2397533, -3012778, -10727373, -18462084, -31401547, -49573775, -59370774, -48684284, -24945886, -6400773, 660702, 3824105, 6168828, -118293, -18361896, -35751443, -34358495, -11730125, 13853443, 21260526, 9755860, -370123, 5441415, 15897917, 11584183, -3768596, -8916839, -1125210, -2105798, -20366031, -33385395, -24139167, -12342652, -24243123, -47591944, -46679404, -14886144, 17539742, 27712418, 24366805, 22924981, 21304441, 11401769, -3722206, -16383540]
39383a6383540r493722p949398l826737P17716j326670q235686j0651349n123391
39375f2272777M012666J3342357K0762866K1034529J1898982J836255J241458
39368A1856336P634793R177179K032164m402182n99860J0576691J6533433Q740341
39360F1548895o780170j5365528j2434508j0115230j7696415k3579539j1687917
39353c6110412R589947J5484237J691292r687271n370219K231365K401898N031298
39345a4737865J6572838K0497279L731503j5195732r710669J4052582K5016270
39338D0226206J0475470j0985403j8920796j3822711p630086n874317m420674
39331a0952311K564290J3447123J7315647O534962q696804r672260L999859J1662398
$$ y = [-16383540, -25877262, -33826660, -37653397, -36935681, -38262351, -46498037, -57149386, -62272777, -58260111, -44917754, -24154888, -3120359, 8778623, 10614878, 11856336, 19491129, 28668308, 30700472, 26298290, 25698430, 36275121, 52808554, 61548895, 54768725, 39403197, 26968689, 16853459, -842956, -24422495, -36110412, -26520465, -11036228, -9344936, -19032207, -24402426, -22171061, -19769163, -14737865, 1834973, 22332252, 26063755, 10868023, 1157354, 15209936, 40226206, 50701676, 39716273, 20795477, 6972766, -657320, -6531637, -10952311, -8388021, 5059102, 22374749, 28909711, 20212907, 10540647, 14540506, 26202904]
39323B6202904J901725j1123662j1299256l229505J520278L959151P829138N815086
39315B1575859o667956j7020950j2349604R33187J0123944J5149357J8279132
39308C0022969J1268909p661545k0420543j4685233o562819j3177951k0014649
39301d1230862n413589J7571937J8686167j58800r748058k488342J216459n049817
39293b6614905l334543J1764010K1007121J4470007O126559M313831k446002j7765029
39285G521049k3624245r728227P052518Q595308J166108n8252M787818O367940
39277B080017L524157J763158L201340N819093N666530j459589j1631368j0796967
39269a833629M772820J4420097P99020j7111775q031112J9733204K6328342J977128
$$ y = [26202904, 28104629, 16980967, 5681711, 2452206, 3972484, 7931635, 15760773, 21575859, 14907903, -2113047, -14462651, -13529464, -3405520, 11743837, 30022969, 41291878, 33630333, 13209790, -1475443, -8038262, -21216213, -41230862, -46644451, -29072514, -10386347, -10545147, -20293205, -22781547, -21565088, -26614905, -29949448, -18185438, 2821683, 17291690, 23418249, 27732080, 25286078, 7521049, -16103196, -25831423, -18778905, -10183597, -9017489, -9075741, -4287923, 2080017, 5604174, 7367332, 10568672, 16387765, 22054295, 20594706, 8963338, -1833629, 2939191, 17359288, 18158308, 1046533, -6984579, 12748625, 39076967, 41054095]
39261D1054095j8707569j3535077l847983j0561293j6301627J332860K6996671
39254F430077K8521477L096075k3285067l0412995j8330608J417298J3815026
39247a8748717J0821134L218880P691936J8267331J3874477j529286M37545K0822857
39239E4856157K1613686j2305710l9407339k2692098J0785339J3039735j0393007
39232A5496763j6828820J177773J0189125m246116j8976995j6169603n133564
39225c4491437L243005R913462J1244125J98721j2204979o482787J0445919J0344599
39217g789372j0527338k1561935m344832J9314398K1190157N644181l144678K638062
39209A418643R083254M360242n883098p279993L926667J3146355M382771j4845811
$$ y = [41054095, 22346526, 8811449, 4963466, -5597827, -21899454, -20566594, 6430077, 34951554, 38047629, 14762562, -15650433, -33981041, -32563743, -18748717, -7927583, -4708703, 2983233, 21250564, 35125041, 33595755, 34033300, 54856157, 76469843, 64164133, 24756794, 2064696, 12850035, 25889770, 15496763, -1332057, -154284, 10034841, 5788725, -13188270, -29357873, -34491437, -31248432, -21334970, -10090845, -9892124, -22097103, -28579890, -18133971, -7789372, -18316710, -39878645, -44223477, -24909079, -3718922, 1925259, -1219419, 1418643, 10501897, 14862139, 8979041, 1699048, 5625715, 18772070, 23154841, 8309030]
39201H309030j8727150K8200J6086041Q454623p072733m462478J0091665J1002668
39193B3709866k726229q792347j687989J521995m390251m336418O912251J4695372
39185B4906250J0627619L520490q56212o784251j1690723o810278K334867J537581
39177A6785343m494418J418308J3568129P969006j3036357j8467339j314620O647962
39169I076014r975708k1203834m331933J2665626l348942l2002669k8895927N462760
39161g2554613K9866823K6115642J6396270J7634434J7401856M067391r996773
39154B8931030r362380J201941P802799P586832O206558M644538q34758r561101
39146C6615459j4761977j1459527l478714j68264m342021o991007m01222P150740
$$ y = [8309030, -10418120, -10389920, 5696121, 14150744, 7078011, 2615533, 12707198, 23709866, 20983637, 12191290, 10503301, 12025296, 7635045, 3298627, 10210878, 24906250, 35533869, 39054359, 38198147, 31413896, 19723173, 12912895, 15247762, 16785343, 12290925, 13709233, 27277362, 35246368, 22210011, 3742672, 2428052, 9076014, -899694, -22103528, -26435461, -13769835, -17118777, -49121446, -78017373, -72554613, -42687790, -16572148, -175878, 17458556, 34860412, 38927803, 28931030, 19568650, 20770591, 28573390, 36160222, 42366780, 47011318, 46176560, 36615459, 21853482, 10393955, 6915241, 6746977, 2404956, -4586051, -4987273, 2163467]
39138B163467J699331j2597185j6038294k800983J0257655J1097355R299565J3851461
39130A6932372J4059242L16449j2969075p388314Q339126J0855315j791204j0679576
39122A7674335q555680o845270r364527l939247J2388563K1068889P727694j4149115
39114A6005642j9302280k814761J6299779K0320759J0784970K96420n101726r566749
39106B6922054j6222427j9498687j2397303K318864J3494907J3006550K114266
39099I738224j0750515j4206006j622912J7440778K0378430j222623k3647106
39092c891730j7954360Q808012K1434358O467875j1221229q952643L101815O102693
39084C894791L336057O516834J0081595K243006j0960566j4456806p707991m57420
$$ y = [2163467, 3862798, -8734387, -24772681, -27573664, -17316009, -6218654, 3080911, 16932372, 30991614, 31308063, 18338988, 10950674, 19289800, 30145115, 28353911, 17674335, 9118655, 2273385, -7091142, -11030389, 1358174, 22427063, 30154757, 16005642, -3296638, -6111399, 10188380, 30509139, 41294109, 41590529, 36488803, 26922054, 10699627, -8799060, -21196363, -18877499, -5382592, 7623958, 9738224, -1012291, -15218297, -16841209, 599569, 20977999, 19755376, -3891730, -21846090, -13038078, 8396280, 14864155, 3642926, -5309717, -2207902, 3894791, 7230848, 13747682, 23829277, 26072283, 15111717, 654911, -7053080, -7510500]
39076g510500N516425J1690172J0192081l454959j4103109n470355J2439345J6817375
39068B6116475O531638q39323j584143q640557k1686345k1449048m70334K2435288
39060D13651K7151387J5112322N07976o624416l185222P166839J2465197L919765
39052E6927499q226658n112458J1450490J7349016O20468j9203109j7575153J703863
39044C7933958J3337483M477550j1155411j3430666j466441O455569j939679j4395899
39036A9816464r342892J2358243K5416403J5039301k267693m421072N087097Q541767
39028G0227618L249213j377936n702802j5388458k2221321j4395658j370066k146836
39020A0873754j1163708m444569J8841541L0832015J7421237k043144p218092
$$ y = [-7510500, -1994075, 9696097, 19888178, 16433219, 2330110, -3140245, 9299100, 26116475, 32648113, 31808790, 30224647, 21584090, -102255, -21551303, -22021637, 413651, 27565038, 42677360, 43185336, 36560920, 33375698, 40542537, 53007734, 56927499, 48700841, 43588383, 55038873, 72387889, 73008357, 53805248, 36230095, 37933958, 51271441, 55748991, 44593580, 31162914, 29696473, 36152042, 34212363, 19816464, 10473572, 22831815, 48248218, 63287519, 61019826, 56598754, 61685851, 70227618, 73476831, 72098895, 66396093, 51007635, 28786314, 14390656, 13020590, 10873754, -289954, -4734523, 14107018, 44939033, 62360270, 60317126, 53099034]
39013E3099034k410289K024935Q290627J6429148J4661164J340233m947326M674004
39005I3161530J0266090m888232k2690708j6974138K632702L903847j6968587
38998D8442504k8259543j0392774J5382730J7942175j529411j4335862m057912
38991B3191907J4239008J7281792M494543n038895k135050J599921k961714n187670
38983D5483842N518658J6671751J0177038o189576r320338J662661N518849l575524
38975F5947361p927332n72234K810841l784127l024430J1601612J7285921j225175
38967H1112437k2069434j8810194r68117N739482K062026P669155K2724166K7911590
38959A05371111J7670511N888177L10604m642292j0099085r604714m593568m113027
$$ y = [53099034, 50688745, 52713680, 61004307, 77433455, 92094619, 93434852, 88487526, 93161530, 103427620, 98539388, 75848680, 58874542, 61507244, 65411091, 48442504, 20182961, 9790187, 25172917, 43115092, 41585681, 27249819, 23191907, 37430915, 54712707, 59207250, 54168355, 52033305, 53633226, 50671512, 45483842, 51002500, 67674251, 77851289, 71661713, 62341375, 64004036, 69522885, 65947361, 58020029, 57447795, 60258636, 56474509, 53450079, 65051691, 82337612, 81112437, 59043003, 40232809, 39264692, 45004174, 47066200, 54735355, 77459521, 105371111, 123041622, 128929799, 129240403, 124598111, 114499026, 104894312, 100300744, 96187717]
38951I6187717q107807p239172O90398Q939293J4927585K0531008K1742221J3405881
38943A61077124K515637J784156J0911532J7539995J4974469O746362k506515
38936B13042760p767059p60524J8630193L3100063K6259103O397979l831184K636504
38928B87707835J3641624J9288026J9643747J5163738P396418N395915J3383698
38921C81621001J7074955K463029j7206914j6915971J229296J1120847M339383
38914C83725626O196Q446389J3836778L242320j2346770j8468183j6938831j3168923
38906C48334602m905622L480406l203153k5114246l6948781k1650123K416652
38899B62409735P879367k729615o805292M62712K722807p272448j7430255j8226654
$$ y = [96187717, 88079910, 80840738, 81531136, 90470429, 105398014, 125929022, 147671243, 161077124, 163592761, 165376917, 176288449, 193828444, 208802913, 215549275, 213042760, 205275701, 204515177, 223145370, 256245433, 282504536, 288902515, 285071331, 287707835, 301349459, 320637485, 340281232, 355444970, 362841388, 368237303, 381621001, 398695956, 401158985, 383952071, 367036100, 368265396, 379386243, 383725626, 383731822, 392178211, 406014989, 409257309, 396910539, 378442356, 361503525, 348334602, 343428980, 346909386, 343706233, 318591987, 281643206, 259993083, 262409735, 270289102, 267559487, 260754195, 261216907, 263939714, 256667266, 239237011, 221010357]
38891B21010357j5645745j6914333j8167580j3725800p296194n870642q825832
38884A34564231j0781385j1520891j4572120j6333603o646008J3922095K6067801
38877A14700120J3823298r141735j2943434O043585J6916479n89829k3813820
38870A04994664k0438385K622981J0919445o052170k4420808k4410060j0779026
38863C2436641O096786K1385689K4454290N217501k0818685k2131088L769921
38856E0411055K2280163J1440502p981137q856870K740107O095778R04691j067359
38848G5966930j311301o503593r325461j233723P739174M535751l377954k545130
38840F3944693N32055p364057j7632441j1653161N762150J1987243K299621n916919
$$ y = [221010357, 205364612, 188450279, 170282699, 156556899, 149260705, 143390063, 134564231, 123782846, 112261955, 97689835, 81356232, 74710224, 88632319, 114700120, 128523418, 119381683, 106438249, 112481834, 129398313, 128808484, 104994664, 84556279, 87179260, 98098705, 92046535, 67625727, 43215667, 32436641, 38533427, 59919116, 84373406, 89590907, 68772222, 46641134, 50411055, 72691218, 84131720, 76150583, 67293713, 70033820, 76129598, 77034289, 75966930, 74655629, 68152036, 58826575, 57592852, 65332026, 69867777, 66489823, 63944693, 64476748, 57112691, 39480250, 27827089, 33589239, 45576482, 47876103, 41959184]
38832D1959184l419717J240059K835088O458845J0826669O368157o154459j4171906
38824D5941920j3399636j1573417j0655543m033418O757427J1387703Q579151
38817C3004187N716024M64774j4898323k9412484k0314408R043013K5216494J1044378
38809A9863655r131613p049706R688122J6218159R440651L708354J160153o993282
38801C6904493j6581586j3631568J5037P085114K457890n44819M487511N744969
38793B5937041m025374j1165302j417195J5201303J6126094j931004j8230868
38786B0494695j5955628k232195M732276o60521q229995p691521M66743Q521442
38778e54704R753749L636761k289520K120956J5367897J8712916k717243l2600917
$$ y = [41959184, 38539467, 39779526, 42614614, 49073459, 59900128, 66268285, 60113826, 45941920, 32542284, 20968867, 10313324, 6279906, 13037333, 24425036, 33004187, 38720211, 39184985, 24286662, -5125822, -25440230, -16397217, 8819277, 19863655, 10732042, 3682336, 13370458, 29588617, 39029268, 42737622, 43897775, 36904493, 20322907, 6691339, 6706376, 13791490, 16249380, 15704561, 20192072, 25937041, 21911667, 10746365, 9329170, 24530473, 40656567, 38725563, 20494695, 4539067, 2306872, 7039148, 6378627, -1851368, -9542889, -9076146, -554704, 9199045, 12835806, 10546286, 12667242, 28035139, 46748055, 44030812, 11429895]
38770A1429895l4205298K260663L8969345L4556912j514817k1518964l666474
38763B6311262K2082704K0006730l439793j5771247o934462K493348k605693j1297523
38755C0845326q176864K680064P397086M396186K483898K903599j397241r737136
38747C1394918j2148091o665925l407663n532388j814591J1106499J4950896m054739
38739B3828916k7474556k6151847k907235J1759866N069264m470274k534799R87647
38731b1893018k383052k066679P816431J2368396K881362l526591O468518J5616730
38723A5282097N541017p818501l05277J5599273R024362j6247267k6082179j0222235
38715a5228710O229293P507127N738119Q142304K349651j3251181j7638291j605920
$$ y = [11429895, -22775403, -20514740, 18454605, 53011517, 51496700, 29977736, 26311262, 48393966, 68400696, 64960903, 49189656, 42255194, 44748542, 42142849, 30845326, 22668462, 25348526, 32745612, 37141798, 39625696, 42529295, 41132054, 31394918, 19246827, 12580902, 9173239, 3640851, 1826260, 12932759, 27883655, 23828916, -3645640, -29797487, -32704722, -20944856, -15875592, -20345866, -22880665, -21893018, -24276070, -26342749, -18526318, -6157922, -3276560, -6803151, -334633, 15282097, 20823114, 13004613, 12699336, 28298609, 37322971, 21075704, -5006475, -15228710, -8999417, -1492290, 4245829, 12388133, 14737784, 1486603, -16151688, -17757608]
38707a7757608J4298638J2711497M532874M514974O501281J071185m649595l074404
38699A8148842j074687j673913O732697K4214652K6553327J919801k2496505j7954808
38691C4369406J547016L030818j3693273k1691600j3296214n656420m834934J226021
38683a8999180J3075292J4825236L979689j621514N823290J0904551J145362j3953298
38675A5179428j9043634j1614342K300652J5789777J9380289P386107r343364
38668B0034913j2690379l034363J524095m505523n273597O744421J4215775K590493
38660A9605835j3852434j2224957M942898J5184641Q358157n009432j4158293
38653B846415j9100685k0143609j2122484M924209J9692521K1709094J4258147
$$ y = [-17757608, -3458970, 9252527, 13785401, 18300375, 24801656, 25872841, 21223246, 18148842, 17074155, 15400242, 22132939, 46347591, 72900918, 74820719, 52324214, 34369406, 35916422, 38947240, 25253967, 3562367, -9733847, -15390267, -20225201, -18999180, -5923888, 8901348, 12881037, 11259523, 17082813, 27987364, 29132726, 15179428, -3864206, -15478548, -13177896, 2611881, 21992170, 29378277, 20034913, 7344534, 4310171, 5834266, 1328743, -3944854, 2799567, 17015342, 19605835, 5753401, -6471556, -1528658, 13655983, 22014140, 17004708, 2846415, -16254270, -36397879, -48520363, -43596154, -23903633, -2194539, 12063608]
38646A2063608Q882247R623995R055914N64896j1165534j6403980j4012235j1952050
38638a3343139j3999018j4082175p586294k24744J461293J782009Q400231J7516331
38630b0075506J7746508P490230k335091l635963K56537K660227J469935k633638
38622I43239p564790p552677K210208J6004762K0379496R784943o758280j6586001
38614A0860900j4445764j693621J6514112K9669732K6366755O797819j4371494
38607E9698439k2763694j7773945p784025K063330J0999413J5621186J0201585
38600E0262289m447526j7498182j7675544o076521L941712K322491m956195m565421
38592A307103L957777O524164l524540j2960465p324940O916940J1526708K347970
$$ y = [12063608, 20945855, 30569850, 39625764, 40190660, 29025126, 12621146, -1391089, -13343139, -27342157, -41424332, -49010626, -49235370, -47774077, -45992068, -37591837, -20075506, -2328998, 5161232, 2826141, -809822, -553285, 2106942, 3576877, 943239, -6621551, -14174228, -11964020, 4040742, 24420238, 34205181, 27446901, 10860900, -3584864, -5278485, 11235627, 40905359, 67272114, 74069933, 59698439, 36934745, 19160800, 11376775, 13440105, 24439518, 40060704, 50262289, 45814763, 28316581, 10641037, 4564516, 8506228, 10828719, 5872524, 1307103, 5264880, 11789044, 8264504, -4695961, -12020901, -5103961, 6422747, 8770717]
38584H770717p708801q758729l020622N310963J4576059J8190818P271219j3788478
38576B0843146k6070061j7501913K485034J5235555J3242570L777941k136255
38569I876017m48895K786436j601837j2420892j5643070l122290J1465672Q445710
38561f63149q699390j6242306l811569J2083489J4071885P418382P238112J4225056
38553B5620510J5369282K881053j6694821k9020910k3430895k831462J5652858
38546a2454385J6679449M459892l936597k831199k997587j0571482j5895650r740857
38538c7288416K516825J0676454J2480282R703733K794287l783533k534647L934817
38530a500198L298586n973859q929587J853583J1916366P097038m105097n518107
$$ y = [8770717, 1061916, -7696813, -10717435, -5406472, 9169587, 27360405, 34631624, 20843146, -5226915, -22728828, -20243794, -5008239, 8234331, 12012272, 9876017, 9427122, 12213558, 10611721, -1809171, -17452241, -20574531, -9108859, -663149, -9362539, -25604845, -29416414, -17332925, -3261040, 4157342, 11395454, 25620510, 40989792, 43870845, 27176024, -1844886, -25275781, -28107243, -12454385, 4225064, 8684956, 4748359, 1917160, -1080427, -11651909, -27547559, -37288416, -34771591, -24095137, -11614855, -1911122, 883165, -2900368, -5435015, -1500198, 1798388, -4175471, -13105058, -11251475, 664891, 7761929, 3656832, -1861275]
38522a861275J131797K483622l117466n538699j262340L078221L089448J007504
38514i89188j80912R64424M199785M634659l071727j3480645j4007010m222211
38506b6152825K508543J972849N405212J4713449J3707087k430099j2679005l989760
38498f944549M563569m378425j2426925L440630K6192477K2427841l536348j8736537
38490A0601733j4955173j1659713j1641446J354052K0229581J6160502r603509
38483D86027k0535539m529776N404269j0772542k4547037q744046J5139041J3872952
38475c4226651k963367l127039J3957444K0280820N141483j4415827k2196143
38468c7549280j5525764L567096K6016394L2166158J3624548q589118r769649
$$ y = [-1861275, -729478, 1754144, -1363322, -6902021, -8164361, -5086140, -1996692, -989188, -1170100, -205676, 3994109, 8628768, 5557041, -7923604, -21930614, -26152825, -23644282, -21671433, -16266221, -1552772, 12154315, 9724216, -2954789, -6944549, -2380980, -6759405, -19186330, -15745700, 10446777, 32874618, 29338270, 10601733, -4353440, -16013153, -27654599, -26300547, -6070966, 10089536, 486027, -20049512, -24579288, -19175019, -29947561, -54494598, -63238644, -48099603, -34226651, -37190018, -40317057, -26359613, -6078793, -937310, -15353137, -37549280, -53075044, -49507948, -23491554, 8674604, 22299152, 13710034, 3940385]
38461C940385K962272M319923q208860j3769917m197273O562811Q987197Q246258
38453H842796N435531o547407k2128227k0887626L144509K7433886K7774971P026115
38445C0094548j2815945j7561580j0530133k216649O98001j733833n173032n681391
38437b4920014k498249L454731J0572258J4813228J2175105N407011J801294J639169
38429B2444533k264750r848642j0579522j538552M648487l90846o891715n023698
38421i444705k250342p097603j0132025p17926R999780N666933n659182l070221
38413b2705291J3041837K3374815K0782918J3549932K976306j4244809k5013121
38406A1762587j2348169J1272816J5502026o73446p775461L183039P180008n919866
$$ y = [3940385, 6902657, 11222580, 3013720, -10756197, -14953470, -8390659, 596538, 8842796, 14278327, 7730920, -14397307, -35284933, -32140424, -4706538, 23068433, 30094548, 17278603, -282977, -10813110, -13029759, -12331758, -14065591, -19238623, -24920014, -27418263, -23963532, -13391274, 1421954, 13597059, 19004070, 20805364, 22444533, 20179783, 10331141, -248381, -1786933, 2861554, 2470708, -4421007, -9444705, -11695047, -18792650, -28924675, -29642601, -19642821, -13975888, -19635070, -22705291, -9663454, 13711361, 34494279, 48044211, 51020517, 36775708, 11762587, -585582, 10687234, 26189260, 25515814, 17740353, 20923392, 28103400, 22183534]
38398B2183534j0049360Q448440J9867082r80554k8633738k4975353J619843J4060130
38390A540024N359760o89839L739298L728989l019719k566972L485435j074817
38382A0502159j1580373m197089J9872174K7997326O730150j5148012j2236796
38375B1939539J34405j991745r157986O66812J8503276J6565891m537601j4716538
38367B7406053r60629J4846125J1299120m389844j4264782j5103923j2565880
38360F266240o180317M138576Q521253P63064o977630o99291J0200732M526547
38352B0559174j5344566k2751229p433815N964858n210247k4854316k0327965
38345f9398106Q839145K9392011K0174368l341794j4806544p705010P450459K0088605
$$ y = [22183534, 12134174, 20582614, 40449696, 39469142, 10835404, -14139949, -12520106, 1540024, 6899784, 6209945, 9949243, 13678232, 10658513, 8091541, 11576976, 10502159, -1078214, -5275303, 14596871, 42594197, 49324347, 34176335, 21939539, 22073944, 20082199, 10924213, 11591025, 30094301, 46660192, 42122591, 27406053, 26445424, 41291549, 52590669, 48200825, 33936043, 18832120, 6266240, 85923, 4224499, 12745752, 13508816, 6531186, 5831895, 16032627, 20559174, 5214608, -17536621, -24970436, -19005578, -24215825, -49070141, -69398106, -60558961, -31166950, -10992582, -14334376, -29140920, -36845930, -29395471, -9306866]
38337i306866K3626232J5380768K466820k459227R78853q33379j1602377j4653781
38329C597043J070157J9134074J7141197o72108j1580785p424572N60285M606386
38321B6431677O733925M641185o429516j6783524r759351R452323J4697477l325677
38313B5658519k1457406j8383546m908781k980066j0057431n873956J3066738
38306b4935929K7182406K1842703M884714p384745r470407o768884m319795j695741
38298f65678L106999Q375683Q953668K840610m326499n561817k043030P4465J283037
38289A2037438P231080J4416595J0433837n485576j5401988o746962P693479P637151
38281C1815054n434007j3248189r839209p160669j1451452j2200813r10991J2954079
$$ y = [-9306866, 14319366, 29700134, 32166954, 29707727, 30686580, 29853201, 18250824, 3597043, 4667200, 23801274, 40942471, 40270363, 28689578, 21265006, 21825291, 26431677, 33165602, 37806787, 31377271, 14593747, 4834396, 14286719, 28984196, 25658519, 4201113, -14182433, -19091214, -22071280, -32128711, -38002667, -24935929, 2246477, 24089180, 28973894, 21589149, 12118742, 5349858, 1030063, -665678, 2441321, 10817004, 19770672, 22611282, 18284783, 12722966, 10679936, 10754401, 12037438, 19268518, 33685113, 44118950, 38633374, 23231386, 16484424, 24177903, 31815054, 26381047, 13132858, 3293649, -3867020, -15318472, -27519285, -28430276, -15476197]
38273a5476197J3940208P11468j3460694j6119804o843297M046040O093183O24169
38265b6484924Q8184J0193985J7473357O258968j4377982j7449907M192482K4573696
38257D467859J9716255P09573m722613O795530J2347770r81250j8284024k0049551
38249d51p479831L458277K569529p854481j8669813j8959312l018388J9741506
38241c0212964K8691426J5161480l931061o620930M344762O395157q778430k2542215
38233a7492775j7087889j205342M205042l255909p334574k15733O961447L892090
38225c1533643k806071j313162P217043J1984932Q724535L094814J59183j065469
38217e537838k367871k281040Q99570N599163P616093L248680o365740j2742729
$$ y = [-15476197, -1535989, -824521, -14285215, -30405019, -37248316, -33202276, -27109093, -26484924, -26396740, -16202755, 1270602, 7529570, -6848412, -24298319, -20105837, 4467859, 24184114, 24893687, 20171074, 26966604, 39314374, 38333124, 20049100, -451, -7480282, -4022005, -1452476, -9306957, -27976770, -46936082, -49954470, -30212964, -1521538, 13639942, 9708881, 3087951, 7432713, 13827870, 5049440, -17492775, -34580664, -35786006, -31580964, -34836873, -42171447, -42387180, -35425733, -31533643, -34339714, -35652876, -28435833, -16450901, -7726366, -4631552, -4472369, -5537838, -7905709, -10186749, -9287179, -3688016, 3928077, 7176757, 811017, -11931712]
38209a1931712o609776R060585J8153022J0582003k654416l825016N175923M473294
38201B2423907j3737640l0778651k5076495k72692K0256470K1044052O949497
38194H08448q217250j5192996j1951378k123214O535642P585760K687798L58808
38186a9508382O392704J6520852J8927590N056042j9071091l3106992k0766754
38179d5556031R540928L0159993K5212795P837251r21889k94420l431227j0798106
38171A1749294r578275R85379M610049n098167j1526184q42258J4216659J2304340
38163A6820837m844606j6298544j2386795l679877m16083K04102K875427M906751
38155a2818788M327676N669293R958694Q440614m057990j5970263j0625482J0326448
$$ y = [-11931712, -18541488, -9480903, 8672119, 19254122, 16599706, 12774690, 17950613, 22423907, 8686267, -22092384, -47168879, -47441571, -27185101, -6141049, 808448, -7408802, -22601798, -34553176, -36676390, -30140748, -22554988, -19867190, -19508382, -13115678, 3405174, 22332764, 27388806, 8317715, -24789277, -45556031, -36015103, -5855110, 19357685, 27194936, 26273047, 25978627, 22547400, 11749294, 2171019, 3156398, 7766447, 2668280, -8857904, -9700162, 4516497, 16820837, 11976231, -4322313, -16709108, -20388985, -20805068, -20600966, -17725539, -12818788, -8491112, -2821819, 7136875, 15577489, 11519499, -4450764, -15076246, -4749798]
38147d749798K5312378J7615921n017240k0493132j8286992q421658m224397m206164
38139b2471082J550934J1313900J0641791n022321j8801713j3572385L470869
38132c2890007J0869460L185301m446864k035823K063585o48007l166049L405768
38124b3662636J2056125R406064l150878j0884633n658620O306825J4743324J3922040
38116A3077611L171621j1127220j5854195m608101R618192P420960r804359j8857755
38108b6963246n894373J4352245J9522780R002400l60218q03523j46912k929354
38100E779799j666585O803987R634608n014272k5994311k8914129q373080J3091625
38092c4652358J4439270L405139L022220J7386685K6088179J3884052q167512
$$ y = [-4749798, 20562580, 38178501, 33161261, 12668129, -5618863, -14040521, -18264918, -22471082, -20920148, -9606248, 1035543, -3986778, -22788491, -36360876, -32890007, -22020547, -18835246, -23282110, -25317933, -23254348, -23902355, -27068404, -23662636, -11606511, -2200447, -5351325, -16235958, -21894578, -15587753, -844429, 13077611, 16249232, 5122012, -10732183, -15340284, -5722092, 1698868, -8105491, -26963246, -32857619, -18505374, 1017406, 10019806, 9659588, 8856065, 8709153, 5779799, 4113214, 10917201, 20551809, 15537537, -10456774, -39370903, -47743983, -34652358, -20213088, -16807949, -13785729, 3600956, 29689135, 43573187, 35405675]
38085C5405675j8308768j1118166L16796L655677o59816m590855k342791M633571
38077F991323Q371360K229136r076461j2432453l840870M237247O50212p305934
38069a0176440o394793m35050m111736j5677625j5039998N759890K7235312K7636179
38061H795739J0553648m607434j0021983j3112473j7719730j6553683m626394
38054d7292310R959229J4229120N822212l901495k972151O425223R850519m67652
38046h347305j3343404j2010105L287214J5424080J2459683k84790j0491686j0748456
38038b4054769J8351J4664503J6963607j760687k3006963j7674796J1551832K7343495
38030D044573R903943j2424905o059053J6500467J8591500k389597j4873960n976719
$$ y = [35405675, 17096907, 5978741, 6295537, 9951214, 9291398, 4700543, 2357752, 6991323, 15362683, 17591819, 8515358, -3917095, -7757965, -3520718, -2870506, -10176440, -16571233, -17006283, -21118019, -36795644, -51835642, -46075752, -18840440, 8795739, 19349387, 14741953, 4719970, -8392503, -26112233, -42665916, -47292310, -37333081, -23103961, -17281749, -21183244, -24155395, -17730172, -7879653, -8347305, -21690709, -33700814, -30413600, -14989520, -2529837, -2814627, -13306313, -24054769, -24036418, -9371915, 7591692, 5831005, -17175958, -34850754, -23298922, 4044573, 13948516, 1523611, -4535442, 11965025, 30556525, 28166928, 13292968, 7316249]
38022G316249K876087k815225q822193k940619L238149o78603l497407M104853
38014a218709Q765545j181220j0171479O68525J8948464J7787564j912059j3929947
38006A7756684p854367r3552j935162l370775K781377M028107r854674k4747438
37998b3289800j9821131J775601J7112440J5262304Q978395J2063546J8547476
37991C0628831J3355670l246459j3775570p291769M840700M076029r832618j8572229
37983A82585j0301295N202813J0697884K872954p134858r594522m912179J705889
37975a1280729P533774J2862095J7371044J7791088J0476711k102924j0072553
37968D2578506o533232K681451P126570P901725J4449339K4726583K3710891P624153
$$ y = [7316249, 10192336, 7377111, -1445082, -4385701, -1147552, -1826155, -5323562, -1218709, 7546836, 6365616, -3805863, -3137338, 15811126, 33598690, 31686631, 17756684, 9902317, 9808765, 7873603, 4502828, 7284205, 11312312, 1457638, -23289800, -43110931, -41335330, -24222890, -8960586, 17809, 12081355, 30628831, 43984501, 40738042, 26962472, 19670703, 24511403, 28587432, 18754814, 182585, -10118710, -4915897, 5781987, 8654941, 1520083, -8074439, -12986618, -11280729, -3746955, 9115140, 26486184, 44277272, 54753983, 52651059, 42578506, 36045274, 38726725, 45853295, 53755020, 68204359, 92930942, 116641833, 124265986]
37960A24265986o115496m386118O01560q161722k2318354j9015523L593667K2984765
37952I1448765K3954318J3804581L448997p103297j8026597k1963898j6632666
37945F8930203j1402287j1565054q499092L737900J3828554Q956399l512647n666221
37937E4807755M095180R603780K073608q103177q572579j631954L395239M999638
37929F0667490P138020P804369J420235q596721j1691164p703611j0129668k3222388
37921A5686562k7636557n543661K6106675K9970825q46939k9561594k4789648
37914a6614337j068826Q944091L837025O539016J8724089J6644939n402724k0089985
37906A1513288p592116J4835712K0071001P719655m210836q020595p875295n070072
$$ y = [124265986, 118150490, 113764372, 114365932, 106204210, 83885856, 64870333, 68464000, 91448765, 115403083, 129207664, 132656661, 125553364, 107526767, 85562869, 68930203, 57527916, 45962862, 37463770, 41201670, 55030224, 63986623, 60473976, 54807755, 58902935, 68506715, 70580323, 62477146, 53904567, 52272613, 55667852, 60667490, 67805510, 75609879, 77030114, 68433393, 56742229, 49038618, 38908950, 15686562, -11949995, -17493656, 8613019, 38583844, 37736905, 8175311, -16614337, -17683163, -8739072, -4902047, 1636969, 20361058, 37005997, 31603273, 11513288, 3921172, 18756884, 38827885, 46547540, 42336704, 34316109, 26440814, 21370742]
37898B1370742n87097k963533j5551534k4016898j4620979K550645Q099777M327768
37890b1391109Q971190K1292130K0556705K050523j1109936l042589R839572M889526
37882C2056012j1945514j6593777k565003J3188089J6297673R339966J83159q264890
37874C1695715j3323405j0804809l463384m94664k884141o1638J0877402J3976526
37866B5517602l985558k8364574l0963452q154324J3878017J5728952P564778
37859h778559O006803P067277q86922j1417757r343624K019573O330951L498467
37851e503791Q511651K0073757J7695951j853179j2069951L565956K2194976J3537152
37843F6152522j5106786l0254277j9183980j028005N775462M489521O031392J1598963
$$ y = [21370742, 20783645, 17820112, 2268578, -21748320, -36369299, -33818654, -25718877, -21391109, -12419919, 8872211, 29428916, 31479439, 20369503, 17326914, 27166486, 32056012, 20110498, 3516721, 951718, 14139807, 30437480, 39777446, 39960605, 31695715, 18372310, 7567501, 4104117, 3609453, 725312, 663674, 11541076, 25517602, 21532044, -6832530, -37795982, -45950306, -32072289, -16343337, -8778559, -2771756, 4295521, 3408599, -8009158, -17352782, -15333209, -9002258, -5503791, 3007860, 23081617, 40777568, 38924389, 26854438, 30420394, 52615370, 66152522, 51045736, 20791459, 1607479, 579474, 6354936, 10844457, 16875849, 28474812]
37835B8474812J4837171J0569321j789527j6427298k3439884j9473576j2436815
37828a9685796q984327m759899L479439O156480l941385j3672263n593209J3633800
37820c3367160K1422329J2749112L430916M45860o750522k0568192k4738510r845281
37812e7221448R636775J5678975R196721J916529k15547M390815J6819022K9061617
37804B9263459K5069511K836863j6344523j3788150J620965P732238o16722j0144313
37796B5629328j1481848q237643o450634p385949j0188006j2477051q911255L519989
37788c5983069J8937099K6156359J8863556J348484j3353677j2797171Q95816
37781D067397Q739472l302150k2487370k3599390m370071J1867987J1627468P638734
$$ y = [28474812, 43311983, 53881304, 52091777, 35664479, 12224595, -7248981, -19685796, -28670123, -33430022, -29950583, -23794103, -27735488, -41407751, -47000960, -33367160, -11944831, 804281, 4235197, 4681057, -2069465, -22637657, -47376167, -57221448, -47584673, -31905698, -22708977, -20792448, -21007995, -16617180, 201842, 29263459, 54332970, 57169833, 40825310, 27037160, 28658125, 36390363, 35773641, 25629328, 14147480, 5909837, -540797, -7926746, -18114752, -30591803, -39503058, -35983069, -17045970, 9110389, 27973945, 29322429, 15968752, 3171581, 4067397, 12806869, 9504719, -12982651, -36582041, -40952112, -29084125, -17456657, -9817923]
37773i817923J2019198J5994699R946492K525057K563601J149280q739833j3219034
37765A2421537j066998J0713722J806415j5059326j3144779K937381M543193j2421958
37757i270813k0998741p941667P795693R176648M073793K831642o61490j0839970
37749b5834905j5335766m180084J2354067J9383113J7083349J2712018O418515
37742B2600307l186018j1211219j4600216j6676296j5464866j584480K2348607
37735a7774181L5273512K3845594K560432o107551j051749K117357l801421j1746958
37727B3315035j4069760r517960l61104P998740Q608919J283030n665399o720243
37719D871258m666603j453617M949256J0061743M151719q603404r084957P662053
$$ y = [-9817923, 2201275, 18195974, 28142466, 30667523, 33231124, 34380404, 25640571, 12421537, 11354539, 22068261, 23874676, 8815350, -4329429, -1392048, 3151145, -9270813, -30269554, -38211221, -30415528, -21238880, -17165087, -14333445, -14994935, -25834905, -41170671, -45350755, -32996688, -13613575, 3469774, 16181792, 22600307, 19414289, 8203070, -6397146, -23073442, -38538308, -40122788, -17774181, 17499331, 41344925, 43905357, 37797806, 36746057, 38863414, 35061993, 23315035, 9245275, -272685, -633789, 7364951, 15973870, 17256900, 11591501, 4871258, 204655, -1248962, 3700294, 13762037, 17913756, 9310352, 225395, 7887448]
37711G887448J9918083J0582064o494099r888544l459744k868212m139469O026427
37703A7563954J8088294R169130j7528542l2710595k2775568m297436P068012
37696b5422751J4384454J9147972J1631162n712996j0761003N587089K0980182
37689B9834109J4632799p40141j967421O034314J108627j6588741k3867149j1408348
37681b961951M041207P835977N841899P643239R748610N375677k928712j0264808
37673B4331138j7370860k2222661j5595091K720500J3897816K436576j8120449
37666b9923031k0321732j569966J2130548M235314j0819231j2940840m027488
37659f3236426M206696J3136153K7363536L4047503J7410325j1000534k2497010
$$ y = [7887448, 27805531, 38387595, 31893496, 22004952, 18545208, 15676996, 11537527, 17563954, 35652248, 44821378, 27292836, -5417759, -28193327, -32490763, -25422751, -11038297, 8109675, 19740837, 14027841, 3266838, 8853927, 29834109, 44466908, 43726767, 41759346, 47793660, 48902287, 32313546, 8446397, -2961951, 1079256, 8915233, 14757132, 22400371, 32148981, 37524658, 34595946, 24331138, 6960278, -15262383, -30857474, -28136974, -14239158, -11802582, -29923031, -50244763, -51814729, -39684181, -35448867, -46268098, -59208938, -63236426, -59029730, -45893577, -18530041, 15517462, 32927787, 21927253, -569757]
37652e69757j1722632r45020j062258K388153J4915801J5943979n061672k3093987
37644i207393j4464308L503968J186324j2564838n942242J8855786K5640806L135810
37636A0143913j5902211o074674J4519233J7443107N151276k853952l974222q891010
37628I561460j7240750j8420391r443948L798415J6404144K3656549J9175033
37621B7490512N231867m829929n188861o640462j5443238j7959300l077001J3824676
37613f591736J0611124p215548j4236056j859273J4231091K0214763J6777828
37606C1932193P275084n947458j3271809n932356O490625O189390m595221o702448
37598A5438000K955610N987579m348063j0702693l200314K293007o257500j3336503
$$ y = [-569757, -12292389, -13237409, -14299667, -11911514, 3004287, 18948266, 13886594, -9207393, -23671701, -20167733, -18981409, -31546247, -37488489, -18632703, 7008103, 10143913, -5758298, -11832972, 2686261, 20129368, 25280644, 22426692, 18452470, 9561460, -7679290, -26099681, -35543629, -31745214, -15341070, 8315479, 27490512, 32722379, 27892450, 22703589, 16063127, 619889, -17339411, -20416412, -6591736, 4019388, -3196160, -17432216, -19291489, -5060398, 15154365, 31932193, 39207277, 33259819, 19988010, 14055654, 20546279, 26735669, 22140448, 15438000, 18393610, 24381189, 20033126, 9330433, 6130119, 8423126, 2165626, -11170877]
37590a1170877l799839O295623n027928k4011948j7483571J4395884L4757259
37583f045397K3124096J771628j809693P113209P302267k922789q214095l508657
37575A6810569K134969M641614Q560974J1308170J957368j8057404k7704414j1134835
37567a1482989J8344092L1475527J7846991l937103j2240689p266896l159695
37560B9579238m156529j634735O402483P282275p610446k5568944k5270251l348900
37552b4325809K2013196L3004388K7575097J2782244m914040j7782225j6662183
37545C1690668k371409R630439O173180o316537j1317208n386225l37119l838128
37537A7927661j0732313j5305182j9099866k1656629j5925061j141963J0063933
$$ y = [-11170877, -14970716, -8675093, -13703021, -37714969, -55198540, -40802656, -6045397, 17078699, 18850327, 17040634, 24153843, 31456110, 28533321, 20319226, 16810569, 18945538, 23587152, 32148126, 43456296, 45413664, 27356260, -348154, -11482989, 6861103, 38336630, 56183621, 52246518, 40005829, 32738933, 29579238, 25422709, 23787974, 30190457, 37472732, 29862286, 4293342, -20976909, -24325809, -2312613, 30691775, 58266872, 71049116, 66135076, 48352851, 31690668, 29319259, 38949698, 45122878, 38806341, 27489133, 22102908, 21765789, 17927661, 7195348, -8109834, -27209700, -48866329, -64791390, -65933353, -55869420]
37530e5869420P866918O28830K512908J1857779J5142779R018445M035895O522038
37522A716172J0598763J0696223R071671O724015o48571j1516833j5310196q521702
37514B809542k787467o354516q130393N118643K3124950K2107769n67299j9915273
37506A5405956j6418684k43914O302686j505394j0188396r409603j314140P947402
37498i424087J3878706J1175896l004178k0604047k7005207j8173555n557920
37491e8714392Q97417N753408J5891501K3651724J5984934k275856j0220827J44570
37483h887521J1136494M641167j1433908j5283224k948130P859529N094949j388747
37475a1209391L842476J9624839K9804641K2214727P69770j9037208k4182950
$$ y = [-55869420, -48002502, -47373672, -44860764, -33002985, -17860206, -8841761, -4805866, 1716172, 12314935, 23011158, 32082829, 38806844, 38158273, 26641440, 11331244, 2809542, 22075, -6332441, -14462834, -9344191, 13780759, 35888528, 35321229, 15405956, -1012728, -1256642, 5046044, 3540650, -6647746, -16057349, -17371489, -9424087, 4454619, 15630515, 12626337, -7977710, -34982917, -53156472, -58714392, -57816975, -52063567, -36172066, -12520342, 3464592, 1188736, -9032091, -8887521, 2248973, 6890140, -4543768, -19826992, -22775122, -14915593, -9820644, -11209391, -7366915, 12257924, 42062565, 64277292, 65047062, 46009854, 21826904]
37468B1826904j5443646m813453m0811M085605J3538731K0263093J1590257p864391
37460D3142289j8502296j2144374j585628Q46968q07645N72391R69582m022916
37452H468371o653992R76887J1644195J3270329O545594p09513q329655j8564628
37444F647588k4152440j7622902n729216J303571O772629J5565644J5441325m611215
37436f385016k4284787j1779185K5281322M1764861J6568114j8940259k7909905
37429e684855j3918651j019887M485071P567387K953506j1168393j6041134M10420
37421c2416536J4060014l661072l4960082l4993068O79896K7906797J9518643
37414d3865408N25503K533151J7198958J8672977O852461J029937O483854J2980288
$$ y = [21826904, 6383258, 1569805, 1528994, 5614599, 19153330, 39416423, 51006680, 43142289, 24639993, 12495619, 10909991, 11756959, 10949314, 11521705, 12491287, 8468371, 1814379, 2791266, 14435461, 27705790, 34251384, 33541871, 25212216, 6647588, -17504852, -35127754, -40856970, -39553399, -32780770, -17215126, -1773801, -6385016, -30669803, -42448988, -17167666, 24597195, 41165309, 22225050, -5684855, -19603506, -20623393, -16138322, -8570935, -5617429, -16785822, -32826956, -32416536, -18356522, -22017594, -56977676, -91970744, -91290848, -63384051, -43865408, -43339905, -40806754, -23607796, -4934819, 1917642, 2947579, 9431433, 22411721]
37406B2411721J6540700K0152689J9841551J0189303j891704p178902j1613171
37399F8452187k4425969l4964359k4268675K210868J7512752J1270491J250284
37392A7037579P43834r11889j2487274j8374311k916804J8092790J5601283q531377
37384H253831k0445108j017215K6860466K8476055J777346k2256209j9264290
37377B384876J554977J3469760O330556m760182l944118L471653K144152p084398
37369A3567276p067587P990905K0089961J1421908j0652700k4385137k1157348
37362a0192722r119205M254630J7475399K5228743J9564823L444366r654045j2532231
37354B8469758r961641o625965j822899K223066O67499k244447L542913J4649274
$$ y = [22411721, 38952421, 59105110, 78946661, 89135964, 87244260, 80065358, 68452187, 44026218, 9061859, -15206816, -12995948, 4516804, 15787295, 17037579, 17781413, 16869524, 4382250, -13992061, -16908865, 1183925, 16785208, 8253831, -12191277, -13208492, 13651974, 42128029, 43905375, 21649166, 2384876, 3939853, 17409613, 23740169, 18979987, 15035869, 18507522, 20651674, 13567276, 6499689, 14490594, 34580555, 46002463, 35349763, 10964626, -10192722, -19311927, -15057297, 2418102, 27646845, 47211668, 50656034, 41001989, 28469758, 18508117, 11882152, 10059253, 12282319, 12949818, 10705371, 14248284, 28897558]
37346B8897558J4553644k52673j1877563q541104k384067o293777j1158988m691657
37338a748627L575425n19110o711987L763318K1227387J7692588o945087k0549259
37330I784648o935492J1072487Q960202n052437r728539l865477M0256k86066
37322C989582P68859J236776l336959p784285o822389q105301j8314315k4347611
37314f2715643r155871J7703473K7505962J1883436n586814l149615J1646514
37307a1868558J7690363R302481k656365r126850r232809l396702O857767J2738644
37299A0307971L866223j5472203k4583636r025288J8926854L1767755J9190421
37292C4978097l03781m719319L467963M536411q468922k0383212j6012679L4115
$$ y = [28897558, 43451202, 43198529, 31320966, 22779862, 20395795, 14102018, 2943030, -1748627, 1826798, 1307688, -5404299, -1640981, 19586406, 37278994, 30333907, 9784648, 2849156, 13921643, 22881845, 17829408, 8100869, 4235392, 4275648, 3989582, 4758441, 5995217, 2658258, -5126027, -11948416, -20053717, -38368032, -62715643, -71871514, -54168041, -26662079, -14778643, -20365457, -23515072, -11868558, 5821805, 15124286, 12467921, 3341071, -5891738, -9288440, -2430673, 10307971, 14174194, -1298009, -25881645, -34906933, -15980079, 15787676, 34978097, 34674316, 29954997, 33422960, 37959371, 29490449, 9107237, -6905442, -6871327]
37284f871327J0871649O868608p596360k0875185k2570947j0025801R062882K2851888
37276a8284593K5424514J7851670K309276j6370295k5355740j3418463J0702747
37269a7140884K2112570Q472781j4884767k4437040j3600275O751911K1962296
37262a0763408K1410004M055569j5825391j8671514l007580J1257168R054233
37255b490919k608122r883532r368182k175319J1569934K1775748J1925063j2392134
37247F352537k0475597n56373J7034611N758090j2693327m448137J6749599J0207406
37239A7928809k1878608l4498459j1403204J1538091O703821n220877L819144
37232c3011283K4250857L0193510J9118165N630853m153840j0420007q742457
$$ y = [-6871327, 4000322, 10868930, 3272570, -17602615, -40173562, -50199363, -41136481, -18284593, 7139921, 24991591, 27300867, 10930572, -14425168, -27843631, -17140884, 4971686, 13444467, -1440300, -25877340, -39477615, -32725704, -10763408, 10646596, 14702165, -1123226, -19794740, -22802320, -11545152, -2490919, -5099041, -14982573, -24350755, -26526074, -14956140, 6819608, 18744671, 6352537, -14123060, -14679433, 2355178, 8113268, -4580059, -9028196, 7721403, 17928809, -3949799, -38448258, -49851462, -38313371, -31609550, -36830427, -33011283, -8760426, 21433084, 40551249, 46182102, 42028262, 31608255, 22865798]
37225B2865798j71448K596559n686362j2789430j0200743o069320n186041K026152
37217a2614835J6125990J8239213J298258j2194662n064097N526672j089506j2314095
37209b087062o163198Q231684P941955j573078J718801J2797626O168690j7599095
37201I436323k8948163j5084790M310149J1444717J0257283O449612l195552j3653156
37193a8983577j0582757M215409J0425200J485047m414723M151892J2964153Q088737
37185G349381r57412k79930M106265o55880r820544q188424N125293J4528672
37177A1207421Q374224q275257k0285766j7367744m459793K713957k855116q112663
37169c9060737K101950K0203995K4409766J0668026k391550k749946L10958l033499
$$ y = [22865798, 22694350, 25290909, 19604547, 6815117, -3385626, -9454946, -14640987, -12614835, 3511155, 21750368, 23048626, 10853964, 5789867, 11316539, 10227033, -2087062, -8250260, -18576, 7923379, 6350301, 8069102, 20866728, 27035418, 9436323, -19511840, -34596630, -30286481, -18841764, -8584481, -2134869, -5330421, -18983577, -29566334, -25350925, -14925725, -13440678, -17855401, -13703509, -739356, 7349381, 6391969, 6112039, 10218304, 9562424, -258120, -8446544, -3321251, 11207421, 19581645, 11306388, -8979378, -26347122, -30806915, -28092958, -30948074, -39060737, -36958787, -16754792, 7654974, 18323000, 15931450, 13181504, 13492462, 10458963]
37161A0458963o974062m756837k538203n775319n661562O462165K1100061K1418862
37153C3734068O496994q313729j1701604q161721r608741j9398433k5673203j3724601
37145e6350970J2083718K7075586J6912826j88933J002791J3779420J1149274
37138B5463712p454992j2861922N010756J8042005M558814j6377081j6798234
37131d16942j939964M495340j186019n437141n679564r233565j2058807l583908
37123c5040570J0788910J3807915K241216q941136p955252K286439J3031088J8507545
37115H726155J7390724J3377234J0529462M379433j1707713k7382829k0868411
37108e555945O384247K2036482O482341j7069165j7826053k177735L900703j294331
$$ y = [10458963, 3484901, -1271936, -3810139, -9585458, -15247020, -8784855, 12315206, 33734068, 40231062, 31917333, 20215729, 12054008, 2445267, -16953166, -42626369, -56350970, -44267252, -17191666, -278840, -467773, 535018, 14314438, 25463712, 18008720, 5146798, 10157554, 28199559, 32758373, 16381292, -416942, -2356906, 2138434, 952415, -4484726, -10164290, -19397855, -31456662, -35040570, -24251660, -10443745, -8202529, -17143665, -25098917, -22812478, -9781390, 8726155, 26116879, 39494113, 50023575, 54403008, 42695295, 15312466, -5555945, 828302, 22864784, 29347125, 12277960, -5548093, -7725828, -3825125, -5119456]
37100e119456j678600L73848q861561j9340109q012253J7569030K5143111R769930
37092I843940J463468J3512167K1244037N802079j5752865k1951148j8152842
37085c991164j6518166j1956995J3484N057948o719117j8665937j2212268K792666
37077f2199549N859415j8707L459906J7492958K5916313K1800422J3007637M541051
37069B9859446n287148j2264002p395302P322339J7133996J1418173n169152j8728285
37061A6890065j8525042n915934N600050L960832n800755p511783K853440J2086120
37053C636993J1685978R359387J0884793P204324p901869k1958531k0654393q752190
37045a6495508O28933O140190J1770011J1552160o15655j3763261j1366713M271084
$$ y = [-5119456, -6798056, -6424208, -15285769, -34625878, -42638131, -25069101, 74010, 9843940, 11307408, 24819575, 46063612, 51865691, 36112826, 14161678, -3991164, -20509330, -32466325, -32452841, -27394893, -34114010, -52779947, -64992215, -62199549, -56340134, -56358841, -52898935, -35405977, -9489664, 12310758, 25318395, 29859446, 24572298, 12308296, 4912994, 12235333, 29369329, 40787502, 35618350, 16890065, -1634977, -7550911, -1950861, 2009971, -3790784, -11302567, -8449127, 3636993, 15322971, 24682358, 35567151, 42771475, 34869606, 12911075, -7743318, -16495508, -15866575, -9726385, 2043626, 13595786, 12980131, -783130, -12149843, -7878759]
37037g878759J5284706J1991986l61219j2829138j6939978m955436J8555766L2354376
37029C5222304K1787516n59415j3480837j7035503k3978533l0524231k0954604
37022d9523303K149195J7761192J7145985J1682188Q886264M076706j185928L697059
37014A4689358J6504087J9333634N269117j1332593j7875404j7578001j4053675
37007e043477k658021J3677688J9829865J0583046l00637l173092o530946j7124134
36999I260292k4649617j9247044p228858L315377J4851321K4944800J8555079
36992A9801350o131055k2900408j0776110J3053210J7617368L155833m655571
36985I164617K720760Q089188Q07157q603958r769780o766559n446721l782409
$$ y = [-7878759, 7405947, 19397933, 19036714, 6207576, -10732402, -15687838, 2867928, 35222304, 57009820, 56450405, 42969568, 25934065, 1955532, -28568699, -49523303, -47374108, -29612916, -12466931, -784743, 8101521, 12178227, 10992299, 14689358, 31193445, 50527079, 55796196, 44463603, 26588199, 9010198, -5043477, -7701498, 5976190, 25806055, 36389101, 36088464, 32915372, 26384426, 9260292, -15389325, -34636369, -41865227, -38549850, -23698529, 1246271, 19801350, 13670295, -9230113, -20006223, -6953013, 10664355, 13820188, 9164617, 11885377, 19974565, 20781722, 12177764, 2407984, -4358575, -9805296, -13587705]
36977a3587705o42965j35509k138250j63844P541339J4673084J6496568J3450935
36969C5493653N375780p179422j6187955j2161170K158850J3823770J4935291
36962C6258797P091997n595122j6525831j4816312J440737J4255606N675756j4300420
36954A3485208j9934488q283733j188122o216433l995186J4383905K4976364O669990
36946A9897505k1144963k2153315O292237L0364117K4043935l582755k5230748
36939H486013k4234811n283910J2499305J2715065p87541o960606M727522J7296342
36931A8457379Q742926j5548303k8662066j7292015N124291J9866655K1103813
36924A1792680J0520885r088846k7626672k9233607j0995304Q474900R729157
$$ y = [-13587705, -14230670, -14366179, -16504429, -16668273, -9126934, 5546150, 22042718, 35493653, 40869433, 33690011, 17502056, 5340886, 7499736, 21323506, 36258797, 43350794, 37755672, 21229841, 6413529, 7854266, 22109872, 27785628, 13485208, -6449280, -14733013, -15921135, -22137568, -26132754, -11748849, 13227515, 19897505, -1247458, -23400773, -17108536, 13255581, 37299516, 33716761, 8486013, -15748798, -21032708, -8533403, 4181662, 3394121, -3566485, 1161037, 18457379, 27200305, 11652002, -17010064, -34302079, -29177788, -9311133, 11792680, 22313565, 13224719, -14401953, -43635560, -54630864, -46155964, -36426807]
36917c6426807l291102r406604J911359J8204556K1106100Q912791k783038j039697
36909b812442R272666J3250286N577281m135293n883035j149350L736349Q161014
36901B6017476J3493478J4973300P663932k399971l528675N672313J4974729J6977927
36893I3844509J3660873Q501469K213125k250609o17260M195811M114596j007412
36885A22655102k831274k45059l232180j4879789k2355424j5925086n886576p276499
36877E0023215j5827865j4724159j223499R720211Q563288K583793O30210K75877
36869D0021071k951085m808868l93370M493804N37360j0030259j5173971r117503
36861B577179J296256O761215N114224k34718m605106k706957P746860J8994766
$$ y = [-36426807, -39717909, -49124513, -47213154, -29008598, -7902498, 1010293, -1772745, -2812442, 6460224, 19710510, 25287791, 21152498, 15269463, 14120113, 17856462, 26017476, 39510954, 54484254, 62148186, 59748215, 56219540, 61891853, 76866582, 93844509, 107505382, 116006851, 118219976, 115969367, 115352107, 119547918, 123662514, 122655102, 119823828, 119578769, 116346589, 101466800, 79111376, 63186290, 57299714, 50023215, 34195350, 19471191, 18247692, 27967903, 36531191, 39114984, 39745194, 40021071, 37069986, 32261118, 31867748, 36361552, 36898912, 26868653, 11694682, 2577179, 3873435, 10634650, 15748874, 15514156, 10909050, 8202093, 15948953, 34943719]
36853C4943719J6956017j106883j8413937j7358800k513767O189958J224669n565917
36845A4355059n099964l452177n041060p95890J2894505J8641523K134581j8520078
36837A5116499j3395039J2464850K1569471j193466k4646476j6623899J1083045
36830D374985K4348844J5369798L968892L91811n545750j8763361k6532711j8187718
36822b0575210j005513R954356P016948p691473k4083657k7281695j1072601J0433955
36814f4304890J7143194R788068P503653J6721460K1108827R783570l358948j845370
36806A2539564P314600O771413l122669q357637o308495o477064q737233j763348
36798h140869J3787099K0038230Q124163o334178n725053L787255L581840p948298
$$ y = [34943719, 51899736, 50792853, 32378916, 15020116, 12506349, 18696307, 19920976, 14355059, 9255095, 5802918, 761858, -34032, 12860473, 31501996, 33636577, 15116499, 1721460, 14186310, 35755781, 34562315, 9915839, -6708060, 4374985, 28723829, 44093627, 48062519, 48454330, 42908580, 24145219, -2387492, -20575210, -21580723, -11626367, -4609419, -12300892, -36384549, -63666244, -74738845, -64304890, -47161696, -37373628, -29869975, -13148515, 7960312, 17743882, 14384934, 12539564, 19854164, 26625577, 23502908, 15145271, 8836776, 2359712, -6377521, -8140869, 5646230, 25684460, 33808623, 27474445, 21749392, 25536647, 29118487, 21170189]
36790B1170189j3980409o016863L985044K899884m891779o712253r39434L533870
36782i51751K980470K687999N299426N967787K372772K42837K837078K575639
36774B4012257p721825j9541424j5779831N673797K4747805K0646507m341317
36767B7695969k7333887k8783516j0096037J1020796J8521125J0757034j257992
36760E23492n356520J420871J1165424J2657187K649463r037093q770162L670980
36752H923642J1446111P22946j9018866k5059603j1511349L617302N579687K854167
36744b2445963R507821J9650229J5878433k088590j4547092q827774M864732R285572
36736A1277368K004916m505730J2065J0485107J0666704p461651k8852988k8818622
$$ y = [21170189, 7189780, 1172917, 5157961, 8057845, 3166066, -3546187, -4485621, -951751, 2028719, 4716718, 10016144, 15983931, 18356703, 18599540, 21436618, 24012257, 16290432, -3250992, -19030823, -13357026, 11390779, 32037286, 27695969, 362082, -28421434, -38517471, -27496675, -8975550, 1781484, 523492, -4833028, -3412157, 7753267, 20410454, 23059917, 14022824, 5252662, 8923642, 20369753, 21092699, 2073833, -22985770, -34497119, -30879817, -25300130, -22445963, -12938142, 6712087, 22590520, 20501930, 5954838, -2872936, 1991796, 11277368, 13282284, 8776554, 8788619, 19273726, 29940430, 22478779, -6374209, -35192831]
36728c5192831n382017J4231838R327094n829870n701098P440244J1983296N966980
36720c156364P636451J7810410J4169905q653368k3864623j2726901N938971N790827
36712B945308q601223j4474127n296563Q558952J9637563K3590273J2679849r854976
36704B9185056k1101355o409239J4867663J5025819r43673o598673J660620K304789
36696B7991007j1042035j8653564r479381J692337J924211J94324O581364J2325999
36688A1534262O504227l381405m125667J104690l37038q424382j0311448m76832
36680g913593J0632555J0011693j825593j0680099m124003J3093444K2249321
36673C1443725J2646176m111650q951425n88544M242473n109073j9434431k2303493
$$ y = [-35192831, -40574848, -26343010, -17015916, -22845786, -28546884, -21106640, -9123344, -3156364, 4480087, 22290497, 36460402, 27807034, 3942411, -8784490, -2845519, 2945308, -5655915, -20130042, -25426605, -16867653, 2769910, 26360183, 39040032, 29185056, 8083701, 1674462, 16542125, 31567944, 30624271, 24025598, 25686218, 27991007, 16948972, -1704592, -11183973, -9491636, -7567425, -7373101, -791737, 11534262, 18038489, 14657084, 10531417, 11636107, 11299069, 2874687, -7436761, -7913593, 2718962, 12730655, 10905062, 224963, -3899040, 9194404, 31443725, 44089901, 39978251, 31026826, 30438282, 34680755, 29571682, 10137251, -12166242]
36665a2166242r118470Q699040J4724477L780213j0495088j0075186K570049N855802
36657f225405p248081j3837478M156755K6508428K1954855k211089r979290P004186
36649B0122881J7496267Q59241k3475211k9283089j8117020m945548O076361J3546789
36641a7719329Q043606j0445283k1302169r485016J0430976J4830050L768411
36634b1878754m850254l552669K41210J044708R27790K680210P885987J6015178
36626a486594J9054914P598939j1575358j8602211q877481p83447n363561r021311
36618b9056110l16790Q397027N178472K561603J3672789K3995814J4719773k337793
36610C6814785l821603M436113r78861j7807945k1379787p143567M480162N527235
$$ y = [-12166242, -21284712, -12585672, 2138805, 5919018, -4576070, -14651256, -12081207, -6225405, -13473486, -27310964, -23154209, 3354219, 25309074, 23097985, 13118695, 20122881, 37619148, 38478389, 15003178, -14279911, -32396931, -37342479, -31266118, -17719329, -9675723, -20121006, -41423175, -50908191, -40477215, -25647165, -21878754, -26729008, -30281677, -30040467, -28995759, -28067969, -25387759, -17501772, -1486594, 17568320, 25167259, 13591901, -5010310, -13887791, -14671238, -20034799, -29056110, -29372900, -20975873, -15797401, -13235798, 436991, 24432805, 39152578, 36814785, 32993182, 37429295, 36450434, 18642489, -2737298, -9880865, -5400703, 126532]
36602A26532Q832451J5850131J0247098q061983j4539680J089224J5264378O025178
36594C4833329j4704642k1559356j0727093K382603P337234N405949J057004j642057
36586B382971k50339K274822J840611K493831J0403762J8505125J2553169n199199
36578D5004753j5419294r332951K18765J221177j680862j706517k877193p888574
$$ y = [126532, 8958983, 24809114, 35056212, 26994229, 12454549, 13543773, 28808151, 34833329, 20128687, -1430669, -12157762, -9775159, -2437925, 2968024, 4025028, 2382971, 2132632, 4407454, 6248065, 8741896, 19145658, 37650783, 50203952, 45004753, 29585459, 20252508, 20471273, 21692450, 20011588, 18305071, 15427878, 7539304]
$$ [...]
##END NTUPLES=NMR SPECTRUM
##END=
