##TITLE=31Pdec_LR-696-C1
 CDCl3, 24 sc
 11.11.2019
##JCAMPDX= 6.0         $$ Bruker NMR JCAMP-DX V2.0
##DATA TYPE= NMR SPECTRUM
##DATA CLASS= NTUPLES
##ORIGIN= UXNMR, Bruker Analytische Messtechnik GmbH
##OWNER= root
$$ XWIN-NMR		Version 3.5
$$ Mon Nov 11 16:13:22 2019 Russian Standard Time (UT+4h)  she@DPX200
##.OBSERVE FREQUENCY= 81.013821
##.OBSERVE NUCLEUS= ^31P
##.ACQUISITION MODE= SIMULTANEOUS
##.ACQUISITION SCHEME= undefined
##.AVERAGES= 24
##.DIGITISER RES= 17
##SPECTROMETER/DATA SYSTEM= spect
##.PULSE SEQUENCE= zgpg30
##.SOLVENT NAME= MeOD
##.SHIFT REFERENCE= (INTERNAL, MeOD, 0, 182.463)
##AUDIT TRAIL= $$ (NUMBER, WHEN, WHO, WHERE, WHAT)
$$ ##TITLE= Audit trail, XWIN-NMR		Version 3.5
$$ ##JCAMPDX= 5.01
$$ ##ORIGIN= Bruker BioSpin GmbH
$$ ##OWNER= she
$$ F:/spectra/data/she/nmr/P31/1/pdata/1/auditp.txt
$$ ##AUDIT TRAIL=  $$ (NUMBER, WHEN, WHO, WHERE, WHAT)
(   1,<2019-11-11 16:12:34.07 +0400>,<she>,<DPX200>,
      <created by zg, POWCHK disabled, PULCHK disabled
       configuration hash MD5:
       00 E9 B6 7A A2 85 ED C7 34 08 36 98 17 FE 4E 26
       data hash MD5: 32K
       16 E6 BF DA B7 DC 47 49 05 81 3C 16 0C B9 28 5E>)
(   2,<2019-11-11 16:12:36.85 +0400>,<she>,<DPX200>,
      <Start of raw data processing
       efp BC_mod = 2 LB = 1 FT_mod = 6 PKNL = 1 PHC0 = -788.7427 PHC1 = 155.0007 SI = 64K 
       data hash MD5: 64K
       0E BF A0 42 98 AF 43 F2 7A B4 D0 D8 7F 23 EA 51>)
(   3,<2019-11-11 16:12:55.64 +0400>,<she>,<DPX200>,
      <pk PHC0 = -182.8208 PHC1 = 0 
       data hash MD5: 64K
       74 AE 25 29 53 B1 CC 6A 20 3A 78 AE 04 E1 C7 D8>)
(   4,<2019-11-11 16:12:59.26 +0400>,<she>,<DPX200>,
      <abs ABSG = 5 
       data hash MD5: 64K
       E9 C1 A1 B4 66 E9 3C 30 81 7B BD 60 65 DC 38 4B>)
$$ ##END=
$$ 
$$ hash MD5
$$ 45 44 A0 8E 6A B3 9D BD AC 0B 35 75 1B 74 45 DE
##$RELAX= 
##$RELAX= 
##$RELAX= 
##$RELAX= 
##$RELAX= 
##$RELAX= 
##$RELAX= 
##$RELAX= 
$$ Bruker specific parameters
$$ --------------------------
##$DU= <F:/spectra>
##$EXPNO= 1
##$NAME= <P31>
##$PROCNO= 1
##$TYPE= <nmr>
##$USER= <she>
##$AMP= (0..31)
100 100 100 100 100 100 100 100 100 100 100 100 100 100 100 100 100 100 
100 100 100 100 100 100 100 100 100 100 100 100 100 100 
##$AQSEQ= 0
##$AQ_mod= 1
##$AUNM= <au_zg>
##$AUTOPOS= <>
##$BF1= 81.014009
##$BF2= 200.13
##$BF3= 200.13
##$BF4= 200.13
##$BF5= 200.13
##$BF6= 200.13
##$BF7= 200.13
##$BF8= 200.13
##$BYTORDA= 1
##$CFDGTYP= 0
##$CFRGTYP= 5
##$CHEMSTR= <none>
##$CNST= (0..31)
1 1 145 1 1 1 1 1 1 1 1 1 1 1 1 1 1 1 1 1 1 1 1 1 1 1 1 1 1 1 1 1 
##$CPDPRG= <waltz16>
##$CPDPRG1= <>
##$CPDPRG2= <waltz16>
##$CPDPRG3= <>
##$CPDPRG4= <mlev>
##$CPDPRG5= <mlev>
##$CPDPRG6= <mlev>
##$CPDPRG7= <mlev>
##$CPDPRG8= <mlev>
##$CPDPRGB= <>
##$CPDPRGT= <>
##$D= (0..31)
0 1 0 0 0 0 0 0 0 0 0 0.03 2e-05 3e-06 0 0 0 0 0 0 0 0 0 0 0 0 0 0 0 0 
0 0 
##$DATE= 1573474353
##$DBL= (0..7)
120 120 120 11 120 120 24 19 
##$DBP= (0..7)
150 150 150 150 150 150 150 150 
##$DBP07= 0
##$DBPNAM0= <>
##$DBPNAM1= <>
##$DBPNAM2= <>
$$ [...]
##$SUBNAM3= <"">
##$SUBNAM4= <"">
##$SUBNAM5= <"">
##$SUBNAM6= <"">
##$SUBNAM7= <"">
##$SUBNAM8= <"">
##$SUBNAM9= <"">
##$SW= 369.568048894756
##$SWIBOX= (0..15)
0 1 3 0 0 0 0 0 0 0 0 0 0 0 0 0 
##$SW_h= 29940.119760479
##$TD= 32768
##$TD0= 1
##$TE= 0
##$TE2= 300
##$TE3= 300
##$TEG= 300
##$TL= (0..7)
0 120 53 12 22 120 120 120 
##$TP= (0..7)
150 150 150 150 150 150 150 150 
##$TP07= 0
##$TPNAME0= <>
##$TPNAME1= <>
##$TPNAME2= <>
##$TPNAME3= <>
##$TPNAME4= <>
##$TPNAME5= <>
##$TPNAME6= <>
##$TPNAME7= <>
##$TPOAL= (0..7)
0.5 0.5 0.5 0.5 0.5 0.5 0.5 0.5 
##$TPOFFS= (0..7)
0 0 0 0 0 0 0 0 
##$TUNHIN= 0
##$TUNHOUT= 0
##$TUNXOUT= 0
##$USERA1= <user>
##$USERA2= <user>
##$USERA3= <user>
##$USERA4= <user>
##$USERA5= <user>
##$V9= 5
##$VALIST= <valist>
##$VCLIST= <CCCCCCCCCCCCCCC>
##$VD= 0
##$VDLIST= <DDDDDDDDDDDDDDD>
##$VPLIST= <PPPPPPPPPPPPPPP>
##$VTLIST= <TTTTTTTTTTTTTTT>
##$WBST= 1024
##$WBSW= 4
##$XGAIN= (0..3)
0 0 0 0 
##$XL= 0
##$YL= 0
##$YMAX_a= 6549
##$YMIN_a= -4926
##$ZGOPTNS= <>
##$ZL1= 120
##$ZL2= 120
##$ZL3= 120
##$ZL4= 120
##$ABSF1= 182.463
##$ABSF2= -187.1042
##$ABSG= 5
##$ABSL= 3
##$ALPHA= 0
##$AQORDER= 0
##$ASSFAC= 0
##$ASSFACI= 0
##$ASSFACX= 0
##$ASSWID= 0
##$AUNMP= <proc_1d>
##$AZFE= 0.1
##$AZFW= 0.5
##$BCFW= 0
##$BC_mod= 2
##$BYTORDP= 0
##$COROFFS= 0
##$CY= -3
##$DATMOD= 1
##$DC= 0
##$DFILT= <>
##$DTYPP= 0
##$F1P= 0
##$F2P= 0
##$FCOR= 1
##$FTSIZE= 65536
##$FT_mod= 6
##$GAMMA= 0
##$GB= 0
##$INTBC= 1
##$INTSCL= 5.30512e-09
##$ISEN= 30
##$LB= 1
##$LEV0= 0
##$LPBIN= 0
##$MAXI= 10000
##$MC2= 0
##$MEAN= 0
##$ME_mod= 0
##$MI= 50
##$NCOEF= 0
##$NC_proc= -7
##$NLEV= 6
##$NOISF1= 182.463
##$NOISF2= 159.3651
##$NSP= 0
##$NTH_PI= 0
##$NZP= 0
##$OFFSET= 182.463
##$PC= 4
##$PHC0= -971.5635
##$PHC1= 155.0007
##$PH_mod= 1
##$PKNL= yes
##$PPARMOD= 0
##$PSCAL= 0
##$PSIGN= 0
##$REVERSE= no
##$SF= 81.0140089999434
##$SI= 65536
##$SIGF1= 159.3651
##$SIGF2= -187.1042
##$SINO= 113.3802
##$SIOLD= 16384
##$SREGLST= <1H.CDCl3>
##$SSB= 0
##$STSI= 65536
##$STSR= 0
##$SW_p= 29940.119760479
##$SYMM= 0
##$S_DEV= 0
##$TDeff= 32768
##$TDoff= 0
##$TI= <>
##$TILT= no
##$TM1= 0
##$TM2= 0
##$TOPLEV= 0
##$USERP1= <user>
##$USERP2= <user>
##$USERP3= <user>
##$USERP4= <user>
##$USERP5= <user>
##$WDW= 1
##$XDIM= 65536
##$YMAX_p= 268150177
##$YMIN_p= -32473491
$$ End of Bruker specific parameters
$$ ---------------------------------
##NTUPLES= NMR SPECTRUM
##VAR_NAME=  FREQUENCY,     SPECTRUM/REAL,   SPECTRUM/IMAG
##SYMBOL=    X,             R,               I
##VAR_TYPE=  INDEPENDENT,   DEPENDENT,       DEPENDENT
##VAR_FORM=  AFFN,          ASDF,            ASDF
##VAR_DIM=   65536,         65536,           65536
##UNITS=     HZ,            ARBITRARY UNITS, ARBITRARY UNITS
##FACTOR=    0.456856943014862, 1,           1
##FIRST=     14782.0589164792, 0,            0
##LAST=      -15158.0608439998, 0,           0
##MIN=       -15158.0608439998, -32473491,   0
##MAX=       14782.0589164792, 268150177,    0
$$ Real data points
##PAGE= N=1
##DATA TABLE= (X++(R..R)), XYDATA
$$ [...]
44567 179007 -1351144 -1300174 -736070 454117 3721161 8066963 9539259 6806701 4165186
44558 4165186 5896575 10006906 11095517 7783676 3569199 1376756 1201680 2741943
44550 2741943 6165173 9619244 9825400 6585164 3603829 3341835 3974255 3169577 1865922
44541 1865922 1837912 2134043 1074690 -21224 1453957 4825656 6477468 4594926 984320
44532 984320 -1709207 -2298420 -888852 1148086 1282431 -1597828 -4949785 -5496017 -3899514
44523 -3899514 -3305298 -3640788 -1702585 2447243 4079675 923032 -2868931 -3051554 -1488644
44514 -1488644 -1900718 -3017328 -1333621 1609873 811094 -3855825 -6729048 -4692852
44506 -4692852 -1414805 -1511120 -4504144 -6631846 -5553593 -1508820 3371305 5412529
44498 5412529 2091442 -3870282 -6128501 -2487842 1912519 1547402 -2446690 -5327994
44490 -5327994 -6005320 -6918822 -8274135 -7253170 -3183749 621317 1481873 840524 1574174
44481 1574174 3953424 5969456 6337948 5556185 4551347 3540343 2255094 669889
44473 669889 -731457 -1413898 -1432318 -1266244 -937079 68378 1614176 2384405 1247231
44464 1247231 -1347033 -3993860 -5855705 -6855359 -6884103 -5753005 -3817050 -2028296 -1354340
44455 -1354340 -2208844 -4004320 -5254160 -4896994 -3564819 -2527614 -1493172 842134
44447 842134 3785101 4474988 1905765 -1013502 -1198482 618347 1699697 1411741 958076
44438 958076 355907 -1260640 -2948105 -2698433 -901556 -158940 -1218438 -1776153 -36481
44429 -36481 3024594 5888512 8591386 11196758 12128695 9790509 4835334 -338181 -3535434
44420 -3535434 -3700988 -1330933 1221187 1280725 -1250096 -3690605 -4058797 -3220633 -2533426
44411 -2533426 -1248274 1756818 5030362 5936752 4658265 4332296 6696058 9628009
44403 9628009 10132774 8362153 7114269 7815945 8531816 6477176 1701870 -2596993 -3419296
44394 -3419296 -1010328 1694257 2234764 794474 -559394 -247768 1333797 2492539
44386 2492539 2281407 1589911 1685520 1893510 53429 -4030341 -6970546 -5309842 -88779
44377 -88779 3950440 3766954 842111 -1801265 -3414366 -4992551 -6339049 -5804688 -2964556
44368 -2964556 138936 1247861 484683 -281131 -163361 -4609 -217138 498433 2991034
44359 2991034 5368906 4901116 1799864 -1189533 -3017047 -5346757 -8493794 -9503026
44351 -9503026 -6487789 -2318602 -1007971 -2210681 -2558371 -1121585 102972 443006
44343 443006 1351534 2771661 2446659 -182710 -2507102 -2326937 -342984 1784199 3265545
44334 3265545 3281466 1058396 -2071493 -3359757 -2467580 -1912855 -2770390 -3108336 -1974538
44325 -1974538 -1352447 -2218317 -2330196 -549904 276504 -1835530 -3606394 -1191480 3229131
44316 3229131 4269310 1198668 -1694901 -1783576 -598964 188612 1076109 2597123 4369793
44307 4369793 6560320 9170064 10044722 7157530 2860482 1989964 5346879 8935895
44299 8935895 10194744 10686643 11536293 10836904 7785114 5237175 5291915 5818108 4440123
44290 4440123 2804583 3419456 4999665 4855754 3787022 4417279 6102659 5880089 3893318
44281 3893318 3537283 5870851 7780962 6722491 4056445 2363382 2100889 2332995 2508699
44272 2508699 2067880 303610 -1836207 -1690726 1494106 4383800 3179755 -1405598
44264 -1405598 -4924064 -4608567 -2004755 -114415 82759 -526323 -1212726 -1867176 -2176500
44255 -2176500 -1746037 -958711 -593621 -443734 587645 2510106 3446815 1924104 -647716
44246 -647716 -1219571 1166571 4273327 5630711 5136829 3868066 1808009 -1477232 -4628960
44237 -4628960 -5105595 -2386611 1007139 2455393 2141742 2242740 4020116 6554144 7904018
44228 7904018 6893648 4130725 1670932 1108467 1626967 848229 -1740098 -3437370 -1778982
44219 -1778982 1719525 3340277 2173265 726093 248197 -1425191 -5604550 -9062771
44211 -9062771 -7820596 -3294605 -1013491 -3082692 -5355337 -3375131 1711002 5309073
44203 5309073 5457040 4080999 3106769 2148037 408344 -1361058 -2013365 -1949676 -2640758
44194 -2640758 -4519218 -6253741 -6245945 -4359054 -1947377 -533687 -890045 -3140483 -6723313
44185 -6723313 -9734052 -9407514 -4778094 1326580 4457196 3079944 -139708 -1757270
44177 -1757270 -922159 981315 2431823 2629188 1597217 429762 330887 667247 -557187
44168 -557187 -3372607 -4892369 -3281917 -807034 -639169 -2139301 -2186193 -301556 790376
44159 790376 -287165 -1572635 -1135555 90931 68753 -1488645 -3049957 -2830042 38769
44150 38769 4516047 7601885 6957700 3897277 1977825 2364664 2830926 1937825 1499092
44141 1499092 3287139 5545354 5090681 1709026 -1567983 -1962823 726434 4636908
44133 4636908 7320695 7227791 4882989 2329498 874123 86568 -625222 -778920 28178
44124 28178 1045191 1518514 1820305 2475720 3225785 3945753 5129827 6520589 6883413
44115 6883413 6251318 6417487 7659494 7239668 3483279 -776712 -1893950 -874176 -1503464
44106 -1503464 -4118413 -5503450 -4850257 -5164639 -7503387 -8202229 -4489083 471272 1577752
44097 1577752 -1149075 -3049278 -1504174 1248810 2177366 1393728 833313 983110 700108
44088 700108 -424383 -1104084 -58717 2153071 3645488 3426426 2548181 2715178 4061419
44079 4061419 4910524 3842465 1506989 30590 790390 3023604 4577348 3878530 1255051
44070 1255051 -1384996 -2009692 71418 3498737 5435148 3699871 -844745 -4578382
44062 -4578382 -4858587 -3082091 -2669971 -4303800 -5141716 -3142510 60616 1849785 2245901
44053 2245901 2945747 4078739 4120934 2421332 -159298 -2787449 -5015632 -5836186 -4281789
44044 -4281789 -1196764 1142221 1565061 1059911 1093571 1849025 2269387 1176605 -1455998
44035 -1455998 -3790550 -3407829 -170165 3126655 4027701 3113147 2025519 486099 -2380420
44026 -2380420 -5172798 -5743673 -4799856 -4669061 -4971946 -3311364 -349660 56599 -3111000
44017 -3111000 -5946271 -5368499 -3144167 -1848063 -576592 2079410 4036565 2771232
44009 2771232 176113 88426 2251657 2939439 984282 -933675 -1018706 -349734 548832
44000 548832 3238713 7785778 10742313 9011391 3841593 -997544 -3574402 -4491065
43992 -4491065 -4435587 -3199854 -901772 1444393 2846277 3010498 2145796 826498 -5717
43983 -5717 321834 1361615 1869738 1296361 572682 916101 1958508 1706103 -1270787
43974 -1270787 -5987399 -9819185 -10841154 -9038367 -5808204 -3072661 -2294349 -3119278
43966 -3119278 -3285838 -1222295 1563764 2309135 854589 -549511 -1169152 -2413883 -3734420
43957 -3734420 -1547836 5307195 12021812 13170680 9804680 7672913 9540431 12904817
43949 12904817 14709618 14443087 12319329 8115178 2994950 -389832 -985149 -406795
43941 -406795 -55234 620801 2068942 3181340 3229551 3299165 4366089 5481422 5143160
43932 5143160 3219702 592310 -1831930 -3112851 -2800770 -2031611 -2407995 -3369700 -2819117
43923 -2819117 -915939 -574161 -3037899 -5730000 -6112897 -4906295 -3493765 -1178449
43915 -1178449 2148896 3524111 975568 -2008458 -567759 3979004 5279084 687513
43907 687513 -5429348 -7936680 -6633391 -4370123 -2863811 -2301430 -2563028 -2878694 -2018225
43898 -2018225 -196361 907339 961869 1618995 3161773 3070106 -152186 -3983239 -5142351
43889 -5142351 -4105474 -3731794 -4675446 -5021757 -3840673 -2298834 -1278117 -357713 545110
43880 545110 701593 299824 814245 2878611 5113626 5724026 4308170 1800636 -406281
43871 -406281 -1217353 -816492 -845970 -2374915 -3981275 -3627127 -2272992 -3124645 -6609013
43862 -6609013 -8768353 -6351910 -1346152 1855749 2244484 2457226 4060171 5504725
43854 5504725 5083113 3509222 2603019 2943855 3710435 3825080 2661804 477381 -1489908
43845 -1489908 -2162903 -1971138 -2043148 -2101524 -669735 2294666 4689707 5073313 4653357
43836 4653357 5233012 6415406 6373838 4567125 2117368 -11926 -1695444 -2786752 -3071078
43827 -3071078 -3043026 -3340178 -3277910 -1348934 2367943 5534936 6063925 4455977 2806334
43818 2806334 2089999 1498650 378511 -329228 593786 2292814 1998659 -1836750 -7269782
43809 -7269782 -10703999 -10630579 -8404655 -5628048 -2528997 685430 2802746 3157501 2845456
43800 2845456 3084112 3500310 3289742 2775464 2292946 906536 -1776290 -3700015 -2637079
43791 -2637079 423931 2551114 2795308 2276064 1185953 -1011631 -2742843 -1463516
43783 -1463516 1917890 3585153 2775688 3208587 6799448 9942006 8831573 5092521
43775 5092521 2746424 2371850 2014532 1629914 2414453 3156753 1582685 -1230341 -1816203
43766 -1816203 307825 1852424 610638 -2159556 -4477570 -5550356 -4611034 -1265301
43758 -1265301 2221706 2320769 -863251 -3105507 -1794466 838921 1803073 1561279 1860150
43749 1860150 2034246 491483 -1801198 -2387233 -1145324 -440232 -1628251 -3480015 -4250083
43740 -4250083 -3860940 -3742978 -5241688 -8133148 -10370383 -9805330 -6487379 -2585494 83888
43731 83888 1434244 2057550 2377239 3045091 4291566 4545692 2049737 -1516152 -1978349
43722 -1978349 1309568 3563697 1143930 -2894044 -3167176 495618 3953675 5535953
43714 5535953 7144999 9013535 8365580 4465646 816050 323252 1484075 1620914 1288770
43705 1288770 2767960 5805864 7619283 6692712 4535034 3503132 4074255 4603484 3406908
43696 3406908 944774 -402388 788740 2895308 3135339 1149417 -731227 -607671
43688 -607671 1204717 3508065 5587649 6993322 7598787 8144105 9143808 9268454 6829061
43679 6829061 2970883 943599 1692067 2773040 2433457 1865577 2102371 1750636 -109582
43670 -109582 -1610512 -1332093 -1343888 -3846509 -6835902 -6783048 -4248126 -2865023 -3353649
43661 -3353649 -2632885 759779 4138669 4767319 3555437 3162702 4505864 6482612 7620430
43652 7620430 7011691 4865404 2700949 1829766 1619286 769575 -45175 871978 2683603
43643 2683603 2314709 -933752 -3933367 -4223226 -3281256 -3524691 -4511952 -4460036 -3605286
43634 -3605286 -3407413 -3625594 -2707367 -419209 1976198 3541096 3881548 2454309 -301979
43625 -301979 -1956808 -522871 2513248 3795998 2435997 542397 -285661 -473786 -360456
43616 -360456 757204 2714060 3985199 4180152 4937482 7044431 8591227 7642659 5190813
43607 5190813 3546153 2895811 1552643 -856856 -2507260 -1957914 -212676 329639 -1696518
43598 -1696518 -5369121 -8072348 -7484992 -3792485 14067 782535 -1617952 -4223768
43590 -4223768 -4186624 -1566847 1228022 2269031 1919667 1966551 3383929 5292793 6123863
43581 6123863 5371972 3760237 1931957 -255503 -2992415 -5769090 -7685692 -7944476
43573 -7944476 -5842875 -1217597 4444848 8254161 8482703 6549820 5319383 5583442
43565 5583442 5467093 3445282 576819 -1038264 -1099959 -1306172 -2948583 -5230082 -6250380
43556 -6250380 -5252293 -3513648 -2933644 -3899799 -4924124 -4550782 -3116700 -2046992 -1849174
43547 -1849174 -1828433 -1674172 -1955665 -2546759 -1945603 627927 3340248 3468156 745673
43538 745673 -2388304 -3839434 -3754763 -3187757 -2439726 -1544980 -1175151 -1860155 -2944556
43529 -2944556 -3338439 -2801406 -1520266 967526 4982643 8928385 9889854 6787303 2123180
43520 2123180 -223320 1252906 4433265 5777713 3591569 -492660 -2959329 -1556836
43512 -1556836 2683171 6478958 7218645 4829905 1290872 -1085759 -1150678 440382 1868567
43503 1868567 1826540 513337 -1243292 -3138799 -4818317 -4979804 -2710535 521760 2086770
43494 2086770 1611710 1285796 2307304 3164422 2379348 768350 -436034 -1551980 -2695756
43485 -2695756 -2266000 270392 2016407 343520 -2397101 -1658403 2425369 5092277
43477 5092277 4094873 2412921 2574242 2573183 -50665 -3653120 -5354354 -5892571 -7864784
43468 -7864784 -10632401 -10768939 -7171895 -2490673 679152 2344168 3501998 4299165
43460 4299165 4448971 3839338 2341744 389123 -305705 1704892 5293651 7836806 8872963
43451 8872963 10754557 14976933 19640389 21687922 20461372 17970094 16476145 16713217
43443 16713217 17820314 18171797 16645078 13730716 11262602 10717098 11813018 12819095
43435 12819095 12277029 10732016 10578473 13155417 15926690 14483722 8430824 2988313
43427 2988313 2372358 3625473 762045 -5997673 -9872162 -7044746 -1799128 138447
43419 138447 -649673 279086 3791854 6387799 5692096 2897496 -191616 -3316465 -6361551
43410 -6361551 -8270675 -8367797 -7310398 -6093091 -5076445 -4171603 -3091043 -1547555 -97554
43401 -97554 -298554 -2801850 -5792030 -6851629 -6089233 -5766383 -6875615 -7842672 -7042408
43392 -7042408 -5178410 -4478716 -6268752 -9561096 -11464799 -9350975 -3685079 1575081
43384 1575081 2690417 168151 -2107281 -1521471 976267 3097900 3873436 3541917 2346908
43375 2346908 435790 -1780592 -3770341 -4997320 -4927207 -3535124 -1567481 384286
43367 384286 2447286 4131520 3499113 -468711 -5339809 -7294067 -5526747 -2493965
43359 -2493965 -115202 1707752 2948038 2950629 2575343 3703324 5713881 5664750 3177341
43350 3177341 1624042 2635894 3161287 742823 -1859278 -1092627 1263751 897917 -2183229
43341 -2183229 -4501857 -5493216 -7630622 -10347729 -9483108 -4168018 719103 1379848 255090
43332 255090 1311075 3496083 2750555 -1288029 -4427385 -3436125 438351 3681208 4187639
43323 4187639 2340272 -95893 -1553892 -1839405 -2026591 -2960654 -4110736 -4247241 -2908894
43314 -2908894 -819661 870257 1542498 1658563 2478803 4898905 8601754 12627915 16263002
43305 16263002 18723535 18799713 16131277 12274355 8968398 5857974 1739394 -2515730
43297 -2515730 -4739734 -4987814 -5367573 -5971560 -4299445 -108766 2364508 -471421 -6332293
43288 -6332293 -9525896 -7427494 -2491494 1091620 1055131 -1526993 -3125379 -1328307
43280 -1328307 1589125 818203 -4125208 -7738122 -5857634 -1329266 868195 898387 1973184
43271 1973184 3601170 2620563 -172818 -384522 2789239 5268134 4888254 4217199 5080908
43262 5080908 5403082 3739339 2286180 2653702 2874773 1622638 1397636 4075984 6942614
43253 6942614 6945712 5558538 5281171 4502384 743892 -3512098 -3749602 -706049 799726
43244 799726 -341913 -465846 1948795 3714776 2477012 57731 -1393127 -2392357 -3386568
43235 -3386568 -2936013 -954523 -356526 -2854415 -5884831 -6250039 -4328013 -2162832 132633
43226 132633 3125433 5312668 4911587 3040296 2022653 1626151 153637 -1574797 -925618
43217 -925618 1848259 3142711 1219031 -1083274 -532906 1749599 1854479 -1664376 -6042304
43208 -6042304 -7645864 -5693159 -2372200 -124589 535304 615340 729197 348253 -911399
43199 -911399 -2092801 -1801716 -45435 1574983 1536857 -195361 -2374246 -3678217 -3762579
43190 -3762579 -3363009 -3231287 -2952469 -1417270 1235341 2972726 1978540 -1098871 -3895926
43181 -3895926 -4986141 -4835767 -4328346 -3476667 -1905705 165586 1908251 2575760 2048879
43172 2048879 887119 -181160 -999167 -2048140 -3596830 -5159949 -6167781 -6752774
43164 -6752774 -7298107 -7496502 -6512833 -4019153 -627226 2574156 4578009 4906611 4044103
43155 4044103 3210766 3231089 3803408 4166721 4009894 3304536 1933588 280556 -388929
43146 -388929 789789 2820032 3666957 2588862 923656 552678 2159713 4871064 7016026
43137 7016026 7403392 6381860 5379347 4979664 4144753 2136279 375995 977575 3741349
43128 3741349 6071349 5986846 4030135 2024777 1028296 818175 600658 -43436 -539143
43119 -539143 76548 1491825 1920882 542266 -890489 -397807 1273919 2130389 2491438
43110 2491438 4246641 6771263 6887244 3680881 239807 -832778 -736575 -1365943 -1628075
43101 -1628075 358769 3380402 4636709 4103426 4364937 6541248 9143544 10831085
43093 10831085 11575258 10837653 7375839 1918445 -2197614 -2622637 -868818 -171147 -1426657
43084 -1426657 -2715394 -2400510 -1220930 -955299 -1926408 -2647363 -1875237 -306867 350141
43075 350141 -261256 -554655 982709 3846962 5990539 5755947 3102047 -425567 -2613152
43066 -2613152 -2258944 -475911 364951 -526726 -1387834 -360330 1955459 3219601 1953995
43057 1953995 -1254348 -4412165 -5365799 -3340658 -50987 1617152 803921 -421601
43049 -421601 -36685 1431082 2356093 2372607 1824439 390123 -1874329 -3324955 -2477088
43040 -2477088 43288 2921609 5992135 8631509 8314150 3899426 -1155909 -2641924
43032 -2641924 -1758563 -3295203 -8022322 -11600943 -11683035 -11098358 -12008407 -11582053 -6945633
43023 -6945633 -1054077 553987 -2755889 -6147062 -5702520 -2523962 -392875 -1338896
43015 -1338896 -3930407 -5119786 -3700822 -1732997 -1582212 -2177108 -572767 2833495
43007 2833495 4033301 1479583 -1110049 -238842 2227810 2313507 -286552 -2936664 -4420391
42998 -4420391 -5089422 -4445320 -2255853 -648294 -1259800 -1534418 1914338 7087102 8504470
42989 8504470 5369106 2877957 4270894 6325683 5074464 2022187 1422532 3948421
42981 3948421 6412211 6474488 4847963 3386422 3089373 3819535 4601039 4366618 3267618
42972 3267618 2840095 4193272 6520718 7969411 7539649 5780491 4038032 3105103 2239287
42963 2239287 -8831 -3246800 -4463509 -1419884 3837358 6915526 6242942 4076486
42955 4076486 2510846 1169448 -672837 -2386701 -3491531 -4642385 -6028101 -6720108
42947 -6720108 -6425404 -5828172 -4641404 -1960476 736222 337320 -2609444 -3052257 1481152
42938 1481152 6411126 6344058 2896523 1754893 3838426 4599395 1667629 -1953558 -3191243
42929 -3191243 -2870576 -2583093 -1337596 2100751 6089855 7983026 7592202 6574812 5535532
42920 5535532 3852424 1653935 -55728 -1042055 -1927938 -2574625 -1895457 232226 2068210
42911 2068210 1893442 113421 -1505248 -2314277 -3142641 -3950539 -2812364 1364591 6280183
42902 6280183 8531427 8058645 7917205 9498922 10760474 10102039 9030785 9097731 8944684
42893 8944684 7109342 5432652 6195042 7518097 5707118 1477355 -475323 1564578
42885 1564578 3946500 3362803 1142933 34749 54807 -24181 268138 1752890 3162642
42876 3162642 2758064 1149113 162269 18164 -92919 266285 1918836 3639525 3252841
42867 3252841 1018804 -506772 -102636 936819 1558400 2472194 4006264 4601861 3014323
42858 3014323 638037 215 1646474 3840886 4811867 4028762 1690281 -1521951 -4040436
42849 -4040436 -4156773 -1847793 1007117 2870527 4195496 6019129 7787168 8023985
42841 8023985 6810142 5846067 5813754 5510001 4384168 4025050 5602439 7495047 7612182
42832 7612182 6787554 7123305 7719195 5449720 299997 -3530709 -3169098 -693179 586965
42823 586965 624255 932953 935996 -657573 -2492145 -2229982 -695684 -622861 -1556596 -19485
42813 -19485 4584418 8147897 7520838 4526015 2125793 -224302 -4240877 -8238096 -8848618
42804 -8848618 -6345461 -4404315 -4504369 -4092102 -1187689 2321346 3678323 3203776 3172668
42795 3172668 4299761 5506664 6320277 7387565 8788407 9579379 9240787 8347467 7555001
42786 7555001 6833327 5868247 4506399 2807186 1300739 947131 2044081 3592182 4834165
42777 4834165 6886232 11116525 16050248 18128717 16292221 13727082 13712409 15609362
42769 15609362 17021692 18578321 23718450 33527742 43949056 49102825 46485333 38524482
42761 38524482 29860803 23456832 18824905 13856269 8382869 5007910 5545421 7750849
42753 7750849 7517702 4045565 741371 636947 2949656 5143653 6589282 8490258
42745 8490258 11122377 12974842 12743763 11074777 9866475 10137618 10811977 9795252 6453943
42736 6453943 2721028 1178154 2249063 3997739 4488753 3437092 1694865 287790
42728 287790 74057 1197292 2632096 3333160 3928180 5924390 9002046 10733189 9679203
42719 9679203 7211373 5263606 3748962 1617084 -622118 -1154061 680784 3498396
42711 3498396 5480786 6093712 6149880 6529856 6862954 5716948 2568451 -968979 -3004516
42702 -3004516 -3878666 -5029511 -5802343 -4074606 -396352 1660424 677163 -155141 1987576
42693 1987576 4858158 4454061 995790 -1873514 -2544888 -2465198 -2352269 -1098023 1346763
42684 1346763 3263900 4011169 4876604 6396356 7216933 6350298 4480949 2547147 1085102
42675 1085102 1171038 3485620 6004768 5436107 1853195 -916082 -735563 -9193 -1186076
42666 -1186076 -2253942 433619 6647163 12526163 15337237 15444914 14313097 13110843
42658 13110843 13001895 14424796 15931330 15640185 13902470 12647816 12033278 10005508
42650 10005508 5935895 2501068 2295824 3983167 3881825 883691 -2307168 -3128656
42642 -3128656 -2319992 -1913822 -1731702 -152186 2216568 2434041 -347066 -2728759 -1147885
42633 -1147885 3446951 7018369 7441864 5958784 4532636 4231448 5777096 9018190
42625 9018190 11811602 12076416 11285879 13201568 18563379 24032784 27540416 31462206
42617 31462206 38318763 46035253 50358304 50128387 47134356 42093673 34254045 24757587
42609 24757587 17143525 13555377 12471918 11106736 8693593 6678837 6626520 8492027
42601 8492027 10451499 10378350 7993946 5267520 4043365 3846949 3075524 1797598 1810955
42592 1810955 3837065 6093910 6299084 4273181 1923647 1059008 1775410 2962607 3888677
42583 3888677 4632116 4871549 3421728 231410 -1992831 -397739 3620652 5122644
42575 5122644 1855348 -2469103 -2920672 500664 3810661 4793769 4969596 6134968 7605686
42566 7605686 7547732 5364381 2068096 -780389 -2203097 -2476427 -2592343 -2774010 -2339477
42557 -2339477 -1448360 -1401300 -2113104 -1272574 1916639 4019953 1454488 -3815932 -6219112
42548 -6219112 -4002725 -1121278 -1135659 -2719217 -2635601 -236370 2878757 5382332 6431944
42539 6431944 5200741 2214607 -155736 -308911 573604 615649 72883 338443 1242863
42530 1242863 1361800 414563 -521363 -884801 -1019592 -838275 246446 1891290 2758272
42521 2758272 2267764 1298926 744703 375068 -310909 -942726 -791142 -10875 444171
42512 444171 161122 -115879 476409 1656564 2261454 1654758 377700 -602106 -757948
42503 -757948 -115504 769641 850252 -364313 -1433164 6378 3949160 7104675 6686292
42494 6686292 3837111 1347670 -755010 -4299223 -8002923 -7255306 -487754 7156148
42486 7156148 9181125 5237523 657426 -604442 401883 1330944 2897533 7372443
42478 7372443 14083874 19318928 21455877 23857771 30224785 37954308 39458355 31244083
42470 31244083 18917060 10833849 8808983 8172925 5609952 2798251 2068300 2540528
42462 2540528 2324545 1561362 1120803 500058 -700255 -896251 1476546 5123052 7250632
42453 7250632 7104213 6166042 5374836 4269724 2880582 2408919 3246744 3644656 1503156
42444 1503156 -2815073 -6283917 -6173138 -2957471 270650 1280944 615771 -427029
42436 -427029 -2147732 -5062229 -7305967 -6051294 -1476801 3102690 5362686 5915103
42428 5915103 5880210 5262919 4496518 4755200 5533481 4688622 2253434 1165481 2380378
42419 2380378 2572860 -610917 -4143627 -3962520 -1136873 360717 46742 544357 2049677
42410 2049677 2099446 685204 777043 2950055 3856912 1561057 -1390555 -2210391 -2019053
42401 -2019053 -3338756 -5748027 -6599338 -4844322 -2112077 -535358 -715039 -1435149 -946254
42392 -946254 878998 1940698 731859 -791779 625789 4603473 7054126 5646982
42384 5646982 2643915 1235139 1678490 2565799 3464459 4395431 4728412 4553647 5323375
42375 5323375 7214308 7813300 5691815 3346857 3745030 5511213 4932019 1874188 33505
42366 33505 1240543 3058583 2920284 1541113 787079 804569 1130086 2411434 4657958
42357 4657958 5418491 2566312 -1747991 -2824650 587547 4598880 5523154 4632896 5612042
42348 5612042 8772961 10556028 8685695 5183583 3140092 2471606 817601 -2343292
42340 -2343292 -4746737 -4705032 -3603012 -4083773 -6711655 -9463571 -10177393 -8665404 -6386215
42331 -6386215 -4648277 -3499663 -2205632 -389311 1554031 2958252 3394751 2785531
42323 2785531 1562931 725207 1009819 1804216 1678375 369263 -663340 -253572 848690
42314 848690 1260042 995827 1046566 1565840 1821385 1632480 1568795 1812429 1915246 1613783
42304 1613783 957803 -129955 -1452063 -2073909 -1407381 -371739 -172805 -317629 571942
42295 571942 2170048 2490002 745374 -1502084 -2483884 -2036379 -868919 443348 1164756
42286 1164756 600123 -605789 -628878 1251507 3596040 4725541 4602248 4098988 3590293
42277 3590293 3227496 3583485 4836252 5877644 5266698 2911623 339106 -433501 1699766
42268 1699766 5754513 8654268 7655038 3589850 735938 2370131 6982017 9940099
42260 9940099 8704475 5412839 4121952 6286497 9704508 11729655 12342097 13097089
42252 13097089 13947086 13188308 10714275 8868768 8887633 8904061 7471129 6716764 9033949
42243 9033949 12481804 13191329 11222835 9893997 9785536 8076039 4320739 2051461
42235 2051461 2992252 4124856 2930681 1613950 3072597 5959155 7143896 6477567
42227 6477567 5675901 4713234 2946057 2019762 3819367 6669654 7325683 6127424 6551669
42218 6551669 9707262 12614580 12397836 9392417 5492204 1852488 -933524 -2313534
42210 -2313534 -2416126 -2097460 -1910521 -1880410 -2193150 -3008035 -3670119 -3139782 -1190583
42201 -1190583 1429757 3630720 4360313 3356862 2203105 3362380 7192904 11196708
42193 11196708 13148926 13333708 12624803 10583487 7332539 5187300 5894900 7776623
42185 7776623 8044427 6531499 4742507 2847621 413435 -1372524 -1248318 -343362 12347
42176 12347 1540800 6459314 12742509 15908619 15034515 13117584 11821490 10031597 7722527
42167 7722527 6876874 7628143 7407185 5234917 3472181 3918123 5153690 5127839 3863492
42158 3863492 2582422 2429504 4466185 8319335 10773928 8889327 4645528 2919389
42150 2919389 4683219 6353105 6232844 6574756 7965304 7124703 2902935 -498480 350059
42141 350059 3059967 4030200 3958503 4749345 4854256 2472922 244182 1662597 5197066
42132 5197066 6952024 7094999 8449101 10424649 9970593 7601920 6766510 7453648 6146899
42123 6146899 2631327 1172589 3496507 5852503 5240569 3866878 4620354 6158475
42115 6158475 5797481 4102370 3094921 2300686 133922 -2434415 -2998733 -1491892 199113
42106 199113 1592064 3560164 5382515 5023432 2675706 1187582 2099339 3604480 3535927
42097 3535927 2297270 1442702 1129852 676864 246242 98559 -695518 -2651364 -3788792
42088 -3788792 -1621360 3085522 7137893 9464244 11805757 14311434 14102509 10194538
42080 10194538 6506216 6795264 9015490 8385606 4395567 756850 -586305 -1066690
42072 -1066690 -1415157 -507516 1056683 531878 -2373659 -4160734 -2423246 1213843 4428880
42063 4428880 6848779 7708431 5044176 -5663 -1966439 2200136 8073788 9389471
42055 9389471 6097797 2674685 724127 -1704393 -4583107 -4993453 -2148246 1071874
42047 1071874 2659529 3987942 6426295 8361153 7349996 3539600 -328236 -1362516
42039 -1362516 1366397 6065423 9504702 10020849 8873320 7805992 6551999 4333541
42031 4333541 2298813 2024831 2703186 2508457 1891116 2637909 4442428 5611612 6549247
42022 6549247 8819032 10910164 9172120 3795727 -248993 105346 2083255 1960104
42014 1960104 503083 580075 1941761 1915519 8070 -1404015 -556417 2131278 5795459
42005 5795459 9958309 13164081 12931908 8398526 2056249 -2344418 -3374560 -2522434
41997 -2522434 -1353626 494379 3480017 5578130 3966991 -548228 -3526452 -2726085
41989 -2726085 -1458602 -3684943 -7805084 -8800291 -5619355 -2539006 -2819197 -4609805
41981 -4609805 -4555699 -2602744 -1153450 -1170958 -1152903 650425 4203615 7554300 8355127
41972 8355127 6124576 3044114 1678324 2080586 2259073 1207360 -1054 -46734 1164723
41963 1164723 2782885 3383091 1423441 -2926617 -6646381 -6413246 -2238881 3020926
41955 3020926 7183761 9682036 9802787 7028601 3165298 1139403 1225920 1172652 283996
41946 283996 187440 990467 287498 -2634925 -4972818 -4628641 -3219722 -2745488 -2091744
41937 -2091744 545083 4004451 5669825 5072759 3674201 2452380 1748552 2029358 2756216
41928 2756216 1956445 -1015370 -3734929 -3847298 -2478802 -2158834 -2706522 -1975781 113016
41919 113016 1234864 388327 -503085 716390 3810990 6763032 7915237 7181094 5833811
41910 5833811 5190795 5154246 4381133 2171766 -498328 -2217565 -2622137 -2277597 -1949859
41901 -1949859 -2211079 -2671843 -1560724 2295727 6809790 8018740 4925068 845561
41893 845561 -1215054 -2287272 -4691662 -7528115 -7603064 -4207030 -541336 81847 -1859473
41884 -1859473 -2734402 -88006 4209633 5992857 4063448 1655128 1482466 1768587 43545
41875 43545 -1416255 1338588 6392648 7213863 2257272 -2235871 -1067512 3369673 6098643
41866 6098643 6354133 5920395 4881959 3031296 2138543 2911232 2691045 -113262 -2419694
41857 -2419694 -1242809 1084821 884429 -592958 196575 2522134 2672588 284752 -1572725
41848 -1572725 -1601579 -1117964 -694940 -12280 172659 -267874 1053141 5097851 7844566
41839 7844566 5543057 1256027 507506 2446878 1888652 -1228923 -1797637 1134377 2402987
41830 2402987 -718444 -4718902 -6295894 -6419547 -6077765 -3993667 -890548 -276474 -2278036
41821 -2278036 -2097534 2389506 6605230 6176845 3203128 2002744 2768810 3297670 3493512
41812 3493512 4213283 4346658 2614289 196769 -1189264 -1736651 -1905786 -870875 1228751
41803 1228751 2148406 885983 -379524 236415 1495866 1598051 883752 210994 -545298
41794 -545298 -785247 868089 3382863 3638737 1511193 567098 1894273 2010784 -578101
41785 -578101 -2040574 -77516 1169538 -2005702 -5734944 -4298817 439821 1733615
41777 1733615 -2045147 -6309453 -7979844 -8350448 -8433561 -6803013 -2912441 1339200 4115402
41768 4115402 5042808 4254793 2492701 1526046 2156372 2854810 2522333 2794377 5023866
41759 5023866 7121141 6495399 4041009 1930269 -239928 -3408068 -5567528 -4596111
41751 -4596111 -2484872 -2290133 -2856538 -1304373 1210812 1502549 447549 1357388 3453390
41742 3453390 2999746 308590 -576437 959408 1578759 921268 2434326 6148129 7215693
41733 7215693 3751235 80788 -383824 114067 -1034410 -2148549 -1405531 -865811 -2392726
41724 -2392726 -3492995 -1256440 2719407 5064121 5504435 5523840 4794972 2503233 62318
41715 62318 -818242 -954924 -1740520 -2400888 -2017438 -2101994 -4010455 -5764530 -4844373 -2569006
41705 -2569006 -2185683 -3659409 -3801183 -1112568 2511344 4775557 5224754 4628999 4167808
41696 4167808 4954936 6652529 7143730 5297310 3196552 3577556 5783131 6564081 4623847
41687 4623847 2156386 1684092 3169211 4720235 4973796 4348230 4412480 5908546 7343563
41678 7343563 6549335 3954427 2615790 3964261 5369942 3725534 -116976 -2780866
41670 -2780866 -3092022 -2681812 -2357567 -789165 2655392 6184969 7867408 8046611 8247708
41661 8247708 8686953 8115388 5771585 2584941 432920 600147 2793944 5201791 5590895
41652 5590895 3075178 -643628 -2193182 339345 5037994 7849941 6953956 4288760
41644 4288760 2236242 581325 -1688029 -3286448 -2074537 1073539 2821993 2026498
41636 2026498 1089030 1947648 3364070 3555394 3225435 3952120 4958791 3716651 -379324
41627 -379324 -4353713 -4207318 919528 7230245 9599131 6954411 3354456 2764405 4358426
41618 4358426 4979534 4561159 5776520 9032116 11585114 11836436 10885295 9283703 6001808
41609 6001808 1626194 -1213296 -2076055 -3620511 -6489868 -7228995 -3868097 139582
41601 139582 873956 -272382 504947 3205065 4704717 4029185 3051301 2781048 2374220
41592 2374220 1489456 910607 1034855 1644830 2518431 2839656 1486138 -534151 -134586
41583 -134586 3192332 5348216 3328042 458298 1845278 6288514 7497663 3055897
41575 3055897 -2284698 -3017485 919656 5460245 7244750 5923253 3403962 1838786
41567 1838786 1653954 1533514 625048 -428668 -1266162 -2573192 -3870091 -3133301 -538644
41558 -538644 366335 -2049342 -4092292 -2158235 1406827 2198586 829643 993221 2643214
41549 2643214 2960654 2720524 5333168 9920793 11721296 9810299 8229811 8497640 7208997
41540 7208997 2777185 -1343561 -2393494 -1858493 -1021158 1561097 5401331 6362868 3097116
41531 3097116 346015 2012237 5293265 5627974 3371163 1395568 -104933 -1962153
41523 -1962153 -2601438 -824762 986343 861912 1285738 4457529 6749880 3699489 -1877134
41514 -1877134 -3134335 705444 3869490 3278124 1936439 2416268 2996761 2181219 1933617
41505 1933617 3741567 5285247 3797036 101013 -2918983 -3805870 -2840399 -878217
41497 -878217 644405 355268 -1128310 -1582214 -456818 84682 -1483824 -3478409 -3142669
41488 -3142669 -27974 3836489 5957694 4810750 693759 -3910931 -6044650 -5127028
41480 -5127028 -3018695 -969575 1657006 4896956 6644275 5321841 2529664 1003835
41472 1003835 892021 138933 -1883965 -3295937 -2527460 -409665 1348619 2387248 3165851
41463 3165851 3083456 904735 -2701749 -4694355 -3050953 135386 638332 -2759978 -6724633
41454 -6724633 -7603756 -5743997 -4359636 -5097198 -6280248 -5311310 -1584406 3035067 5808192
41445 5808192 5236718 2268819 -575384 -1574049 -1023219 -53870 779261 1199039 678923
41436 678923 -689987 -1682394 -1494760 -1095590 -1799082 -3210112 -3919713 -3490476 -2157244
41427 -2157244 730181 5816642 11288699 13391339 10198891 3770143 -1835695 -3795565
41419 -3795565 -1895159 1885778 4775332 5375848 4971002 5963854 8892495 11821494 12673237
41410 12673237 11144447 8265171 5208222 2856127 1597658 1102457 784864 531030
41402 531030 538793 836230 1602067 3195688 4765052 3849466 -594448 -5224849 -4934060
41393 -4934060 976882 7379363 8999046 5657017 805279 -3063724 -5533996 -6211965
41385 -6211965 -4324403 -623672 2268117 2441280 810212 -150502 589014 1575069 837755
41376 837755 -1724994 -4358856 -5499620 -5113793 -4041827 -2903581 -2078211 -2011394 -2821058
41367 -2821058 -3950001 -4670660 -4574634 -3411875 -1256471 876678 1696625 1461693 1843494
41358 1843494 3201663 3576756 1655315 -895884 -1808728 -1403478 -1208314 -729796 1681901
41349 1681901 5524126 8502114 9813630 10399762 10323794 8851840 6920424 6232618 5784328
41340 5784328 2951548 -1278086 -2137179 2161555 7085870 7563938 4102874 552723
41332 552723 -1440284 -2576690 -2756971 -1555782 -718197 -2552987 -6021578 -7519494 -5871967
41323 -5871967 -3916654 -4307216 -5768634 -4806659 -222985 5137282 7209164 5014522
41315 5014522 1659504 478288 881963 -310730 -3701945 -6066468 -5078332 -2573001
41307 -2573001 -1301590 -798950 964638 3458262 4000223 1630302 -1768544 -3834231
41299 -3834231 -3439987 -752061 2629932 4322058 3644656 2626161 3049281 3954687 3983013
41290 3983013 4318404 6517982 9071592 9564900 9024826 10120089 11687641 9549557 3194127
41281 3194127 -2638048 -4150217 -2458439 -132957 2270467 4313130 4081090 1244860
41273 1244860 -1155969 -734624 861144 1217415 1288389 3050294 5081034 4263647 895312
41264 895312 -1526967 -1416066 -804946 -1613021 -2834264 -2188821 1158673 5921746 9395503
41255 9395503 9030902 4972841 890181 494051 3229029 5197589 4343876 2609715 2481735
41246 2481735 3554690 3761135 2540683 1295703 1315658 2364330 3165329 2723659 1309520
41237 1309520 354358 1121223 3386009 5656313 6555545 5718250 3741592 1800774 851022
41228 851022 507359 -768735 -3533870 -6082941 -6484195 -5257315 -4449514 -4454273 -3694280
41219 -3694280 -1562777 342124 569210 -284519 -820350 -531884 503214 2105432 3227487
41210 3227487 2249346 -665656 -2790768 -1874366 1000362 2960442 2815496 1527233 88002
41201 88002 -1364773 -2819317 -4321454 -6193476 -7925579 -7620997 -4425637 -877734 -456333
41192 -456333 -2885229 -4408358 -3101671 -1200072 -1096251 -1719611 -864719 947625 1461297
41183 1461297 337400 -757444 -1215939 -2201137 -4191158 -5913814 -6196423 -5174487 -3164951
41174 -3164951 -45183 3395284 5046436 3794999 1307849 66163 128934 -647619 -3220833
41165 -3220833 -5781150 -6243802 -5027687 -3959343 -3106103 -759425 2997983 4930281
41157 4930281 2697792 -1230649 -2481491 -1070467 -1424158 -5430058 -9086403 -8229526
41149 -8229526 -4430721 -1941724 -1329058 -413511 203420 -2022830 -5332513 -4092081 2664715
41140 2664715 8273520 7181785 2489345 870828 3336294 5628780 5452443 4294495
41132 4294495 3301334 2317212 2590450 5529831 8524302 6903964 1077850 -3040003 -2410584
41123 -2410584 -950818 -2626200 -5029770 -3914206 -693844 -380775 -3706451 -6297235
41115 -6297235 -5541295 -3885043 -4266382 -5586325 -4464265 249404 6003266 8854927
41107 8854927 7074770 3217598 2041564 5131827 8485820 7252766 1935155 -2588107
41099 -2588107 -3560639 -2800272 -2644503 -2827975 -2374804 -1571357 -586822 1199018 2832631
41090 2832631 1441539 -3479203 -7757334 -7299295 -3450257 -655879 -96883 950522
41082 950522 3894693 6510262 6522536 4709717 3200796 2609940 2092933 967019 -698030
41073 -698030 -2216874 -2463270 -735549 2293222 5301759 7792776 9585282 9265104 5359514
41064 5359514 -460721 -3594796 -1293367 4153363 8111678 8211654 5330448 1647488
41056 1647488 -701705 -374793 1763428 2628839 188572 -3524034 -4366589 -1083930 3202883
41047 3202883 4885925 3981139 3514574 5326188 7432728 6198862 1096313 -3792441
41039 -3792441 -4185375 -782112 1888739 1508621 153635 -94167 -446991 -2463696 -4824624
41030 -4824624 -5870716 -6827979 -9052135 -10268973 -7844380 -4237735 -4172481 -7012844 -7484589
41021 -7484589 -4362427 -2468924 -4279251 -5580974 -2867684 404828 -212810 -2259906
41013 -2259906 -358727 4616712 6737155 4316086 1820518 2147978 2689100 744108
41005 744108 -1820056 -1840222 463161 2513326 2863098 1742449 -21959 -1038547 31891
40996 31891 2465705 3528785 1700004 -1527129 -3906518 -4861719 -4736975 -3441851 -1116222
40987 -1116222 1308581 3323402 5229122 6475145 5407722 1834335 -1987704 -4321385
40979 -4321385 -6077606 -8289091 -9307690 -6908795 -2158855 1133945 520460 -3067947
40971 -3067947 -6795224 -8014935 -5746415 -1747445 437466 -1014698 -4124244 -5613023
40963 -5613023 -4504759 -2009324 702782 2704848 2696574 687470 -643035 1022737 3861298
40954 3861298 4049473 1359325 -602927 6593 832803 -449756 -2614377 -3387176 -2951840
40945 -2951840 -2779520 -2797718 -1982397 -569075 401787 971943 1916552 3086361 3650926
40936 3650926 3528220 3221046 2705581 1738802 748814 153909 -622922 -2039007 -2905780
40927 -2905780 -1782692 246674 205135 -2740837 -5515774 -4607721 -416815 3127303 3049499
40918 3049499 356516 -1671611 -1420910 -398863 -897430 -3105236 -5107758 -5198344 -3353918
40909 -3353918 -765131 1021179 662521 -1834103 -4238575 -3896537 -1072120 1076690
40901 1076690 859420 573732 2865624 6214016 6849291 4464332 2763744 3904944 5548484
40892 5548484 4866555 2744882 1675329 1435388 -182885 -3191003 -4931939 -3948987 -1852000
40883 -1852000 -731556 -845153 -1682848 -3204910 -4670339 -4157442 -1248467 1139212 -59259
40874 -59259 -3734380 -5926573 -5306424 -4699553 -6535879 -9266284 -9715628 -7187307 -3663424
40865 -3663424 -1303650 -1206898 -3238223 -5356648 -4462757 -31205 4173731 4364799 1825771
40856 1825771 1023490 3281996 5693345 6444755 7481755 10539479 13819875 14683163 13047742
40847 13047742 9960174 5282250 -531576 -4505021 -4258570 -1808649 -1128548 -2751282
40839 -2751282 -3846188 -3042541 -1903571 -1665132 -1703943 -1682145 -2288392 -3117867 -2462092
40830 -2462092 -94391 2107674 3147211 4168576 5888068 7199791 7378764 7236800
40822 7236800 6895780 4929403 1207296 -1881090 -2774524 -2912726 -3697191 -3859965 -2244963
40813 -2244963 -715409 -1324199 -2684784 -2411142 -1313405 -1529150 -2109481 -799432 685025
40804 685025 -1962875 -8586824 -13426476 -12358628 -7521126 -3221338 -806825 431036
40796 431036 540394 -207845 11742 2427088 5617271 7459859 7566267 6213906 2903988
40787 2903988 -1891550 -5374140 -5323980 -3148198 -1770415 -1638922 -1148443 47630 753668
40778 753668 664412 570677 339028 -1054549 -3403068 -5022936 -4697357 -2491542 898786
40769 898786 4029859 4687981 2094901 -1280102 -2274279 -1124380 -804105 -2532939 -4443248
40760 -4443248 -4777850 -3778208 -1948220 924144 4150450 5943504 5883641 5423012 4947860
40751 4947860 2713802 -1887160 -6277238 -7775883 -6945580 -6034494 -5763799 -5643061 -5878769
40742 -5878769 -6578831 -6184328 -3226754 906664 3270780 3127400 2275660 1825936 926388
40733 926388 -986162 -2714079 -2813411 -1132119 1718642 5052476 7632645 7844016 5388432
40724 5388432 2122340 366408 704107 1896007 2559725 2468188 2421910 3226157 4828669
40715 4828669 6401489 7165548 6855969 5435971 3052545 599131 -499792 175999 1298499
40706 1298499 1401738 727946 573085 1307097 2175777 2755539 3321079 3727411 3121994
40697 3121994 1155665 -1300361 -2991197 -3364877 -2737312 -1821642 -1132294 -597761 75781
40688 75781 620179 440047 -252404 -688791 -1296529 -3448804 -6427631 -6808660 -3054585
40679 -3054585 1167311 1352915 -1457932 -2465089 -669488 -84191 -2690487 -4946183
40671 -4946183 -3527959 -409577 960969 1121988 2338859 3536357 2067761 -942746
40663 -942746 -1764278 -128714 428848 -1377846 -2664883 -1680287 -784432 -1999071 -3215638
40654 -3215638 -1757344 1021964 1990015 1179604 1021703 1805513 1562743 281550 666007
40645 666007 3800958 6937816 7105331 4863235 2832352 2057423 1615956 756712 -494001
40636 -494001 -2366916 -5200029 -8284898 -10320305 -11053453 -11068119 -9928219 -6371461 -1004130
40627 -1004130 3065537 3746623 2809285 3432758 5786733 7126856 5935104 3703479 2330321
40618 2330321 1945885 2087240 2890793 3776298 2843728 -488780 -3544892 -3202871 96165
40609 96165 3117740 3982682 3438517 2441289 940295 -740863 -1655252 -1944351 -2688217
40600 -2688217 -3388879 -1889531 2029261 5128726 4482756 1135539 -1729671 -2788676
40592 -2788676 -2799876 -2112182 -288594 2327019 4678176 6325177 7109131 6158863 3172003
40583 3172003 158345 -293533 1610343 3208048 2964739 1704871 460780 -596710
40575 -596710 -1048597 -480452 3280 -859000 -1406205 1486483 7115416 10601110 9274418
40566 9274418 5858935 3300603 376084 -4305676 -7651329 -6149787 -2160432 -933833
40558 -933833 -2668592 -2901454 -410692 820634 -1691130 -5409399 -7509669 -8479232 -8994103
40549 -8994103 -7619113 -4268363 -2080498 -2873918 -4155713 -3658110 -3298074 -4979595 -5914884
40540 -5914884 -2806236 1935129 3409756 1963092 2055188 4102290 3473510 -1470600 -5859722
40531 -5859722 -5075936 -784653 2378137 2767013 1616360 -324539 -2935540 -4999323
40523 -4999323 -5012527 -3220486 -1391362 -1242221 -3722598 -8296287 -12044014 -11445664 -6534257
40514 -6534257 -1591572 -174792 -1140144 -1314325 -237775 269220 34486 1026429 3888713
40505 3888713 6405870 6232510 3750316 1375388 672364 853076 247939 -1040292 -902127
40496 -902127 1583598 3884365 3038089 409205 460696 4295682 7696376 7100516 4346655
40487 4346655 3101052 3462796 3294800 2538548 2336074 1418782 -2375485 -7505485 -9651465
40478 -9651465 -7379591 -3413019 -170116 2311716 3654496 2399065 -682545 -2086312
40470 -2086312 -138082 2924602 4959256 6708843 8599739 8340390 4907738 2009915
40462 2009915 3531371 7327058 7862629 4269189 1398408 2499608 4950248 4805129
40454 4805129 2293941 439125 401613 914799 1316730 2483540 4609731 6091733 5475809
40445 5475809 3354978 1385303 128432 -992579 -1826381 -1000467 1985302 5144838
40437 5144838 5830239 4040807 2617675 3685123 5921527 6241365 3632604 265666
40429 265666 -1265135 -902862 -677756 -1625073 -2181651 -348334 3176568 5427959 4944485
40420 4944485 3587948 3685175 4775055 4797540 3521072 2742449 3424959 4615818 5195991
40411 5195991 4897289 3594618 1479365 -54127 242658 1228177 860921 -46996 1308576
40402 1308576 4477923 5084018 1190357 -3223599 -3885755 -2158203 -1850261 -2822140 -2166990
40393 -2166990 -95242 165765 -2117921 -4236304 -4700742 -4621034 -4012230 -1219921 2698465
40384 2698465 3392873 -695632 -5255189 -5768222 -3294175 -1765539 -2129982 -2495785 -2260089
40375 -2260089 -2602136 -3714542 -4455293 -4261659 -3140015 -605677 3006088 5198164 4068062
40366 4068062 1633871 1361541 2920925 2909702 744921 -267906 1165816 1523979 -1917225
40357 -1917225 -6052795 -6116007 -2704573 -548695 -1179648 -1203737 1466192 3709261 1814137
40348 1814137 -2700322 -4894140 -2784421 1057999 3949427 6007116 7693415 7267610
40340 7267610 3136094 -2600511 -5792698 -5527813 -5353255 -8261926 -12346232 -13106752 -9090497
40331 -9090497 -3459430 -189739 -241718 -1735154 -2663035 -2667038 -2597071 -2966963 -3112339 -2050724
40321 -2050724 -26028 1514637 1741835 1347291 1097748 704086 256386 1399098 4948930
40312 4948930 8186129 7372545 3080483 -9397 502293 1778031 1064708 649697 3901155
40303 3901155 8555055 8769955 3659012 -987310 -830937 1449314 1369428 -190799 801100
40294 801100 4070178 4674252 407159 -4603572 -5380289 -2135617 1354297 3024808 3315029
40285 3315029 2217720 -906324 -4540856 -5352014 -2643109 -78044 -1124510 -4490507
40277 -4490507 -6234391 -5178665 -3598738 -2991554 -2142229 -118337 1464161 836019 -1082756
40268 -1082756 -2175578 -2209698 -2296779 -2068998 149097 4243194 7554717 7962568 6206415
40259 6206415 4432703 3757592 4064954 4964212 5798318 5471630 3437942 662344 -1043290
40250 -1043290 -480364 2256582 5818031 7963639 6855040 2865443 -1359024 -3295798
40242 -3295798 -2680738 -1029266 137592 96964 -1029170 -2098340 -1566896 686321 2686524
40233 2686524 2507773 695103 -380606 711188 3129528 4907069 4789890 3288073
40225 3288073 2320656 3202646 4697222 4198764 1359234 -1059521 -951602 386988 919815
40216 919815 1283996 2960667 4544957 3105742 -1311190 -5642009 -7972306 -8675964 -7745637
40207 -7745637 -4684035 -1306754 -634168 -1993414 -1262052 2449590 4592923 2121258
40199 2121258 -1470698 -1557025 684328 1100405 -294572 74262 3028964 5780180 6825889
40190 6825889 7162229 6641576 3563083 -1443914 -5088992 -5942948 -5816055 -5825210 -4807457
40181 -4807457 -2863450 -2672524 -5316170 -8037896 -8276468 -7000323 -5938451 -4577069
40173 -4577069 -2480050 -1583700 -2927399 -3611168 -692098 3823532 5783245 5169531 5304569
40164 5304569 6711427 6553652 4376365 3559624 5564104 6952814 4559033 324355
40156 324355 -1849881 -1595324 -1377952 -2069025 -2409514 -1966662 -1590554 -1231806 -93975
40147 -93975 936857 -265364 -3468854 -5284972 -3192034 1393822 5296200 7213537
40139 7213537 7718555 7196780 5955928 5515252 7246907 9659060 9395510 5693640 1785703
40130 1785703 623349 1060491 191225 -1899066 -2337834 -87319 2341741 2511004 1136574
40121 1136574 217361 -140460 -1172406 -2813486 -3656051 -3186117 -2250398 -1408389 -636254
40112 -636254 -765560 -3069510 -6564673 -7763668 -4800875 -399653 1340255 279617
40104 279617 -9417 2337173 4907786 4684857 2037840 -411721 -1155467 -221564 2291094
40095 2291094 5723975 7702215 6088665 2058658 -1138915 -2565892 -4085207 -6058098
40087 -6058098 -5875748 -2503877 595111 19239 -2231644 -1461480 2864366 6627819 6992285
40078 6992285 5081281 2513155 -711492 -3506728 -2674131 2815585 9132450 11974477
40070 11974477 11742120 11569380 11936495 10703445 7736440 5836153 6548886 7960627 7641764
40061 7641764 5552723 3008583 731701 -855951 -1074243 -113674 519002 -28604 -646345
40052 -646345 -207347 350368 -411558 -1655167 -1177825 1076775 2605920 2003138 1060828
40043 1060828 1997492 4141398 5269780 5463467 7262397 11529776 15222973 14786292 10645152
40034 10645152 6526790 4682678 3704741 1491371 -1440692 -2929941 -2430187 -1703978
40026 -1703978 -2411110 -4187122 -5250168 -4131867 -815755 3054470 5115937 4298960
40018 4298960 2020262 629019 707131 849035 -14397 -1558666 -3604415 -6802036 -10586267
40009 -10586267 -12132402 -9347030 -3974806 364850 2615739 4377202 5904276 5157591
40001 5157591 1742734 -1221190 -1170662 258276 100202 -1262045 -1244978 369860 1445307
39992 1445307 1613660 2767219 5030491 5808265 4015402 1961485 1351167 569831 -1803302
39983 -1803302 -3845024 -3730415 -3707459 -6720083 -10806768 -11288387 -7860572 -5013543 -5144898
39974 -5144898 -5660729 -4070566 -1819111 -971423 -570801 987725 2564967 2162016 379128
39965 379128 -731611 -865325 -932128 -571928 1031662 2691212 2454103 1040423 1305177
39956 1305177 4041539 6767548 7235767 5978688 4607890 3591887 2810298 2568122 2603395
39947 2603395 1398297 -1776133 -4849547 -4851971 -1800689 1028997 1267596 327727 875421
39938 875421 2634314 2846302 740551 -942166 92775 2469086 3819528 4770385 7248356
39929 7248356 9875602 8900126 4158297 408188 1115536 3989288 4902855 3633816 2859873
39920 2859873 3357303 3522391 2856647 2797285 3991953 5163804 5056389 3754066 1876300
39911 1876300 -35868 -1236176 -1234685 -646550 -535400 -1030048 -1449408 -1336566 -515878
39902 -515878 1052610 2492989 2349370 1157134 2200655 7492077 14091331 17041319
39894 17041319 15371281 12497000 10944756 9605916 6664563 2640837 -463763 -1316658
39886 -1316658 48294 2218893 2923577 1124521 -1443103 -2434953 -2159927 -2554177 -3414644
39877 -3414644 -2583426 -75475 1115484 -656291 -3274096 -4128777 -3504853 -3175928 -3508589
39868 -3508589 -3587892 -2934684 -1808792 -742908 -511157 -1559342 -3090686 -3820204 -3604846
39859 -3604846 -2915045 -1109041 2614010 6704778 8251401 6770056 4622969 3434478
39851 3434478 2624588 1683686 1055175 403388 -1040415 -2101696 -911127 1157638 617905
39842 617905 -2392353 -3716610 -1681780 466892 347016 122703 2135283 5190857 7747980
39833 7747980 10638809 14100891 16388539 17720756 20829672 25359466 27722934 29277670
39825 29277670 37209927 53503511 72591159 96349468 139075434 203449580 259752950
39818 259752950 268150177 222404373 156448327 105738969 76781394 58035054 43568514
39811 43568514 34728787 29623982 24078312 18622861 15629589 13306594 9555087 7369310
39803 7369310 9411115 11566940 9063910 4836370 4304145 5812319 4546919 2486520
39795 2486520 4977100 9381320 7311605 -1665430 -8228517 -6898654 -2560095 -680106
39787 -680106 427689 3159841 3943736 -807083 -7144654 -8452019 -4906960 -2315796
39779 -2315796 -3270654 -4839100 -4528613 -3779370 -4691513 -6615932 -7343619 -5883993 -3137052
39770 -3137052 -771948 166562 119283 508649 2087264 4180492 5725460 6212691 5349837
39761 5349837 3092039 729615 562327 3144600 5721283 4928672 851673 -2755744
39753 -2755744 -2364029 1905501 6696539 8670957 7296258 4763555 3323015 2896521
39745 2896521 1656343 -1195473 -3953875 -4072492 -964149 3146705 5108112 3641510
39737 3641510 457925 -1495427 -952933 796447 1843533 1603689 620136 -332098 -189367
39728 -189367 2033132 5506794 7339620 5718009 2418491 350840 -493990 -2207379
39720 -2207379 -4610582 -4865683 -2079231 593948 30942 -2726512 -4200282 -2903993
39712 -2903993 -308088 1539013 1548748 -560541 -3980936 -6271454 -4783938 381386 5473666
39703 5473666 6203014 2087500 -2865672 -4465577 -2850410 -1442438 -1710245 -1448502 676012
39694 676012 1799345 -968727 -5090364 -5454959 -2017097 -38122 -2115886 -4592363
39686 -4592363 -3779111 -1476193 -1178863 -2211793 -1631307 203247 195024 -2280047 -4555963
39677 -4555963 -4912733 -4345853 -3879660 -3000423 -1368733 179929 926725 809899 -428005
39668 -428005 -2729916 -4394668 -3506531 -976700 132076 -1120149 -2251873 -1271529 299814
39659 299814 -235535 -3030426 -5857172 -6864202 -5783649 -3256705 -288751 2054662
39651 2054662 3321089 3772307 3569128 2710760 2050930 2987425 5296253 6586480 5181761
39642 5181761 2568172 1526313 2464542 3150541 1872522 -600501 -2437797 -2969872 -2936988
39633 -2936988 -3129854 -3389634 -3013213 -2013349 -1633165 -3076242 -5791259 -7855277 -8327300
39624 -8327300 -8266711 -8849862 -9553143 -9308381 -8619235 -8938013 -10141048 -10255415 -8130715
39615 -8130715 -5111774 -3332539 -3284581 -3937810 -4510271 -4889646 -4572180 -2702316 177951
39606 177951 1579391 -353072 -4070546 -6012666 -5075725 -3995794 -5183956 -6838977
39598 -6838977 -5424204 -1183408 1713329 909059 -1150977 -1391984 -660627 -1613592 -3853330
39589 -3853330 -4409729 -2554594 -939328 -1449572 -2733356 -3017515 -2979337 -3950861 -4906077
39580 -4906077 -3529297 208310 3414658 3389077 241055 -3712026 -6269482 -6836650 -6154024
39571 -6154024 -4908522 -2852935 261872 3164926 3824031 2269457 1157954 2177527
39563 2177527 3182552 1053102 -3194951 -4825717 -1467273 3574199 5411078 3186721
39555 3186721 -112790 -2018955 -2424493 -1659313 595036 3674567 5168789 3361073
39547 3361073 -318823 -2636785 -2228308 -908792 -1088371 -2658275 -3133699 -754195 3252663
39538 3252663 5938045 5772728 3772028 1599669 -276183 -1978172 -3003549 -2957741 -2746090
39529 -2746090 -3302685 -3461717 -1222828 2533962 3939341 1002185 -3348356 -4833879
39521 -4833879 -2830635 338257 3621824 7613793 11133361 11026969 6600231 1573995
39513 1573995 -169088 1047183 2335026 2590212 2876528 3359520 2465488 -505477 -3695462
39504 -3695462 -4473771 -2164388 1434963 3776980 3612070 1714188 -162575 -930870 -645817
39495 -645817 156501 618252 -658114 -4262998 -7997140 -8291621 -4866980 -1977327 -2978423
39486 -2978423 -5376773 -4118674 1213688 5835497 6331363 4419167 3265285 3102194
39478 3102194 2281113 476655 -1234349 -2223245 -2536598 -2126843 -1118710 -47787 1105746
39469 1105746 3129127 5913043 7711406 7113411 4716494 1929736 -564514 -2039824
39461 -2039824 -1010899 2875163 7261617 9311822 8943280 8166118 7770957 6559896 3801778
39452 3801778 785031 -508787 541527 2538552 3033938 638233 -3347906 -6147076
39444 -6147076 -6722464 -6521473 -6515795 -5506974 -2689576 229029 1534680 2265566 4018726
39435 4018726 5763467 5750691 4929894 4928106 4088862 -3455 -4718199 -4329743 1472405
39426 1472405 6161902 5357181 2411217 2096598 3117366 1289143 -2789585 -4375488
39418 -4375488 -1947177 602082 -374372 -3717381 -5567430 -3901388 -37519 3110824
39410 3110824 3687193 2485702 1968158 3300273 4960723 4921607 3323465 2028093 2320913
39401 2320913 4055308 6273636 7656813 7150652 5151772 3343528 2625755 2270731 1816913
39392 1816913 2169626 3572102 4156898 2307091 -818043 -2935875 -3665033 -4018548 -3989472
39383 -3989472 -2785732 -760244 889964 1855510 2516489 2733609 2400432 2288033 2813364
39374 2813364 3189532 3341755 4761923 7239641 7068446 1957331 -4124711 -5338668 -2203722
39365 -2203722 -696355 -3356961 -6460306 -6943954 -6866754 -8545725 -9712355 -7040439 -1598690
39356 -1598690 2689313 4266664 4716604 5523420 6455737 6399519 4212474 -252363 -4869216
39347 -4869216 -6518024 -4807854 -2739715 -2482691 -2729720 -1790183 -666273 -660428 -331171
39338 -331171 2094964 5102627 6064468 5768777 7157002 10128483 11274211 9029725 5823218
39329 5823218 4334429 4374361 4471956 4197548 3739140 3090363 2777389 3664814 4905303
39320 4905303 3825734 -548881 -5144699 -5911517 -2734890 410012 143050 -3026179
39312 -3026179 -6414858 -8604704 -9949343 -10614188 -10011252 -8344603 -6895899 -5860346
39304 -5860346 -3582425 467973 3514802 2772315 -17546 -514822 1853084 3035779
39296 3035779 729065 -2163856 -2443402 -1460772 -1916441 -2627650 -563616 3467045 5458432
39287 5458432 4157229 2455205 2502408 2939478 1879538 -359356 -2680003 -4847944 -6443384
39278 -6443384 -6354640 -4712042 -3577635 -4394359 -6165672 -7199692 -7185517 -6534696 -5263297
39269 -5263297 -3809299 -3509357 -4740487 -5703778 -4619423 -2274178 -780349 -413788 544378
39260 544378 2902220 5218302 6001757 6060069 7509984 10747177 13508900 13403782 10576344
39251 10576344 6919191 3277861 -751303 -4108371 -3879876 647508 5508670 6365929
39243 6365929 4270530 4013999 6995957 9256967 7547672 4048691 2938845 4605338
39235 4605338 5865427 4706052 2369241 1149386 2003654 4268649 6417214 7168176
39227 7168176 6728183 6576903 7296705 7401263 5417785 2404917 1006360 2352129 5141682
39218 5141682 7482667 8358958 7528810 5432957 3356186 2449690 2353253 1880945 1239598
39209 1239598 2170724 5178556 7857740 7337485 3961704 1192857 1612649 4046856 5328623
39200 5328623 4196972 2266368 1154605 79088 -2617475 -6327300 -8214402 -6697977
39192 -6697977 -3630344 -2178397 -3261905 -4972213 -5100517 -3286200 -673112 1718961
39184 1718961 3807887 5869468 7540270 7733560 5838299 2918602 1169516 1820064
39176 1820064 3855523 5148362 4601988 2816251 964772 -259732 -504548 637494
39168 637494 3127796 5707239 6381087 4210095 510607 -2080303 -1857859 610005 3215100
39159 3215100 4299639 4135827 4456482 6163413 7692320 6742344 3907283 2869748 5589108
39150 5589108 8916348 8461927 4787247 2412346 2823119 2557328 -430637 -2679100 -539728
39141 -539728 3575636 4338052 1152714 -1538954 -982781 906124 1648867 1735642 2829826
39132 2829826 4958181 6884731 7814683 7850618 7710277 8247742 9482426 10423930 10562961
39123 10562961 10523698 10388462 9197104 7499818 7909666 10884350 12826925 11432267 9673099
39114 9673099 10510502 11575750 10783912 13012818 23169202 36463003 46626549 61286215
39106 61286215 93563994 135187538 154699218 132953779 88302537 53976802 40066481
39099 40066481 32584323 22581608 16903418 20151647 24031950 20775614 14457573 11824881
39091 11824881 11264997 8073993 3563996 1905985 2928085 3986536 4949107 6352167
39083 6352167 6413789 4368694 3074169 4145018 4419487 1588839 -754544 1297792 5013936
39074 5013936 5222699 2588199 1881203 3978771 5278171 3894511 1247852 -1601050
39066 -1601050 -4290610 -4723590 -1295276 3008678 3709604 1659824 1665336 4480623 5886221
39057 5886221 4445847 4126468 7048887 9225757 7006082 3356655 3537895 7555995
39049 7555995 11150956 12324899 12743283 13599120 13937565 13184510 12308590 11850594 10913718
39040 10913718 8695494 5479124 1785415 -1978113 -4683841 -4887166 -2934327 -1494683
39032 -1494683 -2725096 -5355717 -5860344 -2712485 1609161 3628037 3098814 2809062 4240033
39023 4240033 5324948 3691141 650203 -141991 2437291 5610285 6507650 5322552
39015 5322552 3770628 2229457 81083 -2124045 -2796763 -1571719 46546 697075
39007 697075 767215 1401127 2666260 3513173 3187223 1781566 -551038 -3805656 -6969312
38998 -6969312 -7739282 -4825895 -245890 2227885 1169056 -1348133 -3033151 -3992452
38990 -3992452 -5048990 -5402554 -3990579 -1879349 -838388 -248816 1802958 4470218
38982 4470218 4306319 426801 -3285229 -2895433 766257 4016767 5255081 5433380 4742376
38973 4742376 1913885 -2954835 -7364377 -9055764 -8042021 -5410654 -1940392 979815
38965 979815 806247 -3677860 -9807560 -12839956 -10705753 -5916808 -2546707 -2362716 -4233021
38956 -4233021 -6061535 -6303053 -4420609 -1274251 1031189 919868 -707262 -1200594 791639
38947 791639 3841435 5744913 6037345 5651917 4911916 3287309 1045439 -261061 398960
38938 398960 1984922 2402367 900143 -1098792 -1745829 -1064036 -927117 -2392680 -3703712
38929 -3703712 -2224137 1588137 3878094 2130148 -1308977 -2287946 -404057 930680
38921 930680 -336006 -2435590 -3115388 -2760484 -2717637 -2743145 -2204908 -2216357 -4134053 -6775734
38911 -6775734 -7487176 -5654136 -3089354 -1174410 230609 1046206 501457 -984584 -1489384
38902 -1489384 -97111 1877884 3024956 3615679 4288051 4525831 3716782 2468002 1600761
38893 1600761 906954 21192 -647153 -961774 -1616266 -2342675 -1318949 1751933 3800500
38884 3800500 2260104 -787250 -1646042 -989800 -2598964 -6408478 -7769917 -4925841
38876 -4925841 -2336001 -3770923 -6283716 -5008301 -820293 1480667 713972 60402
38868 60402 1006913 1495723 467217 -343137 -277774 -1201133 -3291876 -3310284 345036 4140769
38858 4140769 4153509 1780166 1141691 2572588 2657299 11535 -2942076 -4286528 -5122261
38849 -5122261 -6584174 -7274167 -5525831 -2282368 213573 1389223 2247349 3105465 3159999
38840 3159999 2084835 684667 -141174 -171643 392871 1168113 1636943 1781675 2588443
38831 2588443 4908451 7657496 8327380 6012803 3078825 2819449 5886706 9972463
38823 9972463 12630978 13175448 11854324 8743310 4302227 36547 -2473777 -2881997
38815 -2881997 -1906234 -527644 53621 -1261188 -3849925 -4788373 -1724838 3633219 6664086
38806 6664086 5055172 1459854 89169 1858110 4134845 4571149 3734044 3854365 5918996
38797 5918996 8443968 8916317 6387908 2706962 937350 2317455 4992056 6013282
38789 6013282 4368659 1630073 -300321 -1445427 -3183021 -5634801 -6763230 -5033953
38781 -5033953 -2279690 -2099440 -5078898 -7519052 -6127132 -2304987 103799 28535 -375425
38772 -375425 189071 611058 238408 405252 1857425 2981538 2320962 1132777 1478001
38763 1478001 2889189 3019179 1247107 -165154 1175144 4945501 8425062 9212732
38755 9212732 7396807 5110224 4092710 4130164 4119452 3812997 3588580 3273344 2579493
38746 2579493 2139753 2569735 3137294 3195632 4036805 6641848 8291524 5156638 -1390949
38737 -1390949 -5133791 -3074912 764808 1675607 408730 -50249 -94822 -1526023 -2616611
38728 -2616611 -235336 4200179 5788194 3234885 600471 1109372 2771930 1645791
38720 1645791 -2961084 -7943123 -9658170 -7080848 -2758355 -648372 -2063418 -4418836
38712 -4418836 -5121342 -5265432 -7442856 -11257017 -13732539 -13362091 -11040832 -7687394 -3762463
38703 -3762463 -586800 732143 1184898 1892862 1224050 -2627163 -7014372 -7124098 -2912186
38694 -2912186 660237 893037 308550 1186901 1862802 735076 -170697 1336323 3689405
38685 3689405 4116379 2785265 1731114 1618878 1974414 2876685 4226946 4865640 4215760
38676 4215760 3228307 2258626 -23165 -4059397 -7825175 -9408862 -9065377 -7341875 -3890464
38667 -3890464 25851 926277 -2273822 -5670792 -5412846 -2980433 -2098661 -2507339 -862488
38658 -862488 3186625 5820559 4143529 -372906 -3881646 -3846595 -1053265 674954 -2246974
38649 -2246974 -8734188 -13385204 -12910427 -10103068 -9081604 -9040666 -6345296 -1181460 2136135
38640 2136135 1174984 -1909210 -3743093 -2776114 935877 5873400 8818284 7428882
38632 7428882 3496622 1158718 1656732 2329483 960526 -1450233 -2652418 -1572659
38624 -1572659 1605102 5699642 8598510 8933615 7696830 6508350 5019907 2375098
38616 2375098 279495 1283619 4276095 5293168 3207466 1073467 999538 1232700 -230151
38607 -230151 -2381794 -3472728 -3835854 -4312398 -3981713 -1627548 1973371 4924033 6153524
38598 6153524 5352290 2559080 -912899 -2787775 -2617672 -2971137 -6352900 -11904778 -16316940
38589 -16316940 -17070401 -13943861 -8594769 -3742445 -1645970 -2221217 -3328354 -3450765
38581 -3450765 -3061090 -2986281 -2961428 -2561005 -2104431 -1759616 -1087121 -266577 -323803 -1265291
38571 -1265291 -1508537 -191881 1456897 2186581 2585006 3454890 3803651 2303491 -196350
38562 -196350 -1526506 -1134487 -455042 -448786 -384497 477852 1248891 573052 -866386 -346662
38552 -346662 3383624 7349536 7096054 2496372 -1615694 -2020133 -1631402 -4552814 -8833263
38543 -8833263 -8602640 -2838744 2776818 3646283 1541129 330886 406528 105653 -377534
38534 -377534 243939 1588496 2533088 3570761 5655914 7719500 7749510 5778101 3870971
38525 3870971 3560577 4653984 5939548 5974365 4095609 1679549 1256928 3353013 5523463
38516 5523463 5575031 4217176 3326117 3230627 3124964 2580255 1221459 -1424730 -4267872
38507 -4267872 -4640239 -1636344 2263622 4530741 5530538 6297321 5776580 2953372 -260562
38498 -260562 -1288603 -551529 61066 916823 3563206 6960012 8157666 6279511 2978829
38489 2978829 -360739 -2947366 -3066397 152342 3830585 3928108 903283 -749438 1016281
38480 1016281 3432935 3820318 3057148 2559336 1307149 -1567248 -3763241 -2379455 1676356
38471 1676356 4379687 3408039 527195 -886692 413613 2572812 2956703 1088585
38463 1088585 -1096418 -1889223 -1709977 -1804091 -2263268 -2506553 -2570677 -2447092 -1340684
38454 -1340684 587599 1014349 -1655410 -5231238 -6238210 -4601296 -2854934 -1532971
38446 -1532971 855070 3367501 2471070 -2452034 -7138064 -7740232 -5084393 -2012101
38438 -2012101 405128 1882907 1092512 -2315257 -5716419 -6136714 -3643268 -333885
38430 -333885 2351031 3445202 1742826 -2034094 -4052241 -1536701 2774706 3485623
38422 3485623 -475917 -4723876 -5366660 -3105084 -611448 1346458 3356220 4823387
38414 4823387 4363139 2293662 827269 1350038 2706179 2904264 1761110 840524 1112776
38405 1112776 1983944 2832701 3955062 5045862 4254373 567015 -3736226 -5166857 -3394122
38396 -3394122 -1509914 -1829147 -3401161 -4051700 -3016074 -1046689 371469 -393489 -3315367
38387 -3315367 -5205885 -2628374 2777366 4727749 -174752 -7819904 -11705659 -10439623
38379 -10439623 -7405539 -4917830 -2426431 127689 1066046 3335 -708762 904006
38371 904006 3601912 4652156 3320364 1316448 307851 230100 114876 -375728 -836375
38362 -836375 -1037653 -996360 -123638 2386552 5607731 6804166 4907010 2762225 3442910
38353 3442910 5211673 3576356 -1548013 -4740285 -2629048 1241238 1760291 -646246
38345 -646246 -1683764 307017 3285076 5484492 6604380 5846699 2623634 -957723
38337 -957723 -1951436 -1068419 -1761210 -4388824 -5109118 -1894000 1876625 1989487 -1063039
38328 -1063039 -3482886 -3275583 -1747391 -1161274 -2782538 -6281539 -9516225 -9812800 -6822203
38319 -6822203 -3214174 -1392934 -667332 1019747 3776293 5782703 5668793 3296185
38311 3296185 -876463 -5426640 -7755882 -6312069 -2852771 -846362 -1773519 -4362959
38303 -4362959 -6881659 -8341710 -7922984 -5515104 -2960241 -2557571 -3930083 -4475373 -3381736
38294 -3381736 -2802717 -4094814 -5345130 -4262795 -1498213 758570 1694420 1433949 -425596
38285 -425596 -3304786 -4302304 -1536563 2144883 2246102 -933759 -2556723 -258828 2782566
38276 2782566 2874457 420585 -2216058 -4314743 -5950986 -6147190 -4544764 -3070553 -3467154
38267 -3467154 -4742007 -5281578 -5651175 -6732806 -6962641 -4595674 -1311743 -128957 -703385
38258 -703385 -333216 960535 383943 -2325768 -3467691 -495968 4491071 7790060 8171911
38249 8171911 6610791 4066917 985665 -2284691 -5300668 -6795495 -4768742 547293
38241 547293 4523483 2277109 -4739811 -9665515 -8486484 -4008403 -632711 1000654
38233 1000654 2240997 2864594 2076225 560400 -1045050 -3630475 -7288280 -9635194
38225 -9635194 -8843772 -6427425 -4706186 -3426439 -1296403 976295 1753208 1048830 -267023
38216 -267023 -2245473 -4550531 -5132874 -2786664 453949 1932871 1900819 2046929 2204931
38207 2204931 1210507 -475046 -1703341 -2752895 -3916050 -3691703 -1263635 975057
38199 975057 542762 -1160550 -1329271 -422891 -620534 -1335392 -583758 539103 -472281
38190 -472281 -2239467 -1003556 2706714 4150700 1814796 -206778 1372277 4710648
38182 4710648 6617535 6602220 5269823 2402992 -1166058 -2929568 -2163759 -1422407 -2660458
38173 -2660458 -4226741 -3455415 -145138 3973255 7240677 8479449 7473903 5812775
38165 5812775 5121770 4301094 1416912 -1646367 -512943 4696452 8088833 5776993
38157 5776993 916900 -1644814 -1948616 -2744110 -3892654 -3078804 -407729 1463892 1214111
38148 1214111 252925 567952 2665616 4912085 4306171 -287489 -5144569 -4798318 664667
38139 664667 4849339 3580760 499273 1074738 4451826 5494955 2759449 -103493
38131 -103493 -75811 1901911 3208837 2407964 64659 -1393168 450062 4584535 6721126
38122 6721126 4849216 2416978 3251912 5693331 5490556 2787587 1923870 4881786 8823070
38113 8823070 10194287 8176406 4096823 133565 -1559821 -770449 225890 -78513 -155330
38104 -155330 1187579 1554466 -1183312 -3987836 -2517563 1512155 2421668 -445346 -1859517
38095 -1859517 488888 2462228 782401 -1765476 -1613125 -278306 -1121308 -3588395
38087 -3588395 -4530043 -2997564 -436694 2081473 3962866 4084559 2335650 730769
38079 730769 696475 795322 -643420 -2388446 -2320233 -979149 -368886 -554280 -337174 -259430
38069 -259430 -1797919 -4066314 -4430343 -2521384 -900724 -1337144 -2851374 -3966051 -4550972
38060 -4550972 -4641935 -3654325 -1989007 -1543634 -3090506 -4584167 -3819489 -1758386 -1224886
38051 -1224886 -2728037 -3783659 -2874498 -2108032 -4427981 -9159912 -12124253 -10268909
38043 -10268909 -4893376 153271 2465490 2602914 2373520 2610501 2730710 2057768 1251235
38034 1251235 1929639 4429398 6585481 6045554 3635785 2661315 4365832 6003172 4650691
38025 4650691 1235726 -1053167 -1113276 -492246 -274563 228589 1530136 2669496 2517717
38016 2517717 1189120 -332620 -1203203 -1171222 -633318 -234993 -116454 -48178 -483469
38007 -483469 -2146062 -3838641 -2466001 3079970 9548170 12896791 12942460 12139812 11128415
37998 11128415 8691845 5461939 4017784 4877549 5545899 4342060 2387467 900496
37990 900496 -721658 -2821898 -3895566 -2660174 13073 2391030 3473105 2566013
37982 2566013 -594117 -4209615 -5119546 -2660314 8451 -43650 -1892051 -2788717 -2041916
37973 -2041916 -820940 531148 2561537 4573391 4614073 2008728 -1265595 -2252074 90465
37964 90465 3513667 4162884 411940 -4992156 -7589887 -5984002 -2727258 -508325 719009
37955 719009 2118760 3163840 1946398 -2046188 -6339153 -7206938 -3712284 154665
37947 154665 -633141 -5237060 -6853327 -1990317 3438695 1947269 -4082879 -5425821
37939 -5425821 61649 4206159 1126569 -4468295 -5815681 -4444950 -5898022 -9699619
37931 -9699619 -10633567 -7733241 -5342297 -5874530 -7208484 -7399667 -7085317 -6622432 -5009636
37922 -5009636 -2492556 -799552 -60889 1463493 3991530 5457936 4878275 3901263 4145255
37913 4145255 5016595 4870357 2852955 -519615 -3265525 -2996636 171163 2641682 1528352
37904 1528352 -1053391 -648969 3135659 6038900 5090454 2220315 1250812 3546898 7236239
37895 7236239 8972434 6369502 507335 -4091492 -3801060 141720 3752265 5311683
37887 5311683 5758516 5278358 3068025 181257 -1052876 -744796 -1200968 -2659859 -2872642
37878 -2872642 -1585231 -1586915 -3856707 -5179876 -2679318 1904856 4408003 2773607 -1783037
37869 -1783037 -5983913 -6058808 -871667 5387118 6555379 1970522 -2369341 -1667804 1975991
37860 1975991 3931360 3637889 3539460 4082557 3708001 2458191 2048592 3003559 4565131
37851 4565131 6706001 9463579 10999802 9359955 5958598 4364090 5331469 5785449
37843 5785449 3470917 88519 -1552005 -1508121 -1893132 -3152158 -3377161 -1525514 571235
37834 571235 676470 -514581 -514662 723639 359320 -2484443 -4208930 -1716294 2179392
37825 2179392 2064605 -2284172 -5646123 -5022357 -3132144 -3021028 -3513011 -2459217 -879098
37816 -879098 -692242 -990730 166782 2272754 3822270 5428083 8116507 9940142 8007248
37807 8007248 3316308 44654 -84970 346452 -1288353 -4226536 -5985564 -5407208 -3085315
37798 -3085315 -257755 1802516 2207099 1011711 -815189 -1906134 -947320 2362820
37790 2362820 6109402 7117619 4396241 732026 -497058 716656 1653816 702511
37782 702511 -1054645 -1653756 -217800 2637695 5255004 6049708 4920514 3114236 1453930
37773 1453930 -140335 -1197596 -842831 -150799 -1744870 -5494381 -7408500 -5228124
37765 -5228124 -2425968 -3341641 -6527801 -6913412 -3207220 1048415 3129044 3621919 3337723
37756 3337723 1878870 -32649 -421546 761835 1367051 737662 715278 2140655 3274771
37747 3274771 2668785 936079 -1084400 -3118612 -3754293 -1232046 2874916 4068449
37739 4068449 736967 -3375887 -4375414 -3062480 -2413284 -2853682 -2746764 -1788286 -1351693
37730 -1351693 -2463938 -5079452 -8136470 -9235454 -6202487 -372241 3753868 3622522
37722 3622522 1239871 -618113 -1810524 -2490909 -947136 2845548 4603534 1066491
37714 1066491 -4139067 -4731091 -617716 2412355 1271594 -1381342 -3051509 -4916608
37706 -4916608 -7555715 -7962650 -3975453 1606307 4590669 4788117 4782017 5147236 4255085
37697 4255085 2033945 783650 1984973 4414955 5819657 5073052 2618306 48128
37689 48128 -723376 932411 3446999 4656966 4206389 3335612 2496810 693934 -2360294
37680 -2360294 -4829251 -4658958 -2305970 -345703 -261958 -606461 949007 4170478 5941485
37671 5941485 3815240 -883053 -4415552 -4720243 -3008133 -1407618 -611988 -472369 -1267860
37662 -1267860 -2910444 -4029546 -3734744 -3606159 -5697248 -8727746 -8892312 -5185380 -1336899
37653 -1336899 -838372 -2245102 -1782034 942146 2740565 1752406 -393948 -1529115 -1449034
37644 -1449034 -807067 191156 932080 94152 -2597662 -5599025 -7253020 -6989265 -4712233
37635 -4712233 -1182754 618432 -2383294 -8337672 -10708003 -6088172 887741 3590773
37627 3590773 1928260 839061 2128030 2870163 1613214 923638 2470268 4030295
37619 4030295 3584262 2893826 4411726 7218373 8648090 8130710 7082717 6360868 5818774
37610 5818774 5246203 4157026 1890965 -714221 -1371721 318920 1321928 -991005
37602 -991005 -4916437 -6629669 -5174018 -2826065 -1291137 -85928 1522133 3273144
37594 3273144 4805888 6019678 6387848 5370442 3541101 2013139 905250 -318868
37586 -318868 -1296444 -1077372 169193 1327866 2215289 3695471 5653827 6321432 4229508
37577 4229508 -75351 -4641368 -7693598 -8447259 -7175829 -4862504 -2449341 -397583
37569 -397583 895050 861228 -421928 -1726640 -1817112 -830577 58317 -43086 -1195151
37560 -1195151 -2727814 -3397478 -2270377 31512 1984670 3529908 6250981 10299597
37552 10299597 12923138 11551717 6831538 1085200 -4394765 -8509127 -8899501 -4485836
37544 -4485836 1600550 4712017 3822287 1434324 -574007 -1808330 -1069274 2611259
37536 2611259 6539742 6148099 1214006 -3345155 -4064821 -2761373 -2340147 -2477586 -1715594
37527 -1715594 -672870 -481374 -445944 246857 678230 405522 1186040 3776860 5210207
37518 5210207 2522710 -2353850 -4807151 -3712594 -2163311 -2522680 -3769814 -3728957 -1385904
37509 -1385904 2990932 7737511 9949879 8096521 4417099 2435379 2242575 855330
37501 855330 -2674783 -5562735 -5591408 -4219132 -3693582 -3409781 -1514381 1269081 2115516
37492 2115516 277011 -1455340 -335187 2612589 3758712 1438000 -1937008 -2833914
37484 -2833914 -668339 2196931 3858172 4565785 5046621 5151155 4878401 4838468 4604417
37475 4604417 2569281 -977377 -2624198 24147 4553689 6710006 5863834 4511170
37467 4511170 3413929 1058676 -2117110 -2963353 -181283 3634496 5873940 6877553
37459 6877553 7560108 7106503 5108140 3324207 2889969 2097250 -376199 -2203165 -649870
37450 -649870 2458037 2659731 -885131 -4541297 -5511289 -4657882 -3619539 -2399464 -956705
37441 -956705 -367812 -798441 -529965 1300663 2838757 2178007 334069 -387866 221316
37432 221316 605898 335198 456339 1226002 1534632 773000 -409625 -1489471 -2664456
37423 -2664456 -3644882 -3304977 -1246475 1367118 3130259 3595875 2800420 905169 -1013056
37414 -1013056 -1229706 436974 1876788 1412919 123627 -185199 -223161 -2123125 -5567691
37405 -5567691 -7639438 -6909049 -5157747 -4057295 -2587808 405129 3009098 2234750
37397 2234750 -1478460 -4231772 -3403870 -594123 739328 -756512 -3467995 -5034751
37389 -5034751 -4589342 -3034093 -1642551 -639064 694001 2699639 4831104 6616002
37381 6616002 8188604 9327565 9086744 7432823 6187205 6750847 7594966 5946019 1774556
37372 1774556 -1892018 -2884879 -2212112 -1904365 -2403781 -3071165 -3666347 -4008129 -3375806
37363 -3375806 -1649487 -171863 -122083 -702819 -273733 1216574 2261046 1950245 840762
37354 840762 -171842 -685946 -624705 -427201 -1341692 -4128643 -7176849 -7366463 -3704740
37345 -3704740 885884 2495212 385293 -2808935 -4576052 -4818352 -4567192 -4062525 -3228556
37336 -3228556 -2967351 -4203273 -5840113 -5586551 -3430143 -2461343 -4763176 -7813435 -7128028
37327 -7128028 -2057366 3262686 5005009 3625447 1964340 1334041 1051347 601649 333648
37318 333648 249260 -383132 -1902940 -3541008 -4072453 -2881831 -523661 1487105 1767465
37309 1767465 329824 -1499596 -2597136 -2994495 -3180419 -3255395 -3204754 -3210851 -3125827 -2399211
37299 -2399211 -1146739 -492103 -1147696 -2465042 -3597140 -4599933 -5459775 -5185282 -3253487
37290 -3253487 -1037203 -187484 -279727 228786 1268883 1332468 98628 -1219744 -2304890
37281 -2304890 -4413266 -7980556 -11304379 -12509341 -11544143 -9519443 -7245079 -5052707
37273 -5052707 -2960110 -517518 2383673 4337708 3673011 1281344 163355 1219051
37265 1219051 1730569 -322105 -2641050 -1865336 1150984 2515509 1025754 -804214
37257 -804214 -1623497 -3307246 -6523671 -7725862 -3790713 2354819 4587250 1579216
37249 1579216 -1834394 -1917721 -853155 -2128927 -4318262 -3247089 1154347 4476312
37241 4476312 4417594 3648575 4794676 6351372 6024442 4951853 5250761 5702988 3805347
37232 3805347 614566 -715001 -412389 -1428085 -3328537 -2122397 2434393 4660820
37224 4660820 1103933 -3579280 -3031756 1818702 4931140 4120721 2714283 3120658 3821173
37215 3821173 3203836 2027652 906332 -1065346 -3702980 -4705496 -2823408 245580
37207 245580 2367540 3160949 2640424 239518 -3275926 -5283657 -4569236 -3139098 -2909355
37198 -2909355 -2564855 15497 3870865 6148378 6197918 5931237 6609336 7600799 8090701
37189 8090701 7837851 6231613 2679489 -1673494 -4302140 -3969157 -1979195 -588933
37181 -588933 -1117559 -3420932 -5951682 -6476923 -4172861 -1028223 220338 -521748 -965744
37172 -965744 7164 1135403 1501907 2088174 3397999 3702748 1646600 -899624 -972130
37163 -972130 1182115 2291376 533270 -2321413 -3756868 -3668493 -3662149 -4463190 -5196356
37154 -5196356 -4594907 -2070457 1810530 5094303 5365124 2109454 -2025691 -3415370
37146 -3415370 -1011964 2963111 5599942 5495915 2678641 -1784522 -5451536 -5677333
37138 -5677333 -2735412 -503017 -2041417 -5298393 -5531237 -1622998 2797968 4811651
37130 4811651 5498526 6327303 5593935 1538231 -3273226 -4622338 -2705495 -1458668 -2051415
37121 -2051415 -1590663 766763 1350023 -1622693 -3567380 35989 5695075 5958128 244093
37112 244093 -4274987 -3127762 -33810 269897 -695627 867261 3709843 3432452 -249989
37103 -249989 -3310329 -3883551 -4158991 -5556469 -6511280 -6074319 -5643576 -5707424 -4777436
37094 -4777436 -3294073 -4417362 -8297123 -9733523 -5433202 -55313 -100749 -4334534
37086 -4334534 -5949761 -2831817 510522 1089253 1057308 1849193 949204 -2579634 -4674299
37077 -4674299 -2309145 1213313 1262815 -1246816 -2549635 -2749572 -4710304 -8000192 -9171856
37068 -9171856 -7383886 -5061904 -3387440 -1673505 -897080 -2888754 -5674749 -4768740
37060 -4768740 -284318 2212805 -207341 -3727683 -4337989 -3866855 -5826781 -9042212
37052 -9042212 -9784974 -7664301 -5046693 -2423349 1341065 5190187 6368935 4413925
37044 4413925 1345738 -1696190 -4852038 -7074879 -6678176 -4366678 -2655404 -2204169
37036 -2204169 -1597833 -565765 -146898 311460 2589952 5499799 5244330 1134782 -2736382
37027 -2736382 -3264364 -2253422 -2366486 -2584577 -760588 2029995 3208332 2887461 2850190
37018 2850190 2698031 677046 -2293807 -3031607 -730200 1859149 2460321 1889367 1829368
37009 1829368 2219715 2042111 1229761 701853 1228854 2694679 3898066 3252022 523153
37000 523153 -2529316 -4223300 -4914462 -5625889 -5912618 -5168892 -4900329 -6658575 -8248509
36991 -8248509 -5714031 388667 4526550 3448199 295988 -715622 -241845 -1187872
36983 -1187872 -2985589 -2720506 -513955 569425 -292117 -576065 1023176 2560767 2507263
36974 2507263 2278243 3374275 4518625 3774039 1795740 784186 1118341 931213 -1282866
36965 -1282866 -4952266 -8149801 -9235880 -8091440 -6226323 -5217122 -4880166 -3932789
36957 -3932789 -2570193 -2674686 -4608004 -5643566 -3325141 910883 3516577 3419348 2643426
36948 2643426 2766257 3133536 2833528 2229125 1781938 1182339 542717 780170 1723197
36939 1723197 1484852 -708083 -2377868 -500006 4328184 8524599 10178964 10854369
36931 10854369 12137941 12497464 9255706 2731143 -3340249 -5566651 -4101504 -2030793
36923 -2030793 -2207768 -4590906 -6216206 -4253595 191064 2193608 -1398947 -7007798
36915 -7007798 -7595007 -1581247 4445430 4064004 -508786 -1887679 1944596 5251751
36907 5251751 3193391 -1868307 -5053477 -5965243 -7145101 -8129132 -5854101 -392634
36899 -392634 4134424 5044614 3922326 2955177 1814675 -139132 -1520392 -1143068 -410465
36890 -410465 -984960 -1717300 -492606 2119642 3840353 4469093 5642775 6986852 5785688
36881 5785688 1430326 -2586670 -2886039 -575887 556258 -816182 -2198252 -877739
36873 -877739 2607268 5029073 3922924 251713 -2397569 -1632968 830184 1021637 -2263300
36864 -2263300 -5595889 -4988419 -685408 3526910 4955155 4125277 2653899 1188277
36856 1188277 8064 -230336 438149 708205 -229617 -1183667 -496068 1477708 2677234
36847 2677234 1822585 -506430 -2965775 -4422845 -4027422 -1674460 1393568 3563758
36839 3563758 4663263 5767274 7086675 7367571 5853246 3569469 1955011 1332245
36831 1332245 1470174 2440208 3862998 4419832 3461940 2288257 2389209 3042825 2226789
36822 2226789 -384849 -2889199 -3614745 -2759706 -1473878 -573678 -459038 -1264228 -2646172
36813 -2646172 -3915985 -4389469 -3326249 -277010 3668658 5948331 5278797 3574175
36805 3574175 3453842 4681409 5252554 5222677 6433040 8523592 8710637 6413795 4672451
36796 4672451 5330967 6113120 4865995 3654277 5323485 8307399 8797734 6768676 5690535
36787 5690535 6595410 6593384 4031079 1372020 1228686 2412524 2177451 494773 -305294
36778 -305294 747103 2057657 1928821 625940 -525486 -1164222 -2071378 -3333796 -3337977
36769 -3337977 -747336 2813947 3872274 1624768 -536419 366579 2448701 1637967
36761 1637967 -2205752 -4935640 -3856425 -724223 1751711 3427163 5054612 5484868
36753 5484868 3071488 -1082201 -3472008 -1873962 2367469 5620463 4973725 451495
36745 451495 -5079864 -8421411 -8730662 -7494083 -6238152 -5342976 -4948779 -5434056 -6481900
36736 -6481900 -6975075 -6389211 -5151355 -3302164 -339792 3034896 4784101 4257944 3587842
36727 3587842 5039305 8071110 10242233 10116921 8256826 6298906 5900440 7401991
36719 7401991 8695316 6945527 2486519 -855960 -826100 -41256 -1986544 -5642975 -7233162
36710 -7233162 -6095664 -5163981 -5843576 -6152935 -4697752 -3053877 -2648285 -2181795 -329110
36701 -329110 1254980 324438 -1922031 -2153659 -8901 905207 -2001926 -6399527 -7805759
36692 -7805759 -5234990 -2073200 -1283782 -1798902 -968889 955200 1299168 -260943 -285796
36683 -285796 3639229 8844216 10560743 7788809 3796896 1394567 308126 -647462
36675 -647462 -1385673 -1508861 -1540633 -2027251 -2722890 -3519175 -4760088 -5691106 -4230733
36666 -4230733 174778 4759086 6382644 5405798 4496247 4093549 1809339 -2992282 -6667344
36657 -6667344 -5354514 -72007 4553076 5920089 5310191 4251468 2108927 -1433861
36649 -1433861 -4248828 -4575482 -4113518 -5392370 -7324326 -6851265 -4412439 -3621860 -4975598
36640 -4975598 -4336979 397104 5266462 5933872 3879119 3019244 3064299 1119463 -1930881
36631 -1930881 -2209597 326616 1324295 -833153 -2421792 -747890 1452416 708138 -1828290
36622 -1828290 -2936848 -2389449 -2107145 -2424266 -2526687 -2928499 -4090482 -3784343 499532
36613 499532 6822725 9872619 7277293 2262051 -572452 123982 2714210 5290401
36605 5290401 6819016 6879708 5607959 3604707 1463476 -289736 -887091 241382 2537340
36596 2537340 4436245 4594602 2711870 -561962 -3962442 -6158258 -6648069 -5951659 -4524008
36587 -4524008 -2111409 1083183 3359869 2952075 322711 -2073555 -2350959 -731588
36579 -731588 1274168 2292644 1790619 339469 -626630 44858 2151154 4451779 5802070
36570 5802070 5699199 4287822 2342453 639642 -1149041 -4065628 -7711626 -9700746
36562 -9700746 -8512262 -5896027 -4940991 -6522040 -9167396 -11578259 -13428240 -14354295
36554 -14354295 -14202137 -13774045 -13279677 -10798259 -5001298 1119558 2799269 248561
36546 248561 -846568 2987770 8316587 10013314 7998526 5712742 4471894 3259181
36538 3259181 2611541 4312466 7222985 7361326 3220959 -1948016 -4482322 -4556155 -4663753
36529 -4663753 -5868171 -7260091 -7719427 -6563731 -3550123 70961 1298066 -1908732
36521 -1908732 -7634146 -11130898 -9284885 -3227957 3404518 7769663 9144582 8114443
36513 8114443 5546758 2320843 -708985 -3011080 -4498530 -4937800 -3341873 1202396
36505 1202396 7561126 12207357 12149157 8221033 4337826 3238784 4085691 4674000 4635570
36496 4635570 5264497 6975001 8378348 7917349 5592584 2972673 1806954 2345338 2858886
36487 2858886 1551608 -798292 -1393281 599573 2243907 714591 -2381565 -3037116
36479 -3037116 -504212 1916602 1769227 163799 -1099428 -2181449 -3482204 -3792340
36471 -3792340 -2198061 17349 1356653 2366042 3920775 4923620 4125771 2885624
36463 2885624 3371077 4859155 4635474 2211084 -31566 -334415 775166 2337156 3978434
36454 3978434 4834118 3892145 1954503 1113370 1767272 2185196 1425398 513461 209382
36445 209382 -174664 -1043556 -1683968 -1773207 -1675224 -877011 1399584 3589176 2781662 -691027
36435 -691027 -2794443 -1408068 676115 261115 -1794150 -2999044 -3271267 -3719879 -3837249
36426 -3837249 -2975735 -2583305 -3863989 -5012522 -3878777 -1686187 -982029 -1662969 -2352248
36417 -2352248 -3746741 -6601500 -8155254 -5352927 -678694 282608 -3051211 -5620279
36409 -5620279 -4594984 -2768943 -2876898 -3521703 -2929733 -2374190 -3036818 -3040197 -758965
36400 -758965 1626735 1085487 -1567992 -2771881 -921565 2186388 3834162 2860833 419107
36391 419107 -1018355 -414903 130211 -1706946 -4272145 -3732277 -192552 1921056 618361
36382 618361 -826737 200576 1282800 -405316 -3025549 -3472971 -2584470 -2735655 -3004642
36373 -3004642 -1352176 573490 -238346 -2547876 -2629826 -718634 -560502 -2902083 -4671955
36364 -4671955 -4950188 -6420791 -9692631 -11321828 -9644749 -8029382 -9439054 -11556198
36356 -11556198 -10728401 -7801204 -6133773 -5634930 -2860923 3199210 8736575 9355866
36348 9355866 4834474 -1151592 -5006596 -6157685 -6333850 -6630271 -6160409 -3974736 -1147296
36339 -1147296 481209 860360 1056613 521000 -2277405 -6135516 -7000417 -3120442 1910127
36330 1910127 3185260 58238 -4065750 -6097698 -5437336 -2866097 398619 2747137
36322 2747137 3191283 2627842 2900216 4509566 6242829 6990077 6799118 5984145 4339439
36313 4339439 1894797 -226473 -635764 580460 1682335 1394261 709620 1530993 3661094
36304 3661094 4807155 4179976 4044710 5998586 7637018 5786869 1871813 419884
36296 419884 2398775 4019030 2997478 1821606 2702088 3246929 670314 -2588149 -1815368
36287 -1815368 2786237 6134374 5225872 2228043 229222 -542490 -1082713 -1140197 -167078
36278 -167078 1167643 2026239 2606463 2965920 1913696 -1344071 -5161138 -6621364 -4803693
36269 -4803693 -1907739 -800273 -1890015 -2907004 -1862839 364118 1301027 478391
36261 478391 46835 1175895 1925812 494895 -1277729 -492231 1906458 2412871 965127
36252 965127 1561327 5678772 8985795 7130525 1802973 -2087463 -3038458 -3201179 -3492652
36243 -3492652 -2567972 -570531 -79766 -2185986 -4383071 -3810362 -733441 2367669 3656737
36234 3656737 2962508 1414763 924799 2591028 4838261 4754790 2158800 381697 1570003
36225 1570003 3221914 1691618 -2288089 -4411143 -2616219 690345 2459460 2492871
36217 2492871 2220579 2027418 1149257 -935885 -4046123 -7356345 -9267492 -8290282 -4879540
36208 -4879540 -1464775 120223 332072 343042 -26817 -1562293 -3671184 -4608388 -3475680
36199 -3475680 -1004423 1443182 2907904 3258679 3292442 3903128 4552543 3518765 619628
36190 619628 -1555042 -800470 1345466 1660015 31153 -661214 380984 231151 -2813274
36181 -2813274 -5599932 -4289667 -441042 488830 -3477990 -8080573 -8405125 -4888665
36173 -4888665 -2081189 -2834241 -5717414 -7830870 -8274083 -8160108 -8413532 -8823790 -9055087
36164 -9055087 -9382528 -9843112 -9380467 -6825976 -2650614 1158055 3209898 3942491 4364811
36155 4364811 4384226 3134384 442158 -2824905 -5421720 -5900171 -2848651 3389652 9352488
36146 9352488 10900765 7924529 4841395 5001015 6289902 4517897 -161046 -3464057
36138 -3464057 -3394331 -2666837 -3506784 -3751634 -909657 2813243 3425262 1393840 663025
36129 663025 2097399 2528015 720087 -528304 118940 -450876 -4447948 -8793587 -9772288
36120 -9772288 -8809172 -9242191 -9982493 -7693610 -3800399 -3369289 -6798469 -8333687 -4472241
36111 -4472241 1099192 3396675 2745493 2382987 2852704 2498285 1405182 1248489 2264542
36102 2264542 3160010 3187321 2164361 -274811 -3162331 -3476849 194870 4493844 5007417
36093 5007417 2393083 1329293 3606817 5999342 5579696 3460112 1792789 384625
36085 384625 -1402983 -1967583 438467 4370349 6617084 6170002 4490417 2608321 555585
36076 555585 -636454 671363 3668082 5035449 3250169 755928 188189 564929 -275545
36067 -275545 -1179558 758875 4548367 5269534 952205 -3989017 -4460024 -1097594 1798977
36058 1798977 2430377 2075565 1143127 -1086516 -3185299 -2425805 363148 779461 -2900208
36049 -2900208 -7068742 -8210440 -7407981 -6897230 -5557775 -1611077 2485355 2214771 -2610138
36040 -2610138 -7349729 -8444655 -6757128 -4812309 -3571246 -2692957 -1824998 -792261
36032 -792261 87258 -333348 -2564877 -4758359 -4272613 -1128470 1882676 2787683 2326593
36023 2326593 1860990 1273506 -90597 -1700645 -2141240 -640048 2116238 4335952 4484666
36014 4484666 2916859 1739300 2332917 3757704 4550729 4905786 5465053 5149558 2453855
36005 2453855 -1848653 -5617408 -8186430 -9655372 -8321738 -2629058 4303244 6376116
35997 6376116 2132049 -2986033 -3855585 -1714137 -562612 -824642 -93766 1999646 3585122
35988 3585122 4310699 5747328 8022810 8948962 7069855 3519940 274885 -1905231
35980 -1905231 -3266412 -3969368 -3829937 -2727057 -1108031 -26962 -49486 -111638 1280517
35971 1280517 3428788 3809569 1885770 415165 1351896 2573441 1117699 -2082207
35963 -2082207 -3830557 -3924879 -5096136 -7784772 -8781886 -6194757 -2522089 -904473 -839412
35954 -839412 23777 1633817 1864179 345465 -758364 -162328 461549 -1124318 -4491941
35945 -4491941 -6934422 -6557103 -3894377 -667206 1791187 2504745 628640 -3354852
35937 -3354852 -6783204 -6855279 -3800210 -648535 587469 1081440 2784546 5313500 6566844
35928 6566844 5419441 2388614 -1506145 -4895007 -5747394 -3011210 1292821 3440248
35920 3440248 2155708 193305 1049146 4843312 8074128 7204919 2466646 -1646422
35912 -1646422 -291847 6373100 12364525 11930007 6225664 2054410 3628238 7782781
35904 7782781 8664445 5179502 1324838 -19511 -510986 -2607977 -4945245 -4023837 193863
35895 193863 3219280 1573998 -2714339 -5112425 -4742987 -4781896 -6893772 -8465588 -6775417
35886 -6775417 -3312489 -1478691 -1516586 -562412 2731835 6319267 7800307 7125996 5581661
35877 5581661 3866346 2098579 438366 -1139098 -2758905 -3870803 -3669385 -2761119
35869 -2761119 -3107997 -5495487 -8164520 -8909150 -7652438 -6027329 -5232845 -5314237 -5858308
35860 -5858308 -6273416 -5836579 -4551040 -3673266 -4353378 -5896570 -6386084 -5098528 -3425523
35851 -3425523 -3187616 -4728660 -6923899 -8440535 -8591349 -7423864 -5599243 -4176501
35843 -4176501 -4007396 -4918353 -5534990 -4411108 -1732790 416102 209780 -1490361 -1782535
35834 -1782535 700994 3717939 3925460 1008709 -1993117 -2517643 -1208066 -208773 -177294
35825 -177294 -435921 -1161678 -3272163 -5996041 -6715951 -4355394 -1301435 -348613 -884714
35816 -884714 -97179 2696433 5257821 5987526 5842987 5903255 5258824 2908766 163894
35807 163894 -797504 58061 891411 873613 1012200 1989384 2701953 1565655 -1552601
35798 -1552601 -5169339 -7444314 -7333429 -4961385 -1349252 2139028 4341463 4880602
35790 4880602 4583863 4735486 5159036 3807519 -295562 -4388233 -4626568 -1528124 46104
35781 46104 -2629999 -6541442 -7604982 -6108046 -4681031 -3261602 47104 4308865
35773 4308865 6083342 4434662 1994345 532871 -1147976 -3880303 -5732056 -4573221
35765 -4573221 -946677 2940242 5345553 5232593 2444183 -1164107 -2618480 -1182528
35757 -1182528 662182 598540 -814784 -1872983 -2344917 -2884074 -3307355 -3091080 -2608560
35748 -2608560 -2543552 -2816981 -2976104 -2775238 -1839520 -64516 1094125 -533286 -4735135
35739 -4735135 -8385610 -9165342 -8138971 -7383684 -6919509 -5734091 -4265142 -3823231 -4566199
35730 -4566199 -5771874 -7145872 -8262230 -7758397 -4831251 -810517 2112675 2883586
35722 2883586 1395355 -2013814 -5392174 -5461655 -1406766 3016001 3586450 739828 -1798175
35713 -1798175 -2351192 -2524516 -3837781 -5916581 -7757678 -8402669 -6766653 -3131799 -210689
35704 -210689 -218455 -1597001 -1416700 -142650 -544861 -2467845 -2890673 -1467973 -1584138
35695 -1584138 -4667627 -7626098 -7782309 -6463126 -5383785 -3330105 390851 2583759
35687 2583759 289167 -3997254 -5388868 -3474055 -2067549 -2963555 -4076560 -3737280
35679 -3737280 -2859617 -2126487 -580555 1693322 2522888 994709 -589908 -19868 1463294
35670 1463294 1154716 -1096042 -2878319 -2443031 -203170 2411440 4069595 4036579 3045208
35661 3045208 3132193 4978342 5992636 3260531 -1642984 -3453168 142569 5086147
35653 5086147 6114944 3489407 1817814 3057723 3967970 1180253 -3954481 -7336945
35645 -7336945 -7344799 -6149928 -6374179 -7967982 -8525937 -6017679 -1223961 2444078 2162504
35636 2162504 -1177624 -4086136 -4832942 -4966656 -5793204 -5669690 -2869509 674974 1532653
35627 1532653 -43550 -357053 2041936 4079462 2823986 -212249 -1430936 -47690
35619 -47690 1599595 1740943 1051340 1005885 2047667 3617888 4779665 4495133 2322713
35610 2322713 -592642 -1971730 -687800 1627380 2135300 184699 -1665395 -748592
35602 -748592 2213459 3954516 2768506 168501 -1798009 -2965243 -3838831 -3947453 -3142515
35593 -3142515 -2980083 -4670744 -6821930 -7451804 -7043531 -6893379 -5623700 -1067623 4680751
35584 4680751 6380143 2824102 -1023680 -898456 1302209 1400936 -830148 -2546643 -2720004
35575 -2720004 -2657436 -2901064 -2861200 -2876336 -3714465 -4345291 -2875955 316936 2722659
35566 2722659 3079915 2606262 2711421 3303849 3600864 3163099 2051447 1089213 1522728
35557 1522728 3152223 3707664 1924115 286050 2168394 6650203 8971802 6425116
35549 6425116 1265629 -2721591 -4135195 -3760122 -2828209 -2519589 -3264466 -3617902 -1641286
35540 -1641286 1866975 3573796 1926459 -890099 -2338536 -2495168 -2242133 -1092730
35532 -1092730 1001322 1933358 319573 -1526225 -535171 2217398 2737977 -94469 -3073628
35523 -3073628 -3348557 -1778172 -706569 -645231 -436855 772001 2818546 4767657 5215809
35514 5215809 3398870 502282 -1244873 -1238730 -1047158 -1821944 -2668329 -2528892 -2277742
35505 -2277742 -3449502 -5682195 -6992109 -6413056 -5079235 -4479147 -4553738 -4075539 -2672046
35496 -2672046 -1956997 -4019365 -8406443 -11326815 -9200570 -3046475 2175319 3217276
35488 3217276 2059589 2574047 4943752 5407614 1407515 -4819785 -8559355 -7717554 -4907747
35479 -4907747 -4574138 -8324698 -13335710 -15551256 -13972662 -10841577 -7960831 -4827595
35471 -4827595 -1136271 1124880 222364 -1987843 -1865231 1210945 4155569 4306279 2074811
35462 2074811 -674266 -2590221 -2636717 -244693 3197786 4824512 3479431 1012073
35454 1012073 -503518 -1174813 -1865004 -2239443 -1833986 -1500342 -1908002 -1810788 162428
35445 162428 2756349 3162005 642319 -2493521 -3549163 -2044391 178373 770904 -800036
35436 -800036 -2448448 -1886079 151626 965160 481701 1856311 6013901 8878175 6951652
35427 6951652 2895723 1707743 3354627 3653051 1295755 -795187 -863937 -352759 -173652
35418 -173652 466821 742098 -1594243 -5256053 -5346384 -471286 4308330 4367978 1518572
35409 1518572 9952 120058 -514756 -2046252 -2992598 -3710969 -5435086 -7271885 -7628323
35400 -7628323 -7285819 -7710855 -7746464 -5625905 -3021029 -3030126 -4829131 -4578713 -1708926
35391 -1708926 -131578 -2290056 -5616797 -6427736 -4641324 -3059715 -3815153 -6652777
35383 -6652777 -9290337 -8903623 -4763396 212993 1989757 -311695 -3939391 -5907708
35375 -5907708 -5170904 -2116628 1621262 3084016 436204 -4250643 -7082224 -7270091
35367 -7270091 -7275274 -7994936 -7257558 -4052573 -802429 393953 877811 2607276 4658752
35358 4658752 5049424 4206946 3993604 4463426 4088821 2605676 1499897 1882509 3460108
35349 3460108 5348244 6571677 6073629 3525482 53333 -2751894 -4385638 -5304211
35341 -5304211 -5596402 -4590357 -1784903 2188027 5536370 6483389 5022231 3209380
35333 3209380 2830456 3130631 2177603 224038 -132200 2476117 6133972 7841806 6456697
35324 6456697 3053942 -131447 -732509 1963071 5465521 5955425 2557379 -1713349
35316 -1713349 -3832258 -3735766 -2711282 -1162273 497831 734258 -1277329 -3904490 -4876783
35307 -4876783 -3982483 -2697508 -2174469 -2722976 -4069898 -5019241 -4198221 -2250738 -1742041
35298 -1742041 -3668195 -5807202 -5956581 -4851804 -4043004 -2892095 -132403 3158478
35290 3158478 4881942 5248611 6219480 8212332 9622774 9227734 7284855 4862320 3533508
35281 3533508 4546335 6692067 6694160 3758883 1647867 3418452 6315058 5761541 2688457
35272 2688457 2023209 4541226 5544725 2356575 -1942893 -3991243 -4760969 -6081379
35264 -6081379 -6408332 -3495079 1266044 4529006 5439287 5541457 5511206 4730629 3341356
35255 3341356 2192200 1088886 -692756 -2215450 -1267626 2478008 6023386 5624282
35247 5624282 561213 -5868393 -9114007 -7377127 -2992152 295576 1040367 561841
35239 561841 445846 1016604 2120324 3725775 5249650 5602194 4552793 3177943 2601733
35230 2601733 3030572 3983966 4576932 3904655 2275941 1416665 1924021 1549385 -1559573
35221 -1559573 -4823139 -3908173 644386 3511593 2264600 740854 2635057 5676580
35213 5676580 5533489 2575778 805668 1709054 2913639 2269646 211392 -1633034 -1940275
35204 -1940275 -371070 1504181 1192837 -1021374 -1367143 1912686 4721157 2461949
35196 2461949 -2738480 -4833930 -2740972 -1040298 -1808229 -1584945 1866434 5179717
35188 5179717 4770765 2272887 982986 403646 -1420504 -2639787 480784 7201270
35180 7201270 12166972 11938185 8389006 5107944 3344300 2510946 2288220 2631472 2895446
35171 2895446 2181839 167006 -2700391 -5262870 -6072598 -4721824 -2675022 -1708545 -1649191
35162 -1649191 -975847 370917 521379 -1367604 -3312470 -2940209 -771012 365719 -1077272
35153 -1077272 -3536621 -4270001 -2355476 590861 2348475 2379225 2131206 3247517 5796263
35144 5796263 8363914 9449642 8424201 5671073 2511749 560109 166404 -234268
35136 -234268 -2131589 -4644033 -5794686 -5942446 -7652785 -11377325 -13686509 -11618056
35128 -11618056 -6881233 -3394891 -2116950 -1135437 146884 402895 -158484 563299 2489148
35119 2489148 2389761 -1170236 -4832296 -4807453 -1960064 147859 458028 658125 1475031
35110 1475031 1924781 1772134 1816630 1853313 1005185 56780 835554 3154391 4961008
$$ [...]
##END NTUPLES=NMR SPECTRUM
##END=
