##TITLE=31Pdec_LR-695-CR2
 CDcl3, 24 sc
 24.10.2019
##JCAMPDX= 6.0         $$ Bruker NMR JCAMP-DX V2.0
##DATA TYPE= NMR SPECTRUM
##DATA CLASS= NTUPLES
##ORIGIN= UXNMR, Bruker Analytische Messtechnik GmbH
##OWNER= root
$$ XWIN-NMR		Version 3.5
$$ Thu Oct 24 15:59:25 2019 Russian Standard Time (UT+4h)  she@DPX200
##.OBSERVE FREQUENCY= 81.013821
##.OBSERVE NUCLEUS= ^31P
##.ACQUISITION MODE= SIMULTANEOUS
##.ACQUISITION SCHEME= undefined
##.AVERAGES= 24
##.DIGITISER RES= 17
##SPECTROMETER/DATA SYSTEM= spect
##.PULSE SEQUENCE= zgpg30
##.SOLVENT NAME= DMSO
##.SHIFT REFERENCE= (INTERNAL, DMSO, 0, 182.463)
##AUDIT TRAIL= $$ (NUMBER, WHEN, WHO, WHERE, WHAT)
$$ ##TITLE= Audit trail, XWIN-NMR		Version 3.5
$$ ##JCAMPDX= 5.01
$$ ##ORIGIN= Bruker BioSpin GmbH
$$ ##OWNER= she
$$ F:/spectra/data/she/nmr/P31/1/pdata/1/auditp.txt
$$ ##AUDIT TRAIL=  $$ (NUMBER, WHEN, WHO, WHERE, WHAT)
(   1,<2019-10-24 15:58:43.95 +0400>,<she>,<DPX200>,
      <created by zg, POWCHK disabled, PULCHK disabled
       configuration hash MD5:
       00 E9 B6 7A A2 85 ED C7 34 08 36 98 17 FE 4E 26
       data hash MD5: 32K
       C1 87 A0 E0 05 E8 DE 31 40 0C 81 9A DA 6C DC B3>)
(   2,<2019-10-24 15:58:46.48 +0400>,<she>,<DPX200>,
      <Start of raw data processing
       efp BC_mod = 2 LB = 1 FT_mod = 6 PKNL = 1 PHC0 = -887.2673 PHC1 = 538.0007 SI = 64K 
       data hash MD5: 64K
       4E AD 85 6E 52 9A 30 62 69 03 D4 71 96 CE 75 51>)
$$ ##END=
$$ 
$$ hash MD5
$$ 02 F3 40 F6 01 BF 18 3D 9A B7 C4 CE 7D D9 78 77
##$RELAX= 
##$RELAX= 
##$RELAX= 
##$RELAX= 
##$RELAX= 
##$RELAX= 
##$RELAX= 
##$RELAX= 
$$ Bruker specific parameters
$$ --------------------------
##$DU= <F:/spectra>
##$EXPNO= 1
##$NAME= <P31>
##$PROCNO= 1
##$TYPE= <nmr>
##$USER= <she>
##$AMP= (0..31)
100 100 100 100 100 100 100 100 100 100 100 100 100 100 100 100 100 100 
100 100 100 100 100 100 100 100 100 100 100 100 100 100 
##$AQSEQ= 0
##$AQ_mod= 1
##$AUNM= <au_zg>
##$AUTOPOS= <>
##$BF1= 81.014009
##$BF2= 200.13
##$BF3= 200.13
##$BF4= 200.13
##$BF5= 200.13
##$BF6= 200.13
##$BF7= 200.13
##$BF8= 200.13
##$BYTORDA= 1
##$CFDGTYP= 0
##$CFRGTYP= 5
##$CHEMSTR= <none>
##$CNST= (0..31)
1 1 145 1 1 1 1 1 1 1 1 1 1 1 1 1 1 1 1 1 1 1 1 1 1 1 1 1 1 1 1 1 
##$CPDPRG= <waltz16>
##$CPDPRG1= <>
##$CPDPRG2= <waltz16>
##$CPDPRG3= <>
##$CPDPRG4= <mlev>
##$CPDPRG5= <mlev>
##$CPDPRG6= <mlev>
##$CPDPRG7= <mlev>
##$CPDPRG8= <mlev>
##$CPDPRGB= <>
##$CPDPRGT= <>
##$D= (0..31)
0 1 0 0 0 0 0 0 0 0 0 0.03 2e-05 3e-06 0 0 0 0 0 0 0 0 0 0 0 0 0 0 0 0 
0 0 
##$DATE= 1571918323
##$DBL= (0..7)
120 120 120 11 120 120 24 19 
##$DBP= (0..7)
150 150 150 150 150 150 150 150 
##$DBP07= 0
##$DBPNAM0= <>
##$DBPNAM1= <>
##$DBPNAM2= <>
##$DBPNAM3= <>
##$DBPNAM4= <>
##$DBPNAM5= <>
##$DBPNAM6= <>
##$DBPNAM7= <>
##$DBPOAL= (0..7)
0.5 0.5 0.5 0.5 0.5 0.5 0.5 0.5 
##$DBPOFFS= (0..7)
0 0 0 0 0 0 0 0 
##$DE= 6
##$DECBNUC= <off>
##$DECIM= 4
##$DECNUC= <off>
##$DECSTAT= 4
##$DIGMOD= 1
##$DIGTYP= 9
##$DL= (0..7)
0 0 52 120 120 21 21 25 
##$DP= (0..7)
$$ [...]
##$SUBNAM2= <"">
##$SUBNAM3= <"">
##$SUBNAM4= <"">
##$SUBNAM5= <"">
##$SUBNAM6= <"">
##$SUBNAM7= <"">
##$SUBNAM8= <"">
##$SUBNAM9= <"">
##$SW= 369.568048894756
##$SWIBOX= (0..15)
0 1 3 0 0 0 0 0 0 0 0 0 0 0 0 0 
##$SW_h= 29940.119760479
##$TD= 32768
##$TD0= 1
##$TE= 0
##$TE2= 300
##$TE3= 300
##$TEG= 300
##$TL= (0..7)
0 120 53 12 22 120 120 120 
##$TP= (0..7)
150 150 150 150 150 150 150 150 
##$TP07= 0
##$TPNAME0= <>
##$TPNAME1= <>
##$TPNAME2= <>
##$TPNAME3= <>
##$TPNAME4= <>
##$TPNAME5= <>
##$TPNAME6= <>
##$TPNAME7= <>
##$TPOAL= (0..7)
0.5 0.5 0.5 0.5 0.5 0.5 0.5 0.5 
##$TPOFFS= (0..7)
0 0 0 0 0 0 0 0 
##$TUNHIN= 0
##$TUNHOUT= 0
##$TUNXOUT= 0
##$USERA1= <user>
##$USERA2= <user>
##$USERA3= <user>
##$USERA4= <user>
##$USERA5= <user>
##$V9= 5
##$VALIST= <valist>
##$VCLIST= <CCCCCCCCCCCCCCC>
##$VD= 0
##$VDLIST= <DDDDDDDDDDDDDDD>
##$VPLIST= <PPPPPPPPPPPPPPP>
##$VTLIST= <TTTTTTTTTTTTTTT>
##$WBST= 1024
##$WBSW= 4
##$XGAIN= (0..3)
0 0 0 0 
##$XL= 0
##$YL= 0
##$YMAX_a= 3715
##$YMIN_a= -7049
##$ZGOPTNS= <>
##$ZL1= 120
##$ZL2= 120
##$ZL3= 120
##$ZL4= 120
##$ABSF1= 0
##$ABSF2= 0
##$ABSG= 0
##$ABSL= 0
##$ALPHA= 0
##$AQORDER= 0
##$ASSFAC= 0
##$ASSFACI= 0
##$ASSFACX= 0
##$ASSWID= 0
##$AUNMP= <proc_1d>
##$AZFE= 0.1
##$AZFW= 0.5
##$BCFW= 0
##$BC_mod= 2
##$BYTORDP= 0
##$COROFFS= 0
##$CY= -3
##$DATMOD= 1
##$DC= 0
##$DFILT= <>
##$DTYPP= 0
##$F1P= 0
##$F2P= 0
##$FCOR= 1
##$FTSIZE= 65536
##$FT_mod= 6
##$GAMMA= 0
##$GB= 0
##$INTBC= 1
##$INTSCL= 5.30512e-09
##$ISEN= 30
##$LB= 1
##$LEV0= 0
##$LPBIN= 0
##$MAXI= 10000
##$MC2= 0
##$MEAN= 0
##$ME_mod= 0
##$MI= 50
##$NCOEF= 0
##$NC_proc= -10
##$NLEV= 6
##$NOISF1= 182.463
##$NOISF2= 159.3651
##$NSP= 0
##$NTH_PI= 0
##$NZP= 0
##$OFFSET= 182.463
##$PC= 4
##$PHC0= -887.2673
##$PHC1= 538.0007
##$PH_mod= 1
##$PKNL= yes
##$PPARMOD= 0
##$PSCAL= 0
##$PSIGN= 0
##$REVERSE= no
##$SF= 81.0140089999434
##$SI= 65536
##$SIGF1= 159.3651
##$SIGF2= -187.1042
##$SINO= 113.3802
##$SIOLD= 16384
##$SREGLST= <1H.CDCl3>
##$SSB= 0
##$STSI= 65536
##$STSR= 0
##$SW_p= 29940.119760479
##$SYMM= 0
##$S_DEV= 0
##$TDeff= 32768
##$TDoff= 0
##$TI= <>
##$TILT= no
##$TM1= 0
##$TM2= 0
##$TOPLEV= 0
##$USERP1= <user>
##$USERP2= <user>
##$USERP3= <user>
##$USERP4= <user>
##$USERP5= <user>
##$WDW= 1
##$XDIM= 65536
##$YMAX_p= 337315915
##$YMIN_p= -295380886
$$ End of Bruker specific parameters
$$ ---------------------------------
##NTUPLES= NMR SPECTRUM
##VAR_NAME=  FREQUENCY,     SPECTRUM/REAL,   SPECTRUM/IMAG
##SYMBOL=    X,             R,               I
##VAR_TYPE=  INDEPENDENT,   DEPENDENT,       DEPENDENT
##VAR_FORM=  AFFN,          ASDF,            ASDF
##VAR_DIM=   65536,         65536,           65536
##UNITS=     HZ,            ARBITRARY UNITS, ARBITRARY UNITS
##FACTOR=    0.456856943014862, 1,           1
##FIRST=     14782.0589164792, 0,            0
##LAST=      -15158.0608439998, 0,           0
##MIN=       -15158.0608439998, -295380886,  0
##MAX=       14782.0589164792, 337315915,    0
$$ Real data points
##PAGE= N=1
##DATA TABLE= (X++(R..R)), XYDATA
$$ [...]
##PAGE= N=2
##DATA TABLE= (X++(I..I)), XYDATA
$$ plain form
4656 -16615039 -7405862 3889899 20708186 31360997 23602893 3925792 -11684035
4649 -11684035 -21997194 -38620891 -60039758 -67162882 -51454014 -29833372 -20717268
4642 -20717268 -20624295 -18221385 -17340907 -27525685 -41197019 -40952330 -25983248 -12420324
4634 -12420324 -8665965 -8277232 -7532855 -11522424 -19180333 -19500632 -9157201 323751
4626 323751 -3732 -3905320 -1220728 9223471 23434323 37659800 44566082 36138983
4618 36138983 16759867 1408275 -5025884 -12273528 -21160702 -13663881 18980929 53914887
4610 53914887 62294830 47383887 36192021 39139080 40449184 28867765 17245502 24854824
4602 24854824 52968824 83450128 94052651 74899534 38030860 8457427 -3130546
$$ packed form
4656a6615039R209177J1295761J6818287J0652811p758104j9677101j5609827
4649a1684035j0313159j6623697k1418867p123124J5708868K1620642R116104
4642b0717268R2973K402910Q80478j0184778j3671334K44689J4969082J3562924
4634a2420324L754359L88733P44377l989569p657909l20299J0343431R480952
4626C23751l27483l901588K684592J0444199J4210852J4225477O906282q427099
4618C6138983j9379116j5351592o434159p247644q887174P496821L2644810L4933958
4610E3914887Q379943j4910943j1191866K947059J310104j1581419j1622263P609322
4602B4854824K8114000L0481304J0602523j9153117l6868674k9573433j1587973
$$ plain form
4595 -3130546 -13164398 -38522718 -65561836 -66424844 -42376793 -25110238 -30939438 -39896144
4587 -39896144 -31609894 -17930181 -21377593 -38421777 -45527801 -32228879 -9149945 11467923
4579 11467923 26749123 37137591 41966670 39859470 27030377 1686347 -23887063
4572 -23887063 -27921362 -6661746 15944852 20100530 16860700 23795696 29939437 14212509
4564 14212509 -10432073 -7009931 29263399 59277051 54530847 31648067 17294353
4557 17294353 9673183 -1202349 -1506622 24747477 57174505 58030188 26238793 -358040
4549 -358040 -352549 4304949 -11423858 -34594845 -34519882 -9412133 10347141 2718635 -20670303
4540 -20670303 -33507136 -25949579 -8486374 8206696 25367431 45583892 59175872
$$ packed form
4595c130546j0033852k5358320k7039118q63008K4048051J7266555n829200q956706
4587c9896144Q286250J3679713l447412j7044184p106024J3298922K3078934K0617868
4579A1467923J5281200J0388468M829079k107200j2829093k5344030k5573410
4572b3887063m034299K1259616K2606598M155678l239830O934996O143741j5726928
4564A4212509k4644582L422142L6273330L0013652m746204k2882780j4353714
4557A7294353p621170j0875532l04273K6254099L2427028Q55683l1791395k6596833
4549c58040N491M657498j5728807k3170987P4963K5107749J9759274p628506k3388938
4540b0670303j2836833P557557J7463205J6693070J7160735K0216461J3591980
$$ plain form
4533 59175872 51489648 23575894 -4337289 -15347887 -14999117 -20849408 -38303805 -55961428
4525 -55961428 -62069484 -55516311 -41264158 -25954530 -20445781 -35476421 -67219698 -93558377
4517 -93558377 -93465930 -69290558 -44668566 -39827124 -51427425 -57696563 -43315802 -17973062
4509 -17973062 -6270624 -17691418 -33807366 -32597310 -18058666 -11026829 -13348857 -2193311
4501 -2193311 31752737 59950707 48764215 6825841 -21508759 -9132916 25880117
4494 25880117 48899385 48349716 37532034 29549816 24463002 17513665 7881566 -3262554
4486 -3262554 -16637421 -32467633 -46051355 -49326006 -39027086 -22504423 -11811675
4479 -11811675 -10590405 -11411885 -9590810 -12921615 -28259404 -42347977 -30582400 10578241
$$ packed form
4533E9175872p686224k7913754k7913183j1010598L48770n850291j7454397j7657623
4525e5961428o108056O553173J4252153J5309628N508749j5030640l1743277k6338679
4517i3558377R2447K4175372K4621992M841442j1600301o269138J4380761K5342740
4509a7973062J1702438j1420794j6115948J210056J4538644P031837k322028J1155546
4501b193311L3946048K8197970j1186492m1938374k8334600J2375843L5013033
4494B5880117K3019268n49669j0817682p982218n086814o949337r632099j1144120
4486c262554j3374867j5830212j3583722l274651J0298920J6522663J0692748
4479a1811675J221270q21480J821075l330805j5337789j4088573J1765577M1160641
$$ plain form
4471 10578241 51409197 58045647 28300710 -8570532 -23314625 -11109658 11407435
4464 11407435 25152370 24447450 18946995 20919855 30219238 34966147 27836433 15415891
4456 15415891 7980081 6794642 7261836 8267498 10460373 9661835 593889 -14657284
4448 -14657284 -28085844 -33034815 -25497522 -4648121 20092693 29708138 15356522 -6463781
4440 -6463781 -10847491 6077528 26948944 38846313 43119586 40390922 25261887 2536847
4432 2536847 -7846143 6421888 31905602 43849826 33087777 12851664 4447519
4425 4447519 19034802 46295285 59868414 43635313 12974308 -2760271 1475961
4418 1475961 4167572 -3996715 -3973265 16736424 37740907 36294453 25563340 34995032
$$ packed form
4471A0578241M0830956O636450k9744937l6871242j4744093J2204967K2517093
4464A1407435J3744935p04920n500455J972860R299383M746909p129714j2420542
4456A5415891p435810j185439M67194J005662K192875p98538r067946j5251173
4448a4657284j3428560m948971P537293K0849401K4740814R615445j4351616k1820303
4440f463781m383710J6925019K0871416J1897369M273273k728664j5129035k2725040
4432B536847j0382990J4268031K5483714J1944224j0762049k0236113q404145
4425D447519J4587283K7260483J3573129j6233101l0661005j5734579M236232
4418A475961K691611q164287K3450K0709689K1004483j446454j0731113R431692
$$ plain form
4410 34995032 63208128 79143450 66824801 42475145 26032738 20007381 21165448
4403 21165448 30943012 45638098 53329656 49211412 40939572 33133857 20743042 4166009
4395 4166009 -3730484 4886512 19731950 26243804 23328880 18484221 13387746 4318990
4387 4318990 -7525406 -14718543 -11854358 -1023073 10621763 18288234 25111237 36740923
4379 36740923 48465442 46687120 30798968 22393311 38054131 62662340 69925639 62165945
4371 62165945 63507481 75688935 72250722 43955166 18355853 17857522 25825574 16983307
4363 16983307 -734907 -2482563 9330293 6316013 -24268143 -62140395 -78514508
4356 -78514508 -62720542 -26570252 5631351 16432575 15206528 29747476 66717305
$$ packed form
4410C4995032K8213096J5935322j2318649k4349656j6442407o025357J158067
4403B1165448R777564J4695086P691558m118244q271840p805715j2390815j6577033
4395D166009p896493Q616996J4845438O511854k914924m844659n096475r068756
4387D318990j1844396p193137K864185J0831285J1644836P666471O823003J1629686
4379C6740923J1724519j778322j5888152q405657J5660820K4608209P263299p759694
4371F2165945J341536J2181454l438213k8295556k5599313m98331P968052q842267
4363A6983307j7718214j747656J1812856l014280l0584156l7872252j6374113
4356g8514508J5793966L6150290L2201603J0801224j226047J4540948L6969829
$$ plain form
4349 66717305 94950417 85201220 50446810 22890188 6487274 -15000606 -33080798
4342 -33080798 -19496826 20438199 40432215 14376130 -28831796 -50912319 -53865068
4335 -53865068 -58752063 -61840126 -45853826 -18962615 -6597423 -9949807 -5806722 11701392
4327 11701392 20957245 11315794 1679209 6035256 6163924 -18882938 -53574949 -63039278
4319 -63039278 -42042595 -20425009 -19109389 -25618416 -21297724 -10717769 -8152938 -10118646
4311 -10118646 -1876227 14891545 20719730 5933778 -15301806 -22251904 -8651045 15912228
4303 15912228 36747954 44949109 45537982 53228115 70580731 75982108 50651953 14252125
4295 14252125 8390055 39241080 63748843 47250366 9445104 -8716385 -1662559
$$ packed form
4349F6717305K8233112r749197l4754410k7556622j6402914k1487880j8080192
4342c3080798J3583972L9935025J9994016k6056085m3207926k2080523k952749
4335e3865068m886995l088063J5986300K6891211J2365192l352384M143085J7508114
4327A1701392R255853r641451r636585M356047J28668k5046862l4692011r464329
4319f3039278K0996683K1617586J315620o509027M320692J0579955K564831j965708
4311a0118646Q242419J6767772N828185j4785952k1235584o950098J3600859K4563273
4303A5912228K0835726Q201155N88873P690133J7352616N401377k5330155l6399828
4295A4252125n862070L0851025K4507763j6498477l7805262j8161489P053826
$$ plain form
4288 -1662559 6473436 7776250 14572452 23089728 11365471 -19238937 -33227344 -7740083
4280 -7740083 32944961 47561844 27262614 -1229799 -11194081 -407474 13077099
4273 13077099 8829715 -17103021 -44462413 -46723629 -21979300 3184560 6037771 -7644629
4265 -7644629 -18940118 -22287297 -23365677 -21118474 -9349408 8011906 19827084 25400628
4257 25400628 33919585 44693160 44454763 31417959 26198307 43669826 64002786 53715799
4249 53715799 16342845 -1843332 29517549 79565376 93723658 66120966 42820113
4242 42820113 51127278 61093809 34891817 -15164817 -46449890 -44907962 -32768603 -28556713
4234 -28556713 -31117760 -37696427 -45992549 -39730082 -4320936 40663525 56527651 38341944
$$ packed form
4288a662559Q135995J302814O796202Q517276j1724257l0604408j3988407K5487261
4280g740083M0685044J4616883k0299230k8492413r964282J0786607J3484573
4273A3077099m247384k5932736k7359392k261216K4744329K5163860K853211j3682400
4265g644629j1295489l347179j078380K247203J1769066J7361314J1815178N573544
4257B5400628Q518957J0773575k38397j3036804n219652J7471519K0332960j0286987
4249E3715799l7372954j8186177L1360881N0047827J4158282k7602692k3300853
4242D2820113Q307165R966531k6201992n0056634l1285073J541928J2139359M211890
4234b8556713k561047o578667q296122O262467L5409146M4984461J5864126j8185707
$$ plain form
4226 38341944 20860513 24340289 29792220 21372744 15448833 23987509 23781859 -4959701
4218 -4959701 -36280064 -33212364 -7579530 -4779649 -36210180 -65510443 -63811884 -44872127
4210 -44872127 -36357133 -41913539 -44229602 -30788347 -7900115 3431045 -13618436 -48104567
4202 -48104567 -63305021 -36139711 12766917 44515771 47684773 37688445 21738899
4195 21738899 -4290722 -27428245 -22342224 6794386 21075805 -1651252 -36569145
4188 -36569145 -49648830 -40619918 -27875813 -13985247 6095449 18898401 6823941
4181 6823941 -17468816 -21953303 -1970942 12374191 2977014 -9373752 -1487057 10835121
4173 10835121 -5412120 -46302076 -68153702 -43895146 2394086 30701860 34415589
$$ packed form
4226C8341944j7481431L479776N451931q419476n923911Q538676k05650k8741560
4218d959701l1320363L067700K5632834K799881l1430531k9300263J698559J8939757
4210d4872127Q514994n556406k316063J3441255K2888232J1331160j7049481l4486131
4202d8104567j5200454K7165310M8906628L1748854L169002r996328j5949546
4195B1738899k6029621k3137523N086021K9136610J4281419k2727057l4917893
4188c6569145j3079685R028912J2744105J3890566K0080696J2802952j2074460
4181F823941k4292757m484487J9982361J4345133r397177j2350766P886695J2322178
4173A0835121j6247241m0889956k1851626K4258556M6289232K8307774L713729
$$ plain form
4166 34415589 32742382 28758039 7340085 -25836283 -38135014 -17212860 4303344
4159 4303344 -5338299 -28772141 -27291960 -2038548 8991437 -8416470 -24744924 -15801459
4151 -15801459 1792425 1605977 -12356747 -19174644 -16662799 -18607385 -26465080 -28146194
4143 -28146194 -22051847 -20928610 -29623734 -36411517 -31612212 -20963475 -13132224 -4836353
4135 -4836353 11262931 29892752 36483576 27766226 18838004 24019209 37531196 42073198
4127 42073198 33185079 23727570 23171921 24284820 15209168 -5738743 -32945404 -59335810
4119 -59335810 -71931473 -56474206 -20115781 4047036 -6518305 -33352318 -43847365
4112 -43847365 -38691375 -46311785 -75280789 -102318531 -109253884 -102084998 -87482453 -61001376
$$ packed form
4166C4415589j673207l984343k1417954l3176368j2298731K0922154K1516204
4159D303344r641643k3433842J480181K5253412J1029985j7407907j6328454Q943465
4151a5801459J7593884j86448j3962724o817897K511845j944586p857695j681114
4143b8146194O094347J123237q695124o787783M799305J0648737P831251Q295871
4135d836353J6099284J8629821O590824q717350q928222N181205J3511987M542002
4127D2073198q888119r457509n55649J112899r075652k0947911k7206661k6390406
4119e9335810j2595663J5457267L6358425K4162817j0565341k6834013j0495047
4112d3847365N155990p620410k8969004k7037742o935353P168886J4602545K6481077
$$ plain form
4104 -61001376 -30160184 -19587997 -35670442 -51149194 -43843647 -27180417 -21418297
4097 -21418297 -18625597 -3202401 13212069 9249122 -7936398 -15389346 -16134831 -32611654
4089 -32611654 -60777266 -67072433 -37651684 1197097 23240372 35066918 52761730
4082 52761730 69251802 66703894 47832302 33283583 32969250 37469431 37357431 36427008
4074 36427008 40865812 44711807 35340001 12555923 -6241094 -5685802 8257813 18068398
4066 18068398 19207886 19225473 13710383 -12518047 -50608666 -60874389 -23825892 22527271
4058 22527271 27336942 -3646047 -18268922 7223988 41272215 49496587 37642566
4051 37642566 28565660 27538758 29434179 35851688 44437408 40261263 17998662 -2551171
$$ packed form
4104f1001376L0841192J0572187j6082445j5478752P305547J6663230N762120
4097b1418297K792700J5423196J6414470l962947j7185520p452948p45485j6476823
4089c2611654k8165612o295167K9420749L8848781K2043275J1826546J7694812
4082E2761730J6490072k547908j8871592j4548719l14333M500181j12000r30423
4074C6427008M438804L845995r371806k2784078j8797017N55292J3943615R810585
4066A8068398J139488J7587n515090k6228430l8090619j0265723L7048497M6353163
4058B2527271M809671l0982989j4622875K5492910L4048227Q224372j1854021
4051C7642566r076906j026902J895421O417509Q585720m176145k2262601k0549833
$$ plain form
4043 -2551171 -1414033 14805021 27584817 32872731 34713076 27677391 7565628 -11414905
4035 -11414905 -12326888 -892615 4328849 -861490 -8479305 -18609234 -34788224 -46125648
4027 -46125648 -38931879 -23065139 -22036173 -37369548 -46951814 -40108149 -29854741 -26523959
4019 -26523959 -23989644 -19519749 -23519493 -37786611 -44116602 -28700162 -3286834 10442084
4011 10442084 6264738 -5833170 -12906276 -6313491 11691173 23598713 13769505 -6468682
4003 -6468682 -10756903 73298 -5889044 -40768642 -71103827 -65165723 -39882909 -30184075
3995 -30184075 -32474239 -16500171 17874813 36842579 25648915 7953303 4919132
3988 4919132 7471888 837781 -11165099 -20393618 -29662258 -39209865 -37671608 -20728567
$$ packed form
4043b551171J137138J6219054J2779796N287914J840345p035685k0111763j8980533
4035a1414905r11983J1434273N221464n190339p617815j0129929j6178990j1337424
4027d6125648P193769J5866740J028966j5333375r582266O843665J0253408L330782
4019b6523959K534315M469895l999744j4267118o329991J5416440K5413328J3728918
4011A0442084m177346j2097908p073106O592785J8004664J1907540r829208k0238187
4003f468682m288221J0830201n962342l4879598l0335185N938104K5282814R698834
3995c0184075k290164J5974068L4374984J8967766j1193664j7695612l034171
3988D919132K552756o634107j2002880r228519r268640r547607J538257J6943041
$$ plain form
3980 -20728567 -1578994 9461752 18121884 27370787 26388272 14197850 12973894 35480025
3972 35480025 56178874 40973589 -4729430 -43756143 -56980449 -59623757 -68855549
3965 -68855549 -79567188 -77736867 -60310596 -35830105 -16439166 -10556796 -13377099 -7480892
3957 -7480892 14762568 34366963 27679392 1302901 -14618244 -7266863 5945384 7930068
3949 7930068 3083954 413217 -3825770 -14591189 -25074696 -28092029 -28769231 -34943155
3941 -34943155 -45028071 -54394288 -63310556 -70397924 -69732726 -62649165 -59388051 -59917770
3933 -59917770 -48486758 -19754084 5979193 11000747 8720870 21637728 42170540
3926 42170540 42499193 18539161 -4666956 -13039499 -19989140 -34608246 -41559202 -29719076
$$ packed form
3980b0728567J9149573J1040746Q660132R248903r82515j2190422j223956K2506131
3972C5480025K0698849j5205285m5703019l9026713j3224306k643308r231792
3965f8855549j0711639J830321J7426271K4480491J9390939N882370k820303N896207
3957g480892K2243460J9604395o687571k6376491j5921145P351381J3212247J984684
3949G930068m846114k670737m238987j0765419j0483507l017333o77202o173924
3941c4943155j0084916r366217q916268p087368O65198P083561L261114n29719
3933e9917770J1431012K8732674K5733277N021554k279877J2916858K0532812
3926D2170540L28653k3960032k3206117q372543o949641j4619106o950956J1840126
$$ plain form
3918 -29719076 -17822774 -27472406 -45202219 -38834697 -6215440 19585738 16420568 -462254
3910 -462254 -7306318 -5022226 -7013014 -10528220 -2588426 13515306 21194393 18953277
3902 18953277 22900731 36856778 42874140 31747405 21666257 30414592 46844484 50092240
3894 50092240 42217193 37322982 29829028 3731227 -30699355 -41848353 -22489972 -425240
3886 -425240 5089501 7783533 21611723 33178592 28671108 23704475 38658465 61305868
3878 61305868 63569874 45487773 33589974 39930464 49580618 48513640 39644896 28691344
3870 28691344 15555422 3900394 643346 1360151 -7420071 -27353298 -44770478 -50780977
3862 -50780977 -49411171 -43512772 -30165573 -14510182 -9944278 -17111894 -19334326 -7550498
$$ packed form
3918b9719076J1896302r649632j7729813O367522L2619257K5801178l165170j6882822
3910d62254o844064K284092j990788l515206P939794J6103732P679087k241116
3902A8953277L947454J3956047O017362j1126735j0081148Q748335J6429892L247756
3894E0092240p875047m894211p493954k6097801l4430582j1148998J9358381K2064732
3886d25240N514741K694032J3828190J1566869m507484m966633J4953990K2647403
3878F1305868K264006j8082101j1897799O340490R650154j066978q868744j0953552
3870B8691344j3135922j1655028l257048P16805q780222j9933227j7417180o010499
3862e0780977J369806N898399J3347199J5655391M565904p167616k222432J1783828
$$ plain form
3854 -7550498 6182023 9871982 10002896 15881154 20726935 15338858 9196340 17959920
3846 17959920 35616357 39510009 23352801 6537479 5401746 11324369 7656717 -3220172
3838 -3220172 -4642984 6583964 13224972 2822582 -13256424 -16870245 -10977627 -15219711
3830 -15219711 -35657307 -55694286 -60656706 -54517081 -44435597 -26655949 -2032308
3823 -2032308 10738544 -1948612 -23876856 -30704538 -28070427 -40164084 -63361135 -63701256
3815 -63701256 -27771409 13928813 28669956 21001422 12750613 6637420 -6345524 -20200443
3807 -20200443 -22135241 -19038763 -29355330 -50864411 -60580719 -49108805 -34312332 -35442395
3799 -35442395 -51345623 -71207310 -90048819 -102471471 -95193871 -62852122 -25456694
$$ packed form
3854g550498J3732521L689959J30914N878258M845781n388077o142518Q763580
3846A7959920J7656437L893652j6157208j6815322j135733N922623l667652j0876889
3838c220172j422812J1226948O641008j0402390j6079006l613821N892618m242084
3830a5219711k0437596k0036979m962420O139625J0081484J7779648K4623641
3823b032308J2770852j2687156k1928244o827682K634111j2093657k3197051l40121
3815f3701256L5929847M1700222J4741143p668534q250809o113193j2982944j3854919
3807b0200443j934798L096478j0316567k1509081r716308J1471914J4796473j130063
3799c5442395j5903228j9861687j8841509j2422652P277600L2341749L7395428
$$ plain form
3792 -25456694 -12352687 -26155166 -37184611 -22094052 3329154 4662265 -22941221
3785 -22941221 -47106316 -44273888 -33013821 -43732295 -68300018 -65844440 -18938200
3778 -18938200 39618872 65032465 48893776 19216002 5522538 15521725 36655222
3771 36655222 48358919 37643579 11580141 -8840325 -11741392 -5164476 -1517204 -1422967
3763 -1422967 -197346 -541239 -8117806 -19831885 -25310312 -16883104 6386612 38451771
3755 38451771 65897357 76270343 72264403 68902778 71836628 69972423 56006379 39639836
3747 39639836 29277580 15522837 -10260640 -32652317 -28976453 -4729039 9294052
3740 9294052 -2860236 -23280991 -27561020 -16915049 -11930401 -20370029 -23543254 -349385
$$ packed form
3792b5456694J3104007j3802479j1029445J5090559K5423206J333111k7603486
3785b2941221k4165095K832428J1260067j0718474k4567723K455578M6906240
3778a8938200N8557072K5413593j6138689k9677774j3693464R999187K1133497
3771C6655222J1703697j0715340k6063438k0420466k901067O576916L647272R4237
3763a422967J225621l43893p576567j1714079n478427Q427208K3269716L2065159
3755C8451771K7445586J0372986m005940l361625K933850j864205j3966044j6366543
3747C9639836j0362256j3754743k5783477k2391677L675864K4247414J4023091
3740I294052j2154288k0420755m280029J0645971M984648q439628l173225K3193869
$$ plain form
3732 -349385 39944155 61454186 45192908 16824686 13957600 33869356 39714328 18087562
3724 18087562 -2193098 753219 7809167 -4238154 -22014313 -22373047 -15372512 -23206112
3716 -23206112 -33639145 -17145288 16954460 25409750 -4759352 -36408839 -36062676 -13680194
3708 -13680194 3568576 7489814 4230103 -1761469 -4458071 3047935 13257186 8954861
3700 8954861 -8312728 -16091014 -5930368 3893546 1738130 2583649 18531352 33653660
3692 33653660 28539530 10149587 -3135930 -8806255 -12743438 -11685524 -4526523 -5231627
3684 -5231627 -21497019 -34801292 -26656363 -12432533 -20700590 -45917285 -51596745 -21659618
3676 -21659618 17189954 30352748 13009731 -13988281 -30600008 -31699472 -23989769
$$ packed form
3732c49385M0293540K1510031j6261278k8368222k867086J9911756N844972k1626766
3724A8087562k0280660K946317P055948j2047321j7776159l58734P000535p833600
3716b3206112j0433033J6493857L4099748Q455290l0169102l1649487L46163K2382482
3708a3680194J7248770L921238l259711n991572k696602P506006J0209251m302325
3700H954861j7267589p778286J0160646R823914k155416Q45519J5947703J5122308
3692C3653660n114130j8389943j3285517n670325l937183J057914P159001p05104
3684e231627j6265392j3304273Q144929J4223830q268057k5216695n679460K9937127
3676b1659618L8849572J3162794j7343017k6998012j6611727j099464P709703
$$ plain form
3669 -23989769 -16254983 -11110531 -6147438 -2402221 -3702588 -5445371 2671260 15600449
3661 15600449 10706610 -20128971 -51755928 -57746143 -47949033 -51200780 -70149927 -80102581
3653 -80102581 -69629264 -54838036 -49513972 -45552411 -32210364 -16188256 -11123271 -17973912
3645 -17973912 -24033974 -15565249 10214614 39451314 51240254 41790165 32246586 39548808
3637 39548808 49186599 37401376 12602141 6445587 23804890 32206657 9389268 -26671869
3629 -26671869 -48616547 -55570233 -61049442 -66607351 -67678478 -68348744 -69201199 -55418951
3621 -55418951 -20423717 10345113 5988312 -24305671 -38463720 -16145673 16555398
3614 16555398 23264238 -573636 -31410442 -49514598 -54690943 -56387720 -58989111 -57878157
$$ packed form
3669b3989769P734786N144452M963093L745217j300367j742783Q116631J2929189
3661A5600449m893839l0835581l1626957n990215R797110l251747j8949147r952654
3653h0102581J0473317J4791228N324064L961561J3342047J6022108N064985o850641
3645a7973912o060062Q468725K5779863K9236700J1788940r450089r543579P302222
3637C9548808R637791j1785223k4799235o156554J7359303Q401767k2817389l6061137
3629b6671869k1944678o953686n479209n557909j071127o70266q52455J3782248
3621e5418951L4995234L0768830m356801l0293983j4158049K2318047L2701071
3614A6555398O708840k3837874l0836806j8104156n176345j696777k601391J110954
$$ plain form
3606 -57878157 -46486380 -26034323 -6656782 3095705 5327044 7936490 13833180 19843693
3598 19843693 23085162 22082563 14338139 510452 -10722389 -10984161 -5677472 -9588039
3590 -9588039 -25857771 -38027232 -29421514 -5102446 13075394 12014028 1632773 1646208
3582 1646208 17475396 32923812 27661757 -56146 -31382273 -47994577 -50687569 -52806574
3574 -52806574 -59109849 -60378152 -51192674 -43427453 -52390327 -72942310 -81110051 -62526885
3566 -62526885 -29463841 -3075821 12185651 24985220 34547957 29468121 10806044
3559 10806044 -2052419 1687909 6555125 -5216575 -23334982 -22469327 -916090 14272737
3551 14272737 3016964 -24192504 -43421363 -43468439 -28889400 -10036631 2484268 4296621
$$ packed form
3606e7878157J1391777K0452057J9377541R752487K231339K609446N896690O010513
3598A9843693L241469j002599p744424j3827687j1232841k61772N306689l910567
3590i588039j6269732j2169461Q605718K4319068J8177840j061366j0381255J3435
3582A646208J5829188J5448416n262055k7717903l1326127j6612304k692992k119005
3574e2806574o303275j268303R185478P765221q962874k0551983q167741J8583166
3566f2526885L3063044K6388020J5261472J2799569R562737n079836j8662077
3559A0806044j2858463L740328M867216j1771700j8118407Q65655K1553237J5188827
3551A4272737j1255773k7209468j9228859m7076J4579039J8852769J2520899J812353
$$ plain form
3543 4296621 4831606 17605197 36920319 37905414 9894489 -23121049 -29733421 -10159694
3535 -10159694 7063262 2320410 -15721045 -26011723 -17863473 2018112 16013276
3528 16013276 10534149 -7883857 -15569568 419038 23458622 28294054 14800435 4871150
3520 4871150 8688292 13228125 7173532 -1252436 222441 8868992 14283597 15297718
3512 15297718 18677488 25938122 29811991 21417238 -2868407 -36677953 -62115054 -59774160
3504 -59774160 -27053923 16546461 46390770 52220123 40383563 24308154 16337642
3497 16337642 20952899 29462432 26760923 9191945 -9356412 -14556788 -8579725 -2413145
3489 -2413145 2993917 16907979 41064550 62239768 66475790 54553272 38235803 23999749
$$ packed form
3543D296621N34985J2773591J9315122R85095k8010925l3015538o612372J9573727
3535a0159694J7222956m742852j8041455j0290678Q148250J9881585J3995164
3528A6013276n479127j8418006p685711J5988606K3039584M835432j3493619r929285
3520D871150L817142M539833o054593q425968J474877Q646551N414605J014121
3512A5297718L379770P260634L873869q394753k4285645l3809546k5437101K340894
3504e9774160L2720237M3600384K9844309N829353j1836560j6075409p970512
3497A6337642M615257Q509533k701509j7568978j8548357n200376N977063O166580
3489b413145N407062J3914062K4156571K1175218M236022j1922518j6317469j4236054
$$ plain form
3481 23999749 6750525 -18123286 -41672982 -48724837 -39122874 -31233629 -36679400 -40583147
3473 -40583147 -20127916 22261854 59869127 73814910 67269709 48564331 22189580
3466 22189580 1150675 2837959 19315304 15415409 -23567624 -62771287 -61955157 -32704634
3458 -32704634 -20691157 -40484029 -62299696 -61994890 -49210562 -39119811 -28942787
3451 -28942787 -16539569 -14751573 -28773346 -40401543 -33510700 -17659368 -8120322 321670
3443 321670 17903795 32401255 22847027 -5732016 -25491500 -22875745 -12447646 -12450863
3435 -12450863 -24018923 -37559259 -44876534 -40736431 -24216825 -3114903 10872402
3428 10872402 13494581 8742556 606613 -7857192 -10700855 -4796267 3424807 7896146
$$ packed form
3481B3999749j7249224k4873811k3549696p051855R601963P889245n445771l903747
3473d0583147K0455231M2389770L7607273J3945783o545201j8705378k6374751
3466B2189580k1038905J687284J6477345l899895l8983033l9203663Q16130K9250523
3458c2704634J2013477j9792872k1815667L04806J2784328J0090751J0177024
3451b8942787J2403218J787996j4021773j1628197O890843J5851332R539046Q441992
3443C21670J7582125J4497460r554228k8579043j9759484K615755J0428099l217
3435a2450863j1568060j3540336p317275M140103J6519606K1101922J3987305
3428A0872402K622179m752025q135943q463805k843663N904588Q221074M471339
$$ plain form
3420 7896146 15258914 32585663 46201180 33032231 -3293603 -27996813 -17353434
3413 -17353434 10441929 20476323 5971383 -8106471 -1109131 19119735 29407053
3406 29407053 18289341 -3222241 -12778613 2255428 30932126 46543730 32854355
3399 32854355 2150887 -17590539 -13409318 755829 4771992 -2588414 -7174431 -4215603
3391 -4215603 -6504412 -22986479 -41080586 -42546734 -29888590 -20990963 -20018583 -12386768
3383 -12386768 8747426 31055826 45274111 57603685 67354444 54724746 12180292
3376 12180292 -30467747 -39708037 -24418981 -18222521 -24763586 -16079422 15390446 41015850
3368 41015850 41402714 33248639 34803214 34359206 14671232 -14602101 -32821261 -40251688
$$ packed form
3420G896146P362768J7326749J3615517j3168949l6325834k4703210J0643379
3413a7353434K7795363J0034394j4504940j4077854O997340K0228866J0287318
3406B9407053j1117712k1511582r556372J5034041K8676698J5611604j3689375
3399C2854355l0703468j9741426M181221J4165147M016163p360406m586017K958828
3391d215603k288809j6482067j8094107j466148J2658144Q897627R72380P631815
3383a2386768K1134194K2308400J4218285J2329574R750759j2629698m2544454
3376A2180292m2648039r240290J5289056O196460o541065Q684164L1469868K5625404
3368D1015850L86864q154075J554575m44008j9687974k9273333j8219160p430427
$$ plain form
3360 -40251688 -51264770 -67625778 -79411009 -83751511 -84226233 -78582874 -63038772 -42850978
3352 -42850978 -25878680 -12662278 -2960716 -1732842 -8372148 -13012440 -14378808 -24661152
3344 -24661152 -43015957 -44635857 -16562332 15179769 19906275 6502030 3557822 10648048
3336 10648048 5544670 -9439535 -9100232 7245914 10854794 -6451852 -15907497 162084
3328 162084 18398138 12932463 -4209781 -4981753 13006699 30026963 34399479 27572449
3320 27572449 10507949 -14571140 -35717666 -41162536 -33403161 -22971272 -15867632 -16140207
3312 -16140207 -28836532 -47419982 -49733106 -22884237 15034555 33375205 24020841
3305 24020841 4653633 -7778755 -12610065 -17172474 -25660701 -35761710 -38489580 -25572926
$$ packed form
3360d0251688j1013082j6361008j1785231m340502m74722N643359J5544102K0187794
3352d2850978J6972298J3216402R701562J227874o639306m640292j366368j0282344
3344b4661152j8354805j619900K8073525L1742101M726506j3404245k944208P090226
3336A0648048n103378j4984205L39303J6346146L608880j7306646r455645J6069581
3328A62084J8236054n465675j7142244p71972J7988452J7020264M372516o827030
3320B7572449j7064500k5079089k1146526n444870P759375J0431889P103640k72575
3312a6140207j2696325j8583450k313124K6848869L7918792J8340650r354364
3305B4020841j9367208j2432388m831310m562409q488227j0101009k727870J2916654
$$ plain form
3297 -25572926 -4788247 303995 -21365716 -47402998 -45772332 -16398637 9101077
3290 9101077 10111550 51288 -654206 3301892 -6973417 -30874969 -44996680 -35303931
3282 -35303931 -17001738 -13635543 -26644364 -38532779 -41180904 -44039180 -51263422 -48297939
3274 -48297939 -23339341 10157776 28844968 30601571 32904317 43473868 51630962 50257590
3266 50257590 47497319 50569155 54007464 52065802 49220515 49438620 46714984 35692609
3258 35692609 21992565 13164680 7985480 2660777 -1120905 -2339430 -5863601 -12382412
3250 -12382412 -11060460 7351763 34789367 52028277 48300212 30010783 13061849
3243 13061849 8710174 12629596 8407387 -11394706 -31057182 -30491577 -14717088 -6833937
$$ packed form
3297b5572926K0784679N092242k1669711k6037282J630666K9373695K5499714
3290I101077J010473j0060262p05494L956098j0275309k3901552j4121711R692749
3282c5303931J8302193L366195j3008821j1888415k648125k858276p224242K965483
3274d8297939K4958598L3497117J8687192J756603K302746J0569551Q157094j373372
3266E0257590k760271L071836L438309j941662k845287K18105k723636j1022375
3258C5692609j3700044q827885n179200n324703l781682j218525l524171o518811
3250a2382412J321952J8412223K7437604J7238910l728065j8289429j6948934
3243A3061849m351675L919422m222209j9802093j9662476N65605J5774489P883151
$$ plain form
3235 -6833937 -12160329 -11840255 3076059 15869217 13195209 5858309 5208812 1726336
3227 1726336 -12819127 -22728587 -13203089 -2104250 -18503523 -57612038 -83327087 -72488902
3219 -72488902 -35222904 4917320 30223454 31276561 11209660 -11166117 -17604473
3212 -17604473 -9247957 1287253 8962584 13660706 9116072 -6516292 -17797556 -10580558
3204 -10580558 3810781 4292049 -7993285 -17382345 -25383019 -44864165 -65208722 -56341705
3196 -56341705 -14509294 24353964 29117242 10165599 -375845 10911150 29064262
3189 29064262 31347790 11368548 -11086303 -7068442 25101505 49284230 33989036
3182 33989036 -4549321 -24465394 -14553992 -157377 1424398 -1730546 -3491537 -10093006
$$ packed form
3235f833937n326392L20074J4916314J2793158k674008p336900o49497l482476
3227A726336j4545463r909460R525498J1098839j6399273l9108515k5715049J0838185
3219g2488902L7265998M0140224K5306134J053107k0066901k2375777o438356
3212a7604473Q356516J0535210P675331M698122m544634j5632364j1281264P216998
3204a0580558J4391339M81268j2285334r389060q000674j9481146k0344557Q867017
3196e6341705M1832411L8863258M763278j8951643j0541444J1286995J8153112
3189B9064262K283528j9979242k2454851M017861L2169947K4182725j5295194
3182C3989036l8538357j9916073R911402J4396615J581775l154944j760991o601469
$$ plain form
3174 -10093006 -17736367 -11786119 4600724 11791997 9342700 16089761 27367910 12189360
3166 12189360 -31481165 -58809419 -38855163 1857211 22299135 20562477 16227532
3159 16227532 11207128 2074826 4548342 29269927 54021811 54319353 41886308 38935396
3151 38935396 35903235 13682756 -11601920 -10568401 5531305 -1372984 -35263479 -63270303
3143 -63270303 -69638194 -67412931 -57925761 -27459529 10132589 17187952 -7473697 -18976320
3135 -18976320 2840232 18367850 -7283568 -45091728 -45669892 -12687848 9618801
3128 9618801 4906288 -1726882 7173817 17453080 13426398 2382942 -978178 5107875
3120 5107875 14095795 22692909 30335333 36468196 43029928 51394066 53728886 37022109
$$ packed form
3174a0093006p643361N950248J6386843P191273k449297O747061J1278149j5178550
3166A2189360m3670525k7328254J9954256M0712374K0441924j736658m334945
3159A6227532n020404r132302K473516K4721585K4751884K97542j2433045k950912
3151C8935396l032161k2220479k5284676J033519J6099706o904289l3890495k8006824
3143f3270303o367891K225263R487170L0466232L7592118P055363k4661649j1502623
3135a8976320K1816552J5527618k5651418l7808160n78164L2982044K2306649
3128I618801m712513o633170Q900699J0279263m026682j1043456l361120O086053
3120E107875Q987920Q597114P642424O132863O561732Q364138K334820j6706777
$$ plain form
3112 37022109 2036711 -28564056 -29693840 -667500 33127608 46375030 37332201
3105 37332201 22947916 15498493 11505289 3199901 -8464621 -16841929 -18155513 -10909192
3097 -10909192 6183515 27780565 40291648 36997431 29349178 31662169 39601419 37959785
3089 37959785 26366736 20129174 24712958 27225928 19030174 11163350 17845329 36004942
3081 36004942 51242282 56383517 55023360 52060483 48937164 45929822 44313880 47522523
3073 47522523 59874059 78539570 87224346 67546586 21197598 -25778331 -45161113
3066 -45161113 -29554406 6024918 37767588 48031770 36801558 21779707 19406405
3059 19406405 24041641 15287392 -12215814 -38284079 -41697454 -24112151 -2258714 13771058
$$ packed form
3112C7022109l4985398l0600767j129784K9026340L3795108J3247422r042829
3105C7332201j4384285p449423l993204q305388j1664522q377308j313584P246321
3097a0909192J7092707K1597050J2511083l294217p648253K312991P939250j641634
3089C7959785j1593049o237562M583784K512970q195754p866824O681979J8159613
3081C6004942J5237340N141235j360157k962877l123319l007342j615942L208643
3073D7522523J2351536J8665511Q684776j9677760m6348988m6975929j9382782
3066d5161113J5606707L5579324L1742670J0264182j1230212j5021851k373302
3059A9406405M635236q754249k7503206k6068265l413375J7585303K1853437J6029772
$$ plain form
3051 13771058 25010339 33576406 38539223 39339903 36664505 31633455 27177540 26114559
3043 26114559 25267941 17139864 682679 -15095838 -20739483 -13500986 5798345 33240187
3035 33240187 56199202 58955580 40952041 20372642 13003571 16801545 23241555 30659146
3027 30659146 35432526 23767848 -9352657 -40957246 -41412773 -14766413 2299045 -13011509
3019 -13011509 -41743519 -51235096 -35830951 -14924811 -798648 11425393 22681967
3012 22681967 19884504 -2533760 -25318491 -25322550 -8087883 -2068110 -19690209 -40783491
3004 -40783491 -40052656 -16078212 14820910 38645978 46432906 31975642 3564392 -13294305
2996 -13294305 -4017351 12118198 6686634 -17553443 -33300448 -30153428 -23519286 -23171958
$$ packed form
3051A3771058J1239281Q566067M962817Q00680k675398n031050m455915j062981
3043B6114559q46618q128077j6457185j5778517n643645P238497J9299331K7441842
3035C3240187K2959015K756378j8003539k0579399p369071L797974O440010P417591
3027C0659146M773380j1664678l3120505l1604589m55527K6646360J7065458j5310554
3019a3011509k8732010r491577J5404145K0906140J4126163J2224041J1256574
3012B2681967k797463k2418264k2784731m059J7234667O019773j7622099k1093282
3004d0783491P30835K3974444L0899122K3825068P786928j4457264k8411250j6858697
2996a3294305R276954J6135549n431564k4240077j5747005L147020O634142L47328
$$ plain form
2988 -23171958 -20227061 -9341755 2063183 12918122 31854496 54669942 64290944
2981 64290944 60851305 63515980 72803044 63753922 31935985 10960619 20707325 32582515
2973 32582515 17454886 -4184323 757424 18804033 15427070 -458052 7818892 33481423
2965 33481423 29430879 -11789363 -36852053 -9276749 38110347 53465486 31429900
2958 31429900 1114494 -20416994 -32532804 -31364465 -15176107 4091610 16301365
2951 16301365 27025962 39714526 42296285 30365121 23645462 35874181 46614511
2944 46614511 30751631 1664282 -5878615 12277616 25707767 15493867 -3700542
2937 -3700542 -9822724 2020121 24621525 47641969 57624345 46975368 26431904 13467917
$$ packed form
2988b3171958K944897J0885306J1404938J0854939J8936374K2815446R621002
2981F4290944l439639K664675R287064r049122l1817937k0975366R746706J1875190
2973C2582515j5127629k1639209M941747J8046609l376963j5885122Q276944K5662531
2965C3481423m050544m1220242k5062690K7575304M7387096J5355139k2035586
2958C1429900l0315406k1531488j2115810J168339J6188358J9267717J2209755
2951A6301365J0724597J2688564K581759j1931164o719659J2228719J0740330
2944D6614511j5862880k9087349p542897J8156231J3430151j0213900j9194409
2937c700542o122182J1842845K2601404K3020444R982376j0648977k0543464j2963987
$$ plain form
2929 13467917 8261125 -2091928 -17311562 -23423813 -20141920 -25495133 -46425997 -65778258
2921 -65778258 -67461391 -55943705 -42031350 -27965753 -15774961 -10409067 -4082047 19470713
2913 19470713 50310888 48446355 46455 -45819224 -33003333 22069370 48709783
2906 48709783 19877557 -11652868 10089160 69148584 106487203 97590230 66893705
2899 66893705 38280865 9439270 -20909012 -32878896 -10666770 28751251 51281694
2892 51281694 45102957 30274763 29386427 40184350 42190896 24063266 -2803064 -17462437
2884 -17462437 -10764970 8874608 27042090 35616344 34823255 29085943 22738474 15944426
2876 15944426 3747165 -16310254 -35089703 -37884239 -23067253 -6660338 -2005244
$$ packed form
2929A3467917n206792j0353053j5219634o112251L281893n353213k0930864j9352261
2921f5778258j683133J1517686J3912355J4065597J2190792N365894O327020K3552760
2913A9470713L0840175j864533m8399900m5865679J2815891N5072703K6640413
2906D8709783k8832226l1530425K1742028N9059424L7338619q896973l0696525
2899F6893705k8612840k8841595l0348282j1969884K2212126L9418021K2530443
2892E1281694o178737j4828194q88336J0797923K006546j8127630k6866330j4659373
2884a7462437O697467J9639578J8167482Q574254p93089n737312o347469o794048
2876A5944426j2197261k0057419j8779449k794536J4816986J6406915M655094
$$ plain form
2869 -2005244 -3098730 2072502 9229835 3928589 -12650815 -21532836 -13425049 -2050910
2861 -2050910 -1063439 -1942482 10059041 26385078 20823104 -13288220 -47121851 -47520102
2853 -47520102 -17400898 5852807 -6235656 -38851716 -49368182 -15424114 40618181
2846 40618181 78338928 80975899 60609056 29942388 -10853037 -55862489 -83716816
2839 -83716816 -82297494 -69980399 -71828556 -80728520 -65230071 -17872286 27878657 40598885
2831 40598885 32022583 35593520 54092107 53488132 12440266 -43126021 -68664963 -52855463
2823 -52855463 -24499375 -12034712 -14242906 -14807119 -8653164 -1512341 5495144 14928898
2815 14928898 22433506 23882080 30015219 53624803 80026349 74013933 27835746 -19057285
$$ packed form
2869b005244j093486N171232P157333n301246j6579404q882021Q107787J1374139
2861b050910R87471q79043J2001523J6326037n561974l4111324l3833631l98251
2853d7520102L0119204K3253705j2088463l2616060j0516466L3944068N6042295
2846D0618181L7720747K636971k0366843l0666668m0795425m5009452k7854327
2839h3716816J419322J2317095j848157q899964J5498449M7357785M5750943J2720228
2831D0598885q576302L570937J8498587o03975m1047866n5566287k5538942J5809500
2823e2855463K8356088J2464663k208194n64213O153955P140823P007485R433754
2815A4928898P504608J448574O133139K3609584K6401546o012416m6178187m6893031
$$ plain form
2807 -19057285 -27280014 -8395510 -4696034 -29068481 -53596906 -55136411 -42069294 -30219883
2799 -30219883 -20616591 -13524132 -19249307 -37179978 -45458180 -33397920 -26223073 -50757165
2791 -50757165 -89394719 -99740365 -74730857 -49338489 -44867943 -42240547 -23947077
2784 -23947077 -8823262 -19694809 -41423896 -43623887 -30184397 -30088959 -43873292 -37767946
2776 -37767946 532746 34884543 29044153 -3203484 -20842480 -11575025 2556999
2769 2556999 6403594 8480462 14538966 11537006 -9714469 -33952465 -39509905 -28043360
2761 -28043360 -21207745 -29926975 -39646507 -29964106 -1428012 24496960 31421160 26578453
2753 26578453 27603771 35736337 34717357 18849203 7565331 20679646 49456834 68090646
$$ packed form
2807a9057285q222729J8884504L699476k4372447k4528425j539505J3067117J1849411
2799c0219883R603292P092459n725175j7930671q278202J2060260P174847k4534092
2791e0757165l8637554j0345646K5009508K5392368M470546K627396J8293470
2784b3947077J5123815j0871547k1729087k199991J3439490R5438j3784333O105346
2776c7767946L8300692L4351797n840390l2247637j7638996R267455J4132024
2769B556999L846595K076868O058504l001960k1251475k4237996n557440J1466545
2761b8043360O835615q719230r719532R682401K8536094K5924972O924200m842707
2753B6578453J025318Q132566j018980j5868154j1283872J3114315K8777188J8633812
$$ plain form
2745 68090646 68446240 65523764 69219037 69748643 56934651 38272830 27933845 27443356
2737 27443356 26435642 17314181 3047161 -6689991 -5546477 162209 -4224254 -20842918
2729 -20842918 -29546962 -12806370 15572061 26250072 15848834 7683305 9022923 -2328109
2721 -2328109 -36695877 -66430187 -62059780 -32939439 -8793152 1720896 9134607 13887264
2713 13887264 6196166 -11991206 -28742558 -40625582 -48766854 -43655017 -16827702 17147051
2705 17147051 33166428 27223123 15059136 4355148 -8502935 -18191243 -13746114 -2774601
2697 -2774601 -6611414 -27292139 -42547118 -38319911 -23872577 -9116929 10149404 35261574
2689 35261574 52791382 51176629 36159527 22357644 20145543 32314810 50076247
$$ packed form
2745F8090646L55594k922476L695273N29606j2813992j8661821j0338985m90489
2737B7443356j007714r121461j4267020r737152J143514N708686m386463j6618664
2729b0842918q704044J6740592K8378431J0678011j0401238q165529J339618j1351032
2721b328109l4367768k9734310M370407K9120341K4146287J0514048P413711M752657
2713A3887264p691098j8187372j6751352j1883024q141272N111837K6827315L3974753
2705A7147051J6019377n943305j2163987j0703988j2858083r688308M445129J0971513
2697b774601l836813k0680725j5254979M227207J4447334J4755648J9266333K5112170
2689C5261574J7529808j614753j5017102j3801883k212101J2169267J7761437
$$ plain form
2682 50076247 53120612 30642993 1600376 -4892416 11723571 25629751 24110954 19706878
2674 19706878 22190996 26104456 29505213 35993023 33723229 5675293 -30869221 -32519977
2666 -32519977 6127269 33451696 10225624 -34660957 -47918832 -24087406 256470
2659 256470 5057978 4077579 13406661 32119552 48884207 47180191 13789274 -39107961
2651 -39107961 -74240405 -72055770 -57551077 -62372724 -78534676 -77347882 -57428737 -41068114
2643 -41068114 -34225053 -23931032 -9334985 -3552912 -7735279 -11390332 -14205658 -20224403
2635 -20224403 -17047959 7987453 35620355 32410063 108992 -25979942 -29494373 -29360780
2627 -29360780 -38133120 -39156869 -18520262 9218926 23237802 22869084 18630045 14946680
$$ packed form
2682E0076247L044365k2477619k9042617o492792J6615987J3906180j518797m404076
2674A9706878K484118L913460L400757O487810k269794k8047936l6544514j650756
2666c2519977L8647246K7324427k3226072m4886581j3257875K3831426K4343876
2659B56470M801508r80399R329082J8712891J6764655j704016l3390917n2897235
2651c9107961l5132444K184635J4504693m821647j6161952J186794J9919145J6360623
2643d1068114O843061J0294021J4596047N782073m182367l655053k815326o018745
2635b0224403L176444K5035412K7632902l210292l2301071k6088934l514431J33593
2627b9360780q772340j023749K0636607K7739188J4018876l68718m239039l683365
$$ plain form
2619 14946680 12412409 11693379 8450541 -515383 -4098109 11302880 36075425 46132527
2611 46132527 39069130 35987170 43562941 42993947 25060885 7365996 3846173 3506258
2603 3506258 -5596086 -15474930 -17443735 -19721550 -28716888 -33341113 -25652144 -18231239
2595 -18231239 -23145120 -31081993 -29106343 -22364161 -20018954 -15677582 -1023251 14975476
2587 14975476 19136658 14081533 8750966 2854806 -2102475 7970415 38086121 64620786
2579 64620786 60990757 34498513 15243599 14624712 17076447 9733300 -1294374 -5469342
2571 -5469342 -1508300 6484181 14872421 20671506 23026174 23152396 19188687 8555325
2563 8555325 -270442 8483267 33216657 48771390 38510641 18285531 11118260 11751615
$$ packed form
2619A4946680k534271p19030l242838q965924l582726J5400989K4772545J0057102
2611D6132527p063397l081960P575771n68994j7933062j7694889l519823l39915
2603C506258r102344r878844j968805k277815q995338m624225P688969P420905
2595a8231239m913881p936873J975650O742182K345207M341372J4654331J5998727
2587A4975476M161182n055125n330567n896160m957281J0072890L0115706K6534665
2579F4620786l630029k6492244j9254914o18887K451735p343147j1027674m174968
2571e469342L961042P992481Q388240N799085K354668J26222l963709j0633362
2563H555325q825767Q753709K4733390J5554733j0260749k0225110p167271O33355
$$ plain form
2555 11751615 -620430 -23339962 -30787729 -13386124 8101976 12588429 3679533 -3272803
2547 -3272803 -4232713 -6539163 -14969632 -27105024 -38426096 -45061167 -42992519 -30321546
2539 -30321546 -12086922 1211697 4734261 6377341 13976585 17049629 -1526739 -30077733
2531 -30077733 -28659005 16096755 60467610 58124879 24163601 5141726 5346148 -2142681
2523 -2142681 -4463298 37097670 97946740 102928444 59444887 84197031 229560394
2516 229560394 362993033 318123493 118651985 -54799399 -97945233 -72490108 -63680486
2509 -63680486 -64706968 -40217210 -9045484 -2966881 -5847130 8384743 21848161 7646138
2501 7646138 -17478168 -22263141 -13057665 -13849299 -20060835 -13187041 952420 7680731
$$ packed form
2555A1751615j2372045k2719532p447767J7401605K1488100M486453q908896o952336
2547c272803r59910k306450q430469j2135392j1321072o635071K068648J2670973
2539c0321546J8234624J3298619L522564J643080P599244L073044j8576368k8550994
2531c0077733J418728M4755760M4370855k342731l3961278j9021875K04422p488829
2523b142681k320617M1560968O0849070M981704m3483557K4752144J45363363
2516B29560394J33432639m4869540j99471508j73451384m3145834K5455125Q809622
2509f3680486j026482K4489758L1171726O078603k880249J4231873J3463418j4202023
2501G646138k5124306m784973R205476p91634o211536O873794J4139461O728311
$$ plain form
2493 7680731 16811678 41845934 63552731 53336330 19706707 -5041158 -12587647 -17370219
2485 -17370219 -19352589 -6899974 9231872 3390458 -22991075 -40260472 -33273761 -15349170
2477 -15349170 1447624 19142799 33173844 29167928 8566519 -8591477 -14911837
2470 -14911837 -25052011 -44787130 -55966253 -46136889 -30754833 -28287992 -31444579 -23777932
2462 -23777932 -11573776 -15356002 -35092986 -47829258 -42764875 -37151260 -46580782 -56544669
2454 -56544669 -42394773 -9375475 10544857 4031040 -4935679 6547973 24704241
2447 24704241 22842499 4580801 -4594785 -92755 -1026124 -12446308 -18244841 -15543906
2439 -15543906 -21103745 -33714365 -27119583 1888633 15000956 -11165087 -42506465
$$ packed form
2493G680731R130947K5034256K1706797j0216401l3629623k4747865p546489m782572
2485a7370219j982370J2452615J6131846n841414k6381533j7269397O986711J7924591
2477a5349170J6796794J7695175J4031045m005916k0601409j7157996o320360
2470a4911837j0140174j9735119j1179123R829364J5382056K466841l156587P666647
2462b3777932J2204156l782226j9736984j2736272N064383N613615r429522r963887
2454e6544669J4149896L3019298J9920332o513817q966719J1483652J8156268
2447B4704241j861742j8261698r175586M502030r33369j1420184n798533K700935
2439a5543906n559839j2610620O594782K9008216J3112323k6166043l1341378
$$ plain form
2432 -42506465 -35375551 -1266464 15201789 4761564 -1006517 17050873 45377447
2425 45377447 66019527 70581122 50335871 7596832 -25232579 -13780026 29638881
2418 29638881 59052910 57425857 50140369 53055780 48425436 25364932 5370726 6003492
2410 6003492 9907882 -5974257 -33694459 -49917793 -50373201 -47937456 -50015722 -54874389
2402 -54874389 -59274973 -57881203 -47071845 -36185697 -38250726 -44624354 -32219257 -3242139
2394 -3242139 11270821 25844 -9443695 75462 3123613 -20668833 -39954510 -16315869
2386 -16315869 27952630 37601843 9132389 -5429996 18809825 45282157 38691647
2379 38691647 15108645 3572090 -3924165 -28569697 -56288579 -53685866 -23117502
$$ packed form
2432d2506465P130914L4109087J6468253j0440225n768081J8057390K8326574
2425D5377447K0642080M561595k0245251m2739039l2829411J1452553M3418907
2418B9638881K9414029j627053p285488K915411m630344k3060504j9994206O32766
2410F003492L904390j5882139k7720202j6223334m55408K435745k078266m858667
2402e4874389m400584J393770J0809358J0886148k065029o373628J2405097K8977118
2394c242139J4512960j1244977r469539R519157L048151k3792446j9285677K3638641
2386a6315869M4268499R649213k8469454j4562385K4239821K6472332o590510
2379C8691647k3583002j1536555p496255k4645532k7718882K602713L0568364
$$ plain form
2372 -23117502 -4432596 -18701657 -41122799 -41481613 -26999514 -24739977 -36030589 -35163011
2364 -35163011 -13527215 1360506 -14035729 -38506146 -31001576 9410255 37731707
2357 37731707 24191052 -6336828 -13936001 -422869 323072 -23799530 -49419037 -55669829
2349 -55669829 -47342675 -35215511 -18654970 1620880 13838490 11816678 6707047 9538615
2341 9538615 14574931 12743615 9985718 16928085 28143502 27955254 13958804 551909
2333 551909 -862035 6824563 16566410 28138157 44179893 61078773 68746384 59110014
2325 59110014 34744416 9416793 -3102261 -3179525 -4410032 -15143041 -26470983 -25623277
2317 -25623277 -16721433 -17298659 -33940931 -52201246 -55102733 -43215430 -30091634 -24633336
$$ packed form
2372b3117502J8684906j4269061k2421142l58814J4482099K259537j1290612Q67578
2364c5163011K1635796J4887721j5396235k4470417P504570M0411831K8321452
2357C7731707j3540655l0527880p599173J3513132P45941k4122602k5619507o250792
2349e5669829Q327154J2127164J6560541K0275850J2217610k021812n109631K831568
2341I538615N036316j831316k757897O942367J1215417j88248j3996450j3406895
2333E51909j413944P686598R741847J1571747J6041736J6898880P667611r636370
2325E9110014k4365598k5327623j2519054p7264j230507j0733009j1327942Q47706
2317b5623277Q901844n77226j6642272j8260315k901487J1887303J3123796N458298
$$ plain form
2309 -24633336 -26515194 -34398768 -47232798 -57125119 -52426552 -33128780 -14372268 -7169770
2301 -7169770 -3008552 11937010 32461533 38328671 22625906 1452112 -9197611 -11963355
2293 -11963355 -15044520 -14496717 -4157377 6334652 1955728 -12297709 -14617225 3449634
2285 3449634 26780254 40941064 50284674 63377403 74559470 72331617 56888017 37279348
2277 37279348 17903948 -406784 -11330723 -7991733 5139348 16202700 20055587
2270 20055587 18105562 6975568 -18463974 -48966979 -61776454 -44595730 -10202313
2263 -10202313 18226273 28573655 22188128 5299042 -12635330 -19367451 -10416397 3023633
2255 3023633 5957351 -2383766 -11266748 -16908392 -25891654 -38379480 -41783011 -30091253
$$ packed form
2309b4633336j881858p883574j2834030r892321M698567J9297772J8756512P202498
2301g169770M161218J4945562K0524523N867138j5702765k1173794j0649723k765744
2293a1963355l081165N47803J0339340J0492029m378924j4253437k319516J8066859
2285C449634K3330620J4160810R343610J3092729J1182067k227853j5443600j9608669
2277C7279348j9375400j8310732j0923939L338990J3131081J1063352L852887
2270B0055587j950025j1129994k5439542l0503005j2809475J7180724L4393417
2263a0202313K8428586J0347382o385527j6889086j7934372o732121Q951054J3440030
2255C023633K933718q341117q882982n641644q983262j2487826l403531J1691758
$$ plain form
2247 -30091253 -19456569 -30348170 -56770754 -68195187 -47337631 -14404199 -2501664
2240 -2501664 -14461604 -19266561 4874904 38022667 42626864 14036736 -11525408 -4090595
2232 -4090595 21951147 30615067 13448950 -4890565 -6955555 -3758598 -7636563 -6974070
2224 -6974070 12080366 32884110 23680442 -15818972 -47275146 -40050448 -6337529 19804243
2216 19804243 23198298 14267113 6645880 4512341 7483395 13219248 15135700 8118806
2208 8118806 -3462828 -11855471 -17957915 -26892419 -32959036 -22472177 4530629 27108787
2200 27108787 25803856 5674664 -9905219 -4385874 18154384 40282538 46654031 34510146
2192 34510146 13913403 -2133354 -8949810 -10431393 -9711116 -5581998 814663 3499578
$$ packed form
2247c0091253J0634684j0891601k6422584j1424433K0857556L2933432J1902535
2240b501664j1959940m804957K4141465L3147763M604197k8590128k5562144P434813
2232d090595K6041742Q663920j7166117j8339515k064990L196957l877965O62493
2224f974070J9054436K0803744r203668l9499414l1456174P224698L3712919K6141772
2216A9804243L394055q931185p621233k133539K971054N735853J916452p016894
2208H118806j1581634q392643o102444q934504o066617J0486859K7002806K2578158
2200B7108787j304931k0129192j5579883N519345K2540258K2128154O371493j2143885
2192C4510146k0596743j6046757o816456j481583P20277M129118O396661K684915
$$ plain form
2184 3499578 444863 -1300472 5167043 17491252 29753931 40855326 48851806 43027101
2176 43027101 14648678 -25068583 -50886322 -51675380 -42857657 -45422900 -60784782 -73359853
2168 -73359853 -71845246 -59752964 -47790055 -42765787 -43067760 -40799317 -30282342 -17279116
2160 -17279116 -14871320 -25470579 -33926645 -27784299 -18524677 -28647414 -58652878 -82332928
2152 -82332928 -78856680 -55017976 -28521692 -4149733 20357289 36393645 31006611
2145 31006611 8031634 -13472363 -22187954 -22532969 -19770153 -12399451 -3084195 -2520754
2137 -2520754 -14396651 -26657302 -25707582 -12181430 3026941 10979811 8270358 -3060480
2129 -3060480 -14449848 -19152826 -25696840 -49396641 -82952491 -92557687 -59402690 -12104668
$$ packed form
2184C499578l054715j745335O467515J2324209J2262679J1101395P996480n824705
2176D3027101k8378423l9717261k5817739p89058Q817723k565243j5361882j2575071
2168g3359853J514607J2092282J1962909N024268l01973K268443J0516975J3003226
2160a7279116K407796j0599259q456066O142346R259622j0122737l0005464k3680050
2152h2332928L476248K3838704K6496284K4371959K4507022J6036356n387034
2145C1006611k2974977k1503997q715591l45015K762816P370702R315256N63441
2137b520754j1875897j2260651R49720J3526152J5208371P952870k709453j1330838
2129c060480j1389368m702978o544014k3699801l3555850r605196L3154997M7298022
$$ plain form
2121 -12104668 3282337 -20603487 -46977365 -43163551 -14152017 12766808 17591330
2114 17591330 -1636798 -30073505 -43109092 -28029847 -3397295 -706406 -22117541
2107 -22117541 -35624654 -20634158 2861695 6380607 -3699815 2777691 34434124
2100 34434124 66477095 72702257 51926576 21987334 2340875 4681273 27146874
2093 27146874 51736683 55340111 29316682 -13081710 -47917671 -56943660 -37940245
2086 -37940245 -6286854 15411517 15841451 3329446 -6416862 -6301508 1858326 14821186
2078 14821186 26995315 28171847 13434920 -6920675 -16994586 -13408864 -5559432 53119
2070 53119 6374523 16928109 28236280 31904737 20377642 -6189918 -34420614 -45380091
$$ packed form
2121a2104668J5387005k3885824k6373878L813814K9011534K6918825M824522
2114A7591330j9228128k8436707j3035587J5079245K4632552K690889k1411135
2107b2117541j3507113J4990496K3495853L518912j0080422O477506L1656433
2100C4434124L2042971O225162k0775681k9939242j9646459K340398K2465601
2093B7146874K4589809L603428k6023429m2398392l4835961r025989J9003415
2086c7940245L1653391K1698371M29934j2512005r746308J15354Q159834J2962860
2078A4821186J2174129J176532j4736927k0355595j0073911L585722P849432N612551
2070E3119O321404J0553586J1308171L668457j1527095k6567560k8230696j0959477
$$ plain form
2062 -45380091 -34996460 -20386288 -17538885 -20527039 -13783154 3145461 17424145 23446494
2054 23446494 25835624 25605336 18391005 3825098 -16309456 -43472858 -71574169 -80679059
2046 -80679059 -62223983 -40984722 -44800025 -59117885 -45158953 -2464362 25076607
2039 25076607 13768912 -8004017 -8477216 3759657 7708017 8092905 16423465 21893873
2031 21893873 12958694 4048240 7710780 3268393 -28583243 -60162932 -50768898 -13801983
2023 -13801983 -1814707 -28545891 -54581829 -54064887 -46216923 -47786049 -41558521 -14912055
2015 -14912055 10731380 17111319 21792034 41657691 52470126 23229576 -26995897
2008 -26995897 -46420752 -19026810 18537650 29364008 16333997 3664135 2236088
$$ packed form
2062d5380091J0383631J4610172K847403k988154O743885J6928615J4278684O022349
2054B3446494K389130k30288p214331j4565907k0134554k7163402k8101311r104890
2046h0679059J8455076K1239261l815303j4317860J3958932M2694591K7540969
2039B5076607j1307695k1772929m73199J2236873L948360L84888Q330560N470408
2031B1893873q935179q910454L662540m442387l1851636l1579689R394034L6966915
2023a3801983J1987276k6731184k6035938N16942P847964j569126O227528K6646466
2015a4912055K5643435O379939M680715J9865657J0812435k9240550n0225473
2008b6995897j9424855K7393942L7564460J0826358j3030011j2669862j428047
$$ plain form
2001 2236088 5051849 3513055 -2959524 -8936313 -9484651 -5687691 -2553327 -59695
1993 -59695 8272545 23986277 37397556 38098907 25673343 5778583 -15748036 -29601221
1985 -29601221 -24911963 -3262435 18587152 28389998 30596178 30970111 23761726 7354414
1977 7354414 -2778779 3623414 8433532 -11693116 -45804508 -58654517 -39682079 -16256163
1969 -16256163 -13420743 -24883515 -33980630 -41339424 -54906927 -67088158 -61485748 -37815109
1961 -37815109 -14616435 -6381967 -8323419 -6757790 2342658 11105099 14398713 18709596
1953 18709596 29657974 36044128 21135947 -7519322 -17472701 7749981 43232278
1946 43232278 55927961 48704796 45751100 44765676 18949899 -31685836 -68532320 -68729123
$$ packed form
2001B236088K815761j538794o472579n976789n48338L796960L134364K493632
1993e9695Q332240J5713732J3411279P01351j2425564j9894760k1526619j3853185
1985b9601221M689258K1649528K1849587R802846K206180L73933p208385j6407312
1977G354414j0133193O402193M810118k0126648l4111392j2850009J8972438K3425916
1969a6256163K835420j1462772r097115p358794j3567503j2181231N602410K3670639
1961c7815109K3198674Q234468j941452J565629R100448Q762441L293614M310883
1953A8709596J0948378O386154j4908181k8655269r953379K5222682L5482297
1946D3232278J2695683p223165k953696r85424k5815777n0635735l6846484j96803
$$ plain form
1938 -68729123 -58266621 -66431503 -74796809 -46931118 6150142 31162706 5101233
1931 5101233 -33335732 -38490709 -15782829 -3043699 -12646651 -21234421 -12603329 -1835603
1923 -1835603 -7270978 -20674311 -23899311 -21718909 -33652833 -56663365 -63025239 -42765937
1915 -42765937 -23097179 -29218644 -46919656 -47832709 -35754989 -36953679 -52027242 -52669274
1907 -52669274 -29918684 -11891366 -20638234 -39785644 -43226992 -33316125 -29776944 -37622196
1899 -37622196 -46503374 -48812567 -40519393 -17739078 9488175 15628970 -6609734 -26792159
1891 -26792159 -17413197 523689 -13797263 -55422578 -76409482 -56126706 -28607861
1884 -28607861 -27353650 -40043942 -40303108 -33629157 -41235230 -58118286 -60057542 -43073787
$$ packed form
1938f8729123J0462502q164882q365306K7865691N3081260K5012564k6061473
1931E101233l8436965n154977K2707880J2739130r602952q587770Q631092J0767726
1923a835603n435375j3403333l225000K180402j1933924k3010532o361874K0259302
1915d2765937J9668758o121465j7701012r13053J2077720j198690j5073563o42032
1907e2669274K2750590J8027318q746868j9147410l441348R910867L539181p845252
1899c7622196q881178k309193Q293174K2780315K7227253O140795k2238704k0182425
1891b6792159R378962J7936886j4320952m1625315k0986904K0282776K7518845
1884b8607861J254211j2690292k59166O673951p606073j6883056j939256J6983755
$$ plain form
1876 -43073787 -25727514 -14997646 1941659 28512109 46220323 40715064 21776287
1869 21776287 6267862 -4306163 -16495372 -26024943 -21417682 -2346573 18577926
1862 18577926 31575733 36582112 34445574 23388468 8916023 6297477 22695273 41893889
1854 41893889 38803220 10014836 -19939141 -26481834 -11330430 3835331 2583111 -14573270
1846 -14573270 -37064839 -51828776 -46650570 -19153653 13816719 26328912 10417059
1839 10417059 -13133942 -18729348 -6393794 728344 -12568368 -35969572 -50269741
1832 -50269741 -50992712 -46465620 -39667476 -26368043 -10933632 -7467000 -16897008 -16607104
1824 -16607104 12083512 53733878 73455106 59029826 30203212 5741869 -17272071
$$ packed form
1876d3073787J7346273J0729868J6939305K6570450J7708214n505259j8938777
1869B1776287j5508425j0574025j2189209r529571M607261J9071109K0924499
1862A8577926J2997807N006379k136538j1057106j4472445k618546J6397796J9198616
1854D1893889l090669k8788384k9953977o542693J5151404J5165761j252220j7156381
1846a4573270k2491569j4763937N178206K7496917L2970372J2512193j5911853
1839A0417059k3551001n595406J2335554P122138j3296712k3401204j4300169
1832e0269741p22971M527092O798144J3299433J5434411L466632r430008K89904
1824a6607104K8690616M1650366J9721228j4425280k8826614k4461343k3013940
$$ plain form
1817 -17272071 -44120706 -63778007 -64518421 -52780834 -40221740 -25189965 -5261904
1810 -5261904 4347399 -11419631 -38128916 -45699321 -30234054 -17183348 -20715230 -25973414
1802 -25973414 -19666867 -13132600 -20112312 -31474949 -30301415 -18254855 -8917803 -5484163
1794 -5484163 -3236677 -5668243 -17538185 -25508485 -7716174 32817164 62317176 54355145
1786 54355145 23191940 6730542 20214145 39975594 37393198 18106016 13496139
1779 13496139 34765873 54594451 46393305 25779378 29264929 57860837 71443980
1772 71443980 45428143 4765219 -14244131 -12103351 -13363375 -23541778 -26702508 -17406584
1764 -17406584 -7818957 -5000750 -4715370 -7360419 -17263140 -25253770 -15736267 4874294
$$ packed form
1817a7272071k6848635j9657301p40414J1737587J2559094J5031775J9928061
1810e261904R609303j5767030k6709285p570405J5465267J3050706l531882n258184
1802b5973414O306547O534267o979712j1362637J173534J2046560R337052L433640
1794e484163K247486k431566j1869942p970300J7792311M0533338K9500012p962031
1786E4355145l1163205j6461398J3483603J9761449k582396j9287182m609877
1779A3496139K1269734J9828578q201146k0613927L485551K8595908J3583143
1772G1443980k6015837m0662924j9009350K140780j260024j0178403l160730R295924
1764a7406584R587627K818207K85380k645049r902721p990630R517503K0610561
$$ plain form
1756 4874294 10713122 -5135887 -18259242 -9710363 7801931 15261915 16463720 21216996
1748 21216996 18816980 -4856534 -35862485 -46676695 -36522470 -28672067 -29508761 -21715653
1740 -21715653 -3086044 1500109 -17606382 -31062077 -14538298 7439964 -4372273
1733 -4372273 -40093424 -51318622 -25004329 -4967974 -24644641 -54771238 -46782429
1726 -46782429 -4172645 24817026 14964453 -11455434 -28396656 -40204783 -60280592
1719 -60280592 -82154524 -90515157 -85227905 -76978912 -69181975 -59021707 -48439444 -40603135
1711 -40603135 -32193690 -21317623 -15575214 -18922543 -18021969 1779951 30816377 42638591
1703 42638591 27381594 2910973 -8531844 -1547489 15641784 31798668 36724301
$$ packed form
1756D874294N838828j5849009j3123355Q548879J7512294P459984J201805M753276
1748B1216996k400016k3673514l1005951j0814210J0154225P850403q36694P793108
1740b1715653J8629609M586153j9106491j3455695J6523779K1978262j1812237
1733d372273l5721151j1225198K6314293K0036355j9676667l0126597P988809
1726d6782429M2609784K8989671r852573k6419887j6941222j1808127k0075809
1719f0280592k1873932q360633N287252Q248993P796937J0160268J0582263P836309
1711d0603135Q409445J0876067N742409l347329R00574J9801920K9036426J1822214
1703D2638591j5256997k4470621j1442817O984355J7189273J6156884M925633
$$ plain form
1696 36724301 26506531 8486238 -7748142 -23971496 -47156340 -73170818 -93398897
1689 -93398897 -114498433 -145558910 -160423962 -105740740 29402580 173934176 236791187
1682 236791187 200995320 129220916 82103642 63222470 47903162 30747605 23012618
1675 23012618 23866310 20423505 10513328 6253018 15834065 34996987 55500397 70014081
1667 70014081 69126704 46927956 14318897 -3257725 10025940 40990616 57850738
1660 57850738 41243138 3935670 -21210295 -14230105 11651295 26378860 18751202
1653 18751202 6300156 5382215 4958041 -14717469 -46071539 -59633844 -46217241 -29869241
1645 -29869241 -30425635 -36718141 -32715150 -27604277 -34580898 -37174486 -10971123 28270411
$$ packed form
1696C6724301j0217770j8020293j6234380j6223354k3184844k6014478k0228079
1689i3398897k1099536l1060477j4865052N4683222J35143320J44531596O2857011
1682B36791187l5795867p1774404m7117274j8881172j5319308j7155557p734987
1675B3012618Q53692l442805r910177m260310R581047J9162922K0503410J4513684
1667G0014081q87377k2198748l2609059j7576622J3283665L0964676J6860122
1660E7850738j6607600l7307468k5145965O980190K5881400J4727565p627658
1653A8751202j2451046r17941m24174j9675510l1354070j3562305J3416603J6348000
1645b9869241n56394o292506M002991N110873o976621k593588K6203363L9241534
$$ plain form
1637 28270411 36713759 7007075 -17732808 -9464300 2115268 -20191318 -57947500
1630 -57947500 -62257613 -25651180 11935089 23966288 23616647 24410240 14044645 -15022443
1622 -15022443 -40371140 -40571965 -30854147 -40344394 -65267559 -72638551 -47984771 -14360685
1614 -14360685 972697 -1247127 -3289464 629207 598482 -9040920 -19308378 -18786840
1606 -18786840 -8206352 2763217 9433639 15592348 23170246 26605956 21790447 13526089
1598 13526089 6987552 -1858289 -16940756 -28112685 -20946702 -171451 12395851 7527749
1590 7527749 948855 8101612 21018803 23039004 15624477 14589880 25006562 35332610
1582 35332610 35084573 24676392 7279087 -15844350 -38329708 -48201361 -40575398 -24046229
$$ packed form
1637B8270411Q443348k9706684k4739883Q268508J1579568k2306586l7756182
1630e7947500m310113L6606433L7586269J2031199l49641P93593j0365595k9067088
1622a5022443k5348697k00825R717818r490247k4923165p370992K4653780L3624086
1614a4360685J5333382k219824k042337L918671l0725r639402j0267458N21538
1606a8786840J0580488J0969569O670422O158709P577898L435710m815509q264358
1598A3526089o538537q845841j5082467j1171929P165983K0775251J2567302m868102
1590G527749o578894P152757J2917191K020201p414527j034597J0416682J0326048
1582C5332610k48037j0408181j7397305k3123437k2485358r871653P625963J6529169
$$ plain form
1574 -24046229 -9549514 1069534 10135789 13461195 2975027 -19997810 -40216291
1567 -40216291 -40876187 -19847940 7272357 19733410 7499313 -22384517 -51566001
1560 -51566001 -62901809 -52240094 -31224761 -16641200 -15596020 -24027742 -38606603
1553 -38606603 -59890833 -79176633 -76162380 -44354925 -9329461 -1576978 -15274300
1546 -15274300 -17306499 2067422 14980141 1643961 -17016022 -11021722 16247451
1539 16247451 40738533 55887996 70728414 80763655 70779241 44164184 22127142
1532 22127142 11785876 -721252 -21606424 -37228667 -37385260 -30090619 -24131672 -14457906
1524 -14457906 5254199 29558904 48925406 58357269 54014734 36373940 20980593
$$ packed form
1574b4046229J4496715J0619048R066255L325406j0486168k2972837k0218481
1567d0216291o59896K1028247K7120297J2461053j2234097k9883830k9181484
1560e1566001j1335808J0661715K1015333J4583561J045180q431722j4578861
1553c8606603k1284230j9285800L014253L1807455L5025464P752483j3697322
1546a5274300k032199J9373921J2912719j3336180j8659983N994300K7269173
1539A6247451K4491082J5149463J4840418J0035241r984414k6615057k2037042
1532B2127142j0341266j2507128k0885172j5622243j56593P294641N958947R673766
1524a4457906J9712105K4304705J9366502R431863m342535j7640794j5393347
$$ plain form
1517 20980593 27291488 48950560 54384571 27929496 -8206529 -25960978 -26447383 -26354385
1509 -26354385 -27372032 -21118811 -11829691 -10706135 -15106990 -15034572 -14886169 -27329826
1501 -27329826 -48338842 -58588757 -49295973 -29623939 -10448348 2040626 185400
1494 185400 -17259690 -32621052 -26227827 -6005977 2362636 -4529532 -4707210 6810800
1486 6810800 3609229 -28190572 -59460982 -56635633 -31742260 -25366773 -49430251 -74737173
1478 -74737173 -73595861 -50749652 -28559156 -20568100 -26282620 -38840350 -50188674 -54318140
1470 -54318140 -48509973 -30711587 -2356538 21400293 17027462 -17623713 -49150386
1463 -49150386 -43442554 -8364243 19135901 22425229 15208416 5234159 -16741984 -42548813
$$ packed form
1517B0980593O310895K1659072N434011k6455075l6136025j7754449m86405R2998
1509b6354385j017647O253221R289120J123556m400855P2418J48403j2443657
1501b7329826k1009016j0249915R292784J9672034J9175591J2488974j855226
1494A85400j7445090j5361362O393225K0221850Q368613o892168j77678J1518010
1486F810800l201571l1799801l1270410K825349K4893373O375487k4063478k5306922
1478g4737173J141312K2846209K2190496P991056n714520j2557730j1348324m129466
1470e4318140N808167J7798386K8355049K3756831m372831l4651175l1526673
1463d9150386N707832L5078311K7500144L289328p216813r974257k1976143k5806829
$$ plain form
1455 -42548813 -37788936 8893574 55759973 57567473 25890014 7272101 15350926 22477996
1447 22477996 13689151 7956601 17718943 23884206 9446876 -9365165 -8089742 8028616
1439 8028616 13606191 -193992 -18142238 -23478246 -11738477 12766669 39488820 53398926
1431 53398926 46359047 26203605 8253050 1809967 8597725 24665577 37695795 34831233
1423 34831233 21456027 17376069 24052828 15704381 -18894402 -47472762 -36237450 -4555495
1415 -4555495 -592323 -29889682 -49846673 -37611035 -19886015 -21699323 -26996758 -14479752
1407 -14479752 2200717 1269948 -7321922 -3862472 -130265 -19760545 -49375980 -49843338
1399 -49843338 -13890184 25425859 47277860 67018134 95977607 111218579 87530279
$$ packed form
1455d2548813M759877M6682510M6866399J807500l1677459j8617913Q078825P127070
1447B2477996q788845n732550R762342O165263j4437330j8812041J275423J6118358
1439H028616N577575j3800183j7948246n336008J1739769K4505146K6722151J3910106
1431E3398926p039879k0155442j7950555o443083O787758J6067852J3030218k864562
1423C4831233j3375206m079958O676759q348447l4598783k8578360J1235312L1681955
1415d555495L963172k9297359j9956991J2235638J7725020j813308n297435J2517006
1407a4479752J6680469r30769q591870L459450L732207j9630280k9615435m67358
1399d9843338L5953154L9316043K1852001J9740274K8959473J5240972k3688300
$$ plain form
1392 87530279 37920362 -651963 -9963666 -1070251 7949774 7286706 -5733636 -26488214
1384 -26488214 -41435550 -36889777 -10963436 26215471 59971732 76029862 67110210
1377 67110210 42564029 24406614 24334410 29604115 20786483 -1398087 -17927577 -17541879
1369 -17541879 -9272553 -8164845 -18774622 -35700727 -51582616 -59634828 -55149128 -41409191
1361 -41409191 -30851516 -33660347 -45499571 -51656404 -44092046 -29709272 -19859073 -17059023
1353 -17059023 -17417192 -21841787 -34539002 -48844642 -46073810 -17974503 15473701 22695504
1345 22695504 -4057476 -38442007 -47738931 -24791412 9733413 30606712 29317502
1338 29317502 15802096 3720050 -4649587 -17622009 -38012789 -53606599 -50525989
$$ packed form
1392H7530279m9609917l8572325r311703Q893415R020025o63068j3020342k0754578
1384b6488214j4947336M545773K5926341L7178907L3756261J6058130q919652
1377F7110210k4546181j8157415p2204N269705q817632k2184570j6529490L85698
1369a7541879Q269326J107708j0609777j6926105j5881889q052212M485700J3739937
1361d1409191J0557675k808831j1839224o156833P564358J4382774R850199K800050
1353a7059023l58169m424595j2697215j4305640K770832K8099307L3448204P221803
1345B2695504k6752980l4384531r296924K2947519L4524825K0873299j289210
1338B9317502j3515406j2082046q369637j2972422k0390780j5593810L080610
$$ plain form
1331 -50525989 -33034012 -20692071 -25497118 -40756069 -54063432 -61184511 -62364586 -54141545
1323 -54141545 -33669007 -7778574 9015509 5575665 -17973566 -50128514 -74682207
1316 -74682207 -82217967 -77019938 -69239083 -61330568 -49013112 -34414660 -27135464 -29371007
1308 -29371007 -31247772 -26441437 -21641846 -23109548 -24427427 -17843962 -9298933 -10406614
1300 -10406614 -20914831 -29598471 -27830979 -13246268 13035727 41572126 54925937
1293 54925937 48184092 43186014 63091586 94288106 95317958 49442766 -10854663 -41775392
1285 -41775392 -34436654 -10828857 10815677 26700596 31739810 17773271 -7366426
1278 -7366426 -17599117 2108023 33685949 45845814 31188044 10277256 94487
$$ packed form
1331e0525989J7491977J2341941m805047j5258951j3307363p121079j180075Q223041
1323e4141545K0472538K5890433J6794083l439844k3549231l2154948k4553693
1316g4682207p535760N198029P780855P908515J2317456J4598452P279196k235543
1308b9371007j876765M806335M799591j467702j317879O583465Q545029j107681
1300a0406614j0508217q683640J767492J4584711K6281995K8536399J3353811
1293E4925937o741845m998078J9905572L1196520J029852m5875192o0297429l0920729
1285d1775392P338738K3607797K1644534J5884919N039214j3966539k5139697
1278g366426j0232691J9707140L1577926J2159865j4657770k0910788j0182769
$$ plain form
1271 94487 -5546147 -18231259 -33482133 -41788116 -50488034 -73234081 -99319796 -97158056
1263 -97158056 -57041897 -11260854 2713219 -14172304 -30609368 -25337050 -2404833
1256 -2404833 25221038 46692588 49962448 26584451 -16219192 -59775879 -90609330
1249 -90609330 -103188402 -91684230 -56158243 -15671276 3749131 -2002471 -13878006
1242 -13878006 -19798396 -27833819 -43539150 -53325884 -42723184 -17883840 3742770 14982984
1234 14982984 20462836 24421561 27291525 29156707 28578931 21871348 8470738 -7163395
1226 -7163395 -20942568 -30564300 -32210570 -25085515 -17985642 -19344042 -22734285 -17844344
1218 -17844344 -12992601 -24605399 -44241880 -44573388 -24930786 -18714814 -40099603 -56132677
$$ packed form
1271I4487n640634j2685112j5250874q305983q699918k2746047k6085715K161740
1263i7158056M0116159M5781043J3974073j6885523j6437064N272318K2932217
1256b404833K7625871K1471550L269860k3377997m2803643m3556687l0833451
1249i0609330j2579072J1504172L5525987M0486967J9420407n751602j1875535
1242a3878006n920390q035423j5705331r786734J0602700K4839344K1626610J1240214
1234A4982984N479852L958725K869964J865182n77776o707583j3400610j5634133
1226g163395j3779173r621732j646270P125055P099873j358400l390243M889941
1218a7844344M851743j1612798j9636481l31508J9642602O215972k1384789j6033074
$$ plain form
1210 -56132677 -36863192 -4183216 1937231 -16693517 -27228952 -19921515 -11867953 -6710068
1202 -6710068 8095978 26820414 28823675 18848741 24934694 49222882 58804860 37597861
1194 37597861 11879597 7829004 15701462 15771042 11274091 12970018 14706487 7978332
1186 7978332 2160397 8524856 20073700 25980502 29043657 30625745 18028235 -11305333
1178 -11305333 -32731959 -27633186 -16058305 -26097632 -45312200 -38379685 -6280595
1171 -6280595 10017962 -11596772 -45402592 -57483732 -46468140 -31105924 -19570395
1164 -19570395 -8008728 4583097 15461342 24073357 28234062 21212775 1464738 -19972393
1156 -19972393 -29026576 -22342785 -7580055 5821355 12348310 10228667 -93993 -15810035
$$ packed form
1210e6132677J9269485L2679976O120447j8630748j0535435P307437Q053562N157885
1202f710068J4806046J8724436K003261r974934O085953K4288188R581978k1206999
1194C7597861k5718264m050593P872458O9580m496951J695927J736469o728155
1186G978332n817935O364459J1548844N906802L063155J582088j2597510k9333568
1178a1305333k1426626N098773J1574881j0039327j9214568O932515L2099090
1171f280595J6298557k1614734l3805820j2081140J1015592J5362216J1535529
1164a9570395J1561667J2591825J0878245Q612015M160705p021287j9748037k1437131
1156a9972393r054183O683791J4762730J3401410O526955k119643j0322660j5716042
$$ plain form
1148 -15810035 -29095325 -27319791 -4553467 24270802 31670413 8710816 -21303877
1141 -21303877 -30516455 -18517503 -4084613 4300552 11170719 15049553 9620128 1847317
1133 1847317 5286564 13140360 2357370 -28204090 -47811734 -35635688 -11961298 -8858196
1125 -8858196 -24567675 -29882504 -13450697 2675572 -3661462 -23741611 -30993044 -16578287
1117 -16578287 148255 -2942027 -24546557 -45568376 -54375219 -54130499 -46383825 -24952973
1109 -24952973 6192497 26554627 26277561 25344652 44659006 69278654 67494162 41156795
1101 41156795 25857338 38322514 55302095 54883414 48260508 52151112 55127984 36161415
1093 36161415 816645 -25138858 -29631327 -22501273 -16629815 -17048351 -22874697 -26952024
$$ packed form
1148a5810035j3285290J775534K2766324K8824269P399611k2959597l0014693
1141b1303877r212578J1998952J4432890Q385165O870167L878834n429425p772811
1133A847317L439247P853796j0782990l0561460j9607644J2176046K3674390L103102
1125h858196j5709479n314829J6431807J6126269o337034k0080149p251433J4414757
1117a6578287J6726542l090282k1604530k1021819q806843K44720P746674K1430852
1109b4952973L1145470K0362130k77066r32909J9314354K4619648j784492k6337367
1101D1156795j5299457J2465176J6979581m18681o622906L890604K976872j8966569
1093C6161415l5344770k5955503m492469P130054N871458m18536n826346m077327
$$ plain form
1085 -26952024 -20540469 -8704940 -9633726 -26809455 -37099949 -23477960 -3597659 -2433782
1077 -2433782 -9782085 4917868 40783262 60811624 43738491 13199580 4831086 24943305
1069 24943305 52789029 66887774 57509764 27179691 -7623352 -23579105 -11392887
1062 -11392887 13306606 26195848 18190580 -277513 -14064808 -17654132 -16287091 -15368561
1054 -15368561 -11162593 2623984 18534802 16957137 -7908515 -34381392 -38623725 -25191765
1046 -25191765 -16637287 -19887708 -22878844 -21493069 -27031503 -42550909 -51335085 -38034138
1038 -38034138 -9221563 13559393 13421346 -9221054 -34043502 -35532642 -14549769 -7384012
1030 -7384012 -40916063 -85524211 -85374360 -37564822 -2527078 -20971505 -58449241 -60060993
$$ packed form
1085b6952024O411555J1835529r28786j7175729j0290494J3621989J9880301J163877
1077b433782p348303J4699953L5865394K0028362j7073133l0538911q368494K0112219
1069B4943305K7845724J4098745r378010l0330073l4803043j5955753J2186218
1062a1392887K4699493J2889242q005268j8468093j3787295l589324J367041R18530
1054a5368561M205968J3786577J5910818j577665k4865652k6472877m242333J3431960
1046b5191765Q554478l250421k991136J385775n538434j5519406q784176J3300947
1038c8034138K8812575K2780956j38047k2642400k4822448j489140K0982873P165757
1030g384012l3532051m4608148J49851M7809538L5037744j8444427l7477736j611752
$$ plain form
1022 -60060993 -28909128 -11745138 -24723177 -35164858 -14243647 26894184 57884303
1015 57884303 60286527 34410871 -2671273 -22870772 -11779494 9206814 5628481
1008 5628481 -22625526 -39172952 -22047229 7031934 15581283 1072943 -17133856
1001 -17133856 -28715724 -34815586 -30919258 -10146894 18223852 32149972 22363615 2542490
993 2542490 -9226858 -9404283 -5687302 -3395846 -1664392 1302972 5892979 13057764
985 13057764 22904942 29529625 21911197 -4669298 -38536514 -58153356 -51645832 -27960638
977 -27960638 -7591115 -4582069 -17126359 -30197908 -25932452 1396405 36204214 53225880
969 53225880 42650937 17365830 -7322867 -28204943 -40274826 -26020387 19797768
$$ packed form
1022f0060993L1151865J7163990j2978039j0441681K0921211M1137831L0990119
1015E7884303K402224k5875656l7082144k0199499J1091278K0986308l578333
1008E628481k8254007j6547426J7125723K9079163Q549349j4508340j8206799
1001a7133856j1581868o099862L896328K0772364K8370746J3926120r786357j9821125
993B542490j1769348j77425L716981K291456J731454K967364M590007P164785
985A3057764R847178O624683p618428k6580495l3867216j9616842O507524K3685194
977b7960638K0369523L009046j2544290j3071549M265456K7328857L4807809J7021666
969E3225880j0574943k5285107k4688697k0882076j2069883J4254439M5818155
$$ plain form
962 19797768 64534493 64999419 22146012 -16871558 -17785976 3759035 14462039 7527673
954 7527673 -3427936 -13265275 -23684196 -26769744 -16173288 -6339594 -14909258 -31391759
946 -31391759 -30565946 -15251470 -15773108 -41634945 -63303238 -54794903 -28956391 -13181259
938 -13181259 -11160228 -8961400 -2248047 4760059 14800852 29182256 33247065 13564087
930 13564087 -16674826 -32507807 -32281865 -33284118 -36594731 -26291938 -6123192 -4425679
922 -4425679 -30236231 -53419552 -47731239 -30527011 -36072355 -65653349 -89183337 -86654885
914 -86654885 -64552737 -37052616 -13798375 -5106762 -18794967 -48026963 -75073065
907 -75073065 -88038498 -84774406 -65687933 -36220987 -11260814 -1063775 3815675 17619081
$$ packed form
962A9797768M4736725M64926m2853407l9017570r14418K1545011J0703004o934366
954G527673j0955609r837339j0418921l085548J0596456R833694q569664j6482501
946c1391759Q25813J5314476n21638k5861837k1668293Q508335K5838512J5775132
938a3181259K021031K198828O713353P008106J0040793J4381404M064809j9682978
930A3564087l0238913j5832981K25942j002253l310613J0302793K0168746J697513
922d425679k5810552k3183321N688313J7204228n545344k9580994k3529988K528452
914h6654885K2102148K7500121K3254241Q691613j3688205k9231996k7046102
907g5073065j2965433L264092J9086473K9466946K4960173J0197039M879450J3803406
$$ plain form
899 17619081 33726956 32920720 15019033 1032625 2249518 7997141 7961353 6010684
891 6010684 5519368 693243 -8937545 -13080895 -8697688 -6960967 -13497067 -18236598 -13925036
882 -13925036 -7459309 -3047012 6979045 21952280 22755084 -1741124 -34901032 -56006723
874 -56006723 -66888497 -75861907 -73191824 -48452028 -19013746 -11290668 -19738489 -14243731
866 -14243731 12586044 34770090 34156017 24533403 23040561 20000434 -5249284 -50559878
858 -50559878 -88939444 -96390426 -72606527 -37196814 -12637787 -9884308 -24632226 -42927048
850 -42927048 -48988726 -33188646 -2456896 18021456 8245518 -16640895 -17197544 17998038
842 17998038 48372167 28715023 -32322955 -83599144 -93180757 -74795015 -56897769
$$ packed form
899A7619081J6107875q06236j7901687j3986408J216893N747623l5788j950669
891F010684m91316m826125r630788m143350M383207J736721o536100m739531M311562
882a3925036O465727M412297J0026057J4973235Q02804k4496208l3159908k1105691
874e6006723j0881774q973410K670083K4739796K9438282P723078q447821N494758
866a4243731K6829775K2184046o14073r622614j492842l040127k5249718m5310594
858e0559878l8379566p450982K3783899L5409713K4559027K753479j4747918j8294822
850d2927048o061678J5800080L0731750K0478352r775938k4886413n56649L5195582
842A7998038L0374129j9657144o1037978n1276189r581613J8385742J7897246
$$ plain form
835 -56897769 -50880793 -52814161 -55209249 -50262063 -35292481 -18106862 -6598871 3396854
827 3396854 16542330 21411829 4162851 -27168426 -52974593 -70493412 -87881123 -96869770
819 -96869770 -82326881 -57004114 -51943470 -67918294 -71450913 -47712528 -21514394 -12426946
811 -12426946 -5878692 11003610 19945284 4914993 -14941296 -16521025 -12269560 -25558169
803 -25558169 -46597704 -48095947 -31158009 -20912236 -25231119 -31179520 -37300343 -56067996
795 -56067996 -83409293 -95897408 -84437797 -67402609 -63199247 -67548904 -64388509 -46462265
787 -46462265 -20396257 1069439 11405697 17963104 30244450 39032349 25311959 -2549721
779 -2549721 -6976520 24092050 47854480 23108925 -26090846 -42709550 -18297135 2304946
$$ packed form
835e6897769O016976j933368k395088M947186J4969582J7185619J1507991R995725
827C396854J3145476M869499j7248978l1331277k5806167j7518819j7387711q988647
819i6869770J4542889K5322767N060644j5974824l532619K3738385K6198134R087448
811a2426946O548254J6882302Q941674j5030291j9856289j579729M251465j3288609
803b5558169k1039535j498243J6937938J0245773m318883n948401o120823j8767653
795e6067996k7341297j2488115J1459611J7035188M203362m349657L160395J7926244
787d6462265K6066008K1465696J0336258O557407J2281346Q787899j3720390k7861680
779b549721m426799L1068570K3762430k4745555m9199771j6618704K4412415K0602081
$$ plain form
771 2304946 -7332609 -25308274 -27928405 -21628169 -14796460 2933088 32883359 49751884
763 49751884 34077214 359655 -24661796 -32124604 -25883697 -9118702 8740650 12326208
755 12326208 3205117 3370666 21038147 32494955 14525271 -22714732 -51207405 -56649250
747 -56649250 -39962329 -6521892 28239863 40392918 25158309 9324661 17767320
740 17767320 40802802 51837980 43018826 25792014 11435259 9719134 30070456 62161041
732 62161041 72025001 43225788 7221557 4074445 25609142 30441645 6795004 -17133010
724 -17133010 -24579497 -32749563 -53871107 -68127940 -54385770 -23597373 -987522 8351458
716 8351458 15759535 21875784 14361415 -8742775 -29604072 -30098410 -13457387 66248
$$ packed form
771B304946r637555j7975665k620131O300236O831709J7729548K9950271J6868525
763D9751884j5674670l3717559k5021451p462808O240907J6764995J7859352L585558
755A2326208r121091J65549J7667481J1456808j7969684l7240003k8492673n441845
747e6649250J6686921L3440437L4761755J2153055j5234609j5833648Q442659
740A7767320K3035482J1035178q819154j7226812j4356755j716125K0351322L2090585
732F2161041R863960k8799213l6004231l147112K1534697M832503k3646641k3928014
724a7133010p446487q170066k1121544j4256833J3742170L0788397K2609851R338980
716H351458P408077O116249p514369k3104190k0861297m94338J6641023J3523635
$$ plain form
708 66248 -1548162 -7635720 -1424347 14061593 20034560 12179608 8163245 16428451 17783986
699 17783986 -4076358 -30608215 -31375359 -7919979 12455788 20057916 29540479 43570308
691 43570308 41775934 15162412 -14928646 -25561195 -19848710 -13229714 -9295360 -2317062
683 -2317062 9253982 22567431 33224543 32975828 18136948 3668012 10026822 30024931
675 30024931 31227050 2546200 -24720883 -19334509 7501887 24059001 25071087 30224845
667 30224845 45595082 54121841 43725994 23236424 7427295 919416 -1374582 -7903722
659 -7903722 -22849922 -37043949 -33408074 -11205869 5295724 -3831427 -26462902 -36671907
651 -36671907 -30232695 -21503293 -14593439 -3599386 3362851 -10257507 -37525810 -49640831
$$ packed form
708F6248j614410o087558O211373J5485940N972967p854952m016363Q265206J355535
699A7783986k1860344k6531857p67144K3455380K0375767P602128R482563J4029829
691D3570308j794374k6613522l0091058j0632549N712485O618996L934354O978298
683b317062J1571044J3313449J0657112k48715j4838880j4468936O358810J9998109
675C0024931J202119k8680850k7267083N386374K6836396J6557114J012086N153758
667C0224845J5370237Q526759j0395847k0489570j5809129o507879k293998o529140
659g903722j4946200j4194027L635875K2202205J6501593r127151k2631475j0209005
651c6671907O439212Q729402O909854J0994053O962237j3620358k7268303j2115021
$$ plain form
643 -49640831 -36629433 -21239184 -22980677 -32836009 -36284923 -37919690 -45910813 -51629957
635 -51629957 -44516812 -32415534 -28189865 -29230469 -28930124 -34611649 -51621485 -61723700
627 -61723700 -44749184 -15472223 -9284050 -30612849 -45138454 -30538616 -6972544
620 -6972544 -2785911 -13875574 -17741187 -10350131 -3928155 2558669 23336578 55155921
612 55155921 71041564 54935839 26069797 14928972 24437277 30256491 16578094 -3924181
604 -3924181 -10278887 -1188874 7613729 8135492 8929282 17253245 24295849 16645916 -3918037
595 -3918037 -22173962 -28768852 -28122784 -27111156 -26118994 -24615802 -26286029 -32193899 -35187908
586 -35187908 -28178459 -14232399 -2719195 982955 -3170433 -13916550 -27062723 -34153337
$$ packed form
643d9640831J3011398J5390249j741493r855332l448914j634767p991123n719144
635e1629957P113145J2101278M225669j040604L00345n681525j7009836j0102215
627f1723700J6974516K9276961O188173k1328799j4525605J4599838K3566072
620f972544M186633j1089663l865613P391056O421976O486824K0777909L1819343
612E5155921J5885643j6105725k8866042j1140825R508305N819214j3678397k0502275
604c924181o354706R090013Q802603N21763P93790Q323963P042604p649933k0563953
595c918037j8255925o594890O46068J011628R92162J503192j670227n907870k994009
586c5187908P009449J3946060J1513204L702150m153388j0746117j3146173p090614
$$ plain form
578 -34153337 -31310602 -26616390 -29786336 -36852088 -35464563 -24425335 -16145121 -18102325
570 -18102325 -23363716 -22417036 -12818876 6275834 35080338 61739870 65000136 40611715
562 40611715 12967110 6010738 13108808 12240242 397016 -9095032 -15853825 -30947479
554 -30947479 -46306209 -36701126 -1952366 21949096 11531790 -9238358 -5973333 15293576
546 15293576 24106772 17587361 20132026 35041800 34530004 6957243 -18559644 -12037202
538 -12037202 16886373 37501252 38190337 27714204 12143350 -5866362 -14847484 -6338435
530 -6338435 5074755 -3379447 -28288217 -42862284 -36751690 -30296521 -40585835 -53940602
522 -53940602 -47221685 -22737538 -4695819 -7177379 -20466270 -27214863 -20474334 -5467554
$$ packed form
578c4153337K842735M694212l169946p065752J387525J1039228Q280214j957204
570a8102325n261391R46680R598160J9094710K8804504K6659532L260266k4388421
562D0611715k7644605o956372P098070q68566j1843226r492048o758793j5093654
554c0947479j5358730R605083L4748760K3901462j0417306k0770148L265025K1266909
546A5293576Q813196o519411K544665J4909774n11796k7572761k5516887O522442
538a2037202K8923575K0614879O89085j0476133j5570854j8009712q981122Q509049
530f338435J1413190q454202k4908770j4574067O110594O455169j0289314j3354767
522e3940602O718917K4484147J8041719k481560j3288891o748593O740529J5006780
$$ plain form
514 -5467554 7708933 11585189 6700692 21195 -4339649 -9881647 -20279474 -32546581
506 -32546581 -42913927 -53394611 -64310599 -65911826 -49193581 -22695575 -5472164
499 -5472164 -2626922 -1572864 3784203 834412 -19310363 -40209368 -38065341 -16090611
491 -16090611 -2506688 -12268533 -27511707 -23695500 -1428900 19844036 30087646 34885888
483 34885888 37877298 34850897 27912741 29111980 41885765 51787948 46386143 33969262
475 33969262 29447263 30011473 21136359 2514260 -10061831 -9216757 -4769371 -3880768
467 -3880768 459806 12774075 21701257 15137121 -1037994 -10440438 -5516889 8791940
459 8791940 22902279 26720761 15233635 -2455465 -10459983 -9609347 -18037156 -37671149
$$ packed form
514e467554J3176487L876256m884497o679497m360844n541998j0397827j2267107
506c2546581j0367346j0480684j0915988j601227J6718245K6498006J7223411
499e472164K845242J054058N357067k949791k0144775k0899005K144027K1974730
491a6090611J3583923r761845j5243174L816207K2266600K1272936J0243610M798242
483C4885888K991410l026401o938156J199239J2773785R902183n401805j2416881
475C3969262m521999N64210q875114j8622099j2576091Q45074M447386Q88603
467c880768M340574J2314269Q927182o564136j6175115r402444M923549J4308829
459H791940J4110339L818482j1487126j7689100q004518Q50636q427809j9633993
$$ plain form
451 -37671149 -41021671 -11769631 21503673 22427109 3529422 8148408 41138475 60354335
443 60354335 43674046 21868520 26435867 42268094 39464415 22478809 14801945 15399935
435 15399935 5046768 -15832437 -28395303 -28608865 -29819226 -34950123 -33820452 -28293037
427 -28293037 -33696060 -51291238 -62779448 -58758908 -52654857 -57848038 -66486606 -60296277
419 -60296277 -33505349 -91419 16649362 4341600 -21604096 -29399493 -10248684
412 -10248684 6154750 -6510511 -28612533 -22558886 6717657 16508884 -8841525 -37951971
404 -37951971 -46334097 -50368688 -68554063 -84609863 -76119531 -52547773 -36222214 -27170900
396 -27170900 -14877994 -5585910 -8564326 -11968748 -2783604 4017286 -11264117 -33113570
$$ packed form
451c7671149l350522K9252040L3273304R23436j8897687M618986L2990067J9215860
443F0354335j6680289k1805526M567347J5832227k803679j6985606p676864N97990
435A5399935j0353167k0879205j2562866k13562j210361n130897J129671N527415
427b8293037n403023j7595178j1488210M020540O104051n193181q638568O190329
419f0296277K6790928L3413930J6740781j2307762k5945696p795397J9150809
412a0248684J6403434j2665261k2102022O053647K9276543R791227k5350409k9110446
404c7951971q382126m034591j8185375j6055800Q490332K3571758J6325559R051314
396b7170900J2292906R292084k978416l404422R185144O800890j5281403k1849453
$$ plain form
388 -33113570 -29962097 -5820236 4661837 -8989786 -20510603 -12960341 -1492194 -949874
380 -949874 -3221294 380305 2652247 242350 3830358 14178980 13099233 -5633776
372 -5633776 -20558494 -15856860 -6955416 -11652696 -18245034 -9040058 2548406 -10225828
364 -10225828 -42391347 -61006191 -51659415 -34038155 -28961453 -32983275 -31043188 -16658087
356 -16658087 5771940 25724659 31290293 20843944 9635628 12610672 23313236 24411831
348 24411831 15499070 11388494 13927794 8335463 -7590290 -13566025 2568521 23039484
340 23039484 23508207 4783466 -13082855 -17703779 -11324253 413981 12327143 18027415
332 18027415 16886633 17583552 23650183 22490344 2827539 -22575281 -28874731 -12888545
$$ packed form
388c3113570L151473K4141861J0482073j3651623j1520817P550262J1468147N42320
380i49874k271420L601599K271942k409897L588008J0348622j079747j8733009
372e633776j4924718M701634Q901444m697280o592338R204976J1588464j2774234
364a0225828l2165519j8614844R346776J7621260N076702m021822J940087J4385101
356a6658087K2430027J9952719N565634j0446349j1208316K975044J0702564J098595
348B4411831q912761m110576K539300n592331j5925753n975735J6134546K0470963
340B3039484M68723j8724741j7866321m620924O379526J1738234J1913162N700272
332A8027415j140782O96919O066631j159839j9662805k5402820o299450J5986186
$$ plain form
324 -12888545 2145613 -1502702 -15275658 -22021783 -20197189 -19201372 -20048545 -14538054
316 -14538054 -1102425 10675183 13837631 14015976 20718466 33126192 40395807 35517520
308 35517520 23910824 16095862 15092400 14599773 7864139 -5777322 -22199680 -35530286
300 -35530286 -40205521 -35566232 -28892109 -27937691 -30286675 -27942339 -22607757 -24235751
292 -24235751 -30639449 -24031026 1541435 24026060 21346075 3893472 -2492100 1981507
284 1981507 -6158267 -29865799 -40871728 -22856412 1374800 3059849 -13113387 -23087232
276 -23087232 -20086312 -13575933 -3614849 16811430 38115312 39093704 18843360 2554331
268 2554331 9388110 31134303 48780605 55270342 54214299 48298017 37905449 24151541
$$ packed form
324a2888545J5034158l648315j3772956o746125J824594R95817q47173N510491
316a4538054J3435629J1777608L162448J78345O702490J2407726P269615m878287
308C5517520j1606696p814962j003462m92627o735634j3641461j6422358j3330606
300c5530286m675235M639289O674123R54418k348984K344336N334582j627994
292b4235751o403698O608423K5572461K2484625k679985j7452603o385572M473607
284A981507q139774k3707532j1005929J8015316K4231212J685049j6173236r973845
276b3087232L000920O510379R961084K0426279K1303882R78392k0250344j6289029
268B554331O833779K1746193J7646302O489737j056043n916282j0392568j3753908
$$ plain form
260 24151541 7887505 -8729522 -18613410 -15870171 -5754617 1368603 5359749 12887844
252 12887844 19236335 11007138 -8867924 -17808880 -5052017 10557842 7633681 -7382745
244 -7382745 -13390374 -7222438 -4243482 -11947936 -21244984 -23496652 -21228758 -19847927
236 -19847927 -19614585 -18071839 -13304293 -4718709 4110174 6331349 1229968 -2521895
228 -2521895 -177636 -445220 -11544263 -24356780 -22276675 -3559091 18786380 35067324
220 35067324 43074914 38832672 20634264 1380615 -1104192 11545620 19993383 16073777
212 16073777 12266120 17375993 21826580 17096636 12476337 17996110 23612374 12318562
204 12318562 -12971174 -31247021 -29433471 -14329435 -151022 5023514 460195 -10050660
$$ packed form
260B4151541j6264036j6617027r883888K743239J0115554P123220L991146P528095
252A2887844O348491q229197j9875062q940956J2756863J5609859k924161j5016426
244g382745o007629O167936K978956p704454r297048k251668K267894J380831
236a9847927K33342J542746M767546Q585584Q828883K221175n101381l751863
228b521895K344259k67584j1099043j2812517K080105J8717584K2345471J6280944
220C5067324Q007590m242242j8198408j9253649k484807J2649812Q447763l919606
212A6073777l807657N109873M450587m729944m620299N519773N616264j1293812
204A2318562k5289736j8275847J813550J5104036J4178413N174536m563319j0510855
$$ plain form
196 -10050660 -19533539 -21574108 -15454432 -7031465 -5131882 -15558523 -33820019 -44429162
188 -44429162 -35005265 -12429840 3344186 3526044 -1280066 251168 5951022 10868151
180 10868151 18497985 30173259 34567538 21996797 1920309 -7668979 -3043770 5825490
172 5825490 12724645 17387704 14825359 -519783 -20388721 -28322164 -21654147 -14153767
164 -14153767 -14575972 -16242162 -11370857 -2437136 5868279 13944868 20435550 18952042
156 18952042 8839715 258987 1234256 6968907 8839740 7498349 10062496 18937517
148 18937517 29113830 33236243 26488970 11228823 -1445522 -1292926 8013905 13088878
140 13088878 9529670 6087366 7335736 5499667 -3018804 -5938396 8113321 30116159
$$ packed form
196a0050660r482879k040569O119676Q422967J899583j0426641j8261496j0609143
188d4429162R423897K2575425J5774026J81858m806110J531234N699854M917129
180A0868151P629834J1675274M394279j2570741k0076488r589288M625209Q869260
172E825490O899155M663059k562345j5345142j9868938p933443O668017P500380
164a4153767m22205j666190M871305Q933721Q305415Q076589O490682j483508
156A8952042j0112327q580728R75269N734651J870833j341391K564147Q875021
148A8937517J0176313M122413o747273j5260147j2674345J52596R306831N074973
140A3088878l559208l442304J248370j836069q518471k919592J4051717K2002838
$$ plain form
132 30116159 40546218 32752119 15655367 -205370 -7680772 -1225522 15399458 24419415
124 24419415 12521907 -8479420 -14988556 -4215336 3473618 -4209981 -15906596 -17295449
116 -17295449 -10439184 -4073278 785884 4691114 852086 -15325154 -35126825 -45265654
108 -45265654 -41938601 -28611055 -8089941 13768109 25055480 20797595 12974702 15548028
100 15548028 25118532 29580441 30198633 37965880 50044943 49347758 31701659 15383847
92 15383847 14602495 18607380 10203131 -5866324 -9395700 4489210 17159271 12093840
84 12093840 -3366400 -9309327 -88024 9170665 3147041 -13909950 -24469652 -20580883
76 -20580883 -12215653 -11097075 -15219358 -16474191 -16380319 -22665218 -33310728 -37400297 -33003731
$$ packed form
132C0116159J0430059p794099j7096752j5860737p475402O455250J6624980R019957
124B4419415j1897508k1001327o509136J0773220P688954p683599j1696615j388853
116a7295449O856265O365906M859162L905230l839028j6177240j9801671j0138829
108d5265654L327053J3327546K0521114K1858050J1287371m257885p822893K573326
100A5548028R570504M461909O18192P767247J2079063o97185j7646099j6317812
92A5383847p81352M004885q404249j6069455l529376J3884910J2670061n065431
84A2093840j5460240n942927R221303R258689o023624j7056991j0559702L888769
76b0580883Q365230J118578m122283j254833R3872o284899j0645510m089569M396566
$$ plain form
67 -33003731 -30844457 -35429618 -35123186 -19532565 2812509 14391633 10277279 540565
59 540565 -4158551 -575522 9422527 20022924 22841843 15445150 6989400 8727351 21075623
50 21075623 35681547 45837568 47774617 37567870 17349335 400732 -2306363 1311275
42 1311275 -5746374 -23510898 -32959174 -23002896 -6070218 -426128 -7847969 -16768585
34 -16768585 -19364509 -16715730 -11781904 -5349857 1994743 8065679 9250960 3098883
26 3098883 -6292538 -8091341 3197950 17270862 18745969 7392917 -3753370 -10564061
18 -10564061 -22799772 -42009827 -50951456 -36811693 -12807707 -2301049 -9150468 -18104044
10 -18104044 -19243751 -17044417 -17277098 -19505448 -23817310 -32300719 -40379962 -37219422 -19918746
$$ packed form
67c3003731K159274m585161L06432J5590621K2345074J1579124m114354r736714
59E40565m699116L583029R998049J0600397K818919p396693q455750J737951J2348272
50B1075623J4605924J0156021J937049j0206747k0218535j6948603k707095L617638
42A311275p057649j7764524r448276R956278J6932678N644090p421841q920616
34a6768585k595924K648779M933826O432047P344600O070936J185281o152077
26C098883r391421j798803J1289291J4072912J475107j1353052j1146287o810691
18a0564061j2235711j9210055q941629J4139763K4003986J0506658o849419q953576
10a8104044j139707K199334k32681k228350m311862q483409q079243L160540J7300676
$$ plain form
1 -19918746 257447
0 257447
$$ packed form
1a9918746K0176193
0B57447
##END NTUPLES=NMR SPECTRUM
##END=
