##TITLE=31Pdec_LR-691-R2-PE-M
 
 24 sc
 6.5.2024
##JCAMPDX= 6.0         $$ Bruker NMR JCAMP-DX V2.0
##DATA TYPE= NMR SPECTRUM
##DATA CLASS= NTUPLES
##ORIGIN= UXNMR, Bruker Analytische Messtechnik GmbH
##OWNER= root
$$ XWIN-NMR		Version 3.5
$$ Mon May  6 16:29:46 2024 Russian Standard Time (UT+4h)  she@DPX200
##.OBSERVE FREQUENCY= 81.013821
##.OBSERVE NUCLEUS= ^31P
##.ACQUISITION MODE= SIMULTANEOUS
##.ACQUISITION SCHEME= undefined
##.AVERAGES= 24
##.DIGITISER RES= 16
##SPECTROMETER/DATA SYSTEM= spect
##.PULSE SEQUENCE= zgpg30
##.SOLVENT NAME= CDCl3
##.SHIFT REFERENCE= (INTERNAL, CDCl3, 0, 248.564)
##AUDIT TRAIL= $$ (NUMBER, WHEN, WHO, WHERE, WHAT)
$$ ##TITLE= Audit trail, XWIN-NMR		Version 3.5
$$ ##JCAMPDX= 5.01
$$ ##ORIGIN= Bruker BioSpin GmbH
$$ ##OWNER= she
$$ F:/spectra/data/she/nmr/P31/1/pdata/1/auditp.txt
$$ ##AUDIT TRAIL=  $$ (NUMBER, WHEN, WHO, WHERE, WHAT)
(   1,<2024-05-06 16:28:35.06 +0400>,<she>,<DPX200>,
      <created by zg, POWCHK disabled, PULCHK disabled
       configuration hash MD5:
       00 E9 B6 7A A2 85 ED C7 34 08 36 98 17 FE 4E 26
       data hash MD5: 32K
       CF C0 30 58 37 D2 8A D1 87 B9 7A 4D 45 EF D4 0F>)
(   2,<2024-05-06 16:28:37.70 +0400>,<she>,<DPX200>,
      <Start of raw data processing
       efp BC_mod = 2 LB = 10 FT_mod = 6 PKNL = 1 PHC0 = -13107.58 PHC1 = -265.1166 SI = 64K 
       data hash MD5: 64K
       65 30 B4 E6 44 EB 3A FB D4 61 4D 18 0C 58 95 81>)
(   3,<2024-05-06 16:28:51.29 +0400>,<she>,<DPX200>,
      <pk PHC0 = 29.33665 PHC1 = 0 
       data hash MD5: 64K
       37 14 D4 2D C5 72 94 D4 B6 82 93 19 B9 79 09 FE>)
(   4,<2024-05-06 16:29:10.29 +0400>,<she>,<DPX200>,
      <pk PHC0 = -3.799996 PHC1 = 0 
       data hash MD5: 64K
       AE F1 68 EE 9F 1C 52 24 34 71 5C AA D3 8C 48 9C>)
(   5,<2024-05-06 16:29:13.29 +0400>,<she>,<DPX200>,
      <abs ABSG = 5 
       data hash MD5: 64K
       C0 C8 E0 C2 F2 73 45 9F 62 0A C6 63 E1 05 B8 EF>)
$$ ##END=
$$ 
$$ hash MD5
$$ 45 7B 43 FE 5E 00 4B BA 54 79 D5 01 69 78 64 BF
##$RELAX= 
##$RELAX= 
##$RELAX= 
##$RELAX= 
##$RELAX= 
##$RELAX= 
##$RELAX= 
##$RELAX= 
##$RELAX= 
$$ Bruker specific parameters
$$ --------------------------
##$DU= <F:/spectra>
##$EXPNO= 1
##$NAME= <P31>
##$PROCNO= 1
##$TYPE= <nmr>
##$USER= <she>
##$AMP= (0..31)
100 100 100 100 100 100 100 100 100 100 100 100 100 100 100 100 100 100 
100 100 100 100 100 100 100 100 100 100 100 100 100 100 
##$AQSEQ= 0
##$AQ_mod= 1
##$AUNM= <au_zg>
##$AUTOPOS= <>
##$BF1= 81.014009
##$BF2= 200.13
##$BF3= 200.13
##$BF4= 200.13
##$BF5= 200.13
##$BF6= 200.13
##$BF7= 200.13
##$BF8= 200.13
##$BYTORDA= 1
##$CFDGTYP= 0
##$CFRGTYP= 5
##$CHEMSTR= <none>
##$CNST= (0..31)
1 1 145 1 1 1 1 1 1 1 1 1 1 1 1 1 1 1 1 1 1 1 1 1 1 1 1 1 1 1 1 1 
##$CPDPRG= <waltz16>
##$CPDPRG1= <>
##$CPDPRG2= <waltz16>
##$CPDPRG3= <>
##$CPDPRG4= <mlev>
##$CPDPRG5= <mlev>
##$CPDPRG6= <mlev>
##$CPDPRG7= <mlev>
##$CPDPRG8= <mlev>
##$CPDPRGB= <>
##$CPDPRGT= <>
##$D= (0..31)
$$ [...]
##$SUBNAM3= <"">
##$SUBNAM4= <"">
##$SUBNAM5= <"">
##$SUBNAM6= <"">
##$SUBNAM7= <"">
##$SUBNAM8= <"">
##$SUBNAM9= <"">
##$SW= 501.771253377433
##$SWIBOX= (0..15)
0 1 3 0 0 0 0 0 0 0 0 0 0 0 0 0 
##$SW_h= 40650.406504065
##$TD= 32768
##$TD0= 1
##$TE= 0
##$TE2= 300
##$TE3= 300
##$TEG= 300
##$TL= (0..7)
0 120 53 12 22 120 120 120 
##$TP= (0..7)
150 150 150 150 150 150 150 150 
##$TP07= 0
##$TPNAME0= <>
##$TPNAME1= <>
##$TPNAME2= <>
##$TPNAME3= <>
##$TPNAME4= <>
##$TPNAME5= <>
##$TPNAME6= <>
##$TPNAME7= <>
##$TPOAL= (0..7)
0.5 0.5 0.5 0.5 0.5 0.5 0.5 0.5 
##$TPOFFS= (0..7)
0 0 0 0 0 0 0 0 
##$TUNHIN= 0
##$TUNHOUT= 0
##$TUNXOUT= 0
##$USERA1= <user>
##$USERA2= <user>
##$USERA3= <user>
##$USERA4= <user>
##$USERA5= <user>
##$V9= 5
##$VALIST= <valist>
##$VCLIST= <CCCCCCCCCCCCCCC>
##$VD= 0
##$VDLIST= <DDDDDDDDDDDDDDD>
##$VPLIST= <PPPPPPPPPPPPPPP>
##$VTLIST= <TTTTTTTTTTTTTTT>
##$WBST= 1024
##$WBSW= 4
##$XGAIN= (0..3)
0 0 0 0 
##$XL= 0
##$YL= 0
##$YMAX_a= 1739
##$YMIN_a= -3672
##$ZGOPTNS= <>
##$ZL1= 120
##$ZL2= 120
##$ZL3= 120
##$ZL4= 120
##$ABSF1= 248.5645
##$ABSF2= -253.2056
##$ABSG= 5
##$ABSL= 3
##$ALPHA= 0
##$AQORDER= 0
##$ASSFAC= 0
##$ASSFACI= 0
##$ASSFACX= 0
##$ASSWID= 0
##$AUNMP= <proc_1d>
##$AZFE= 0.1
##$AZFW= 0.5
##$BCFW= 0
##$BC_mod= 2
##$BYTORDP= 0
##$COROFFS= 0
##$CY= -3
##$DATMOD= 1
##$DC= 0
##$DFILT= <>
##$DTYPP= 0
##$F1P= 0
##$F2P= 0
##$FCOR= 1
##$FTSIZE= 65536
##$FT_mod= 6
##$GAMMA= 0
##$GB= 0
##$INTBC= 1
##$INTSCL= 6.047779e-11
##$ISEN= 30
##$LB= 10
##$LEV0= 0
##$LPBIN= 0
##$MAXI= 10000
##$MC2= 0
##$MEAN= 0
##$ME_mod= 0
##$MI= 50
##$NCOEF= 0
##$NC_proc= -10
##$NLEV= 6
##$NOISF1= 182.463
##$NOISF2= 159.3651
##$NSP= 0
##$NTH_PI= 0
##$NZP= 0
##$OFFSET= 248.5645
##$PC= 4
##$PHC0= -13082.04
##$PHC1= -265.1166
##$PH_mod= 1
##$PKNL= yes
##$PPARMOD= 0
##$PSCAL= 0
##$PSIGN= 0
##$REVERSE= no
##$SF= 81.0140089999694
##$SI= 65536
##$SIGF1= 159.3651
##$SIGF2= -187.1042
##$SINO= 113.3802
##$SIOLD= 16384
##$SREGLST= <1H.CDCl3>
##$SSB= 0
##$STSI= 65536
##$STSR= 0
##$SW_p= 40650.406504065
##$SYMM= 0
##$S_DEV= 0
##$TDeff= 32768
##$TDoff= 0
##$TI= <>
##$TILT= no
##$TM1= 0
##$TM2= 0
##$TOPLEV= 0
##$USERP1= <user>
##$USERP2= <user>
##$USERP3= <user>
##$USERP4= <user>
##$USERP5= <user>
##$WDW= 1
##$XDIM= 65536
##$YMAX_p= 395902806
##$YMIN_p= -46858638
$$ End of Bruker specific parameters
$$ ---------------------------------
##NTUPLES= NMR SPECTRUM
##VAR_NAME=  FREQUENCY,     SPECTRUM/REAL,   SPECTRUM/IMAG
##SYMBOL=    X,             R,               I
##VAR_TYPE=  INDEPENDENT,   DEPENDENT,       DEPENDENT
##VAR_FORM=  AFFN,          ASDF,            ASDF
##VAR_DIM=   65536,         65536,           65536
##UNITS=     HZ,            ARBITRARY UNITS, ARBITRARY UNITS
##FACTOR=    0.620285442955139, 1,           1
##FIRST=     20137.2065510682, 0,            0
##LAST=      -20513.1999529968, 0,           0
##MIN=       -20513.1999529968, -46858638,   0
##MAX=       20137.2065510682, 395902806,    0
$$ Real data points
##PAGE= N=1
##DATA TABLE= (X++(R..R)), XYDATA
$$ [...]
41651C924973J123177J145024J145947J120570J054709R35300P62359N53673L37636
41642A2103368J39564k8037j65074k76384l64939m30302m71061m87761m85020
41633I534354m72324m62126m64584m81656n05715n24756n30965n27406n29691
41624E035131n61495o44601p87181r76554j181086j359883j474681j499675j427564
41615d877589j269900j050175p92189n11303k14536R2399L98523O86821R38519
41606f599430J138717J280565J366713J407123J413158J390544J335915J240277
41598C973582J097866R13792P04374M90111K87056J02563o4049k19068l72341
41589F913886n34468p11800r00729j084922j237912j329990j335515j237454j029299
$$ plain form
41651 3924973 5048150 6193174 7339121 8459691 9514400 10449700 11212059 11765732 12103368
41642 12103368 12242932 12214895 12049821 11773437 11408498 10978196 10507135 10019374 9534354
41633 9534354 9062030 8599904 8135320 7653664 7147949 6623193 6092228 5564822 5035131
41624 5035131 4473636 3829035 3041854 2065300 884214 -475669 -1950350 -3450025 -4877589
41615 -4877589 -6147489 -7197664 -7989853 -8501156 -8715692 -8623293 -8224770 -7537949 -6599430
41606 -6599430 -5460713 -4180148 -2813435 -1406312 6846 1397390 2733305 3973582
41598 3973582 5071448 5985240 6689614 7179725 7466781 7569344 7505295 7286227 6913886
41589 6913886 6379418 5667618 4766889 3681967 2444055 1114065 -221450 -1458904 -2488203
41580b488203p17053l22318J16438N48321R20223J188305J325966J326446J200904
41571C099029R74022O79489L56849M8239k08000l86208m78790m92734m39999l31126
41561B820771j77730J70J71425L00361L58785L35368K37070Q3608r9824k86517
41551C743487m48346n56212n85432n25739l89630k11878l8590Q8434J43931J23608
41541A343633M2006p3100j88440k74903l16987l17391k93083k63785k38844k10034
41531g90928j54734m8416J19936L37597N68572P64686Q81686Q92795P94262O02746
41521C968202L48440O8301j99334m19539n65936o25494o01271n11113l80768k33144
41511H48344q0005P7365K38864L96708N35873O42728P12028P45094P42381O99179
$$ plain form
41580 -2488203 -3205256 -3527574 -3411136 -2862815 -1942592 -754287 571679 1898125 3099029
41571 3099029 4073051 4752540 5109389 5157628 4949628 4563420 4084630 3591896 3151897 2820771
41561 2820771 2643041 2643211 2814636 3114997 3473782 3809150 4046220 4129828 4030004 3743487
41551 3743487 3295141 2738929 2153497 1627758 1238128 1026250 987660 1076094 1220025 1343633
41541 1343633 1385639 1312539 1124099 849196 532209 214818 -78265 -342050 -580894 -790928
41531 -790928 -945662 -994078 -874142 -536545 32027 796713 1678399 2571194 3365456 3968202
41521 3968202 4316642 4384943 4185609 3766070 3200134 2574640 1973369 1462256 1081488 848344
41511 848344 768339 845704 1084568 1481276 2017149 2659877 3371905 4116999 4859380 5558559
41501E558559O08748M68852K85420P1252j57168l81074n78954p27485q06265q04780
41491C537105p27440n93692m33759k81783j67616j08918j07035j49047k14133
41482G53682k79616l24270l30558k87477j93332n7179J00851K50774L58361L96506
41472C87742L57634K58560J33535J9563n7467q9307q3045n2994j2486K9602O7301
41461I58638R4765J05593R4270N7777l357q4335j76148k66999l44423l96929m15208
41450c76356l93908l33970k43899j38673l6388M6236R7916J15016J01494O7651
41440a094881K8563J542J515L5602J00202J82411K64342L27721L57911L47778
41430E52706L00485K28928J50777Q1476K9264n471k7986m6497o9827j04217j49657
$$ plain form
41501 5558559 6167307 6636159 6921579 6992831 6835663 6454589 5875635 5148150 4341885 3537105
41491 3537105 2809665 2215973 1782214 1500431 1332815 1223897 1116862 967815 753682
41482 753682 474066 149796 -180762 -468239 -661571 -718750 -617899 -367125 -8764 387742
41472 387742 745376 1003936 1137471 1157034 1099567 1010260 927215 874221 861735 891337 958638
41461 958638 1053403 1158996 1253266 1311043 1307686 1223351 1047203 780204 435781 38852 -376356
41450 -376356 -770264 -1104234 -1348133 -1486806 -1523194 -1476958 -1379042 -1264026 -1162532 -1094881
41440 -1094881 -1066318 -1064776 -1063261 -1027659 -927457 -745046 -480704 -152983 204928 552706
41430 552706 853191 1082119 1232896 1314372 1343636 1338165 1310179 1263682 1193855 1089638 939981
41419I39981j98572k39518k64173k72850k74662k82567l06859l51044m12157m84282
41409b146703n61901o40321p13582p72119q01831p85372p06401n56407l40404
41400h025041p6662K10045M96365P64070R99312J191253J332268J418754J451270
41391b38366J434528J377709J294326J199905J107293J021367R36614Q40294P20942
41382I694612N77257M20779K69255J34828J5671j02717k38066m01033n90239p92661
41372H987686r85668j139428j222793j214509j115175r50932p64092n94868m65233
41363E34988l74465l07837k51315k01923j67995j61603j90264k52880l39549m31907
41353b144750n03080n20015m51511k80683j5336L10959O48899R49697J179584
$$ plain form
41419 939981 741409 501891 237718 -35132 -309794 -592361 -899220 -1250264 -1662421 -2146703
41409 -2146703 -2708604 -3348925 -4062507 -4834626 -5636457 -6421829 -7128230 -7684637 -8025041
41400 -8025041 -8101703 -7891658 -7395293 -6631223 -5631911 -4440658 -3108390 -1689636 -238366
41391 -238366 1196162 2573871 3868197 5068102 6175395 7196762 8133376 8973670 9694612
41382 9694612 10271869 10692648 10961903 11096731 11112402 11009685 10771619 10370586 9780347 8987686
41372 8987686 8002018 6862590 5639797 4425288 3310113 2359181 1595089 1000221 534988
41363 534988 160523 -147314 -398629 -600552 -768547 -930150 -1120414 -1373294 -1712843 -2144750
41353 -2144750 -2647830 -3167845 -3619356 -3900039 -3915375 -3604416 -2955517 -2005820 -826236
41344h26236J326531J397353J407602J370116J288645J159761R80610P56336N01858
41335I362576K37003k1105k62523m82730o77425q39885r63868j048855j102070
41326D201118j134503j153327j155664j128565j056526r32525p65100n76842l96526
41317d098460k50136j53892j09907j05920j20937j34987j37733j31890j31451
41308e375313j56224k23849l40825m95537o56554p78147q13139p29522n22753
41299a0091863k16594J46543N17400Q47949J097900J243351J284173J242544J150778
41290b777819J035578R07994P63302N89556L80124J43869r2967k94919m31425
41281B23293m89176m76426m17899l44493k84196k57445k75166l36843m29284n28651
$$ plain form
41344 -826236 500295 1897648 3305250 4675366 5964011 7123772 8104382 8860718 9362576
41335 9362576 9599579 9578474 9315951 8833221 8155796 7315911 6352043 5303188 4201118
41326 4201118 3066615 1913288 757624 -370941 -1427467 -2359992 -3125092 -3701934 -4098460
41317 -4098460 -4348596 -4502488 -4612395 -4718315 -4839252 -4974239 -5111972 -5243862 -5375313
41308 -5375313 -5531537 -5755386 -6096211 -6591748 -7248302 -8026449 -8839588 -9569110 -10091863
41299 -10091863 -10308457 -10161914 -9644514 -8796565 -7698665 -6455314 -5171141 -3928597 -2777819
41290 -2777819 -1742241 -834247 -70945 518611 898735 1042604 949637 654718 223293
41281 223293 -265883 -742309 -1160208 -1504701 -1788897 -2046342 -2321508 -2658351 -3087635 -3616286
41271c616286o05174o27412n65472l96780j16117K54979O67413J055457J354912
41262b594480J520407J535337J412006J183957Q95123N90411L09659Q4142o5562
41253D871000j30455j11836j7775J40642L50016N90530Q30221J024678J127341
41244H674362J107369R64159P28164M47054J66558q2358k85698m42204n58647
41235A0718759o46503p18306p83548q46432r06829r62778j012052j052391j081224
41226B708696j095398j090573j060893r99848r02103p65367n92026l91190j80491
41217d369193J4776J66774K52743K61405J96402P7294o1962j79487k37997k18400
41207d097645j26078J4121J69331L08759M09204M57907M54206M08843L40556K71532
$$ plain form
41271 -3616286 -4221460 -4848872 -5414344 -5811124 -5927241 -5672262 -5004849 -3949392 -2594480
41262 -2594480 -1074073 461264 1873270 3057227 3952350 4542761 4852420 4936562 4871000
41253 4871000 4740545 4628709 4610934 4751576 5101592 5692122 6522343 7547021 8674362
41244 8674362 9781731 10745890 11474054 11921108 12087666 12005308 11719610 11277406 10718759
41235 10718759 10072256 9353950 8570402 7723970 6817141 5854363 4842311 3789920 2708696
41226 2708696 1613298 522725 -538168 -1538016 -2440119 -3205486 -3797512 -4188702 -4369193
41217 -4369193 -4354417 -4187643 -3934900 -3673495 -3477093 -3399799 -3461761 -3641248 -3879245 -4097645
41207 -4097645 -4223723 -4209602 -4040271 -3731512 -3322308 -2864401 -2410195 -2001352 -1660796 -1389264
41197a389264K22987K10179K37697K98767L80569M71529N63959O50752P21268
41188B368443P61417P57690P01650N92692M39218K58422P3877q9996k15982l01120
41178E346311l58078m08397m70947n53382o51766p56470q57560r45148j006885
41169f62322j028063r96719r10402p78838o20534m56050l01644j64977m3874P0633
41159e892790J87813L12150M43520N80052P17296Q43544R38925R83520R69054
41150H3084R03828Q07352P00377N96972N01404M10274L19165K29672J50374Q9693
41140D792195M7121J1579l0906q6648j49299k04244k39123k52779k56425k67296
41130C364175l00797l65815m62444n80067o97444p88533q32692q22521p64011
$$ plain form
41197 -1389264 -1166277 -956098 -718401 -419634 -39065 432464 996423 1647175 2368443
41188 2368443 3129860 3887550 4589200 5181892 5621110 5879532 5953409 5863413 5647431 5346311
41178 5346311 4988233 4579836 4108889 3555507 2903741 2147271 1289711 344563 -662322
41169 -662322 -1690385 -2687104 -3597506 -4376344 -4996878 -5452928 -5754572 -5919549 -5963423 -5892790
41159 -5892790 -5704977 -5392827 -4949307 -4369255 -3651959 -2808415 -1869490 -885970 83084
41150 83084 986912 1794264 2494641 3091613 3593017 4003291 4322456 4552128 4702502 4792195
41140 4792195 4839316 4850895 4819989 4733341 4584042 4379798 4140675 3887896 3631471 3364175
41130 3364175 3063378 2697563 2235119 1655052 957608 169075 -663617 -1486138 -2250149
41121b250149o70685n56971m34238l09285j84898o2692N2180J47199K03266K01826
41111c864447J35843J8370j17171k26658k70864k29775j09193O3068K48319M08847
41101c943661N15290N49967N09368M06276K67836J27710J5896m8126n7005j3908
41091a670357P0361J81043L02300M17056N04731N42282N12483M15193K71942J18276
41081A665310j0855r2324j17548q9805k1196P0227J65145K48608L13266L58717
41071B489545L88996M09829M25572M36673M40383M35298M25565M19883M25245
41062F296989M39957M50337M33483L65934K34875M5155j82844m22378o49429q47062
41052F165017j005899j122923j198834j233675j222783j156366j024568q26985
$$ plain form
41121 -2250149 -2920834 -3477805 -3912043 -4221328 -4406226 -4468918 -4416738 -4269539 -4066273 -3864447
41111 -3864447 -3728604 -3710234 -3827405 -4054063 -4324927 -4554702 -4663895 -4600827 -4352508 -3943661
41101 -3943661 -3428371 -2878404 -2369036 -1962760 -1694924 -1567214 -1551318 -1599444 -1656449 -1670357
41091 -1670357 -1599996 -1418953 -1116653 -699597 -194866 347416 859899 1275092 1547034 1665310
41081 1665310 1654455 1562131 1444583 1354778 1333582 1403809 1568954 1817562 2130828 2489545
41071 2489545 2878541 3288370 3713942 4150615 4590998 5026296 5451861 5871744 6296989
41062 6296989 6736946 7187283 7620766 7986700 8221575 8266730 8083886 7661508 7012079 6165017
41052 6165017 5159118 4036195 2837361 1603686 380903 -775463 -1800031 -2627016
41044b627016n81426l24008r6221P4568J86719K58922L13868L65393M16944M66473
41034a545784N08544N31502N15750M40092K95156R4565j26590l27047m78390n74587
41024f66789o26934o50527o53070o33099n86626n15462m30530l48736k87435k60775
41014e659983k77957l40785m40074n53629o48709o89175o45723n06400k82676
41005a0045111o468K82022N48380P70823R36700J034776J052606R82655Q31735
40996c611882O24424L95711J77104j4070j74618l05496m01096m48289m37493l76231
40986d571936k91392k16088j71325j57025j57547j54748j38871j12469q7475p7701
40976f136577r0807j24963j72144k23993k74423l17443l44140l43055l04403k25174
$$ plain form
41044 -2627016 -3208442 -3532450 -3628671 -3554103 -3367384 -3108462 -2794594 -2429201 -2012257 -1545784
41034 -1545784 -1037240 -505738 10012 450104 745260 839825 713235 386188 -92202 -666789
41024 -666789 -1293723 -1944250 -2597320 -3230419 -3817045 -4332507 -4763037 -5111773 -5399208 -5659983
41014 -5659983 -5937940 -6278725 -6718799 -7272428 -7921137 -8610312 -9256035 -9762435 -10045111
41005 -10045111 -10051579 -9769557 -9221177 -8450354 -7513654 -6478878 -5426272 -4443617 -3611882
40996 -3611882 -2987458 -2591747 -2414643 -2428713 -2603331 -2908827 -3309923 -3758212 -4195705 -4571936
40986 -4571936 -4863328 -5079416 -5250741 -5407766 -5565313 -5720061 -5858932 -5971401 -6058876 -6136577
40976 -6136577 -6227384 -6352347 -6524491 -6748484 -7022907 -7340350 -7684490 -8027545 -8331948 -8557122
40966h557122j11019K7184J79630L40759N05350O60904P84777Q50924Q42112P58665
40956c717836O18179M47943K75982J25726J5290m1310l5047L3519J48696K78805
40946a850053L83250M25376L84679K62889Q2352j21374l09341m48186n15694n01959
40936b208061m07483k40495j5532K45785N12672P45439R03058R58427R12729P96492
40926B203031O54000N21933M17455L40712K83919K37641J92721J42253Q5639L1771
40916E111075k829j616M2329J20356K10134K84047L18709L00138K24086R4209
40906F700638q0077k86161n11257p44225r74939j191314j375493j501140j535585
40897a499553j449767j233362r05880n14820j20653K22854M83754O57795P64511
$$ plain form
40966 -8557122 -8668141 -8640957 -8461327 -8120568 -7615218 -6954314 -6169537 -5318613 -4476501 -3717836
40956 -3717836 -3099657 -2651714 -2375732 -2250006 -2234716 -2276026 -2311073 -2277554 -2128858 -1850053
40946 -1850053 -1466803 -1041427 -656748 -393859 -311507 -432881 -742222 -1190408 -1706102 -2208061
40936 -2208061 -2615544 -2856039 -2871571 -2625786 -2113114 -1367675 -464617 493810 1406539 2203031
40926 2203031 2857031 3378964 3796419 4137131 4421050 4658691 4851412 4993665 5079304 5111075
40916 5111075 5108246 5106630 5148959 5269315 5479449 5763496 6082205 6382343 6606429 6700638
40906 6700638 6620561 6334400 5823143 5078918 4103979 2912665 1537172 36032 -1499553
40897 -1499553 -2949320 -4182682 -5088562 -5603382 -5724035 -5501181 -5017427 -4359632 -3595121
40888c595121Q34902Q95338R55325J005019J022215R83381Q73239O90072M45868
40879D110238J62595j32191m07720o32204p79373q39460q26720p74163p15728
40870h34726o67951o25090n70985m96979m11212l33300k81195k61989k71897l01316
40860e056640l38161l68204l76780l55079l07642k53540k17447k15914k49097
40851g738504l03851l63968m18067m59727m82393m75300m24354l17766j53307
40842a1137237N7586K92698N27885P44991R32105J077540J165889J182338J122082
40833d034123R96261Q29778O53545M96420L79358L11667K89634K98536L18153
40824E39229L30097L24791L05808K88826K93621L31891L97994M69022N14126N07465
$$ plain form
40888 -3595121 -2760219 -1864881 -909556 95463 1117678 2101059 2974298 3664370 4110238
40879 4110238 4272833 4140642 3732922 3100718 2321345 1481885 655165 -118998 -834726
40870 -834726 -1502677 -2127767 -2698752 -3195731 -3606943 -3940243 -4221438 -4483427 -4755324 -5056640
40860 -5056640 -5394801 -5763005 -6139785 -6494864 -6802506 -7056046 -7273493 -7489407 -7738504
40851 -7738504 -8042355 -8406323 -8824390 -9284117 -9766510 -10241810 -10666164 -10983930 -11137237
40842 -11137237 -11079651 -10786953 -10259068 -9514077 -8581972 -7504432 -6338543 -5156205 -4034123
40833 -4034123 -3037862 -2208084 -1554539 -1058119 -678761 -367094 -77460 221076 539229
40824 539229 869326 1194117 1499925 1788751 2082372 2414263 2812257 3281279 3795405 4302870
40814D302870M38496L16406J67764K8534o6214r0450l1115J10351L16936N56628
40804F050206P87388R66986J064062J065769R78311Q19730O08312L53891N8421
40795A2753076k74837o31129r80851j284641j503025j606415j582952j441959
40787C447267j211060r27900o31151l55090j27634L1716J15379J30212R6141M1298
40777F09178m111j4321K5423J14650K39329L79201N15700O35355P28671P88272
40767D017347Q08913P88667P29563O37285N20576L90692K60545J43128M9456j2959
40757H333213m0655l4407J98N2859J11371J66862K17507K67370L21328L80157
40747I775803M38662M86648N11531N01756M49807L53389K14664L9266j63028l76067
$$ plain form
40814 4302870 4741366 5057772 5225536 5254070 5187856 5097406 5066291 5176642 5493578 6050206
40804 6050206 6837594 7804580 8868642 9934411 10912722 11732452 12340764 12694655 12753076
40795 12753076 12478239 11847110 10866259 9581618 8078593 6472178 4889226 3447267
40787 3447267 2236207 1308307 677156 322066 194432 226148 341527 471739 567880 609178
40777 609178 605067 590746 616169 730819 970148 1349349 1865049 2500404 3229075 4017347
40767 4017347 4826260 5614927 6344490 6981775 7502351 7893043 8153588 8296716 8346172 8333213
40757 8333213 8292558 8258151 8258349 8311208 8422579 8589441 8806948 9074318 9395646 9775803
40747 9775803 10214465 10701113 11212644 11714400 12164207 12517596 12732260 12771526 12608498 12232431
40737A2232431n75711p32037q17128q16071p34300n95364m30452k68032j31028
40728G132308m0587j8310q0263k25122m26872o41521q26411r59377j043946j097982
40718A771917j135582j155726j144371j086798r80354q38283o82621n32978l99817
40709f184613k84586j83026q8358N564J01974K02618L12347M40717N96126P76535
40699d304702R65592J137684J268418J345118J373117J373934J373757J387560
40691E920478J409051J412454J363306J231573J003334O89426L27849k3907l06263
40682A3027301m78151n31194m90120l98986l00781k22051j69759j38191j17397
40673A0180671r6658o3455l438R4473K29780L85711N33170O40726O83150O44399
$$ plain form
40737 12232431 11656720 10924683 10107555 9291484 8557184 7961820 7531368 7263336 7132308
40728 7132308 7091721 7073411 6993148 6768026 6341154 5699633 4873222 3913845 2869899 1771917
40718 1771917 636335 -519391 -1663762 -2750560 -3730914 -4569197 -5251818 -5784796 -6184613
40709 -6184613 -6469199 -6652225 -6740583 -6735019 -6633045 -6430427 -6118080 -5677363 -5081237 -4304702
40699 -4304702 -3339110 -2201426 -933008 412110 1785227 3159161 4532918 5920478
40691 5920478 7329529 8741983 10105289 11336862 12340196 13029622 13357471 13333564 13027301
40682 13027301 12549150 12017956 11527836 11128850 10828069 10606018 10436259 10298068 10180671
40673 10180671 10084013 10020558 10017120 10111593 10341373 10727084 11260254 11900980 12584130 13228529
40663A3228529N18153L10145M0875k56295n42884p84343r56240j047532j062233
40654I448175j018017r39409q47343p51092o47762n29238l91443k40047q9771
40645C994053M1137J37488J91627K05170J88457J57297J26678J03253Q0867M2412
40635E268439l2980j61812l51251n97828q87684j196704j491289j732347j883405
40626c066861j920499j839340j656396j403887j120652q41355n87053l61672j57918
40617a2955633K9401J91684L06022L47234L03901J87240K8328j32594k57823l20579
40607a2272819l09171k27481r2675O8996K27459L54889M31498M48513M06585L11631
40597a0652575J73039O181j64991l11147m06844m39548m12133l38453k36547j23863
$$ plain form
40663 13228529 13746682 14056827 14097702 13841407 13298523 12514180 11557940 10510408 9448175
40654 9448175 8430158 7490749 6643406 5892314 5244552 4715314 4323871 4083824 3994053
40645 3994053 4035190 4172678 4364305 4569475 4757932 4915229 5041907 5145160 5226027 5268439
40635 5268439 5235459 5073647 4722396 4124568 3236884 2040180 548891 -1183456 -3066861
40626 -3066861 -4987360 -6826700 -8483096 -9886983 -11007635 -11848990 -12436043 -12797715 -12955633
40617 -12955633 -12926232 -12734548 -12428526 -12081292 -11777391 -11590151 -11561823 -11694417 -11952240 -12272819
40607 -12272819 -12581990 -12809471 -12902146 -12833150 -12605691 -12250802 -11819304 -11370791 -10964206 -10652575
40597 -10652575 -10479536 -10473355 -10638346 -10949493 -11356337 -11795885 -12208018 -12546471 -12783018 -12906881
40587a2906881j5350P7092J45935J90325K17920K43979K87142L62981M77277O21081
40577a0298499P69872Q88445R40144Q96772P46585M99804J90302j30136m06451
40568e903162n97877o88287o84173o04770m72930l11675j45269j017R1774J07885
40558i209501L6780j06977k81361m27905m92875m47463k95679o7596J95214M53145
40548a0644218O77039Q51323R71891J039448J052824J008230R05388P54496N77233
40539b806346M01019K50507J40340P1223L0958J305l1800p0729j06276j24644
40529b244443j15224p3491J300J09213K49495M17731O03676P91537R61822J093624
40519A795240J167845J171569J101331R62744P66590N25100K51782l5056l09152
$$ plain form
40587 -12906881 -12922231 -12845139 -12699204 -12508879 -12290959 -12046980 -11759838 -11396857 -10919580 -10298499
40577 -10298499 -9528627 -8640182 -7700038 -6803266 -6056681 -5556877 -5366575 -5496711 -5903162
40568 -5903162 -6501039 -7189326 -7873499 -8478269 -8951199 -9262874 -9408143 -9409160 -9317386 -9209501
40558 -9209501 -9172721 -9279698 -9561059 -9988964 -10481839 -10929302 -11224981 -11292577 -11097363 -10644218
40548 -10644218 -9967179 -9115856 -8143965 -7104517 -6051693 -5043463 -4138075 -3383579 -2806346
40539 -2806346 -2405327 -2154820 -2014480 -1943257 -1912299 -1910994 -1942794 -2013523 -2119799 -2244443
40529 -2244443 -2359667 -2433158 -2431858 -2322645 -2073150 -1655419 -1051743 -260206 701616 1795240
40519 1795240 2963085 4134654 5235985 6198729 6965319 7490419 7742201 7707145 7397993
40510G397993n38716o96063p69664p70192p25916o70598o31463o22336o42506
40501A330539o79327p12856p21267o86030n96326m51973k63548m9189J69739L70718
40491b289520N30010O24435O37983N70107M39472K79915J31399K9810l211L0444
40481I80844J01513J61691J64662Q9544m8110k04977l32154l96935l93426l40043
40471b17391k68512k10667j87745k04917k52157l10113l57783l78226l61018l02833
40461c051362k07539q5120N1699J91191L23384M37824N22750N68447N71730N36686
40451a40310M71649L87037K95870K13347J51961J14895R3889P4329M3249o400
40441A699516p8296j78715l19011n10628p55335j038258j328648j586967j773578
$$ plain form
40510 7397993 6859277 6163214 5393550 4623358 3897442 3226844 2595381 1973045 1330539
40501 1330539 651212 -61644 -782911 -1468941 -2065267 -2517240 -2780788 -2829977 -2660238 -2289520
40491 -2289520 -1759510 -1135075 -497092 73015 512487 792402 923801 953611 950400 980844
40481 980844 1082357 1244048 1408710 1498254 1450144 1245167 913013 516078 122652 -217391
40471 -217391 -485903 -696570 -884315 -1089232 -1341389 -1651502 -2009285 -2387511 -2748529 -3051362
40461 -3051362 -3258901 -3344021 -3292322 -3101131 -2777747 -2339923 -1817173 -1248726 -676996 -140310
40451 -140310 331339 718376 1014246 1227593 1379554 1494449 1588338 1662667 1705916 1699516
40441 1699516 1621220 1442505 1123494 612866 -142469 -1180727 -2509375 -4096342 -5869920
40432e869920j856645j820024j669941j435669j160784q88523o49934m60540l23751
40423a6135731k35109j84112j54669j26200p5559K0667J82076M16650P11218J027135
40413a4553634J308169J499855J570073J518473J370566J163389R33350P10787
40405d478972N18535L70694K71340K14533J85707J63793J24719M6933q2742k65429
40395b930889m88916p27605r44626j099113j158476j109779r62973p44415m85535
40386a0652327k13927M8940K84196M71365N89110O22337N70833M52282K96120
40377g531071J31458k3361j62555k84622l80738m30740m12831l20664j73212p748
40367i596084J39076K47456L17216L58387L78946L78055L47421K78543J71448
$$ plain form
40432 -5869920 -7726565 -9546589 -11216530 -12652199 -13812983 -14701506 -15351440 -15811980 -16135731
40423 -16135731 -16370840 -16554952 -16709621 -16835821 -16911380 -16890713 -16708637 -16291987 -15580769 -14553634
40413 -14553634 -13245465 -11745610 -10175537 -8657064 -7286498 -6123109 -5189759 -4478972
40405 -4478972 -3960437 -3589743 -3318403 -3103870 -2918163 -2754370 -2629651 -2582718 -2665460 -2930889
40395 -2930889 -3419805 -4147410 -5092036 -6191149 -7349625 -8459404 -9422377 -10166792 -10652327
40386 -10652327 -10866254 -10817314 -10533118 -10061753 -9472643 -8850306 -8279473 -7827191 -7531071
40377 -7531071 -7399613 -7422974 -7585529 -7870151 -8250889 -8681629 -9094460 -9415124 -9588336 -9596084
40367 -9596084 -9457008 -9209552 -8892336 -8533949 -8155003 -7776948 -7429527 -7150984 -6979536
40358f979536L9849r0997j93308k47484k48162k03055j27224l7246N2592J32457
40348g902114J98046K49864K90176L19382L34492L30886L05568K59583J98467
40339e415650J30969O6374J1523l0417n8489p1920p0977o0419n0587n2212o7885
40328e669690q7959r5463p6760k9891L4974J02571J61738K10589K54663K99745
40318d895483L44496L77487L80194L34831K34812R4124n0100j47329j54000n3717
40308c534685J36044L74533O16585Q26875R84278J079814J113249J090373J021644
40299C708710R22818Q15002P19130O44371N79056M94308L60615J66673p1130l12636
40289H026917n08540o19514o31464n58952m35970l01906j91490j29537j25823
$$ plain form
40358 -6979536 -6939687 -7030684 -7223992 -7471476 -7719638 -7922693 -8049917 -8087163 -8034571 -7902114
40348 -7902114 -7704068 -7454204 -7164028 -6844646 -6510154 -6179268 -5873700 -5614117 -5415650
40339 -5415650 -5284681 -5218307 -5206784 -5237201 -5295690 -5367610 -5438587 -5499006 -5549593 -5601805 -5669690
40328 -5669690 -5757649 -5853112 -5929872 -5959763 -5924789 -5822218 -5660480 -5449891 -5195228 -4895483
40318 -4895483 -4550987 -4173500 -3793306 -3458475 -3223663 -3129539 -3179639 -3326968 -3480968 -3534685
40308 -3534685 -3398641 -3024108 -2407523 -1580648 -596370 483444 1596693 2687066 3708710
40299 3708710 4631528 5446530 6165660 6810031 7389087 7883395 8244010 8410683 8339553 8026917
40289 8026917 7518377 6898863 6267399 5708447 5272477 4970571 4779081 4649544 4523721
40280D523721j69730k31485k74807k75335k32580j67906j12115r2046j22912k06851
40270B637954l34653m88124o41729p64113q21799p87959o54563m40074j84134
40261b479194O9800K92275M73664O16424P23234P91177Q14237P89113P18249O07952
40251C416931M63911K88607Q3553j45064l82277o06076p94382r32253j014162
40242C78788j040394j011445r25967p84766n97938l88704j89261k9903P1907J15808
40232d401875J14741Q7257N1297K1883J1503L1054Q9707J93231L41264N24890
40222b935048P25737R17012J066946J145731J135475J038815Q79787O94682N18054
40213E187191L72364K65552J94727J51169J23514R9169O6318J8660l8401q5679
$$ plain form
40280 4523721 4353991 4122506 3847699 3572364 3339784 3171878 3059763 2967717 2844805 2637954
40270 2637954 2303301 1815177 1173448 409335 -412464 -1200423 -1854986 -2295060 -2479194
40261 -2479194 -2409394 -2117119 -1643455 -1027031 -303797 487380 1301617 2090730 2808979 3416931
40251 3416931 3880842 4169449 4253002 4107938 3725661 3119585 2325203 1392950 378788
40242 378788 -661606 -1673051 -2599018 -3383784 -3981722 -4370426 -4559687 -4589590 -4517683 -4401875
40232 -4401875 -4287134 -4199877 -4148580 -4126697 -4115194 -4084140 -3994433 -3801202 -3459938 -2935048
40222 -2935048 -2209311 -1292299 -225353 920378 2055853 3094668 3974455 4669137 5187191
40213 5187191 5559555 5825107 6019834 6171003 6294517 6393686 6460004 6478664 6440263 6354584
40203F354584r7558n7018L1976J45170K52886L38238M05125M70684N49012O38757
40193I031856P22763P78256P89256P52900O76857N70783M38105K73763O9565j76350
40183A3927754m52552p34675r92640j199903j340201j410590j421523j393674
40175D981996j350622j309432j274778j240386j195098j127382j026131q81881
40167d423714o92053m67647k34680k7006J26204K11729K36519K22870J97048J77140
40157d673590J66149J52787J18483M7252o5354k07870l54775m72996n29500m98204
40147f317618l66681j42038J47409M57593P39711R51703J065982J072730R80124
40138a411085Q12288O04505L95047K15141Q1386m620m8822n4937j9842O2604J92740
$$ plain form
40203 6354584 6257026 6200008 6231984 6377154 6630040 6968278 7373403 7844087 8393099 9031856
40193 9031856 9754619 10532875 11322131 12075031 12751888 13322671 13760776 14034539 14104104 13927754
40183 13927754 13475202 12740527 11747887 10547984 9207783 7797193 6375670 4981996
40175 4981996 3631374 2321942 1047164 -193222 -1388320 -2515702 -3541833 -4423714
40167 -4423714 -5115767 -5583414 -5818094 -5845100 -5718896 -5507167 -5270648 -5047778 -4850730 -4673590
40157 -4673590 -4507441 -4354654 -4236171 -4188919 -4254273 -4462143 -4816918 -5289914 -5819414 -6317618
40147 -6317618 -6684299 -6826337 -6678928 -6221335 -5481624 -4529921 -3463939 -2391209 -1411085
40138 -1411085 -598797 5708 400755 615896 697282 692662 643840 588903 569061 631665 824405
40127H24405L58051N33103O87172P95370Q46419Q42543P93224P09195O00887M79563
40117G469932L57078K43789J47252P2349K0386j3520m0920p4814j21638j77604
40107G882290k33086k81174l23472l69143m27845n00319n72386o17476o07753
40098C949636n26618l74156j63966Q2226L36532N65525P35593Q23573Q25581P56726
40088G010652O42523N09130L78089K64987J78753J20270Q1993M9978Q022n7459
40078I186938j52934k74846m09549n37115o38848p06430p48017p86231q46876
40069D086092r44536j074745j217236j345808j436610j471323j438041j332965
40061f175172j162029r39882o86282m22624j69810N4556K41202L93399N24834
$$ plain form
40127 824405 1182456 1715559 2402731 3198101 4044520 4887063 5680287 6389482 6990369 7469932
40117 7469932 7827010 8070799 8218051 8290400 8310786 8297266 8256346 8181532 8059894 7882290
40107 7882290 7649204 7368030 7044558 6675415 6247570 5747251 5174865 4557389 3949636
40098 3949636 3423018 3048862 2884896 2967122 3303654 3869179 4604772 5428345 6253926 7010652
40088 7010652 7653175 8162305 8540394 8805381 8984134 9104404 9186397 9236375 9244397 9186938
40078 9186938 9034004 8759158 8349609 7812494 7173646 6467216 5719199 4932968 4086092
40069 4086092 3141556 2066811 849575 -496233 -1932843 -3404166 -4842207 -6175172
40061 -6175172 -7337201 -8277083 -8963365 -9385989 -9555799 -9501243 -9260041 -8866642 -8341808
40052h341808O49969P73263Q85784R71598J017871J020961R85962R23311Q46886
40043b66203P73814P22843P08739P34887P89414Q48486Q85311Q80043Q26627P34857
40033G638818O27124N30428M67053M48583M75350N38900O23957P08848P65608
40024A2824669P61667O64946M53235J24967k95124p59746j209542j583875j829357
40015I151840j908747j811449j560730j210425q29344m80202k03577j3625R5876
40006A229617J42239J46827J30177J07119Q3343N7313K7531j853k3598l6372n0604
39995A811739q3895j48479k40817l41585m25200m71192m70416m25228l46222k47661
39985a388956j42556l9330N7869J46278K22479K82723L23597L41006L28779K79581
$$ plain form
40052 -8341808 -7691839 -6918576 -6032792 -5061194 -4043323 -3022362 -2036400 -1113089 -266203
40043 -266203 507611 1230454 1939193 2674080 3463494 4311980 5197291 6077334 6903961 7638818
40033 7638818 8265942 8796370 9263423 9712006 10187356 10726256 11350213 12059061 12824669
40024 12824669 13586336 14251282 14704517 14829484 14534360 13774614 12565072 10981197 9151840
40015 9151840 7243093 5431644 3870914 2660489 1831145 1350943 1147366 1133741 1229617
40006 1229617 1371856 1518683 1648860 1755979 1839322 1896635 1924166 1922313 1898715 1862343 1811739
39995 1811739 1727844 1579365 1338548 996963 571763 100571 -369845 -795073 -1141295 -1388956
39985 -1388956 -1531512 -1570842 -1512973 -1366695 -1144216 -861493 -537896 -196890 131889 411470
39975D11470J88657N8171j00478k68044m23154n50453o46743p21066p88999q65505
39965c706144r60033j073624j196147j304551j366122j348599j232732j019709
39957a3207661p30182l98481o6727K21435M30097N41382N59965N07647M11959
39948a1730566K96800J79820P5034m201m5843m3499l26P1604J56129K37360L01465
39937a0506223L38786L48801L44261L47998L82209M57671N69996P02743Q32401
39928f181357R32246R76388R45844Q35567O58663M44894K33408O2087m3024p4493
39918a209777m3423K7865J16180K04630K83568L47458L91512M09780L94737L39399
39908A261929K42560J14637k0311j28747j76636j39861j3046J86337M21039O43773
$$ plain form
39975 411470 600127 658298 557820 289776 -133378 -683831 -1330574 -2051640 -2840639 -3706144
39965 -3706144 -4666177 -5739801 -6935948 -8240499 -9606621 -10955220 -12187952 -13207661
39957 -13207661 -13937843 -14336324 -14403051 -14181616 -13751519 -13210137 -12650172 -12142525 -11730566
39948 -11730566 -11433766 -11253946 -11178912 -11183113 -11228956 -11272455 -11272781 -11201177 -11045048 -10807688 -10506223
39937 -10506223 -10167437 -9818636 -9474375 -9126377 -8744168 -8286497 -7716501 -7013758 -6181357
39928 -6181357 -5249111 -4272723 -3326879 -2491312 -1832649 -1387755 -1154347 -1092260 -1135284 -1209777
39918 -1209777 -1253200 -1225335 -1109155 -904525 -620957 -273499 118013 527793 922530 1261929
39908 1261929 1504489 1619126 1598815 1470068 1293432 1153571 1140525 1326862 1747901 2391674
39898B391674Q09835Q88238Q68817P64164O05025M28964K66432J31910K5701n6333
39888G124427j14955j48931j62263j67087j77427k00213k33177k70512l08656
39879E341206l46110l79407m01389m04747l88082l59137l31123l13278l02691
39870B115242k85361k47302j87161j20131p0388n7707q6763j44331k04943k41661
39860D69494k37055j90641j21016o1435m8220j04895k29850l95547n60152o84250
39850b163567p43113p29563o49131n13168l35483j33594O9596K48639L82843M62435
39840d104106M88745M69600M15309L38840K58830K00607J90988K47085L65911
39831a128191N24007O89749Q39322R63136J058690J119585J132442J083351R65870
$$ plain form
39898 2391674 3201509 4089747 4958564 5722728 6327753 6756717 7023149 7155059 7180760 7124427
39888 7124427 7009472 6860541 6698278 6531191 6353764 6153551 5920374 5649862 5341206
39879 5341206 4995096 4615689 4214300 3809553 3421471 3062334 2731211 2417933 2115242
39870 2115242 1829881 1582579 1395418 1275287 1204899 1147192 1060429 916098 711155 469494
39860 469494 232439 41798 -79218 -140653 -188873 -293768 -523618 -919165 -1479317 -2163567
39850 -2163567 -2906680 -3636243 -4285374 -4798542 -5134025 -5267619 -5198023 -4949384 -4566541 -4104106
39840 -4104106 -3615361 -3145761 -2730452 -2391612 -2132782 -1932175 -1741187 -1494102 -1128191
39831 -1128191 -604184 85565 924887 1888023 2946713 4066298 5198740 6282091 7247961
39822G247961P84274N52721K93029L0168k15236m33338o24105p88689r20784j005892
39812D920109j028579r81154q67570p01802n04255k99013j11526L5870J31618
39803E93698J82163K12588K57244L44020M81345O55603Q39405J003910J127130
39794E697106J195238J200128J138100J011197Q28923O07954L70171J40496n5894
39785A2133419j98635k79251l05904l00968k90768k93004l09446l27953l31554
39776I495936l08366k56777j84781j06363l8480P92m693o3395j69291k98663m14426
39765G651493m78759m70012l95627k91991k08403j82862k24215l10858m04418
39756D684348m67461m74943m16920k96958j31056N3109K20768L40317L95087L89678
$$ plain form
39822 7247961 8032235 8584956 8877985 8908153 8692917 8259579 7635474 6846785 5926001 4920109
39812 4920109 3891530 2910376 2042806 1341004 836749 537736 426210 462080 593698
39803 593698 775861 988449 1245693 1589713 2071058 2726661 3566066 4569976 5697106
39794 5697106 6892344 8092472 9230572 10241769 11070692 11678646 12048817 12189313 12133419
39785 12133419 11934784 11655533 11349629 11048661 10757893 10464889 10155443 9827490 9495936
39776 9495936 9187570 8930793 8746012 8639649 8601169 8601961 8597268 8533873 8364582 8065919 7651493
39765 7651493 7172734 6702722 6307095 6015104 5806701 5623839 5399624 5088766 4684348
39756 4684348 4216887 3741944 3325024 3028066 2897010 2950119 3170887 3511204 3906291 4295969
39746D295969L47829L04290K94259L42075M50999N98315P39565Q21432P98549
39737H993282O48381L78432K1685l78421p84656j173940j533962j855317k126827
39728B188657k335099k465050k500739k429080k246786j966043j614138j227489
39720a4595767q44836n01870k25082k3726J14536K16848L08508L98790M80533
39711a4672066N41897N78394N96446O09233O30170O67180P18805P73770Q14682
39702h741489Q23836P88073P01724N68470M02046K24556O2095o1057j27913j32918
39692e492577q4079k424Q1985J37826J42833R2868N349q5407j39963j29184m7599
39681e520372Q2367K19760L23907L71023L59459L04372K29503J60851J21129J23174
$$ plain form
39746 4295969 4643798 4948088 5242347 5584422 6035421 6633736 7373301 8194733 8993282
39737 8993282 9641663 10020095 10041780 9663359 8878703 7704763 6170801 4315484 2188657
39728 2188657 -146442 -2611492 -5112231 -7541311 -9788097 -11754140 -13368278 -14595767
39720 -14595767 -15440603 -15942473 -16167555 -16191281 -16076745 -15859897 -15551389 -15152599 -14672066
39711 -14672066 -14130169 -13551775 -12955329 -12346096 -11715926 -11048746 -10329941 -9556171 -8741489
39702 -8741489 -7917653 -7129580 -6427856 -5859386 -5457340 -5232784 -5170689 -5231746 -5359659 -5492577
39692 -5492577 -5576656 -5579080 -5497095 -5359269 -5216436 -5123568 -5118219 -5203626 -5343589 -5472773 -5520372
39681 -5520372 -5438005 -5218245 -4894338 -4523315 -4163856 -3859484 -3629981 -3469130 -3348001 -3224827
39671c224827J64376K25546K75104K76956K00493L1583k18516n11900p94229j013794
39661d589208j139663j168782j119577j018714q90171p50640o09709m72206l41449
39652a2100119k22293j22025m7754j624K3036M1594P3157J33092K26978L49166
39642a1646792M86009O21356P41952Q40974R18543R79441J030543J080254J139017
39633c808703J217221J319563J439466J557709J645376J669049J597855J413426
39625H050962J120132P48719L48455k9120l45365n80876p32553q07064q16386
39616F956904p76735p08190o32513n69291n32581n29074n56686o03097o46173
39607A402564o58747o16960n07905l32653j04598J53964M14987O47576Q22324
$$ plain form
39671 -3224827 -3060451 -2834905 -2559801 -2282845 -2082352 -2050769 -2269285 -2781185 -3575414 -4589208
39661 -4589208 -5728871 -6897653 -8017230 -9035944 -9926115 -10676755 -11286464 -11758670 -12100119
39652 -12100119 -12322412 -12444437 -12492191 -12493815 -12470779 -12429185 -12356028 -12222936 -11995958 -11646792
39642 -11646792 -11160783 -10539427 -9797475 -8956501 -8037958 -7058517 -6027974 -4947720 -3808703
39633 -3808703 -2591482 -1271919 167547 1725256 3370632 5039681 6637536 8050962
39625 8050962 9171094 9919813 10268268 10239148 9893783 9312907 8580354 7773290 6956904
39616 6956904 6180169 5471979 4839466 4270175 3737594 3208520 2651834 2048737 1402564
39607 1402564 743817 126857 -381048 -713701 -818299 -664335 -249348 398228 1220552
39598A220552R17756R27185Q61460P43377N95137M27039K36557J8902k19578m56080
39588E272307o57906p95781q55101q38712p60532o34848m68923k64302k5379K32391
39578B03214M82452O95824Q51342R39945R62698R28581Q55203P68031O92327O40098
39568H019715O02608N56094M77234L57017K04257L8602j20684k63444l91610n16415
39558H963374o51036q00470r52466j076036j131318j086530r31470o79882l62160
39549A292006j5658L21854O14942Q32372R51301R64684Q87722P56279O14241M96331
39539G716074M17469L74815L58285L60318L78512M11879M56215N02920N40643
39530A1517130N56512N36853M70849L57619K10676N3678r0292k06902k90686l39936
$$ plain form
39598 1220552 2138308 3065493 3926953 4670330 5265467 5692506 5929063 5947965 5728387 5272307
39588 5272307 4614401 3818620 2963519 2124807 1364275 729427 260504 -3798 -29177 203214
39578 203214 685666 1381490 2232832 3172777 4135475 5064056 5919259 6687290 7379617 8019715
39568 8019715 8622323 9178417 9655651 10012668 10216925 10255527 10134843 9871399 9479789 8963374
39558 8963374 8312338 7511868 6559402 5483366 4352048 3265518 2334048 1654166 1292006
39549 1292006 1276348 1598202 2213144 3045516 3996817 4961501 5849223 6605502 7219743 7716074
39539 7716074 8133543 8508358 8866643 9226961 9605473 10017352 10473567 10976487 11517130
39530 11517130 12073642 12610495 13081344 13438963 13649639 13703317 13613025 13406123 13115437 12775501
39520A2775501l52941l28955k72508j96350j18343n2614j577M3931R7369J69401
39510A1762914K64695L79109M95420N83562O11568N62551M45280K91259J42490
39501A5538848L7872K436M0049J31192K38046L17024L34907K81957J75357N1150
39491A7148838m9914r3440n5340P6899K99912N88685Q97226J169513J355406J422565
39481B2760350J360502J178679R00769N55324J65235k57302p05227j163837j601199
39472B3193294j970084k221207k320598k262222k069446j783972j447680j087477
39464H030608p11532l17238R6008N17531R23830J283588J565366J744263J806311
39455A4938735J751235J593863J362866J095442Q28862N91806L98564K47838J26509
$$ plain form
39520 12775501 12422560 12093605 11821097 11624747 11506404 11453790 11452213 11496144 11593513 11762914
39510 11762914 12027609 12406718 12902138 13485700 14097268 14659819 15105099 15396358 15538848
39501 15538848 15576720 15579156 15619205 15750397 15988443 16305467 16640374 16922331 17097688 17148838
39491 17148838 17098924 17005484 16950144 17027043 17326955 17915640 18812866 19982379 21337785 22760350
39481 22760350 24120852 25299531 26200300 26755624 26920859 26663557 25958330 24794493 23193294
39472 23193294 21223210 19002003 16681405 14419183 12349737 10565765 9118085 8030608
39464 8030608 7319076 7001838 7097846 7615377 8539207 9822795 11388161 13132424 14938735
39455 14938735 16689970 18283833 19646699 20742141 21571003 22162809 22561373 22809211 22935720
39446B2935720J7502r0824j97598k88148l39920l33581k64017j44862l199J32667
39436B1423740K45010L31367M00992M66749N37200O11606O78488P17847P07018
39427B6120017O28528M76917K61750O196k57766m96822o85726q16264r01006r67874
39417B3367950j046270j151688j277793j400851j493095j535630j522976j458858
39409A2480789j349447j200394j018770q16084o07937m09112k26910n7593J10969
39400F905511K91305M87578O91234Q83687J044090J156336J210214J197514J109659
39391A4977128R41899P01079M09294R9509j93327m40015o21040p27092p57412
39382A4390023p17976o21190m86194l36550j94705p7144O587N3201O6862O0604
$$ plain form
39446 22935720 22953222 22862398 22664800 22376652 22036732 21703151 21439134 21294272 21291073 21423740
39436 21423740 21668750 22000117 22401109 22867858 23405058 24016664 24695152 25412999 26120017
39427 26120017 26748545 27225462 27487212 27493408 27235642 26738820 26053094 25236830 24335824 23367950
39417 23367950 22321680 21169992 19892199 18491348 16998253 15462623 13939647 12480789
39409 12480789 11131342 9930948 8912178 8096094 7488157 7079045 6852135 6794542 6905511
39400 6905511 7196816 7684394 8375628 9259315 10303405 11459741 12669955 13867469 14977128
39391 14977128 15919027 16620106 17029400 17128909 16935582 16495567 15874527 15147435 14390023
39382 14390023 13672047 13050857 12564663 12228113 12033408 11956264 11962851 12016052 12082914 12143518
39372A2143518N2621N6873P4728R4373R7422O6901p806j29034k90008m74394o57624
39361A1027570q11441r11172r42400r03231q01153o47432m53491k31586J781K23669
39351E551114M06772N25430N62386N12972L85489J98133k6064k63935m94111o96477
39341F661709q52736r50561r88885r78749r37311q78341q05110p09791n80049
39332a019824m09560k06420O222J98335L45107M36027M76211M79515M58095M15717
39322A179425L50047K60808J55154M4477o3760j70794k83636m07387n38090o59089
39312a32845p41876p52213o61982m63423j78165J46384M53680O98652Q60076R39222
39302A67510R49666R07603Q27962P24647O10544M95259L82896K73368J67843P4081
$$ plain form
39372 12143518 12196139 12253012 12327740 12422113 12519535 12586436 12578630 12449596 12159588 11685194 11027570
39361 11027570 10216129 9304957 8362557 7459326 6658173 6010741 5557250 5325664 5327445 5551114
39351 5551114 5957886 6483316 7045702 7558674 7944163 8142296 8116232 7852297 7358186 6661709
39341 6661709 5808973 4858412 3869527 2890778 1953467 1075126 270016 -439775 -1019824
39332 -1019824 -1429384 -1635804 -1629582 -1431247 -1086140 -650113 -173902 305613 763708 1179425
39322 1179425 1529472 1790280 1945434 1989911 1926151 1755357 1471721 1064334 526244 -132845
39312 -132845 -874721 -1626934 -2288916 -2752339 -2930504 -2784120 -2330440 -1631788 -771712 167510
39302 167510 1117176 2024779 2852741 3577388 4187932 4683191 5066087 5339455 5507298 5581379
39292E581379N968k3129p129N2565J52974K94671M80175P06593R58861J209110
39282I412038J423064J570233J633171J611713J520621J382290J218753J047359
39274B0819242Q81236P31938O10356N24206M74398M53921M50868M53203M51367
39265B5850735M37056M01319L36552K42704J31878K5291n6413j01870j10612q8940
39255B7067700m5332J1586P3887J35898J95974K56386L20060L85153M41107M70138
39245B9312557M54376L83844K59885R3803r5540k83752m45442n62399o30578o59558
39235B7827196o64771o59244o50063o39148o25156o05447n78042n42347m97387
39226B2365591m39470l62565k62266j40536q294J14918K04251K36434J98731R5026
$$ plain form
39292 5581379 5587347 5564218 5557089 5609654 5762628 6057299 6537474 7244067 8202928 9412038
39282 9412038 10835102 12405335 14038506 15650219 17170840 18553130 19771883 20819242
39274 20819242 21700478 22432416 23042772 23566978 24041376 24495297 24946165 25399368 25850735
39265 25850735 26287791 26689110 27025662 27268366 27400244 27425535 27369122 27267252 27156640 27067700
39255 27067700 27022368 27033954 27107841 27243739 27439713 27696099 28016159 28401312 28842419 29312557
39245 29312557 29766933 30150777 30410662 30504465 30408925 30125173 29679731 29117332 28486754 27827196
39235 27827196 27162425 26503181 25853118 25213970 24588814 23983367 23405325 22862978 22365591
39226 22365591 21926121 21563556 21301290 21160754 21152460 21267378 21471629 21708063 21906794 22001820
39216B2001820n6145k30815m09077n77805p26159q39544q98273q82615p81157
39207A6600230n97655l52919q1363J75540L76469M87546M90161L88243K10343
39198A7696595K295j87969l25531l95729m02205l60194k89528k09248j34373p5464
39188A5318649l9693l0639m5466p2201r0482p6338q767J23661L17027N49005P81236
39177A6725992R68149J069670J062884R48324P48801N01984K50063L0175j31933
39168B2174109k23827k44514k01794j12298l120R1046J39382J29539P4088L177
39158B1825788n1405p0611n4504j9983P696N370m0181j29562k52324l90302n21099
39147B0308883o21196o68253o43790n38291l58166j28926J11577L28981N07892
$$ plain form
39216 22001820 21945675 21714860 21305783 20727978 20001819 19162275 18264002 17381387 16600230
39207 16600230 16002575 15649656 15568293 15743833 16120302 16607848 17098009 17486252 17696595
39198 17696595 17698890 17510921 17185390 16789661 16387456 16027262 15737734 15528486 15394113 15318649
39188 15318649 15278956 15248317 15202851 15130650 15040168 14963830 14955063 15078724 15395751 15944756 16725992
39177 16725992 17694141 18763811 19826695 20775019 21523820 22025804 22275867 22306042 22174109
39168 22174109 21950282 21705768 21503974 21391676 21388556 21479602 21618984 21748523 21822611 21825788
39158 21825788 21774383 21703772 21649268 21629285 21636981 21642351 21602170 21472608 21220284 20829982 20308883
39147 20308883 19687687 19019434 18375644 17837353 17479187 17350261 17461838 17790819 18298711
39138A8298711O56278P95227R40764J089945J220639J305096J328289J299085
39130B6934034J247297J208028J202256J224940J248239J238426J176747J072475
39122C6552442R61438Q91475R02928J015200J226044J520646J880400K284624
39114D7235197K708555L125987L518786L886409M246851M627370N051594N532110
39106G9932859O073123O680026P367418Q158569R076137J0129734J1307268J2573839
39098A51298973J3876152J5145085J6289096J7179257J7636216J7432303J6319394
39091B65176476J4089139J0661579O172324J003966m281081r091449j2967949
39084B70763005j5676677j7207800j7711068j7416622j6571421j5398729j4077268
$$ plain form
39138 18298711 18954989 19750216 20690980 21780925 23001564 24306660 25634949 26934034
39130 26934034 28181331 29389359 30591615 31816555 33064794 34303220 35479967 36552442
39122 36552442 37513880 38405355 39308283 40323483 41549527 43070173 44950573 47235197
39114 47235197 49943752 53069739 56588525 60474934 64721785 69349155 74400749 79932859
39106 79932859 86005982 92686008 100053426 108211995 117288132 127417866 138725134 151298973
39098 151298973 165175125 180320210 196609306 213788563 231424779 248857082 265176476
39091 265176476 279265615 289927194 296099518 297103484 292822403 283730954 270763005
39084 270763005 255086328 237878528 220167460 202750838 186179417 170780688 156703420
39077A56703420j2734647j1450427j0265560r195386q242224p403413o674344
39070I0737419o049152n520420n076794m699172m359854m028485l683094l320372
39062E4000076k959255k634569k381601k217618k130465k081675k022896j916067
39054C5655930j745992j519426j253242r61029o47345l11838M2436M03598P50737
39045C0413829J057216J296288J448777J510189J492461J418065J310167J185177
39037D1132169J051264R11434P67639O23355M84060L56754K49594J72096J35388
39028D5883753J51759K32806L86305O12988R05110J247631J620894K003384K374828
39019E5419458K720398L034314L319402L581330L820965M029219M185882M261716
$$ plain form
39077 156703420 143968773 132518346 122252786 113057400 104815176 97411763 90737419
39070 90737419 84688267 79167847 74091053 69391881 65032027 61003542 57320448 54000076
39062 54000076 51040821 48406252 46024651 43807033 41676568 39594893 37571997 35655930
39054 35655930 33909938 32390512 31137270 30176241 29528896 29217058 29259494 29663092 30413829
39045 30413829 31471045 32767333 34216110 35726299 37218760 38636825 39946992 41132169
39037 41132169 42183433 43094867 43862506 44485861 44969921 45326675 45576269 45748365 45883753
39028 45883753 46035512 46268318 46654623 47267611 48172721 49420352 51041246 53044630 55419458
39019 55419458 58139856 61174170 64493572 68074902 71895867 75925086 80110968 84372684
39011H4372684M224734M052090L745165L339574K901895K512379K241471K131026
39003A09521018K186721K382170K671808L008940L364086L736458M152230M650135
38995A35673566N262916O005576O875283P860198Q949932J0140253J1428431J2801993
38987B04998148J4228943J5655228J7007145J8191647J9091681J9561419J9431040
38980C28165251J8530346J6733953J4013484J0464630O284085J711057l017382
38973C92885424p663901j1965105j5637658j8437920k0236298k1049665k1013768
38966B76881109k0323538j9178271j7748824j6165423j4520056j2877144j1285299
38959A64782554r784708q409434p187439o140219n281432m612782m117459l755653
$$ plain form
39011 84372684 88597418 92649508 96394673 99734247 102636142 105148521 107389992 109521018
39003 109521018 111707739 114089909 116761717 119770657 123134743 126871201 131023431 135673566
38995 135673566 140936482 146942058 153817341 161677539 170627471 180767724 192196155 204998148
38987 204998148 219227091 234882319 251889464 270081111 289172792 308734211 328165251
38980 328165251 346695597 363429550 377443034 387907664 394191749 395902806 392885424
38973 392885424 385221523 373256418 357618760 339180840 318944542 297894877 276881109
38966 276881109 256557571 237379300 219630476 203465053 188944997 176067853 164782554
38959 164782554 154997846 146588412 139400973 133260754 127979322 123366540 119249081 115493428
38951A15493428l468563l192517k876535k494119k046138j558204j075325o53388
38943I8128639l47870k03128k44148m68744q40110j286374j715326k042409k217553
38934H8762977k235018k122253j918519j658808j370251j075781p95364n41920
38926G7045063l18092j20004N3577J94474K86061L10984K60802J42854j8844j89249
38916G7647626l31968m18090m31120l68426k41131p2328J07782K69673L91949
38907G6553967M64710M87509M63121L90437K61033O4090k00499n08669q10068
38898G7165631j041951j151177j110901r25105o24365k58757J11164M26999O46405
38889G3237943P51914P50808O68752N42672M15152L28685L18120M02768N81299
$$ plain form
38951 115493428 112024865 108832348 105955813 103461694 101415556 99857352 98782027 98128639
38943 98128639 97780769 97577641 97333493 96864749 96024639 94738265 93022939 90980530 88762977
38934 88762977 86527959 84405706 82487187 80828379 79458128 78382347 77586983 77045063
38926 77045063 76726971 76606967 76660544 76855018 77141079 77452063 77712865 77855719 77836875 77647626
38916 77647626 77315658 76897568 76466448 76098022 75856891 75784563 75892345 76162018 76553967
38907 76553967 77018677 77506186 77969307 78359744 78620777 78684867 78484368 77975699 77165631
38898 77165631 76123680 74972503 73861602 72936497 72312132 72053375 72164539 72591538 73237943
38889 73237943 73989857 74740665 75409417 75952089 76367241 76695926 77014046 77416814 77998113
38880G7998113Q31893J118760J404879J667749J911431K167782K485564K913452
38872I2499623L485426M213264N086432O077854P153648Q283458R447400J0637563
38864A46884668J1855587J3108901J4405711J5745527J7101669J8397547J9486091
38857B56985701K0144111K0088771J9019144J6687216J2996608Q100139K435418
38850C56457108l353681q596517j2789084j5702626j7370590j7993030j7826585
38843B62824995j7106900j6015447j4680710j3195447j1633275j0057003q521189
38836A71615024p072837n749730m576230l562541k714643k052364j621715j486711
38828A42778253j697590k249520l057256l966274m799398n414522n743249n795566
$$ plain form
38880 77998113 78830006 79948766 81353645 83021394 84932825 87100607 89586171 92499623
38872 92499623 95985049 100198313 105284745 111362599 118516247 126799705 136247105 146884668
38864 146884668 158740255 171849156 186254867 202000394 219102063 237499610 256985701
38857 256985701 277129812 297218583 316237727 332924943 345921551 354021690 356457108
38850 356457108 353103427 344506910 331717826 316015200 298644610 280651580 262824995
38843 262824995 245718095 229702648 215021938 201826491 190193216 180136213 171615024
38836 171615024 164542187 158792457 154216227 150653686 147939043 145886679 144264964 142778253
38828 142778253 141080663 138831143 135773887 131807613 127008215 121593693 115850444 110054878
38820A10054878n636813n353847n025755m707182m424504m179335l954263l720614
38812G3052565l450686l132276k777654k420869k105134j868102j731822j699468
38804E3866554j757066j877111k022654k152581k229499k229117k147176j999791
38796C7451559j815646j622490j434455j247980j049913q32675o05719l95137
38788B8447544k31928j36869j11236j38439j94373k58634l19686l73628m21123
38779B6261628m65528n11481n63007o22502o91416p70995q61699r62334j070070
38770A9742596j180467j286811j380500j453611j501269j520674j507948j456881
38762H454435j361422j220135j040056q37986o37220m59562l16977k09150j28224
$$ plain form
38820 110054878 104418065 99064218 94038463 89331281 84906777 80727442 76773179 73052565
38812 73052565 69601879 66469603 63691949 61271080 59165946 57297844 55566022 53866554
38804 53866554 52109488 50232377 48209723 46057142 43827643 41598526 39451350 37451559
38796 37451559 35635913 34013423 32578968 31330988 30281075 29448400 28842681 28447544
38788 28447544 28215616 28078747 27967511 27829072 27634699 27376065 27056379 26682751 26261628
38779 26261628 25796100 25284619 24721612 24099110 23407694 22636699 21775000 20812666 19742596
38770 19742596 18562129 17275318 15894818 14441207 12939938 11419264 9911316 8454435
38762 8454435 7093013 5872878 4832822 3994836 3357616 2898054 2581077 2371927 2243703
38753B243703o5873j7426J7622L6335L3231J749o2970j60091k79160l99717m97380
38742H50023n54243n66319n42273m95242m34813l64123k81869j86012p6256M5427
38732b605700J75025L05832M27544N28381O01116O48747O83799P20893P68282
38723B253919Q23568Q73806Q98196Q73499P82501O22280M06604J61318q2568k93294
38713G319829m41414n05769m81962l86907k54095j21929k2309K6055K0375k5863
38703E126011q5995j27931j24716o3429N1044J98029L47561M68804N37535N41198
38693F868111M81516L74813K49018J36572O5302N1171R5458J85785K98815M03457
38683I210018M65458M54692L54429J68334p9568l52552o11599q23280r64422j025945
$$ plain form
38753 2243703 2177830 2160404 2178026 2214361 2247592 2249341 2186371 2026280 1747120 1347403 850023
38742 850023 295780 -270539 -812812 -1308054 -1742867 -2106990 -2388859 -2574871 -2651127 -2605700
38732 -2605700 -2430675 -2124843 -1697299 -1168918 -567802 80945 764744 1485637 2253919
38723 2253919 3077487 3951293 4849489 5722988 6505489 7127769 7534373 7695691 7613123 7319829
38713 7319829 6878415 6372646 5890684 5503777 5249682 5127753 5105444 5131499 5151874 5126011
38703 5126011 5040016 4912085 4787369 4723940 4774984 4973013 5320574 5789378 6326913 6868111
38693 6868111 7349627 7724440 7973458 8110030 8175332 8226503 8321961 8507746 8806561 9210018
38683 9210018 9675476 10130168 10484597 10652931 10573363 10220811 9609212 8785932 7821510 6795565
38673F795565j015227r53072q63838p64347o59633n48402m32736l23919k40318
38664I94073j99764k11699k72433l63886m55728n11866n01002m07713k38709k1313
38654b190040K04941M00623N38601O11061O28053O09819N79331N58660N66717
38645B507766O14737P01321Q12106R25515J020513J082155J104019J088295J043327
38636A0899754R79161R04019Q24719P50006O92170O62871O64355O81847O83912
38627A7742814O32807M99579K74550l2387l99065p98386j201217j576261j890635
38618A3251799k112293k213109k171865j977968j636053j169632o20856m4471
38610A305552N03401R77324J349548J608346J750933J778117J694879J513925
$$ plain form
38673 6795565 5780338 4827266 3963428 3199081 2539448 1991046 1558310 1234391 994073
38664 994073 794309 582610 310177 -53709 -509437 -1021303 -1522305 -1930018 -2168727 -2190040
38654 -2190040 -1985099 -1584476 -1045875 -434814 193239 803058 1382389 1941049 2507766
38645 2507766 3122503 3823824 4635930 5561445 6581958 7664113 8768132 9856427 10899754
38636 10899754 11878915 12782934 13607653 14357659 15049829 15712700 16377055 17058902 17742814
38627 17742814 18375621 18875200 19149750 19117363 18718298 17919912 16718695 15142434 13251799
38618 13251799 11139506 8926397 6754532 4776564 3140511 1970879 1350023 1305552
38610 1305552 1808953 2786277 4135825 5744171 7495104 9273221 10968100 12482025
38602A2482025J257117R53808O38892L50811J25718j4000p1958q2034r9720j82786
38592A5357873l68692o58417j014450j374294j672237j858612j909827j829494
38584D671850j643500j390388j109021q28359n64942l28696j31374R579P5061
38575a239790N3643m9449k09082l84742n31136o10813o04340n14311l61158j71868
38565d623046L2912K45630M68099P00215R29893J131900J276726J343731J330578
38556B836638J253669J139962J015836R00304Q05922P42985P19106P31794P61447
38547A0907663P74883P40275O43161M92141L12021J30993l0662j65941k79346
38538A3525188l79613m72429n59167o41478p25092q17078r18840j021845j109930
$$ plain form
38602 12482025 13739142 14692950 15331842 15682653 15808371 15794371 15722413 15640379 15540659 15357873
38592 15357873 14989181 14330764 13316314 11942020 10269783 8411171 6501344 4671850
38584 4671850 3028350 1637962 528941 -299418 -864360 -1193056 -1324430 -1314851 -1239790
38575 -1239790 -1186147 -1235596 -1444678 -1829420 -2360556 -2971369 -3575709 -4090020 -4451178 -4623046
38565 -4623046 -4590134 -4344504 -3876405 -3176190 -2246297 -1114397 162329 1506060 2836638
38556 2836638 4090307 5230269 6246105 7146409 7952331 8695316 9414422 10146216 10907663
38547 10907663 11682546 12422821 13065982 13558123 13870144 14001137 13970475 13804534 13525188
38538 13525188 13145575 12673146 12113979 11472501 10747409 9930331 9011491 7989646 6879716
38529F879716j165892j177756j141870j062123r46916q06879o55277n08893l85604
38520i71494k98940k54442k50443k79877l28730l73442l84296l37245k27539p5060
38510c781508Q3337K10334K83938L03758K85275K47176K00287J43814O8896l3683
38500a988376j66022l19436m76479o16236p18381p64367p39229o37253m69069
38491f894848k63486o0509J01975K01835K41274K46336K55882L03514M01113N33041
38481d933873O64239P57379P89605P60343O87452N96082N08122M37829L92945
38472F60123L76475L85921M11671M38993M54759M54199M41352M22961M02784L82826
38462D832064L68972L72156M01034M52848N12620N62255N90971N98515N90926
$$ plain form
38529 6879716 5713824 4536068 3394198 2332075 1385159 578280 -76997 -585890 -971494
38520 -971494 -1270434 -1524876 -1775319 -2055196 -2383926 -2757368 -3141664 -3478909 -3706448 -3781508
38510 -3781508 -3698171 -3487837 -3203899 -2900141 -2614866 -2367690 -2167403 -2023589 -1954693 -1988376
38500 -1988376 -2154398 -2473834 -2950313 -3566549 -4284930 -5049297 -5788526 -6425779 -6894848
38491 -6894848 -7158334 -7218843 -7116868 -6915033 -6673759 -6427423 -6171541 -5868027 -5466914 -4933873
38481 -4933873 -4269634 -3512255 -2722650 -1962307 -1274855 -678773 -170651 267178 660123
38472 660123 1036598 1422519 1834190 2273183 2727942 3182141 3623493 4046454 4449238 4832064
38462 4832064 5201036 5573192 5974226 6427074 6939694 7501949 8092920 8691435 9282361
38453I282361N75208N56969N39484N21203M92429M35547L31380J69238m5351k90398
38443A2568070n35427p53260r28406j057208j141306j180916j173178j115237
38435D683132j008299q60321o86820n08420l44029k02576q0112L4442J49439K64360
38425A440796L70620M56635N12995N35371N23875M78906L96359K67473Q6181j39776
38415D929435l82929o02531p61091q39579q39882p74774o57499n01187l24984
38406g55021j55033j5309Q3700J47211J87145K09997K11353J80847J13593J8892
38396B27375q1309j63784k16539k43572k59875k80932l12586l46140l62115l41347
38386b380824k76331j75151n6924N6246J46133K02777K25560K19966J92601J49867
$$ plain form
38453 9282361 9857569 10414538 10954022 11475225 11967654 12403201 12734581 12903819 12858468 12568070
38443 12568070 12032643 11279383 10350977 9293769 8152463 6971547 5798369 4683132
38435 4683132 3674833 2814512 2127692 1619272 1275243 1072667 992555 1026997 1176436 1440796
38425 1440796 1811416 2268051 2781046 3316417 3840292 4319198 4715557 4983030 5069211 4929435
38415 4929435 4546506 3943975 3182884 2343305 1503423 728649 71150 -430037 -755021
38406 -755021 -910054 -925363 -841663 -694452 -507307 -297310 -85957 94890 208483 227375
38396 227375 146066 -17718 -234257 -477829 -737704 -1018636 -1331222 -1677362 -2039477 -2380824
38386 -2380824 -2657155 -2832306 -2889230 -2832984 -2686851 -2484074 -2258514 -2038548 -1845947 -1696080
38376a696080J01715O4338N5527Q5273J50455K38035L32068M17765M81866N13642
38366G44604N08649M71603M13751L45426K70546J88688J02636K3412l2636n2068
38356B984611l1049K3331R5957J68499K25240K58837K73159K80765K95884L26808
38346D902042L71078M14355M33034M01340L03334J45584l8580k00185k97408l15674
38336F118920k71374j98169j27102p3262l3751O065O2915J46207K51632L60463
38326F242544M45728M82528M56849L68169K26334M7769j45503l26549m68733n54699
38316F774437n81485n56226m86195l72963k15627j9078K00693M18098O04289P33845
38306F499788P88581P58554O42527M49397J99280p9025l55072o04940q14835r77888
$$ plain form
38376 -1696080 -1594365 -1530027 -1474500 -1389227 -1238772 -1000737 -668669 -250904 230962 744604
38366 744604 1253253 1724856 2138607 2484033 2754579 2943267 3045903 3069315 3036679 2984611
38356 2984611 2953562 2976893 3072850 3241349 3466589 3725426 3998585 4279350 4575234 4902042
38346 4902042 5273120 5687475 6120509 6521849 6825183 6970767 6932187 6732002 6434594 6118920
38336 6118920 5847546 5649377 5522275 5449013 5415262 5421327 5484242 5630449 5882081 6242544
38326 6242544 6688272 7170800 7627649 7995818 8222152 8269921 8124418 7797869 7329136 6774437
38316 6774437 6192952 5636726 5150531 4777568 4561941 4542863 4743556 5161654 5765943 6499788
38306 6499788 7288369 8046923 8689450 9138847 9338127 9259102 8904030 8299090 7484255 6506367
38296F506367j087648j135078j112674j022062q77518p01218n14323l31543j62648
38287d38345j7404R1492J49759J45947P7043m6536j99064l42953m37731m51469
38277a469261l70698k05283J3358K39984M26589N33510N38271M40878K64509N0628
38267D62485j51502k98734l66359l52842k74336j53412j0784J34769K62194L48071
38257d00450L74212L37527K53351J48458M7838l6495j08212j80061k62747l55878
38247a82457m45687n10263n29680m95790m15781l06798j85049n7168Q0407K34408
38237b813858M05103N79915P34236Q39909Q77236Q43276P51499O24599M86620
38228C328535L58620K57052J92166J66350J74861K10125K66974L44226M40724
$$ plain form
38296 6506367 5418719 4283641 3170967 2148905 1271387 570169 55846 -275697 -438345
38287 -438345 -455749 -364257 -214498 -68551 8492 -38044 -237108 -580061 -1017792 -1469261
38277 -1469261 -1839959 -2045242 -2031884 -1791900 -1365311 -831801 -293530 147348 411857 462485
38267 462485 310983 12249 -354110 -706952 -981288 -1134700 -1145484 -1010715 -748521 -400450
38257 -400450 -26238 311289 564640 713098 760936 724441 616229 436168 173421 -182457
38247 -182457 -628144 -1138407 -1668087 -2163877 -2579658 -2886456 -3071505 -3128673 -3048266 -2813858
38237 -2813858 -2408755 -1828840 -1094604 -254695 622541 1465817 2217316 2841915 3328535
38228 3328535 3687155 3944207 4136373 4302723 4477584 4687709 4954683 5298909 5739633
38219E739633N48810O50513P19459P27615O54181M93640K59823j7273l01732n63899
38209H910770p87366r67783j106411j203879j257730j264021j220964j132373
38201b9757j009644q71600p41077o37116n65040n11057m47097l44197j86186K3486
38191e319285K62754M97174O89665Q12351Q56184Q32664P65447O76397N74488
38182F47839M54095L03530J18131r0289k93296m54505n41726n36175m35178k48897
38172a076471N008L04954O26124R40211J216019J421731J529589J523122J403895
38163G894182J191736R15789O03061K74790m7088l32795n47733o65436o79403
38154H607103o04089m66062k94462j17747L5172J36380J66606J24460K9222q6503
$$ plain form
38219 5739633 6288443 6938956 7658415 8386030 9040211 9533851 9793674 9776401 9474669 8910770
38209 8910770 8123404 7155621 6049210 4845331 3587601 2323580 1102616 -29757
38201 -29757 -1039401 -1911001 -2652078 -3289194 -3854234 -4365291 -4812388 -5156585 -5342771 -5319285
38191 -5319285 -5056531 -4559357 -3869692 -3057341 -2201157 -1368493 -603046 73351 647839
38182 647839 1101934 1405464 1523595 1433306 1140010 685505 143779 -392396 -827574 -1076471
38172 -1076471 -1071463 -766509 -140385 799826 2015845 3437576 4967165 6490287 7894182
38163 7894182 9085918 10001707 10604768 10879558 10832470 10499675 9951942 9286506 8607103
38154 8607103 8003014 7536952 7242490 7124743 7159915 7296295 7462901 7587361 7616583 7530080
38144G530080j89815k58137k82453k64325k11631j36847n7306O376L6421K6167
38134F198530j5264o6022j01100j03688p3213k6232J1256J6902j7253q3395j65073
38123E575448k44693l04736l25102k84976j72934O06J99160L69658M61702M46480
38113E720613L25589J26127j13151l54855n68272p28590q17054q25489p61162
38104B003756o45900n08870l77615k71761k00544j63810j55938j70606k02949
38095f94237k48161k99565l49840l94687m34654m72165n05692n26260n20182m77457
38085d922900m00460l06429k20942j66050j50193j65210j90904k03956j87027
38076f914071j34299n1495M8977J54101K53775L40636M08940M55698M84274N06920
$$ plain form
38144 7530080 7340265 7082128 6799675 6535350 6323719 6186872 6129566 6135942 6172363 6198530
38134 6198530 6183266 6117244 6016144 5912456 5839243 5813011 5824267 5841169 5823916 5740521 5575448
38123 5575448 5330755 5026019 4700917 4415941 4243007 4243613 4442773 4812431 5274133 5720613
38113 5720613 6046202 6172329 6059178 5704323 5136051 4407461 3590407 2764918 2003756
38104 2003756 1357856 848986 471371 199610 -934 -164744 -320682 -491288 -694237
38095 -694237 -942398 -1241963 -1591803 -1986490 -2421144 -2893309 -3399001 -3925261 -4445443 -4922900
38085 -4922900 -5323360 -5629789 -5850731 -6016781 -6166974 -6332184 -6523088 -6727044 -6914071
38076 -6914071 -7048370 -7099865 -7050888 -6896787 -6643012 -6302376 -5893436 -5437738 -4953464 -4446544
38066d446544N42401O08390P12813Q49217R98202J132934J225365J251459J195600
38057D069837J054098Q36589N64779K70416o070k18734l26117l08128j80622M316
38047E760364J75687K69330K48837J13918j03414l50863n72098p23364p85813
38038D032584p69028p03565o25393n59772n12656m72674m20804l42258k35814
38029f09380j16743j0974N7488P8703O1391K8527P768K0736P3906J54968K38694
38018a4916L01144L33353L44374L51203L63477L74464L64831L15932K22332R4281
38008C050475n0723j98885l43827m80792n98512o78524p04474o74212o04433n24391
37998a808298m64269m45915m78237n55119o55454p48298q04156q06818p57736
$$ plain form
38066 -4446544 -3904143 -3295753 -2582940 -1733723 -735521 397413 1622778 2874237 4069837
38057 4069837 5123935 5960524 6525303 6795719 6789649 6570915 6244798 5936670 5756048 5760364
38047 5760364 5936051 6205381 6454218 6568136 6464722 6113859 5541761 4818397 4032584
38038 4032584 3263556 2559991 1934598 1374826 862170 389496 -31308 -373566 -609380
38029 -609380 -726123 -737097 -679609 -600906 -539515 -510988 -503220 -482484 -408578 -253610 -14916
38018 -14916 286228 619581 963955 1315158 1678635 2053099 2417930 2733862 2956194 3050475
38008 3050475 2999752 2800867 2457040 1976248 1377736 699212 -5262 -679474 -1283907 -1808298
37998 -1808298 -2272567 -2718482 -3196719 -3751838 -4407292 -5155590 -5959746 -6766564 -7524300
37989g524300o70329n59933m38152l15098k04641j24478q8495r7595j37345j83900
37979a0344266k12374k02292j40317k2747J42698L38060N39290P20801Q58645
37970h322502R32675R28473Q39540O70024M37292J71913q7247l01748m42588m96178
37960e670346m66188l71082k38516r9366J6405Q3452Q7675L4665m7139j14852
37950f785292j29200p2738M1490J75259K82215L28803L08467K41563J61967R9275
37940e348191O6920O0888O6822O9879O2351M6612L2898L3057N3455R1598J39349
37929d624362J89910K41925K96459L50376L93927M16240M14284L97431L83409
37920a540401L88162M15779M54297M80110M69531M11816L16155K07842J15612
$$ plain form
37989 -7524300 -8194629 -8754562 -9192714 -9507812 -9712453 -9836931 -9925426 -10023021 -10160366 -10344266
37979 -10344266 -10556640 -10758932 -10899249 -10921996 -10779298 -10441238 -9901948 -9181147 -8322502
37970 -8322502 -7389827 -6461354 -5621814 -4951790 -4514498 -4342585 -4429832 -4731580 -5174168 -5670346
37960 -5670346 -6136534 -6507616 -6746132 -6845498 -6829093 -6745641 -6657966 -6623301 -6670440 -6785292
37950 -6785292 -6914492 -6987230 -6945740 -6770481 -6488266 -6159463 -5850996 -5609433 -5447466 -5348191
37940 -5348191 -5281271 -5220383 -5153561 -5083682 -5021331 -4974719 -4941821 -4908764 -4855309 -4763711 -4624362
37929 -4624362 -4434452 -4192527 -3896068 -3545692 -3151765 -2735525 -2321241 -1923810 -1540401
37920 -1540401 -1152239 -736460 -282163 197947 667478 1079294 1395449 1603291 1718903
37911A718903N8353L9406N0261P7990J09868J33638J37079J10148M8712m3755
37901B440603j58049k82388m03828n07983n80120o09562n94645n43025m65528
37892a704525l68145k49147j03960O6382K49748M23933N62698O42920O49849N80081
37882G49834M43037K60505O1927j25008k83896m12175n14472n92935o43654o61843
37872a718680o49830o19268n84925n55111n26641m88212m29002l45560k42544
37863f159773j28829j3552R5650J93420K77472L48375M07338M53686M84591M97253
37853c544369M91701M72954M52330M45994M68209N20250N82328O16858N84585
37844A090840M65059K69317L7312j77615l28403l89108l60716k68051j49595m3130
$$ plain form
37911 1718903 1777256 1816662 1866923 1944913 2054781 2188419 2325498 2435646 2484358 2440603
37901 2440603 2282554 2000166 1596338 1088355 508235 -101327 -695972 -1238997 -1704525
37892 -1704525 -2072670 -2321817 -2425777 -2359395 -2109647 -1685714 -1123016 -480096 169753 749834
37882 749834 1192871 1453376 1515303 1390295 1106399 694224 179752 -413183 -1056837 -1718680
37872 -1718680 -2368510 -2987778 -3572703 -4127814 -4654455 -5142667 -5571669 -5917229 -6159773
37863 -6159773 -6288602 -6302154 -6206504 -6013084 -5735612 -5387237 -4979899 -4526213 -4041622 -3544369
37853 -3544369 -3052668 -2579714 -2127384 -1681390 -1213181 -692931 -110603 506255 1090840
37844 1090840 1555899 1825216 1862528 1684913 1356510 967402 606686 338635 189040 145910
37834A45910K7458N7659N7469M0742J6544j3234n1260r9643j53795j98327k09937
37823c80414j68548o9581P2750K33309L86739N12060N91183O08721N57158M43678
37813B787055K91621J33605q55r6865j58437k02557k46222k95250l42388l74642
37803A495065l82965l67338l35438k97393k60023k23872j84752j38795q6748l4522
37793h16781Q668L1067J8341m3254j58298l12695m71151n86153o15837n42122
37783c488215l79132j66198N1028K39517L86444M93279N64372N99788N95843N50346
37773e52928M67770L61568K53251J68792J33169J63517K62385M14352N89322P51954
37763C013152Q71630R27337R07347Q08271O36570M10659J60072p9114k71032l87165
$$ plain form
37834 145910 173368 231027 288496 329238 345782 332548 281288 181645 27850 -170477 -380414
37823 -380414 -548962 -618543 -545793 -312484 74255 586315 1177498 1786219 2343377 2787055
37813 2787055 3078676 3212281 3211426 3114561 2956124 2753567 2507345 2212095 1869707 1495065
37803 1495065 1112100 744762 409324 111931 -148092 -371964 -556716 -695511 -782259 -816781
37793 -816781 -808113 -777046 -758705 -801959 -960257 -1272952 -1744103 -2330256 -2946093 -3488215
37783 -3488215 -3867347 -4033545 -3982517 -3743000 -3356556 -2863277 -2298905 -1699117 -1103274 -552928
37773 -552928 -85158 276410 529661 698453 831622 995139 1257524 1671876 2261198 3013152
37763 3013152 3884782 4812119 5719466 6527737 7164307 7574966 7735038 7655924 7384892 6997727
37753F997727m12451l48003k09459k2719J79839L62832M93433N48621N19318M08398
37743H517536K26184j0079k72183n19134p04152p89706p63191o45367m87072l54480
37733D198356l07199l77307n58198q08577j069852j288239j430424j486495j462786
37724d590721j372736j231446j053362q50499o31993m06851j87773R939J76029
37715a0139413L13108M36165N62595O99780Q38165R52933J012842R92587Q83714
37706c447524O99311M70691K38483M1517r4584j66414j93804k08759k37397k87066
37696c185546l46812l97335m20864m06606l54171k76004j95133j35810j12063
37687e830344j22444j54266j92720k27657k54507k70919k74024k61499k34664
$$ plain form
37753 6997727 6585276 6237273 6027814 6005095 6184934 6547766 7041199 7589820 8109138 8517536
37743 8517536 8743720 8733641 8461458 7942324 7238172 6448466 5685275 5039908 4552836 4198356
37733 4198356 3891157 3513850 2955652 2147075 1077223 -211016 -1641440 -3127935 -4590721
37724 -4590721 -5963457 -7194903 -8248265 -9098764 -9730757 -10137608 -10325381 -10315442 -10139413
37715 -10139413 -9826305 -9390140 -8827545 -8127765 -7289600 -6336667 -5323825 -4331238 -3447524
37706 -3447524 -2748213 -2277522 -2039039 -1997522 -2092106 -2258520 -2452324 -2661083 -2898480 -3185546
37696 -3185546 -3532358 -3929693 -4350557 -4757163 -5111334 -5387338 -5582471 -5718281 -5830344
37687 -5830344 -5952788 -6107054 -6299774 -6527431 -6781938 -7052857 -7326881 -7588380 -7823044
37678g823044j98715j58353j13639o1761l345N4453J02220J35188J55058J65365
37668g746573J66566J56819J38094J21742J27664J76137K76802M21794N87284
37659e573671P42460Q60897R29039R48509R31842Q94113Q44929P84784P06839
37650B069741O02170M65571K99534J15171o9945k35512l62142m34161m41432l79905
37640A629090k50956o1303J74314M28818O62141Q28623Q91484Q37557O84784M78761
37630F303313K79343J42121J01721J63350L05483M91151O81447Q44645R58248
37621A0270822J006238R76725Q63262O68790M08142J06532k05018m94364p31520
37612A2869609q91376r57041r23484p99844o09151l84975j65262J5115J29595
$$ plain form
37678 -7823044 -8021759 -8180112 -8293751 -8355512 -8358857 -8304404 -8202184 -8066996 -7911938 -7746573
37668 -7746573 -7580007 -7423188 -7285094 -7163352 -7035688 -6859551 -6582749 -6160955 -5573671
37659 -5573671 -4831211 -3970314 -3041275 -2092766 -1160924 -266811 578118 1362902 2069741
37650 2069741 2671911 3137482 3437016 3552187 3482242 3246730 2884588 2450427 2008995 1629090
37640 1629090 1378134 1316831 1491145 1919963 2582104 3410727 4302211 5139768 5824552 6303313
37630 6303313 6582656 6724777 6826498 6989848 7295331 7786482 8467929 9312574 10270822
37621 10270822 11277060 12253785 13117047 13785837 14193979 14300511 14095493 13601129 12869609
37612 12869609 11978233 11021192 10097708 9297864 8688713 8303738 8138476 8153591 8283186
37603H283186J60016R3846p4168l31964o39189r29666j132727j201532j129197
37594C098605r44890o98120m43494k29875r1654m2079p2482j58212k66787l63939
37584b12927m18408m08010l25287j78000J6333K36628M60238O62524Q19767R16540
37574A569398R51306R33335Q72413P70687O24180M31852K03029m3120k83672m97223
37564E532185o65659p75755q23915q21670p95434p76727p87273q28403q81867
37555a624518r20974r24647q86549q15850p30643o47285n70842m92958m00352
37546h014618k88523j68576n9542K7277R6745J62666K32561K99342L46864L62772
37536g003032L47048L10287K64753K15943J60972R4078J3500p6603j69117k56002
$$ plain form
37603 8283186 8443202 8537048 8462880 8130916 7491727 6562061 5429334 4227802 3098605
37594 3098605 2153715 1455595 1012101 782226 690572 648493 576011 417799 151012 -212927
37584 -212927 -631335 -1039345 -1364632 -1542632 -1526299 -1289671 -829433 -166909 652858 1569398
37574 1569398 2520704 3454039 4326452 5097139 5721319 6153171 6356200 6313080 6029408 5532185
37564 5532185 4866526 4090771 3266856 2445186 1649752 873025 85752 -742651 -1624518
37555 -1624518 -2545492 -3470139 -4356688 -5172538 -5903181 -6550466 -7121308 -7614266 -8014618
37546 -8014618 -8303141 -8471717 -8531259 -8503982 -8407237 -8244571 -8012010 -7712668 -7365804 -7003032
37536 -7003032 -6655984 -6345697 -6080944 -5865001 -5704029 -5609951 -5596451 -5673054 -5842171 -6098173
37526f098173l25906l62213l48413k78975j65015k7456J16327K59309L99602N30593
37516f300320O37488P02889P15216O73299N86215M70998L49184K41468J61201
37507a762362J10259Q0329N9118L8027J7724R195K8937Q9663J91443L19598M51194
37496c66875N64445O43030O73575O42797N41288L72686J59058o4591k64213m19149
37486B482051n25343n89362o19382o19675n91096n35281m57788l66878k69209
37477b091963j66574n6317O5569K01015L47157M95072O31612P44677Q28245Q82634
37467A881127R10081R10818Q83772Q30640P58750O79743O04014N33931M60910
37458H453786L70243K51388J05291n7560k25511l92397n58474p27674r03542j083808
$$ plain form
37526 -6098173 -6424079 -6786292 -7134705 -7413680 -7578695 -7606151 -7489824 -7230515 -6830913 -6300320
37516 -6300320 -5662832 -4959943 -4244727 -3571428 -2985213 -2514215 -2165031 -1923563 -1762362
37507 -1762362 -1652103 -1571774 -1512656 -1474629 -1456905 -1447710 -1418773 -1329110 -1137667 -818069 -366875
37496 -366875 197570 840600 1514175 2156972 2698260 3070946 3230004 3165413 2901200 2482051
37486 2482051 1956708 1367346 747964 128289 -462807 -998088 -1455876 -1822754 -2091963
37477 -2091963 -2258537 -2314854 -2249285 -2048270 -1701113 -1206041 -574429 170248 998493 1881127
37467 1881127 2791208 3702026 4585798 5416438 6175188 6854931 7458945 7992876 8453786
37458 8453786 8824029 9075417 9180708 9123148 8897637 8505240 7946766 7219092 6315550 5231742
37448E231742j255360j394769j476394j482545j408224j259907j053452q13315
37440d912224n69705l51037j75086m4711M9876J24811J95554K71570L54304M38703
37430d617945N16092N75848O06306N97946N49464M72382L89528L27832L10604
37421b71943L52969M59451O21104Q13395R99119J138188J200368J173633J063572
37412G549856Q85789O58178L99261J32563j09890k92253l87551l89500l14471
37403H131982j93326o0706N1794J19465J29011Q3283J115r0393j67233k16516
37393G788476k37486k36940k22968k00356j69964j32231r2171o1061n2226p3673
37383F309400j23547j92221k68740l46087m21844m95795n67869o37640p03582
$$ plain form
37448 5231742 3976382 2581613 1105219 -377326 -1785550 -3045457 -4098909 -4912224
37440 -4912224 -5481929 -5832966 -6008052 -6052763 -6002887 -5878076 -5682522 -5410952 -5056648 -4617945
37430 -4617945 -4101853 -3526005 -2919699 -2321753 -1772289 -1299907 -910379 -582547 -271943
37421 -271943 81026 540477 1161581 1974976 2974095 4112283 5312651 6486284 7549856
37412 7549856 8435645 9093823 9493084 9625647 9515757 9223504 8835953 8446453 8131982
37403 8131982 7938656 7877950 7929744 8049209 8178220 8261503 8262618 8172225 8004992 7788476
37393 7788476 7550990 7314050 7091082 6890726 6720762 6588531 6496360 6435299 6383073 6309400
37383 6309400 6185853 5993632 5724892 5378805 4956961 4461166 3893297 3255657 2552075
37374B552075p60390p96022p92311p31582o06767m28674k24809k9299J30828K45414
37364a441537L22159L79226M34723M99523N76784O65714P63814Q64246R51710
37355D016362J003484R98110R26210P95464O26408M43324K66712J10794j5217
37346I171651j05518j58347j78427j78123j74670j83969k14642k65667l28001
37337G384287l88587m35057m59840m62077m46268m18588l83796l44752l03733
37328C741589k62859k22309j78364j24745n7711J9012R4285J55374J95470K18072
37318C577814K35919K64793L14492L81850M51252N03408N25734N16037M77855
37309G249154M13580L21731J99594M8497j21034k87567m23542n06093n27403m97525
$$ plain form
37374 2552075 1791685 995663 203352 -528230 -1134997 -1563671 -1788480 -1817779 -1686951 -1441537
37364 -1441537 -1119378 -740152 -305429 194094 770878 1436592 2200406 3064652 4016362
37355 4016362 5019846 6017956 6944166 7739630 8366038 8809362 9076074 9186868 9171651
37346 9171651 9066133 8907786 8729359 8551236 8376566 8192597 7977955 7712288 7384287
37337 7384287 6995700 6560643 6100803 5638726 5192458 4773870 4390074 4045322 3741589
37328 3741589 3478730 3256421 3078057 2953312 2895601 2914613 3008898 3164272 3359742 3577814
37318 3577814 3813733 4078526 4393018 4774868 5226120 5729528 6255262 6771299 7249154
37309 7249154 7662734 7984465 8184059 8232556 8111522 7823955 7400413 6894320 6366917 5869392
37299E869392m39164l80249l48533l66658m45170n75830p30485q67403r41970
37290G73930r17998p77957n30524k11556J24526M20437O31491P34272P27097O24838
37280A598556M51583K33979k703k35489m43813o10834p25489p83167p84768p36321
37270b038466o50020n44089m38673l48897k79734k26090j77503j23992n9978J4975
37260d872467R7808J84132K69546L50281M24475M93839N63761O40072P24176Q10702
37250c13675Q89889R52269R90692R98191R65503Q83090P47743N68805L68758J77223
37240G228488K1353q3277j37767j58625j69915j91817k31148k79223l18263l31774
37230E348032l11236k55023j63279l6401J19901K88066M38371N37293N60505N03794
$$ plain form
37299 5869392 5430228 5049979 4701446 4334788 3889618 3313788 2583303 1715900 773930
37290 773930 -144068 -922025 -1452549 -1664105 -1539579 -1119142 -487651 246621 973718 1598556
37280 1598556 2050139 2284118 2281415 2045926 1602113 991279 265790 -517377 -1302145 -2038466
37270 -2038466 -2688486 -3232575 -3671248 -4020145 -4299879 -4525969 -4703472 -4827464 -4887442 -4872467
37260 -4872467 -4774659 -4590527 -4320981 -3970700 -3546225 -3052386 -2488625 -1848553 -1124377 -313675
37250 -313675 576214 1528483 2519175 3517366 4482869 5365959 6113702 6682507 7051265 7228488
37240 7228488 7249841 7166564 7028797 6870172 6700257 6508440 6277292 5998069 5679806 5348032
37230 5348032 5036796 4781773 4618494 4582093 4701994 4990060 5428431 5965724 6526229 7030023
37220G030023L86014K41124J02272j2635j04052j81487k51049l10565l54689l83179
37210F161777m03837m27365m58259m88736m99887m69015l79167k27501l0616J75082
37200B952476L40418M18341L82522K41594M0425j55710k88746l32782l01099k31798
37190C065641j63352j16394q9820o8502l5818J4447P1226J08730R9059K8549r2612
37179B821154k33985l59002m40048m66171m41680l79706k95444k01479j06364
37170a02725j6852N8487J09141J28860J23536J11995J15911J44990J88254K17681
37160A079278K01797J20875k4773k17367m31621o43567q31791r72965j040335
37151b760469j011370q81284o71875m27384j98571k4364P8758J15855J04911O7544
$$ plain form
37220 7030023 7416037 7657161 7759433 7746798 7642746 7461259 7210210 6899645 6544956 6161777
37210 6161777 5757940 5330575 4872316 4383580 3883693 3414678 3035511 2808010 2777394 2952476
37200 2952476 3292894 3711235 4093757 4335351 4375776 4220066 3931320 3598538 3297439 3065641
37190 3065641 2902289 2785895 2696075 2627573 2591755 2606202 2677428 2786158 2885217 2913766 2821154
37179 2821154 2587169 2228167 1788119 1321948 880268 500562 205118 3639 -102725
37170 -102725 -119577 -61090 48051 176911 300447 412442 528353 673343 861597 1079278
37160 1079278 1281075 1401950 1377177 1159810 728189 84622 -747169 -1720134 -2760469
37151 -2760469 -3771839 -4653123 -5324998 -5752382 -5950953 -5975317 -5896559 -5780704 -5675793 -5608249
37141e608249K3533j1369k7302k2709m614J5871L1011M1209N2743P0581R2387
37130e346908J08246J05380P3891J0796p8018j77613k66544l23176l34371l01969
37120f530286k42238j77403j23661q2631m1408J8242J06353K14911L18577L86538
37110f153006L98179L52999K69457J75188R4845M1658J5567P484O436N288K541
37099d783364O99L289J2340K6961M3212N5019N5597L9016J755n6111j30876k16111
37087d948574l03070l79652m29790m36476l88991k90668j62092l7666M3397M9187
37077g284395l2138j83503l59786n01378n55820m97116l33219r9124J59957M06613
37067i279909O20972P96511R25506R86768R48093P83706M93756J11440l06485
$$ plain form
37141 -5608249 -5584716 -5596085 -5623387 -5646096 -5650710 -5634839 -5603828 -5562619 -5509876 -5439295 -5346908
37130 -5346908 -5238662 -5133282 -5059391 -5048595 -5126613 -5304226 -5570770 -5893946 -6228317 -6530286
37120 -6530286 -6772524 -6949927 -7073588 -7156219 -7197627 -7179385 -7073032 -6858121 -6539544 -6153006
37110 -6153006 -5754827 -5401828 -5132371 -4957183 -4862338 -4820680 -4805113 -4797629 -4791193 -4785905 -4783364
37099 -4783364 -4782665 -4779376 -4767036 -4740075 -4696863 -4641844 -4586247 -4547231 -4545476 -4601587 -4732463 -4948574
37087 -4948574 -5251644 -5631296 -6061086 -6497562 -6886553 -7177221 -7339313 -7376979 -7333582 -7284395
37077 -7284395 -7316533 -7500036 -7859822 -8361200 -8917020 -9414136 -9747355 -9846479 -9686522 -9279909
37067 -9279909 -8658937 -7862426 -6936920 -5950152 -5002059 -4218353 -3724597 -3613157 -3919642
37058c919642o98512j015831j231110j337224j340095j252587j093632q89616
37050a2778249o71431m65609k85753j31560M483J28957K43163L42311M15665M47618
37040a2750405M22179L32014J88155K3505j14855j82638j56334m2725J24652K99701
37030a1856751M41406N27010N55815N43764N13236M83131M62103M45771M19155
37021g465360L65158K76094J60793M1557n7093j19219j40796j25800q0813j2755
37011g158234P0452J59143K42998L12788L60876L80703L67599L21585K48903J58672
37001d534515N5950o2588k05873l80248n81379p90449r76381j104485j149233
36992i729201j104764r85764q17415o20778m02500j53923J40522M89975Q85668
$$ plain form
37058 -3919642 -4618154 -5633985 -6865095 -8202319 -9542414 -10795001 -11888633 -12778249
37050 -12778249 -13449680 -13915289 -14201042 -14332602 -14328119 -14199162 -13955999 -13613688 -13198023 -12750405
37040 -12750405 -12328226 -11996212 -11808057 -11784552 -11899407 -12082045 -12238379 -12281104 -12156452 -11856751
37030 -11856751 -11415345 -10888335 -10332520 -9788756 -9275520 -8792389 -8330286 -7884515 -7465360
37021 -7465360 -7100202 -6824108 -6663315 -6621758 -6678851 -6798070 -6938866 -7064666 -7145479 -7158234
37011 -7158234 -7087782 -6928639 -6685641 -6372853 -6011977 -5631274 -5263675 -4942090 -4693187 -4534515
37001 -4534515 -4478565 -4541153 -4747026 -5127274 -5708653 -6499102 -7475483 -8579968 -9729201
36992 -9729201 -10833965 -11819729 -12637144 -13257922 -13660422 -13814345 -13673823 -13183848 -12298180
36983a2298180J297987J683311J995555K195941K258858K175957J959836J645408
36975B914673J285746R40948O62156M76538L80432L44423L27514K93251K21507
36966G847188J12481j8319j52167k79180m01279n23611o42074p38311p86909p69996
36956C647823o89673n70369m48978l57451l08105k90885k83796k68226k38465
36947A91875k01082j68018j50177j54648j83981k35171k98369l57073l90894l80725
36937b328263l15256j96615m1299J25956K82696M17038N29415O28889P27541Q34503
36927F64605R50072J061736J144763J167904J102604R33060O63698L19795n9563
36918G948674m31319p54577r92893j117969j117321j000815p99589n57146l18082
$$ plain form
36983 -12298180 -11000193 -9316882 -7321327 -5125386 -2866528 -690571 1269265 2914673
36975 2914673 4200419 5141367 5803523 6280061 6660493 7004916 7332430 7625681 7847188
36966 7847188 7959669 7941350 7789183 7510003 7108724 6585113 5943039 5204728 4417819 3647823
36956 3647823 2958150 2387781 1938803 1581352 1273247 982362 698566 430340 191875
36947 191875 -9207 -177225 -327402 -482050 -666031 -901202 -1199571 -1556644 -1947538 -2328263
36937 -2328263 -2643519 -2840134 -2881433 -2755477 -2472781 -2055743 -1526328 -897439 -169898 664605
36927 664605 1614677 2676413 3821176 4989080 6091684 7024744 7688442 8008237 7948674
36918 7948674 7517355 6762778 5769885 4651916 3534595 2533780 1734191 1177045 858963
36909H58963j19757J1671O2097K9401p6311k33174m11132n78483p07817p78182
36899a942724p75178o92275n33545l14753o1269J95736M23621N93378O85297O93373
36889a728339O26848N08543L69495K40049J40751P8885N2722N8423R2133J45671
36879E85181K01819K36742K30932J81603J05897L0189k7255o6038r8093j33195
36869A247782j68702j90063j78522j19724j0549J36841K96655M38262N37695N83473
36859B573148N73255N06263L79754J92580m8142l22887o00510q43113j013897
36850A396451j087050j056569r39264p69025n84801m18554k88449j98927j45598
36841d091786j21135j18393j29610j44221j49030j31756q5547j1542Q1018J76126
$$ plain form
36909 858963 739206 750877 812974 842375 766064 532890 121758 -456725 -1164542 -1942724
36899 -1942724 -2717902 -3410177 -3943722 -4258475 -4319744 -4124008 -3700387 -3107009 -2421712 -1728339
36889 -1728339 -1101491 -592948 -223453 16596 157347 236232 288954 347377 439510 585181
36879 585181 787000 1023742 1254674 1436277 1542174 1572363 1545108 1479070 1380977 1247782
36869 1247782 1079080 889017 710495 590771 580222 717063 1013718 1451980 1989675 2573148
36859 2573148 3146403 3652666 4032420 4225000 4176858 3853971 3253461 2410348 1396451
36850 1396451 309401 -747168 -1686432 -2455457 -3040258 -3458812 -3747261 -3946188 -4091786
36841 -4091786 -4212921 -4331314 -4460924 -4605145 -4754175 -4885931 -4971478 -4983020 -4902002 -4725876
36831d725876K53225K90875K72576J94158O9509p0998j92185k70768l05284l11465
36821d796233l07649l02537k93329k71666k30570j68618r1036p308P4208J50310
36811f244428K20570K79907L14688L08985K57237J72723Q4751K6623K1765P4566
36801d482613J69129K75514L60291L96414L69204K78491J38367k5426j81301l00359
36791c002289l64987l74130l42683k94241k49624k16891j88357j45556o8017N9005
36781e187770K39108M60861O96008R03016J038334J072850J005949Q69014P15461
36772A812831O01549N66350O18627P35310Q72340R83678J039188J032059R73721
36763I235653Q83330P79992O79324N90935N15566M45324L68603K75993J62103
$$ plain form
36831 -4725876 -4472651 -4181776 -3909200 -3715042 -3645533 -3716531 -3908716 -4179484 -4484768 -4796233
36821 -4796233 -5103882 -5406419 -5699748 -5971414 -6201984 -6370602 -6461638 -6468946 -6394738 -6244428
36811 -6244428 -6023858 -5743951 -5429263 -5120278 -4863041 -4690318 -4605567 -4578944 -4557179 -4482613
36801 -4482613 -4313484 -4037970 -3677679 -3281265 -2912061 -2633570 -2495203 -2520629 -2701930 -3002289
36791 -3002289 -3367276 -3741406 -4084089 -4378330 -4627954 -4844845 -5033202 -5178758 -5246775 -5187770
36781 -5187770 -4948662 -4487801 -3791793 -2888777 -1850443 -777593 228356 1097370 1812831
36772 1812831 2414380 2980730 3599357 4334667 5207007 6190685 7229873 8261932 9235653
36763 9235653 10118983 10898975 11578299 12169234 12684800 13130124 13498727 13774720 13936823
36754A3936823K3801j40474l27940n28382p24772q97975j032485j120760j164812
36745H023024j174201j160046j127662j072978r86495q62874p09809n50245m16574
36736c7860l40232l41325m21611n62292p27529q73887r63286r73461r00063p50451
36726f891997n36241k72003K0009L06556N48037P09910P73950P43595O42549N08647
36716c446988L84648L06978K94862L43998M28522N11280N57732N46452M71758
36707C99242L39495J61272m8265k70732m82992o58942p74667q15197p80390o87124
36697c618300n65533m48964l61419l08885k79154k49073j93634r2555O5333K77337
36687e774847N22044P59043R37906J014849R68800Q07753N62529K73233k3210
$$ plain form
36754 13936823 13960624 13820150 13492210 12963828 12239056 11341081 10308596 9187836 8023024
36745 8023024 6848823 5688777 4561115 3488137 2501642 1638768 928959 378714 -37860
36736 -37860 -378092 -719417 -1141028 -1703320 -2430849 -3304736 -4268022 -5241483 -6141546 -6891997
36726 -6891997 -7428238 -7700241 -7680232 -7373676 -6825639 -6115729 -5341779 -4598184 -3955635 -3446988
36716 -3446988 -3062340 -2755362 -2460500 -2116502 -1687980 -1176700 -618968 -72516 399242
36707 399242 738737 900009 851744 581012 98020 -560922 -1335589 -2150786 -2931176 -3618300
36697 -3618300 -4183833 -4632797 -4994216 -5303101 -5582255 -5831328 -6024962 -6117517 -6052184 -5774847
36687 -5774847 -5252803 -4493760 -3555854 -2541005 -1572205 -764452 -201923 71310 48100
36678D8100k98979n34613p14968q26105q56134p99966o64426m69153k41820j0872
36668e368936J99942L73588M99615N73558N96640N76080N25203M61400M00386
36659a162524L49620L06875K66345K26663J92729J70844J64766J78499K20979
36650I14796L03736M30894N91299P60800R11526J019195J065372J039219R41737
36641G978574P88317O04517M16663K44351R8925j4338r4915j47341j80517k03914
36631I490322k22753k36051k38730k24389j85179j10433J0106J76360L68165N45952
36621I373370O65036O95038O31676M94136L12323J14221p9049k51035l86768m73237
36611A1095711n02506m73977l94386k77237j42620j6133P5359J11196Q4972Q522
$$ plain form
36678 48100 -250879 -785492 -1500460 -2326565 -3182699 -3982665 -4647091 -5116244 -5358064 -5368936
36668 -5368936 -5168994 -4795406 -4295791 -3722233 -3125593 -2549513 -2024310 -1562910 -1162524
36659 -1162524 -812904 -506029 -239684 -13021 179708 350552 515318 693817 914796
36650 914796 1218532 1649426 2240725 3001525 3913051 4932246 5997618 7036837 7978574
36641 7978574 8766891 9371408 9788071 10032422 10131347 10117009 10022094 9874753 9694236 9490322
36631 9490322 9267569 9031518 8792788 8568399 8383220 8272787 8282893 8459253 8827418 9373370
36621 9373370 10038406 10733444 11365120 11859256 12171579 12285800 12206751 11955716 11568948 11095711
36611 11095711 10593205 10119228 9724842 9447605 9304985 9288852 9364211 9475407 9560379 9568901
36601I568901r1737j85211k48239k69635k49505j95236j18219l1749N0828J17709
36591H347907J59943J72921J57315J17277N5744k9415j44058k91901m69016o62809
36581G413908q55177j026817j160456j242436j263559j219641j111638r44970
36573a410786p28841m77200k11064M1235K49386L91016M60471M70696M47032M16470
36563c51585L97676L95719M02764M03381L81650L27108K37473J17834k1904j68912
36553B121204l08017m22972m99995n32126n20878m73657l99026l03360j90677
36544a529504o4801O8304J99619L17553M09306M63384M73802M44322L88820L25991
36534A496796K72240K38489K31797K56882L13293L89994M63148N01091M75041
$$ plain form
36601 9568901 9477164 9291953 9043714 8774079 8524574 8329338 8211119 8179370 8230198 8347907
36591 8347907 8507850 8680771 8838086 8955363 9011107 8981692 8837634 8545733 8076717 7413908
36581 7413908 6558731 5531914 4371458 3129022 1865463 645822 -465816 -1410786
36573 -1410786 -2139627 -2616827 -2827891 -2786656 -2537270 -2146254 -1685783 -1215087 -768055 -351585
36563 -351585 46091 441810 844574 1247955 1629605 1956713 2194186 2312020 2290116 2121204
36553 2121204 1813187 1390215 890220 358094 -162784 -636441 -1035467 -1338827 -1529504
36544 -1529504 -1594305 -1526001 -1326382 -1008829 -599523 -136139 337663 781985 1170805 1496796
36534 1496796 1769036 2007525 2239322 2496204 2809497 3199491 3662639 4163730 4638771
36525D638771L69619J86711n9259l49344o63896r79958j267925j494072j629444
36516a248797j659561j588932j437774j232399r94469p35923m62845j84321Q1865
36507i463156L11603M82964N84323O16772N90068N16531M08718K82129J57583
36498e512465N7356l595k3437j0781K3802P4636J41445K24433L18418M10551M83578
36487c816059N22594N21252M84407M27043L70082L33725L30522L62182M21982
36478d2270M99887N85530O67223P29802P54822P25491O35591M97969L45282K19595
36468E618922J55956J70489K58407L98442N58341P01463P97248Q32813Q17210
36459A0309291P73186P21523O69649O12182N41405M58318L75805L11663K76624
$$ plain form
36525 4638771 5008390 5195101 5135842 4786498 4122602 3142644 1874719 380647 -1248797
36516 -1248797 -2908358 -4497290 -5935064 -7167463 -8161932 -8897855 -9360700 -9545021 -9463156
36507 -9463156 -9151553 -8668589 -8084266 -7467494 -6877426 -6360895 -5952177 -5670048 -5512465
36498 -5512465 -5455109 -5458704 -5482141 -5492922 -5469120 -5394484 -5253039 -5028606 -4710188 -4299637 -3816059
36487 -3816059 -3293465 -2772213 -2287806 -1860763 -1490681 -1156956 -826434 -464252 -42270
36478 -42270 457617 1043147 1710370 2440172 3194994 3920485 4556076 5054045 5399327 5618922
36468 5618922 5774878 5945367 6203774 6602216 7160557 7862020 8659268 9492081 10309291
36459 10309291 11082477 11804000 12473649 13085831 13627236 14085554 14461359 14773022 15049646
36450A5049646K65390K56539K21365J36555n945j96077m09959o18878p99528r42012
36440A2957096j051878j144287j233091j321260j398220j444212j438276j366868
36432B559004j231197j050053q54257o74112n28614m24916l66287l57841m02606
36423c330879m92588o05518p11429p82741q00010p52862o41053m77337k87521
36414h881938j02941N2025J68531K51554L10562L51434L76140L88537L98804M20499
36404f266793M61078N13292N55323N60888N12216M06747K54559P1719j24171l14947
36394c370089m82094o07493o73891o65872n73603l99259j61684J04850L57492
36385f471643N53999O62088O67427N77660M19413K28769L9506j25886k59601l65913
$$ plain form
36450 15049646 15315036 15571575 15792940 15929495 15923550 15727473 15317514 14698636 13899108 12957096
36440 12957096 11905218 10760931 9527840 8206580 6808360 5364148 3925872 2559004
36432 2559004 1327807 277754 -576503 -1250615 -1779229 -2204145 -2570432 -2928273 -3330879
36423 -3330879 -3823467 -4428985 -5140414 -5923155 -6723165 -7476027 -8117080 -8594417 -8881938
36414 -8881938 -8984879 -8932854 -8764323 -8512769 -8202207 -7850773 -7474633 -7086096 -6687292 -6266793
36404 -6266793 -5805715 -5292423 -4737100 -4176212 -3663996 -3257249 -3002690 -2930971 -3055142 -3370089
36394 -3370089 -3852183 -4459676 -5133567 -5799439 -6373042 -6772301 -6933985 -6829135 -6471643
36385 -6471643 -5917644 -5255556 -4588129 -4010469 -3591056 -3362287 -3322781 -3448667 -3708268 -4074181
36375d074181m54131n30527n92939o30583o29312n80563m89608l77023k70561
36366h629428j92105j49227j36066j40002j47665j48277j35784j09623p2081k3496
36356i883754L9949J23023K26469L45611M72873N99719P15741Q07887Q63381Q74806
36346d814295Q42697P74424O82111N81397M88682M15294L62142L20108K76087
36337g1353K18967J41395L9169q7681k31327l73476m87460n46087n32204m46019
36327b376076l04712j35240L4097J79329K84193L42850L60882L52329L33527L17121
36317f11700L08831L07518L07897L04312K92825K70408K33780J80820J13239L5839
36307A743769m8632j43797k57662l94889n48929o99479q17227q74081q53792p56795
$$ plain form
36375 -4074181 -4528312 -5058839 -5651778 -6282361 -6911673 -7492236 -7981844 -8358867 -8629428
36366 -8629428 -8821533 -8970760 -9106826 -9246828 -9394493 -9542770 -9678554 -9788177 -9860258 -9883754
36356 -9883754 -9843805 -9720782 -9494313 -9148702 -8675829 -8076110 -7360369 -6552482 -5689101 -4814295
36346 -4814295 -3971598 -3197174 -2515063 -1933666 -1444984 -1029690 -667548 -347440 -71353
36337 -71353 147614 289009 328178 240497 9170 -364306 -851766 -1397853 -1930057 -2376076
36327 -2376076 -2680788 -2816028 -2781931 -2602602 -2318409 -1975559 -1614677 -1262348 -928821 -611700
36317 -611700 -302869 4649 312546 616858 909683 1180091 1413871 1594691 1707930 1743769
36307 1743769 1695137 1551340 1293678 898789 349860 -349619 -1166846 -2040927 -2894719 -3651514
36297c651514n96727l92579j63256P2297K92456M73040N92753O41436O25567N66187
36287a540340M89243M14094L47300K84977K20811J53463Q8648L5797K795p157
36277D89631M262L1725O7432J02818J31085J48883J54997J46888J18760O4332
36267A460813j6353j10215j89753k20371j74877m8128J37212L38149N08016O12557
$$ plain form
36297 -3651514 -4248241 -4640820 -4804076 -4731779 -4439323 -3966283 -3373530 -2732094 -2106527 -1540340
36287 -1540340 -1051097 -637003 -289703 -4726 216085 369548 458196 493993 496788 489631
36277 489631 493893 525618 593050 695868 826953 975836 1130833 1277721 1396481 1460813
36267 1460813 1444460 1334245 1144492 924121 749244 701116 838328 1176477 1684493 2297050
$$ [...]
##END NTUPLES=NMR SPECTRUM
##END=
