##TITLE=31Pdec_LR-691-R2-OST
 CDCl3, 64 sc
 26.6.2024
##JCAMPDX= 6.0         $$ Bruker NMR JCAMP-DX V2.0
##DATA TYPE= NMR SPECTRUM
##DATA CLASS= NTUPLES
##ORIGIN= UXNMR, Bruker Analytische Messtechnik GmbH
##OWNER= root
$$ XWIN-NMR		Version 3.5
$$ Wed Jun 26 13:58:50 2024 Russian Standard Time (UT+4h)  she@DPX200
##.OBSERVE FREQUENCY= 81.013821
##.OBSERVE NUCLEUS= ^31P
##.ACQUISITION MODE= SIMULTANEOUS
##.ACQUISITION SCHEME= undefined
##.AVERAGES= 64
##.DIGITISER RES= 17
##SPECTROMETER/DATA SYSTEM= spect
##.PULSE SEQUENCE= zgpg30
##.SOLVENT NAME= DMSO
##.SHIFT REFERENCE= (INTERNAL, DMSO, 0, 182.463)
##AUDIT TRAIL= $$ (NUMBER, WHEN, WHO, WHERE, WHAT)
$$ ##TITLE= Audit trail, XWIN-NMR		Version 3.5
$$ ##JCAMPDX= 5.01
$$ ##ORIGIN= Bruker BioSpin GmbH
$$ ##OWNER= she
$$ F:/spectra/data/she/nmr/P31/2/pdata/1/auditp.txt
$$ ##AUDIT TRAIL=  $$ (NUMBER, WHEN, WHO, WHERE, WHAT)
(   1,<2024-06-26 13:57:38.65 +0400>,<she>,<DPX200>,
      <continue with go, POWCHK disabled, PULCHK disabled
       configuration hash MD5:
       00 E9 B6 7A A2 85 ED C7 34 08 36 98 17 FE 4E 26
       data hash MD5: 32K
       94 FD F2 25 0E 49 CA 48 76 CB D5 E5 61 E9 55 83>)
(   2,<2024-06-26 13:57:54.15 +0400>,<she>,<DPX200>,
      <Start of raw data processing
       efp BC_mod = 2 LB = 1.5 FT_mod = 6 PKNL = 1 PHC0 = 2742.694 PHC1 = 294.0862 SI = 64K 
       data hash MD5: 64K
       9C CE 99 A1 16 6E 9C 9C 35 2A A7 C9 0E E1 3E EF>)
(   3,<2024-06-26 13:58:06.76 +0400>,<she>,<DPX200>,
      <pk PHC0 = -2.969911 PHC1 = 0 
       data hash MD5: 64K
       85 91 68 1C E5 0A 8A E7 25 C1 75 7C DB 8D 19 38>)
$$ ##END=
$$ 
$$ hash MD5
$$ 22 1D 57 A6 F5 B2 82 C8 B4 DE FB 9D 71 31 DC 70
##$RELAX= 
##$RELAX= 
##$RELAX= 
##$RELAX= 
##$RELAX= 
##$RELAX= 
##$RELAX= 
##$RELAX= 
$$ Bruker specific parameters
$$ --------------------------
##$DU= <F:/spectra>
##$EXPNO= 2
##$NAME= <P31>
##$PROCNO= 1
##$TYPE= <nmr>
##$USER= <she>
##$AMP= (0..31)
100 100 100 100 100 100 100 100 100 100 100 100 100 100 100 100 100 100 
100 100 100 100 100 100 100 100 100 100 100 100 100 100 
##$AQSEQ= 0
##$AQ_mod= 1
##$AUNM= <au_zg>
##$AUTOPOS= <>
##$BF1= 81.014009
##$BF2= 200.13
##$BF3= 200.13
##$BF4= 200.13
##$BF5= 200.13
##$BF6= 200.13
##$BF7= 200.13
##$BF8= 200.13
##$BYTORDA= 1
##$CFDGTYP= 0
##$CFRGTYP= 5
##$CHEMSTR= <none>
##$CNST= (0..31)
1 1 145 1 1 1 1 1 1 1 1 1 1 1 1 1 1 1 1 1 1 1 1 1 1 1 1 1 1 1 1 1 
##$CPDPRG= <waltz16>
##$CPDPRG1= <>
##$CPDPRG2= <waltz16>
##$CPDPRG3= <>
##$CPDPRG4= <mlev>
##$CPDPRG5= <mlev>
##$CPDPRG6= <mlev>
##$CPDPRG7= <mlev>
##$CPDPRG8= <mlev>
##$CPDPRGB= <>
##$CPDPRGT= <>
##$D= (0..31)
0 1 0 0 0 0 0 0 0 0 0 0.03 2e-05 3e-06 0 0 0 0 0 0 0 0 0 0 0 0 0 0 0 0 
0 0 
##$DATE= 1719395764
##$DBL= (0..7)
120 120 120 11 120 120 24 19 
##$DBP= (0..7)
150 150 150 150 150 150 150 150 
##$DBP07= 0
##$DBPNAM0= <>
##$DBPNAM1= <>
##$DBPNAM2= <>
##$DBPNAM3= <>
##$DBPNAM4= <>
##$DBPNAM5= <>
##$DBPNAM6= <>
##$DBPNAM7= <>
##$DBPOAL= (0..7)
0.5 0.5 0.5 0.5 0.5 0.5 0.5 0.5 
##$DBPOFFS= (0..7)
$$ [...]
##$SUBNAM2= <"">
##$SUBNAM3= <"">
##$SUBNAM4= <"">
##$SUBNAM5= <"">
##$SUBNAM6= <"">
##$SUBNAM7= <"">
##$SUBNAM8= <"">
##$SUBNAM9= <"">
##$SW= 369.568048894756
##$SWIBOX= (0..15)
0 1 3 0 0 0 0 0 0 0 0 0 0 0 0 0 
##$SW_h= 29940.119760479
##$TD= 32768
##$TD0= 1
##$TE= 0
##$TE2= 300
##$TE3= 300
##$TEG= 300
##$TL= (0..7)
0 120 53 12 22 120 120 120 
##$TP= (0..7)
150 150 150 150 150 150 150 150 
##$TP07= 0
##$TPNAME0= <>
##$TPNAME1= <>
##$TPNAME2= <>
##$TPNAME3= <>
##$TPNAME4= <>
##$TPNAME5= <>
##$TPNAME6= <>
##$TPNAME7= <>
##$TPOAL= (0..7)
0.5 0.5 0.5 0.5 0.5 0.5 0.5 0.5 
##$TPOFFS= (0..7)
0 0 0 0 0 0 0 0 
##$TUNHIN= 0
##$TUNHOUT= 0
##$TUNXOUT= 0
##$USERA1= <user>
##$USERA2= <user>
##$USERA3= <user>
##$USERA4= <user>
##$USERA5= <user>
##$V9= 5
##$VALIST= <valist>
##$VCLIST= <CCCCCCCCCCCCCCC>
##$VD= 0
##$VDLIST= <DDDDDDDDDDDDDDD>
##$VPLIST= <PPPPPPPPPPPPPPP>
##$VTLIST= <TTTTTTTTTTTTTTT>
##$WBST= 1024
##$WBSW= 4
##$XGAIN= (0..3)
0 0 0 0 
##$XL= 0
##$YL= 0
##$YMAX_a= 6479
##$YMIN_a= -7541
##$ZGOPTNS= <>
##$ZL1= 120
##$ZL2= 120
##$ZL3= 120
##$ZL4= 120
##$ABSF1= 0
##$ABSF2= 0
##$ABSG= 0
##$ABSL= 0
##$ALPHA= 0
##$AQORDER= 0
##$ASSFAC= 0
##$ASSFACI= 0
##$ASSFACX= 0
##$ASSWID= 0
##$AUNMP= <proc_1d>
##$AZFE= 0.1
##$AZFW= 0.5
##$BCFW= 0
##$BC_mod= 2
##$BYTORDP= 0
##$COROFFS= 0
##$CY= -3
##$DATMOD= 1
##$DC= 0
##$DFILT= <>
##$DTYPP= 0
##$F1P= 0
##$F2P= 0
##$FCOR= 1
##$FTSIZE= 65536
##$FT_mod= 6
##$GAMMA= 0
##$GB= 0
##$INTBC= 1
##$INTSCL= 9.790993e-09
##$ISEN= 30
##$LB= 1.5
##$LEV0= 0
##$LPBIN= 0
##$MAXI= 10000
##$MC2= 0
##$MEAN= 0
##$ME_mod= 0
##$MI= 50
##$NCOEF= 0
##$NC_proc= -10
##$NLEV= 6
##$NOISF1= 182.463
##$NOISF2= 159.3651
##$NSP= 0
##$NTH_PI= 0
##$NZP= 0
##$OFFSET= 182.463
##$PC= 4
##$PHC0= 2739.724
##$PHC1= 294.0862
##$PH_mod= 1
##$PKNL= yes
##$PPARMOD= 0
##$PSCAL= 0
##$PSIGN= 0
##$REVERSE= no
##$SF= 81.0140089999434
##$SI= 65536
##$SIGF1= 159.3651
##$SIGF2= -187.1042
##$SINO= 113.3802
##$SIOLD= 16384
##$SREGLST= <1H.CDCl3>
##$SSB= 0
##$STSI= 65536
##$STSR= 0
##$SW_p= 29940.119760479
##$SYMM= 0
##$S_DEV= 0
##$TDeff= 32768
##$TDoff= 0
##$TI= <>
##$TILT= no
##$TM1= 0
##$TM2= 0
##$TOPLEV= 0
##$USERP1= <user>
##$USERP2= <user>
##$USERP3= <user>
##$USERP4= <user>
##$USERP5= <user>
##$WDW= 1
##$XDIM= 65536
##$YMAX_p= 318479827
##$YMIN_p= -259333945
$$ End of Bruker specific parameters
$$ ---------------------------------
##NTUPLES= NMR SPECTRUM
##VAR_NAME=  FREQUENCY,     SPECTRUM/REAL,   SPECTRUM/IMAG
##SYMBOL=    X,             R,               I
##VAR_TYPE=  INDEPENDENT,   DEPENDENT,       DEPENDENT
##VAR_FORM=  AFFN,          ASDF,            ASDF
##VAR_DIM=   65536,         65536,           65536
##UNITS=     HZ,            ARBITRARY UNITS, ARBITRARY UNITS
##FACTOR=    0.456856943014862, 1,           1
##FIRST=     14782.0589164792, 0,            0
##LAST=      -15158.0608439998, 0,           0
##MIN=       -15158.0608439998, -259333945,  0
##MAX=       14782.0589164792, 318479827,    0
$$ Real data points
##PAGE= N=1
##DATA TABLE= (X++(R..R)), XYDATA
$$ [...]
43955a0350170M629595L069690m464110o476520n32831M785600L873204M82062
43947d983480o17934l66092j597144m299233o804624p640220n373653m79149K900713
43938b9260816J614023p79455J418650O258229N970417n16562m620800o17176
43930b0533490O141662Q222567P063943Q365319J0757604P136520l216721j1028087
43922A2909317q268368J336806O980756M231137o14107m17577L156886L858263
43914B3173113J196965l89689j440464p028098j4341625j1909535K126081J1900834
43906C287582N048491p196058o026856N416685P308733m149261j0455649j375729
43898h142062Q893469N937620k367253j386526O271773Q379632M649354L743165
$$ plain form
43955 -10350170 -5720575 -2650885 -7114995 -13591515 -14124346 -9338746 -5465542 -4983480
43947 -4983480 -5601414 -5967506 -7564650 -11863883 -18668507 -26308727 -31682380 -32161529 -29260816
43938 -29260816 -27646793 -28426248 -27007598 -20749369 -14778952 -15295514 -19916314 -20533490
43930 -20533490 -14391828 -6169261 894682 9260001 20017605 27154125 23937404 12909317
43922 12909317 4640949 5977755 12958511 17189648 16575541 16157964 19314850 23173113
43914 23173113 24370078 23980389 22539925 15511827 1170202 -10739333 -8613252 3287582
43906 3287582 8336073 1140015 -4886841 529844 7838577 3689316 -6766333 -8142062
43898 -8142062 751407 6689027 4321774 2935248 9207021 17586653 22236007 25979172
43890B5979172N235023J487533n732218o637719p75788J713128k709915n952707
43882A2606509l050844J18773k023636n851288n439516q88460M051423O686922
43874F209883N489005J252095r40933K724197P145007L731970o296453j2534716
43866F780055j0003984l967101Q90198N590410Q819073N196863l836973q348017
43858A120524m868057k270850n883309p150355J282086J0725827R031951o3916
43850A923901l816484q89472k95441l276716j649235N667950Q954243L429130
43842A0047876l510338m633795j962438K61090J596834K92329p528929j8075548
43834b3512919j9248204o945431O666480R070487L605451R74592K349741K085517
$$ plain form
43890 25979172 31214195 32701728 26969510 20331791 19556003 21269131 18559216 12606509
43882 12606509 9555665 9674438 7650802 1799514 -3640002 -4528462 -477039 6209883
43874 6209883 11698888 12950983 12010050 14734247 21879254 25611224 19314771 6780055
43866 6780055 -3223929 -7191030 -6300832 -710422 8108651 13305514 9468541 1120524
43858 1120524 -3747533 -6018383 -11901692 -19052047 -17769961 -7044134 1987817 1923901
43850 1923901 -1892583 -2782055 -3077496 -6354212 -8003447 -2335497 6618746 10047876
43842 10047876 6537538 1903743 -58695 202395 1799229 2091558 -5437371 -23512919
43834 -23512919 -42761123 -49706554 -43040074 -33969587 -30364136 -29389544 -27039803 -24954286
43826b4954286J326344N743634J2342861J1823939M304825K38843L616621O099737
43818B0542518J680554l972734m310884j921336j051873M49876L656159K036706
43810A7108986p255984j3230921m863553J0041418J3850628M559434k760972m66517
43802A6982519J603891m697886j1454411q314880R63687N922571M709421J543150
43794G258062l705273j1796870j5511671p346658O806062J3348935R115832L137044
43786A305463J503342J838547K665160O147098R725723O716445j678288n954308
43778B2269182l285433j539675m294819m559894L22516J122619o246274r248313
43770e460091K075340J5136829J0974477o402301j5425586r002247j868297m310691
$$ plain form
43826 -24954286 -23627942 -17884308 -5541447 6282492 10587317 10826160 14442781 20542518
43818 20542518 22223072 18250338 13939454 12018118 10966245 11416121 15072280 17108986
43810 17108986 9853002 -3377919 -8241472 1799946 15650574 20210008 17449036 16982519
43802 16982519 18586410 13888524 2434113 -5880767 -4917080 1005491 5714912 7258062
43794 7258062 3552789 -8244081 -23755752 -31102410 -24296348 -10947413 -1831581 1305463
43786 1305463 2808805 4647352 7312512 13459610 23185333 29901778 28223490 22269182
43778 22269182 18983749 17444074 13149255 8589361 8911877 10034496 3788222 -5460091
43770 -5460091 -3384751 11752078 22726555 16324254 898668 -8103579 -9971876 -14282567
43762a4282567p570655k150889N755143O631190M044183O451232J1090604Q906521
43754A8874762Q97604k791601J057230M199206q4272p574791r693718m406058
43746D78362K442048M240609K89038l946318l394545j71283j079306p130734j0081602
43737a8353731l490604O608612Q320854m94735r824840j0782502m817860J880365
43729c0954441O774940R926626R495957M124984k072363k718762J834284L416764
43721a72011l300832j2188605j2108492j299359R649468J1033942N504267J986386
43713h95236K137594L56666l893521l456384L417790O416100k761968j5835665
43705a4514624j7316934n689252N237534O172575K834262L595282P075198Q672211
$$ plain form
43762 -14282567 -21853222 -24004111 -18248968 -11617778 -7573595 -1122363 9968241 18874762
43754 18874762 19772366 16980765 18037995 22237201 22152929 14578138 4884420 478362
43746 478362 2920410 7161019 7450057 3503739 109194 -62089 -1141395 -8272129 -18353731
43737 -18353731 -21844335 -15235723 -6914869 -7409604 -17234444 -28016946 -32834806 -30954441
43729 -30954441 -24179501 -14252875 -4756918 -631934 -2704297 -5423059 -3588775 -172011
43721 -172011 -3472843 -15661448 -27769940 -29069299 -19419831 -8385889 -2881622 -895236
43713 -895236 1242358 1599024 -2294497 -5750881 -2333091 4083009 1321041 -14514624
43705 -14514624 -31831558 -37520810 -32283276 -26110701 -23276439 -19681157 -12605959 -3933748
43697c933748J0849420J6957765J9953278R421789j0277935k0595894j1967363
43690A0407312K694566M900964n358608j1914774o027788L111088L669993k539821
43682a057068n489031k712516j264277n460269j0286898q674930l80162Q527175
43674b6797976J1985712Q488572J933551j329728J298053N480857N680026K908689
43666I647756K388322M603837N011117K754880K056054L209668P94197n357187
43658B5108644o467364J486575Q742775N145229m218226o904873j460322L163739
43650B4596177K795735R22012j261929n440791p941068l642828J908673k066336
43642I869645j2576976j3967517j858840R062004P657767J929367K693977N554424
$$ plain form
43697 -3933748 6915672 23873437 43826715 53248504 42970569 22374675 10407312
43690 10407312 13101878 18002842 12644234 729460 -5298328 -2187240 1482753 -1057068
43682 -1057068 -6546099 -9258615 -10522892 -15983161 -26270059 -34944989 -35325151 -26797976
43674 -26797976 -14812264 -6323692 -4390141 -5719869 -4421816 1059041 6739067 9647756
43666 9647756 12036078 16639915 21651032 24405912 26461966 29671634 30465831 25108644
43658 25108644 18641280 20127855 28870630 34015859 29797633 22892760 21432438 24596177
43650 24596177 27391912 28313924 27051995 21611204 13670136 10027308 11935981 9869645
43642 9869645 -2707331 -16674848 -18533688 -9471684 -1813917 115450 2809427 8363851
43634H363851J541999n638242p119733m947867o159478p854335l350351K412595
43626b2751561P0671n174435M66886J4894174J9841691Q398723m256021m117080
43618G373048K827966M175954O86822M59007K358859j609917j0872620j4396406
43610h997287m749803J2669455K5176714K3906407J0113091o509951j6199570
43603C5409056j7066061j3670930q868471j567323P355940J3077990J2990127
43596B7660328R610395N275639m30412n755450o056774j665666K78009l322748
43588B5593321n484402k29895O373909M432066m544796r564301n936298r10897
43580I728707k658317r890983j4510582j0865189p52280Q970116J3156066J2971569
$$ plain form
43634 8363851 9905850 4267608 -2852125 -7799992 -13959470 -21813805 -25164156 -22751561
43626 -22751561 -22680890 -27855325 -27388439 -12494265 7347426 15746149 11490128 7373048
43618 7373048 10201014 14376968 15063790 15522797 17881656 16271739 5399119 -8997287
43610 -8997287 -13747090 -1077635 24099079 48005486 58118577 51608626 35409056
43603 35409056 18342995 4672065 -4196406 -5763729 1592211 14670201 27660328
43596 27660328 37270723 42546362 42115950 36360500 30303726 28638060 28916069 25593321
43588 25593321 20108919 19879024 26252933 30684999 26140203 16575902 10639604 9728707
43580 9728707 7070390 -2820593 -17331175 -28196364 -28948644 -19978528 -6822462 6149107
43572F149107J2511307J1749579P319540O61377j411056K600374M692361q33631
43564D3438958q029677q848449o037806p473263j1994643j1262014l720366L540724
43556a0386536O448937P643936P977689M233462k502202n369878k047716J382407
43548G380099M59979j355313o26234p09918m701628p490924j825959J0696675
43540A826777K0296816J9100030P364342p582363j5617692j0773921J865713Q972652
43532B5452354K657839j0900166j9569552j8545217j1516248k687195N762094
43525b9346091J0141869O656780k279890q506735p072615j118515L779096O351862
43517b1394239Q154711Q578696N576553O26799j114259K686779P251436N615487
$$ plain form
43572 6149107 18660414 30409993 37729533 38390910 36979854 39580228 44272589 43438958
43564 43438958 35409281 26560832 20523026 13049763 1055120 -10206894 -13927260 -10386536
43556 -10386536 -3937599 3706337 11684026 15917488 13415286 8045408 5997692 7380099
43548 7380099 7840078 6484765 5858531 5148613 446985 -7043939 -8869898 1826777
43540 1826777 22123593 41223623 48587965 41005602 25387910 14613989 16479702 25452354
43532 25452354 28110193 17210027 -2359525 -20904742 -32420990 -35108185 -29346091
43525 -29346091 -19204222 -12547442 -14827332 -23334067 -30406682 -31525197 -27746101 -21394239
43517 -21394239 -13239528 -4660832 915721 1542520 428261 3115040 10366476 15981963
43509A5981963k708458j0723826j2250799q496403m423912j180812L966123J0927167
43501h908957J4635145J1399144M452004O47304K917357P897958J0323990Q297945
43493E1661890M414973K552795L672994M904391L062573j675018o623688j0133611
43485E1837299j2275289j2485138r322989l487317J150215J313248j743379l539399
43477A1447251j558571J920450K936887J317766J003590L557097L991081k611201
43469B2004350j1561047j2300144l232374M587128K966807j562108J231025Q591451
43461A0725088R417347K153459l686033l522818l296590o535689p169658o54897
43453b569791O804589O891591O09360m965039o019802k762034L890536J0819343
$$ plain form
43509 15981963 13273505 2549679 -9701120 -18197523 -22621435 -23802247 -19836124 -8908957
43501 -8908957 5726188 17125332 21577336 22224640 25141997 33039955 43363945 51661890
43493 51661890 56076863 58629658 62302652 67207043 70269616 68594598 61970910 51837299
43485 51837299 39562010 27076872 17753883 14266566 15416781 16730029 14986650 11447251
43477 11447251 9888680 11809130 14746017 16063783 17067373 20624470 24615551 22004350
43469 22004350 10443303 -1856841 -5089215 -502087 2464720 902612 2133637 10725088
43461 10725088 20142435 22295894 18609861 15087043 11790453 5254764 -1914894 -2569791
43453 -2569791 4234798 11126389 11735749 6770710 750908 -2011126 1879410 12698753
43445A2698753J2554266P930268K759982J567410J886217J250466K968599Q217758
43437E1833719R189529o55367j4292384j9132234j4273691r489122q658863n180730
43429a0659143N059280J5842479J8663383J1771211n31862j1248790j2770163
43422A6126395l381930O733142M292914r265000j6941925p769342Q346303J3850828
43414A1991385N612661m191586n660994r14166L367817N135348N765311M870480
43406B5976256R53745m216200n804485j722530L703243M177777n75101l823691
43398A8669014l67432O010973O658377q00296q527557p051117L622306J2982829
43390C1197097J0625548k067981j2038975q381877M560219J1659985N333934n544623
$$ plain form
43445 12698753 25253019 33183287 35943269 37510679 39396896 40647362 43615961 51833719
43437 51833719 61023248 60367881 46075497 26943263 12669572 3180450 -5478413 -10659143
43429 -10659143 -5599863 10242616 28905999 40677210 40145348 28896558 16126395
43422 16126395 12744465 19477607 23770521 14505521 -2436404 -10205746 -1859443 11991385
43414 11991385 17604046 13412460 7751466 6837300 10205117 15340465 21105776 25976256
43406 25976256 26930001 22713801 16909316 15186786 18890029 23067806 22492705 18669014
43398 18669014 18301582 24312555 30970932 30170636 21643079 14591962 18214268 31197097
43390 31197097 41822645 39754664 27715689 19333812 23894031 35554016 40887950 35343327
43382C5343327q109196j806398L562470K720877J26892N41051J870900K21465
43374C4471388l087513l626961p09140J415318o99287m700049m887529m2376L685036
43365B1818887J042412l291689o30016O842026O776606l816871j0638117k580962
43357A5522276R457617P530956o046642j2565696n789472O95310k612190p143015
43349i50856l233825L565746L217603k607915n487872l295385J178708P232589
43341c81207J2415412Q915509n404016j7922100j4471108J957511J5874711J8943727
43333A9928439J4385070N692646n944486j4151758j1168461j353646J532216n622160
43325C297860r709747j653289Q957666Q395473p08173m770767m13647K093071
$$ plain form
43382 35343327 27234131 25427733 28990203 31711080 31837972 32379023 34249923 34471388
43374 34471388 31383875 27756914 27047774 28463092 27763805 23063756 18176227 18133851 21818887
43365 21818887 22861299 19569610 18939594 25781620 32558226 28741355 18103238 15522276
43357 15522276 24979893 32510849 26464207 13898511 8109039 8804349 6192159 -950856
43349 -950856 -4184681 -618935 2598668 -9247 -5497119 -8792504 -7613796 -381207
43341 -381207 12034205 20949714 15545698 -2376402 -16847510 -14889999 984712 19928439
43333 19928439 34313509 40006155 34061669 19909911 8741450 7387804 8920020 3297860
43325 3297860 -6411887 -8065176 892490 9287963 8579790 3809023 3395376 5488447
43317E488447l671639j0579284r611390k887594J093027O2112j229602l66770
43309b1702693J80186K15514M064066J2290963J7185256J1983868P82456o672528
43301A8327088p324501n503930l618765k57866K899512J308964l404297l297002
43293h70797L422549P900381L648272l346658l918908J120355M486363M180038
43285A6621595L759119M029441K240709j949618o074309r056989j0544862q266653
43277i241567j610279M528725N360852L476800M510255P620475O626494p38712
43269B0533043j0334571j6847688j6793468r334762N41013L806748j088810l454714
43261c2973209M574684J3742900R820775m023711j0785405m297246M137693N009489
$$ plain form
43317 5488447 1816808 -8762476 -18373866 -21261460 -20168433 -20106321 -21335923 -21702693
43309 -21702693 -21522507 -21306993 -17242927 -4951964 12233292 24217160 24999616 18327088
43301 18327088 11002587 5498657 1879892 1622026 4521538 5830502 2426205 -870797
43293 -870797 2551752 10452133 14100405 10753747 6834839 7955194 12441557 16621595
43285 16621595 20380714 24410155 26650864 24701246 18626937 9569948 -974914 -9241567
43277 -9241567 -10851846 -6323121 -962269 2514531 7024786 14645261 21271755 20533043
43269 20533043 10198472 -6649216 -23442684 -32777446 -32236433 -28429685 -29518495 -32973209
43261 -32973209 -28398525 -14655625 -4834850 -8858561 -19643966 -23941212 -19803519 -14794030
43253a4794030J931944K12771j648477l252234J567474J2078978J5961870O595562
43245A8653858m966634n342411K412890O111705L373455J476683K858416K491922
43237B7069884j837786o279961p686341o570771m056018j299115M2505J511207
43229H93604Q145482J9334078K4330209J4905789j374750r547549o372379j748628
43221D8565856k646102n769476o769195o974811q075540p789653m495688p15517
43213E329874J072434J902530L385524M826620M838503K983818o50380m689792
43205A8999131n865284k640864J410081J571174j970271n886508q968129j0291927
43197a3642597n426712P207492J7680110J2577959o150172j9756407j4605941
$$ plain form
43253 -14794030 -12862086 -12649315 -14297792 -17550026 -15982552 -3903574 12058296 18653858
43245 18653858 13687224 8344813 10757703 16869408 20242863 21719546 24577962 27069884
43237 27069884 25232098 18952137 11265796 4695025 639007 -660108 -617603 893604
43229 893604 9039086 28373164 52703373 67609162 66234412 56686863 50314484 48565856
43221 48565856 45919754 40150278 33381083 26406272 18330732 10541079 6045391 5329874
43213 5329874 6402308 8304838 11690362 16516982 21355485 24339303 23688923 18999131
43205 18999131 13133847 10492983 11903064 13474238 11503967 5617459 -3350670 -13642597
43197 -13642597 -19069309 -11861817 5818293 18396252 12246080 -7510327 -22116268
43190b2116268J892465J2456443J0660985M086657J225085K579992L808687K261733
43182A6855779n36273o95315L713580R348862R968803K839701q723502j8982040
43174A3789595k3368361j9272514p814843M573747J1155402J2678739J5139284
43167F881049J8597698J5232679K282998j0204849j1470912n046100l310644r265347
43159C696572j2628444n086640Q340022J6669914J6211654J1680416P085362R94625
43151D6963481q545768j8068549k0525188j2975813p49773P412112Q192031O421144
43143H123677Q518734J4412882J7343968J1548247j040998j2400475j6201441
43136C0304594j2884053o784840l11159O309746J0451358P238465l144842j2223261
$$ plain form
43190 -22116268 -20223803 -7767360 2893625 6980282 8205367 10785359 14594046 16855779
43182 16855779 16319506 15624191 19337771 28686633 38655436 41495137 32771635 13789595
43174 13789595 -9578766 -28851280 -36666123 -32092376 -20936974 -8258235 6881049
43167 6881049 25478747 40711426 42994424 32789575 21318663 16272563 12961919 3696572
43159 3696572 -8931872 -14018512 -5678490 10991424 27203078 38883494 45968856 46963481
43151 46963481 38417713 20349164 -176024 -13151837 -13901610 -6489498 1702533 8123677
43143 8123677 16642411 31055293 48399261 59947508 58906510 46506035 30304594
43136 30304594 17420541 10635701 10324542 16634288 27085646 34324111 31179269 18956008
43128A8956008j1888123m307089J598293K264684K195690M174723L452057m401645
43120A2044598j4073909j4516444k244143J2920377J7108299O707334p795521
43113A0150591j2879991n888508M142436Q680843Q267956P544416P260199N524800
43105C2802742K571722j015562o714568j2736650j1333881R1227R946135O012336
43097A9623501n032709n807021M641460Q777569n08688p164200J984429J4883304
43089C1397645J3078203O89461l670692L202309O687170j12332p076540o216491
43081C7978733l968155p755520j2329571p860009N466312J7847013K0787613J3419926
43073F3586342J450655p327966r222916p390429o047214l987149J187273N316117
$$ plain form
43128 18956008 7067885 2760796 4359089 6623773 8819463 12994186 16446243 12044598
43120 12044598 -2029311 -16545755 -18789898 -5869521 11238778 17946112 10150591
43113 10150591 -2729400 -8617908 -4475472 4205371 12473327 20017743 27277942 32802742
43105 32802742 35374464 34358902 27644334 14907684 3573803 3665030 13611165 19623501
43097 19623501 14590792 8783771 13425231 22202800 21694112 14529912 16514341 31397645
43089 31397645 44475848 45165309 41494617 44696926 51384096 51271764 44195224 37978733
43081 37978733 34010578 26255058 13925487 6065478 11531790 29378803 50166416 63586342
43073 63586342 65036997 57709031 48486115 41095686 35048472 31061323 32248596 37564713
43065C7564713K243856n301337q784959p557579q691467j1828475o832841Q265581
43057i22508J9002724J3064868j701481p988145j666867O569335Q317264N723777
43049D0398967L642405K768362K041299J454169O30008j329091l634110m365254
43041D1606755l252086j529557K01888J685532J725661o45837m829541r584729
43033B5378086j3055844j1459072k378767Q716269J1139546K508444n590236j206278
43025A4052148J2594383K1838196J7845439L710153j1505065j8353998j0805773
43018B9375483O832104J8966233J3695035k122899j1337807q861201n303902q138843
43010C3104203j1405439q088310j442030K744704N904621J0650446J2599845P432648
$$ plain form
43065 37564713 39808569 34507232 25722273 18164694 9473227 -2355248 -9188089 -922508
43057 -922508 18080216 31145084 29443603 21455458 19788591 26357926 34675190 40398967
43049 40398967 44041372 46809734 48851033 50305202 50935210 49606119 45972009 41606755
43041 41606755 38354669 36825112 37027000 38712532 40438193 39792356 34962815 25378086
43033 25378086 12322242 863170 -1515597 7200672 18340218 20848662 15258426 14052148
43025 14052148 26646531 48484727 66330166 70040319 58535254 40181256 29375483
43018 29375483 36207587 55173820 68868855 66745956 55408149 46546948 41243046 33104203
43010 33104203 21698764 13610454 12168424 14913128 20817749 31468195 44068040 51500688
43002E1500688L08783j611027j687848q001880j7501702j7966371o657231M368350
42994B751762N183353M03518o11585K586392M701474M688364M285091J493888
42986B5482257n403822j0595724p280336K13165J438637l032366j484254Q986399
42978H323956J5211574P764442l780601o291906l834367q226351j5565464j0778192
42970a7176909N064389J1519697j156841j5736566j2452036L511491J2323869
42963a4102906Q036427J828293J645959L700296L879465M577628P453859R012317
42955B6031338O676169K593577m72969j399516J252869O780894Q241911p38825
42947D8965448j3774827j5497841j485544J3358656J2012791m366809j8945261
$$ plain form
43002 51500688 51809471 50198444 48510596 40508716 23007014 5040643 -1616588 2751762
42994 2751762 7935115 8338633 7727048 10313440 15014914 19703278 23988369 25482257
42986 25482257 20078435 9482711 2202375 2415540 3854177 821811 -662443 8323956
42978 8323956 23535530 31299972 27519371 21227465 17393098 9166747 -6398717 -17176909
42970 -17176909 -12112520 -592823 -1749664 -17486230 -29938266 -26426775 -14102906
42963 -14102906 -6066479 -4238186 -2592227 1108069 4987534 9565162 17019021 26031338
42955 26031338 32707507 35301084 34828115 33428599 34681468 41462362 49704273 48965448
42947 48965448 35190621 19692780 18207236 31565892 43578683 39211874 20266613
42940B0266613j8523407n357783Q143659J1978947N911739l170426r793185j4085997
42932d629840j6841576j4895097o413124K753728N499046M281193O748347J1631197
42924a1866126R989695J849726r55134O435491J2455952O833316k754876k963009
42916A9025035M005792M504350n159125j4172033j3234296m078901P377272J7133879
42908A5401973K0702023J4231533J743711o055592m128245J211351K047863j156870
42900D3997747l067551k198245j350052k038341k967411l176474l362972l871167
42892B1965534l407336o05478L723050O839672P216738O546967O694103N370974
42884E4344224j211861j0473194j3352077n690266M429711N795054k241857j0511604
$$ plain form
42940 20266613 1743206 -3614577 4529082 16508029 22419768 19249342 9456157 -4629840
42932 -4629840 -21471416 -36366513 -42779637 -40025909 -34526863 -30245670 -23497323 -11866126
42924 -11866126 -1876431 -26705 -981839 5453652 17909604 24742920 21988044 19025035
42916 19025035 23030827 27535177 22376052 8204019 -5030277 -9109178 -1731906 15401973
42908 15401973 36103996 50335529 52079240 46023648 41895403 43106754 45154617 43997747
42900 43997747 40930196 38731951 37381899 35343558 32376147 29199673 25836701 21965534
42892 21965534 18558198 17952720 21675770 28515442 35732180 42279147 48973250 54344224
42884 54344224 53132363 42659169 29307092 23616826 28046537 33841591 31599734 21088130
42876B1088130j2325362q999842m133593J074845N712008P547590N598304J411449
42868A6973529k837161n066192k882534M016774J1394164J3724933R496362Q63729
42860D5683604r621258j8180731j9029809j0615515n42309K758438J902097O075935
42852a569548J5171552J8034215R015281k770224n644498l7815M514829K198049
42844C8911841m371365q910099p014009K73220N902010L168645n628689j1212974
42836A1118580r389616n098459k276016K388980J0452874J4213507O678849n704364
42828B2384335r671584k824699L823450J303891o641575j0278885n746789K583862
42820e067994Q184912P970794L148245l394953r616252j3965658j4045798q656165
$$ plain form
42876 21088130 8762768 -237074 -4370667 -3295822 2416186 9963776 15562080 16973529
42868 16973529 14136368 9070176 6187642 10204416 21598580 35323513 44819875 45683604
42860 45683604 36062346 17881615 -1148194 -11763709 -12306018 -9547580 -7645483 -1569548
42852 -1569548 13602004 31636219 40651500 37881276 32236778 32198963 36713792 38911841
42844 38911841 34540476 25630377 18616368 18889588 24791598 27960243 22331554 11118580
42836 11118580 1728964 -3369495 -5645511 -3256531 7196343 21409850 28088699 22384335
42828 22384335 12712751 9888052 13711502 15015393 8373818 -1905067 -7651856 -5067994
42820 -5067994 3116918 11087712 14235957 10841004 1224752 -12740906 -26786704 -35442869
42812c5442869j197731K813204K825892L865288Q395473J2196562J1118345P231263
42804A1805427M464010K645836O77164J504221P826600J5299092J6122115Q659056
42796F9003521j075016o716742o839452m481678m554278r484867j4629848j1718188
42788I503452m74837Q088418N328648l152025o257687l123361j097074j784635
42780G030899l2183M387836N254416J152070j761738m3574L245897O520033J1266731
42771C7020387J3590465N989483p791234j1957704o20499J0467893M752531j1453121
42763C9998201j8899099j2758792n453834m634852l879803J998425O174443J537022
42755D081711o182226n911058K879201J0011436Q900671M237345M100169Q751655
$$ plain form
42812 -35442869 -36640600 -33827396 -31001504 -27136216 -18740743 -6544181 4574164 11805427
42804 11805427 16269437 18915273 19592437 21096658 28923258 44222350 60344465 69003521
42796 69003521 67928505 61211763 54372311 49890633 45336355 35851488 21221640 9503452
42788 9503452 9028615 17117033 22445681 19293656 13035969 9912608 8815534 7030899
42780 7030899 6998716 11386552 16640968 17793038 16031300 15987726 19233623 25753656 37020387
42771 37020387 50610852 56600335 48809101 36851397 36230898 46698791 51451322 39998201
42763 39998201 21099102 8340310 2886476 -1748376 -5628179 -3629754 2544689 4081711
42755 4081711 -2100515 -8011573 -5132372 4879064 13779735 18017080 22117249 30868904
42747C0868904J0422577L701226o266670q601087l86901P783421L955007r191007
42739C2285470j6479684r475125K822115O644457J563426j007227M933359J2395380
42731C3682171J2467451N869679m52196k996569k707864O083M729060O952683
42723E7550498J460964r183542j5482502j2615428o131321l104432k683960j93478
42715I616799L307141K151377m221620q819651n821140K276097Q075328P354428
42707A3918759K284214j585116k34860N768570J1806617J2638462N746521p174284
42699D3168883j9918688k3947974j5468801j946910L326207l151250r352077k938356
42691c0228966J1660241J8901933J2897163L456710L31445P23540k590344p868611
$$ plain form
42747 30868904 41291481 44992707 38726037 30124950 29738049 37521470 41476477 32285470
42739 32285470 15805786 6330661 9152776 15797233 17360659 16353432 21286791 33682171
42731 33682171 46149622 52019301 51567105 48570536 45862672 45868755 50597815 57550498
42723 57550498 59011462 49827920 34345418 21729990 15598669 12494237 9810277 9616799
42715 9616799 12923940 15075317 10853697 2034046 -3787094 -1510997 6564331 13918759
42707 13918759 16202973 14617857 14382997 20151567 31958184 44596646 50343167 43168883
42699 43168883 23250195 -697779 -16166580 -18113490 -14787283 -17938533 -27290610 -30228966
42691 -30228966 -18568725 333208 13230371 16687081 17018526 17742066 15151722 7283111
42683G283111p052449Q22316O580755K842437n966687r092305l036739M562334
42675c057227N737459K675853K685710N138126J606045r213340j5846095r568378
42667a9841847K033426O183895L718406N093358J1247861J2623825P470343O090400
42659C4619667J2465780J5798051Q251438j133194q76469M266558J629005q866335
42651F6154501j5846094j4704101j1451009r132045l443853N648641R545165L649529
42643C0420734m292212n061077j090375j519172p685853j1179094o092800L217033
42635c282816Q876244R492862R477194J0629383R474847L643461l652485q089442
42627C6569248r586485r795038p762090k986944J13668k834322q243011q203409
$$ plain form
42683 7283111 230662 1052978 7633733 10476170 4509483 -4582822 -7619561 -3057227
42675 -3057227 2680232 5356085 8041795 13179921 14785966 5572626 -10273469 -19841847
42667 -19841847 -17808421 -11624526 -7906120 -2812762 8435099 21058924 28529267 34619667
42659 34619667 47085447 62883498 71134936 70001742 69125273 73391831 75020836 66154501
42651 66154501 50308407 35604306 24153297 15021252 11577399 17226040 26771205 30420734
42643 30420734 26128522 21067445 19977070 18457898 10772045 -407049 -6499849 -3282816
42635 -3282816 5593428 15086290 24563484 35192867 44667714 48311175 44658690 36569248
42627 36569248 26982763 17187725 9425635 6438691 6552359 3718037 -4524974 -12728383
42619a2728383j078223Q239002J6837404K3738884K2935896Q720732j0402053
42612E6263259j6525304o002828M556445K543695m040683l626151m48570k875784
42604B9844079m768491L356135J3168817R118302m172085o833430L879340Q294653
42596E1887320l342007j3997434o123069J1348281J6118111K532584j4622196
42589D3801590k0438506j2998368K57509J0084564J0782543M260388j857591k700418
42581C1191711J9402L420958O726193P218929O50284j0205753j4819732q159818
42573A6042174J781625N265147L236757K439413M479563O913726R623383J2190161
42565F1971949R496600j621693j4464628j9256985j5589050j0563904o707825
$$ plain form
42619 -12728383 -13806606 -5567604 11269800 35008684 57944580 66665312 56263259
42612 56263259 39737955 33735127 38291572 40835267 36794584 33168433 32719863 29844079
42604 29844079 25075588 28431723 41600540 50718842 46546757 39713327 43592667 51887320
42596 51887320 48545313 34547879 28424810 39773091 55891202 58423786 43801590
42589 43801590 23363084 10364716 10622225 20706789 31489332 35749720 33892129 31191711
42581 31191711 31211113 34632071 41358264 48577193 49227477 39021724 24201992 16042174
42573 16042174 17823799 23088946 26325703 28765116 33244679 40158405 49781788 61971949
42565 61971949 71468549 69846856 55382228 36125243 20536193 9972289 3264464
42558C264464q3893R819712J6136748J2701978J681156q178055q910091k84022
42550B6147997Q577144P775029n19965l091499N819466J3837905O966708q462925
42542E7049860j2433148J128608J5820120J5213762L434815l165353J699813P835511
42534H6583988K698270j3080558k5366064k1133206l256545J1554205J1542583
42527D9542673K786912j328555J233072K075153o17303J236771R041908J0535157
42519G4505788k186705j7173558j6735807j970142R133027O756652L4204P7035
42511E2440494L594660Q22545p551440j1171874n658322J487895K483322J15291
42503C6562571K617470J1108698J7229367J3394831K115078o487672n416302K190861
$$ plain form
42558 3264464 3180571 13000283 29137031 41839009 43520165 35342110 26432019 26147997
42550 26147997 34725141 42500170 41980205 38888706 44708172 58546077 65512785 57049860
42542 57049860 44616712 45745320 61565440 76779202 80214017 77048664 78748477 86583988
42534 86583988 89282258 76201700 50835636 29702430 26445885 38000090 49542673
42527 49542673 52329585 51001030 52234102 54309255 53691952 54928723 63970631 74505788
42519 74505788 72319083 55145525 38409718 36439576 45572603 52329255 52363459 52440494
42511 52440494 56035154 56857699 49306259 38134385 32476063 33963958 36447280 36562571
42503 36562571 39180041 50288739 67518106 80912937 83028015 76540343 71124041 73314902
42495G3314902P046360M135126k240838m678610j979250Q69845J062505J287425
42487G8817465L172481K850651k706164r037613r582163n273450k646123l612994
42479E1982090l457242J066477P587824J2452392J3560175Q815784j732200j1521452
42471G8753848j2457633n984882j830379l438313k956942N235964J4442982J5346761
42463H7111406Q926852K690918k70550j164760M22418M165480M468806l351499
42455A02999071j4427793j9112905j4787253o897096p22881J652490q31852o302842
42447D1568939q357322l562118J899733N00046m440889l309358N144327J2849144
42439D2292502J4881436J3478547J0202726M030423k163166k982730J96278N22401
$$ plain form
42495 73314902 80361262 84496388 82255550 77576940 75597690 76467535 77530040 78817465
42487 78817465 81989946 84840597 82134433 73096820 63514657 58241207 55595084 51982090
42479 51982090 48524848 49591325 57179149 69631541 83191716 92007500 90275300 78753848
42471 78753848 66296215 60311333 58480954 55042641 52085699 57321663 71764645 87111406
42463 87111406 96038258 98729176 98458626 97293866 97716284 101881764 106350570 102999071
42455 102999071 88571278 69458373 54671120 47774024 47051143 48703633 47871781 41568939
42447 41568939 33211617 29649499 31549232 32049278 27608389 24299031 29443358 42292502
42439 42292502 57173938 70652485 80855211 84885634 82722468 79739738 79936016 80458417
42431H0458417k453849j992852K937824M753271P55209j292489L390558P458458
42423I4014547K916355o214734j0285773o898597n60579M800081O336726J036209
42415H5144235q618131j2501042m160903R016877J4046077Q003836r87086n476480
42407H4467383m366679Q98929Q247668J3357294J2496552P627523L983157K532784
42399A29244611n28344o414783j0383877p518761O44121P064135O417863J016037
42391A19541002j252532L744992J0209416Q754163j542962j1710597j3802275
42384A13941207q418673o73368N583112P884234N547456K260909K341074K702586
42376A31168537l667235j3688006j3895959j78395J2556160R948710j292698m506107
$$ plain form
42431 80458417 78004568 76011716 78949540 83702811 84458020 83165531 86556089 94014547
42423 94014547 96930902 90716168 80430395 73531798 72971219 77771300 84108026 85144235
42415 85144235 76526104 64025062 59864159 68881036 82927113 90930949 89943863 84467383
42407 84467383 80100704 80999633 89247301 102604595 115101147 122728670 126711827 129244611
42399 129244611 128716267 122301484 111917607 104398846 105042967 112107102 118524965 119541002
42391 119541002 118288470 122033462 132242878 140997041 139454079 127743482 113941207
42384 113941207 105522534 104849166 110432278 118316512 123863968 126124877 128465951 131168537
42376 131168537 127501302 113813296 99917337 99738942 112295102 122243812 120951114 116445007
42368A16445007J801706M376198j940656o968818k865175L901532L521159l242067
42360A15028886p917330n664637N49289L752431q69402j0353450j4696306p731849
42352G2097632L657473P242272J610139l010006o58497K473927m65956n514118
42344G7432866m048259M098850J0010730P121095q65328m324428J030739Q196808
42336I8653073O335266n076358j3800235r991161J000783O935860N223842K743743
42328I2024813K661730K125464J661057M845777P819123J867796j0488886j5176110
42320H7340764p808297j901930p270206j3018199m751679J1152145J6090465O719889
42312H6552952k224876j418462K153940M10590l222506k370855J064865J394897
$$ plain form
42368 116445007 118246713 122622911 120682255 113713437 110848262 114749794 118270953 115028886
42360 115028886 107111556 101446919 101996208 105748639 104879237 94525787 79829481 72097632
42352 72097632 75755105 82997377 84607516 81597510 80939013 83412940 82946984 77432866
42344 77432866 73384607 77483457 87494187 94615282 93749954 89425526 90456265 98653073
42336 98653073 104988339 99911981 86111746 76120585 77121368 84057228 89281070 92024813
42328 92024813 94686543 96812007 98473064 103318841 111137964 113005760 102516874 87340764
42320 87340764 79532467 77630537 70360331 57342132 52590453 63742598 79833063 86552952
42312 86552952 84328076 82909614 85063554 85474144 82251638 79880783 80945648 82340545
42304H2340545j597193m413770o407120q591361q889995m386338K652444N706673
42296E6413885J638308n293941q081604m618931N5404n56538o693782j1636081
42288B1226720r402111j055719Q463001J6880866K3807670K5541050J7326700
42281A02788177K099889r066849q833976j871602K317151R55185k375256o147289
42273G9865430j1639823j5752049j1237287K068840J2195286P652807p204000
42266E5949204j5951051r606038L318560Q400887K113690o760128r120614l922273
42258B4422237M142075J0113968J1085820P104941J655725j210145j505398k704422
42250E3104801n464460n185994J506138J0251767J2800900P104038K98771M65905
$$ plain form
42304 82340545 80743352 76329582 69922462 61331101 52441106 48054768 50707212 56413885
42296 56413885 58052193 52758252 44676648 40057717 40113121 39556583 32862801 21226720
42288 21226720 11824609 10768890 19231891 36112757 59920427 85461477 102788177
42281 102788177 104888066 95821217 86987241 85115639 87432790 88387975 86012719 79865430
42273 79865430 68225607 52473558 41236271 43305111 55500397 63153204 55949204
42266 55949204 39998153 30392115 33710675 42111562 44225252 37465124 28344510 24422237
42258 24422237 28564312 38678280 49764100 56869041 58524766 57314621 55809223 53104801
42250 53104801 47640341 42454347 43960485 54212252 67013152 74117190 74415961 74881866
42242G4881866P281624J2425426Q772482j938217j0897754j1255893m657265J684320
42234G6296589L666497M102621O853080R202212L975076r327534j9190295j3109177
42226F2469069O008093K0247600J6744773K432471o573283n624677k660881j256357
42218I1786808M541231J5218169J8804420P928191o035180p685088M57582M175596
42210A29191729J062469J934568R363362J1736897L469258l722061J881344J4597430
42202A69514996K0564418J5997824P179255q92489o632224p950579n088344l630610
42194A89062247p293814j1595447j1320346r253130j0041350j0883703p246124
42187A21428333k816577l570294n997547k444899M672879N881986K18794m648558
$$ plain form
42242 74881866 82163490 94588916 103361398 101423181 90525427 79269534 74612269 76296589
42234 76296589 79963086 84065707 90918787 100120999 104096075 94768541 75578246 62469069
42226 62469069 68477162 88724762 105469535 107902006 101328723 95704046 93043165 91786808
42218 91786808 96328039 111546208 130350628 138278819 132243639 124558551 125016133 129191729
42210 129191729 130254198 132188766 141552128 153289025 156758283 153036222 154917566 169514996
42202 169514996 190079414 206077238 213256493 212364004 205731780 197781201 192692857 189062247
42194 189062247 181768433 170172986 158852640 149599510 139558160 128674457 121428333
42187 121428333 118611756 115041462 109043915 106599016 111271895 117153881 117372675 112724117
42179A12724117p320445j4067304k3568330k4337330j2393013J018913O089059
42172C8145667P636481J3370901J8864260J4805592K781684o706207q334938n072268
42164G5491172l517O232010J0998337J0386323M882287q85168l991668n006186
42156I8103590n270751o180919r265206j3071600j2312298m333751O021009J2161962
42148F5852036J3097489J0394480K597055r779393j7579197j1592970K827635
42141E5817135R979280M187700l749476l540590R96371R17826l810321p112490
42133E3685435p528982p500737n999423q87052L639827J305742m886821m954049
42125B6873940K691932P367192J781873o699877p158740j123689J316504k070189
$$ plain form
42179 112724117 105403672 91336368 67768038 43430708 31037695 32056608 38145667
42172 38145667 45782148 59153049 78017309 92822901 95604585 88898378 80563440 75491172
42164 75491172 75487655 81719665 92718002 103104325 107986612 107101444 103109776 98103590
42156 98103590 92832839 86651920 77386714 64315114 52002816 47669065 53690074 65852036
42148 65852036 78949525 89344005 91941060 82161667 64582470 52989500 55817135
42141 55817135 65796415 69984115 66234639 62694049 63690420 64608246 60797925 53685435
42133 53685435 46156453 38655716 32656293 31769241 35409068 36714810 31827989 26873940
42125 26873940 29565872 36933064 38714937 32015060 24856320 23732631 25049135 22978946
42117B2978946l143031K406667P718352N432566j148961l103205J692598O479134
42109C9313066M508072l671182j1040429j0261273p33692R094832R642438K285393
42101C9137225j145088N449629J2364271O882770q179305j7673459j4072835m706247
42093A8056961J172867K777576K931684K086472J248482K925772M849746O11855
42085C6661415q661460j1826300l381677O861157Q032436M011694M580905Q002435
42077D4280605N477015j809152m718488l116126n248386r610172m125573J1607094
42069C2736817J9067831N497944j5854706k1590007o995727J1228008J6130865
42062D0221025N661264r325548j4628240l841330J3782921K0643725J1011957
$$ plain form
42117 22978946 19835915 22242582 29960934 35393500 34244539 31141334 32833932 39313066
42109 39313066 43821138 40149956 29109527 18848254 18114562 27209394 36851832 39137225
42101 39137225 37992137 43441766 55806037 62688807 54509502 36836043 22763208 18056961
42093 18056961 19229828 22007404 24939088 27025560 28274042 31199814 36049560 36661415
42085 36661415 27999955 16173655 12791978 19653135 27685571 31697265 36278170 44280605
42077 44280605 49757620 47948468 43229980 40113854 34865468 25255296 21129723 32736817
42069 32736817 51804648 57302592 41447886 19857879 12862152 24090160 40221025
42062 40221025 45882289 36556741 21928501 18087171 31870092 52513817 63525774
42055F3525774k136730n827070l441851l535189k643474O309733J5714327J1328653
42047G9294173l612278j0483967k959841M765513J550570n778022p970908p819730
42039D6985510r258998o277918M810466J3539684R535061l60029l381023j602314
42031E3990439n599793j2827160j0202974K703094J0598479N770548q34869K244382
42023D5842146J0350908J1772799L887887p402214j6766126k0367973j4119021
42016A3198406M67709J2523629J2008942K128169m834698l118979J114107K45680
42008C3732965m710082p300461n480788l797406n434988o085516L75766J1574218
42000A2873708J7609485J3648401N703963Q51819j711505m636798m767804j02289
$$ plain form
42055 63525774 61389044 55561974 52120123 48584934 45941460 52251193 67965520 79294173
42047 79294173 75681895 65197928 62238087 67003600 68554170 62776148 54805240 46985510
42039 46985510 37726512 31448594 36259060 49798744 59333805 58973776 55592753 53990439
42031 53990439 48390646 35563486 25360512 28063606 38662085 44432633 43597764 45842146
42023 45842146 56193054 67965853 71853740 64451526 47685400 27317427 13198406
42016 13198406 13666115 26189744 38198686 40326855 35492157 32373178 33487285 33732965
42008 33732965 29022883 21722422 16241634 12444228 7009240 923724 1299490 12873708
42000 12873708 30483193 44131594 49835557 50687376 48975871 44339073 39571269 39468980
41992C9468980K022378m583015j0794889k900677J4198859K0967106J2388972
41985G0767714N526917J1438254J6928804O181457j3502465k2763992j7512164
41978E7064525r546865o000456l741921j294591j715187l889906l149651o79767
41970B7046181j642873m517374l337063j51160l196143j1465360j3548344n457223
41962a6269359J950917o57754o641267k958544J1454376K3946321K2493267P615002
41954D0932959q568502j3447234n830369L255431L796993j501758l118333Q03620
41946A6322807L194230m7312m996450o910551n256799j201125L027439K752592
41938F884831l454382p704665j745647Q684169R664228M8843n974782l19966Q041902
$$ plain form
41992 39468980 41491358 36908343 26113454 23212777 37411636 58378742 70767714
41985 70767714 76294631 87732885 104661689 110843146 97340681 74576689 57064525
41978 57064525 47517660 41517204 37775283 36480692 34765505 30875599 27725948 27046181
41970 27046181 25403308 20885934 17548871 17397711 14201568 2736208 -10812136 -16269359
41962 -16269359 -14318442 -14976196 -21617463 -24576007 -13121631 10824690 33317957 40932959
41954 40932959 32364457 18917223 13086854 16342285 20139278 18637520 15519187 16322807
41946 16322807 19517037 19469725 14473275 7562724 2305925 1104800 4132239 6884831
41938 6884831 3430449 -4274216 -6019863 2664306 12328534 12377377 6402595 6082629 14124531
41929A4124531R044128N867520N404297N342844L88709o881450j0536142j0001460
41921A2752977o751853J90603P832907O903601m545985j3242679p325197N879584
41913A693958J0489276M903331J185629N112774R959587R463834N418578J480490
41905D9707457j302737j918328J50728J822226L3691k892989l320271k536482
41897C9743295k419283K64933O746351Q945043L78665j0133576q680571K637352
41889C7482209Q859911N190227J771614M408951N934030O35323o733109j1414216
41881D6134940j5248174j7535356j2443563k203286L61137q446535j3038307M04166
41873b2014978K2118485L0599754K0072657M210884l513566k078672K259234L522629
$$ plain form
41929 14124531 23168659 29036179 34440476 39783320 40172029 33290579 22754437 12752977
41921 12752977 6001124 6191727 14024634 20928235 16382250 3139571 -4185626 1693958
41913 1693958 12183234 17086565 18272194 23384968 33344555 42808389 48226967 49707457
41905 49707457 48404720 46486392 46637120 48459346 48493037 45600048 42279777 39743295
41897 39743295 37324012 37588945 44335296 53280339 53659004 43525428 34844857 37482209
41889 37482209 46342120 51532347 53303961 57712912 63646942 64282265 57549156 46134940
41881 46134940 30886766 13351410 907847 -1295439 -934302 -9380837 -22419144 -22014978
41873 -22014978 103507 30703261 50775918 54986802 51473236 49394564 51653798 55176427
41865E5176427j086154q529881j0976699m982775K670672L716784m18468k496855
41857C3073051j066884p54007l238078n326620m824237j966713L482170J0374333
41849B9753015J3373474Q853346K005195Q09195M103626L528021k987984q143811
41841E1294077o874707k826533o35612N98254K137206P16131n521601j1002333
41833B7884882r004796j502867L182750J702507p96248Q84790M888226O145774
41825C3385018L914304J550754J51011k883319p846936r769801m924088K787799
41817A6364742O728666O977773R029656J3548261J4479414R185918L331836J669730
41809H1315996M38087n094085j0724157q753868n69546M456621K376837n49292
$$ plain form
41865 55176427 54090273 45560392 34583693 29600918 32271590 35988374 35569906 33073051
41857 33073051 32006167 31252160 28014082 22687462 17863225 15896512 19378682 29753015
41849 29753015 43126489 51979835 53985030 54794225 58897851 62425872 59437888 51294077
41841 51294077 44419370 41592837 40957225 41555479 43692685 44408816 38887215 27884882
41833 27884882 18880086 17377219 20559969 22262476 21466228 22351018 27239244 33385018
41825 33385018 37299322 38850076 39001087 36117768 28270832 18501031 13576943 16364742
41817 16364742 23093408 30071181 39100837 52649098 67128512 76314430 79646266 81315996
41809 81315996 81754083 76659998 65935841 57181973 56612427 61069048 63445885 62896593
41801F2896593J880735P001378P833303K312333n313885r986862j0037394p027645
41793D9558556l461123p49201J233866L145482N515138Q803082J2323548J3031535
41785H9400883Q132570l53241o955376r743155j1555813j2598574q331088O77232
41777D8673438L879902n557173j6914320j3166680M751621J6863189J0362471
41770D8892448l907913p490560J723597J0418782R778065M600940L060441N704473
41762G2780273P417710N204480K41458n575471j1437464j5576347j4010242m224685
41754C4819712R419644J6846791J1946483J89533o797930m224386J881608M023342
41746F8104797J887697n33230j771676k462756j351004K600734N413929J539888
$$ plain form
41801 62896593 64777328 71778706 79612009 81924342 76610457 66623595 56586201 49558556
41793 49558556 46097433 45348232 46582098 49727580 55242718 64045800 76369348 89400883
41785 89400883 97533453 97180212 90224836 80481681 68925868 56327294 47996206 48673438
41777 48673438 52553340 46996167 30081847 16915167 21666788 38529977 48892448
41770 48892448 44984535 37493975 39217572 49636354 59414419 64015359 67075800 72780273
41762 72780273 80197983 85402463 85643921 80068450 68630986 53054639 39044397 34819712
41754 34819712 44239356 61086147 73032630 73222163 66424233 62199847 64081455 68104797
41746 68104797 69992494 69459264 67687588 65224832 63873828 66474562 71888491 73428379
41738G3428379p128536j1389943o234263K740284P733985Q661527R433325Q635939
41730H5880697K034181p022740r008434j999710M637312M297106K282689M589601
41722H5690702N874994j741575j3986346j9907015j7756429j2749350k556323
41715B2868658J8367540L9404933L7869348J0094964j7897050k1864113p835589
41708H1008691L405576O923003J1450060J6367608J1904168l52121o685947k643143
41700A21377895J446930o16391j940255K621145O762736M712315J215954K120306
41692A37700635M696833M628937M051022N301158M364649j775542p624247o594651
41684A44748794j025937J884287m3424l786679o543786o261770j292760N445549
$$ plain form
41738 73428379 66299843 54909900 48675637 51415921 59149906 67811433 77244758 85880697
41730 85880697 87914878 80892138 71883704 69883994 74521306 78818412 81101101 85690702
41722 85690702 91565696 89824121 75837775 55930760 38174331 25424981 22868658
41715 22868658 41236198 80641131 118510479 128605443 110708393 88844280 81008691
41708 81008691 84414267 91337270 102787330 119154938 131059106 130706985 124021038 121377895
41700 121377895 122824825 122208434 120268179 122889324 129652060 134364375 135580329 137700635
41692 137700635 142397468 147026405 151077427 156378585 160743234 158967692 151343445 144748794
41684 144748794 143722857 145607144 145563720 141777041 135233255 128971485 127678725 133124274
41676A33124274O599308j15347o847150n225357K717499P764614M101146o660100
41668A35458887j7555331j9617770r114033N387604J0096828L511783j666953
41661A06501015J759902N046972K95823m364456J240082R695210N835816r088565
41653A16921799j8697651j4678484m146914N173211J2421022J5299475Q965936
41646A21258394k830901p889723j937230N205733M499734p27184l153090k613393
41638A11812340k599259k347259J094451O771694J0182394P293262k813164j5469491
41630A13924968k1424693j6414987q573044q187631j1256415m303807J3467009
41623E7231400K5840017K2002542J1010042O760519R496321J1276977J0671005
$$ plain form
41676 133124274 139723582 139608235 132761085 127535728 130253227 138017841 142118987 135458887
41668 135458887 117903556 98285786 89171753 94559357 104656185 108167968 106501015
41661 106501015 108260917 113307889 113603712 109239256 110479338 120174548 126010364 116921799
41653 116921799 98224148 83545664 79398750 84571961 96992983 112292458 121258394
41646 121258394 118427493 110537770 108600540 113806273 118306007 117578823 114425733 111812340
41638 111812340 109213081 106865822 107960273 114731967 124914361 132207623 129394459 113924968
41630 113924968 92500275 76085288 67512244 59324613 48068198 43764391 57231400
41623 57231400 83071417 105073959 116084001 122844520 132340841 143617818 154288823
41616A54288823J1474144J3122210J2401198J0389848R381267P246739K606745
41609B20910974R25109P326707J7428179K2947115K2173453J7648055R120235
41602C18479827k288114q621301m726371P88642m052543j5891502j9856265j1036965
41594B52795408l9262L538718J763148N83188J556169L868581O146878M699967
41586B74912795k088083p609495m375820L224804M451719l14883j328117P39066
41578B67611986o132112k1526700k6230774j0380742P924638O748247r230146
41571B08784397j8806988j5509701j0474998r457447o230914J171488M797486
41564A54273323P63121m579905o340306p563734j0228762j0274920o062242k660726
$$ plain form
41616 154288823 165762967 178885177 191286375 201676223 211057490 218304229 220910974
41609 220910974 221836083 229162790 246590969 269538084 291711537 309359592 318479827
41602 318479827 316191713 307570412 302844041 303632683 299580140 283688638 263832373 252795408
41594 252795408 252756146 256294864 258058012 258641200 260197369 264065950 270212828 274912795
41586 274912795 272824712 265215217 260839397 264064201 268515920 268201037 266872920 267611986
41578 267611986 261479874 239953174 213722400 203341658 211266296 218014543 208784397
41571 208784397 189977409 174467708 163992710 154535263 148304349 149475837 154273323
41564 154273323 155036444 150456539 144116233 136552499 126323737 116048817 109986575 107325849
41556A07325849l192817l933062k185477j366120m000281o838285p099423o727793
41548G1982591o602000l718757J798223M504208L011607L363130P388754O567829
41540H8295585m382674j5696307j4566558l303262N439311P587493R904081J4834274
41532H8111943J5390581P403826k930071p550724n704539j523450J801912K701773
41524I7701251J045376l73896J554244M714911L485579k682565p516646o558833
41516I1369421k425881P50928K863930M737645M432062Q15692k682281k160480
41508I7701036R80666J731507k386258q913016j2550786q716918J899152J0864152
41500H0609535Q166355n991233j8800263j8136721o267491L391702K029128n559514
$$ plain form
41556 107325849 104133032 100199970 98014493 96648373 92648092 85809807 78710384 71982591
41548 71982591 65380591 61661834 63460057 67964265 70975872 74339002 81727756 88295585
41540 88295585 83912911 68216604 53650046 50346784 55786095 63373588 73277669 88111943
41532 88111943 103502524 110906350 107976279 100425555 94721016 93197566 94999478 97701251
41524 97701251 98746627 98372731 99926975 104641886 108127465 105444900 97928254 91369421
41516 91369421 88943540 89694468 92558398 97296043 101728105 102543797 99861516 97701036
41508 97701036 98681702 100413209 98026951 89113935 76563149 67846231 69745383 80609535
41500 80609535 88775890 82784657 63984394 45847673 39580182 42971884 45001012 39441498
41492C9441498p813549M8395J0292056J0613316j909473j6291384j9177138r116583
41484F087138M362469J3686039J8591957J9210099J2999798K032411m939269l513322
41476F8517320l42219k617936o886138n646569K87452M549165N948400O984125
41468G0793600N205905k813659j0475741o587592O491536J2139975J725857j2509687
41460F3970194j3674249j828072Q354216O730012k997216j0821138j1151293o425274
41452C2157180l559889o331134j0207511p316161K770490J1684796J3113042R147268
41444D1458081L293682n163127j4063174j3322304K888477K2623473K6089250
41437F3804358R712050r049379j3280698n008342J649948j085207q629898j2530074
$$ plain form
41492 39441498 31627949 31676344 41968400 52581716 50672243 34380859 15203721 6087138
41484 6087138 10449607 24135646 42727603 61937702 74937500 76969911 72030642 68517320
41476 68517320 68175101 65557165 58671027 53024458 53311910 57861075 63809475 70793600
41468 70793600 75999505 73185846 62710105 56122513 62614049 74754024 76479881 63970194
41460 63970194 50295945 48467873 56822089 63552101 60554885 49733747 38582454 32157180
41452 32157180 28597291 22266157 12058646 4742485 7512975 19197771 32310813 41458081
41444 41458081 44751763 39588636 25525462 12203158 15091635 37715108 63804358
41437 63804358 73516408 64467029 51186331 46177989 47827937 46742730 38112832 25582758
41429B5582758r359711k004883M429878P586120R356770J1746843J2372143P417896
41421F7127814j217116o486241n148462j279577J156036L573965O948000O782070
41413G1456489L24617n773058l376327L852167M394962l818914r744542n543475
41405E1771919K724214N967387N367704P056154R718805P345695J377755n4094
41397I1275539M929662Q873278O674729K352938J057996J386186K7883j511057
41389A15067154J02530M082358P124911Q250369Q385928P696778O438077N664767
41381A62812872M345222p02207q883447j3923881j1798604o475191l437026k139499
41373A19798239k20212J57426k375774j837027O252529J2880578M964944j3307486
$$ plain form
41429 25582758 16223047 14218164 18648042 26234162 35590932 47337775 59709918 67127814
41421 67127814 65910698 59424457 54275995 52996418 54152454 57726419 64674419 71456489
41413 71456489 71781106 66008048 62631721 66483888 70878850 67059936 57315394 51771919
41405 51771919 54496133 60463520 65831224 72887378 82606183 89951878 91329633 91275539
41397 91275539 96205201 105078479 111753208 114106146 115164142 116550328 116578211 115067154
41389 115067154 115169684 119252042 126376953 134627322 143013250 150710028 157148105 162812872
41381 162812872 167158094 166455887 157572440 143648559 131849955 125374764 121937738 119798239
41373 119798239 119578027 119735453 117359679 115522652 121775181 134655759 139620703 126313217
41365A26313217k2037173j2357759J013724J163913q061844j0894984l514395
41358G1624699L594499L568996N93796j026825l505608p500458p125041L81410
41350F0605468O771036K939038o426003p538858K729697J0625470L482837j2572728
41342F0615957k0129075j2581378n35612L774599J94852l931203m598130k376769
41334B0433241J498993M359506J745985n987073j0401511m906471N211540R672912
41326B1627122P164769M703233N674147P224945P757964P698962M072375n638247
41318F0285270j5048933j5300393r399887p520998q101905K95448J5176740J6973030
41310C7358372j118362j7724339j1923962O864212J4519792O680983j670376l650965
$$ plain form
41365 126313217 104276044 91918285 92932009 94095922 86034078 75139094 71624699
41358 71624699 75219198 78788194 79381990 78355165 74849557 67349099 60224058 60605468
41350 60605468 67376504 70315542 63889539 56350681 59080378 69705848 73188685 60615957
41342 60615957 40486882 27905504 27369892 31144491 31339343 27408140 22810010 20433241
41334 20433241 21932234 26291740 28037725 22050652 11649141 6742670 11954210 21627122
41326 21627122 28791891 33495124 39169271 46394216 54152180 61851142 65923517 60285270
41318 60285270 45236337 29935944 20536057 13015059 4913154 5208602 20385342 37358372
41310 37358372 36240010 18515671 6591709 13455921 27975713 34656696 32986320 29335355
41302B9335355o225224j0545681p270402N189450J4770150J3451427P306208L761950
41294D9773233J155073l197964n497549k791340P97997J300394J206719L460936
41286D6207499N744624N137333K305325k256886r446406j6240594j6835589j2027206
41278B588100q930548q185714j810217J0942235J6936718P272301p405445j0712193
41270F95237k826485K691816k47795m766547m487826j045212K478050O078697
41262a430065Q986150Q683911N644331L410445K990901K058473l33977l160238
41254B6849931o542312r815746q168043J329652J1305565J0802435J203943m557557
41246B2407868j466631N9564p510203j3875982n581259J1472679J8232500R092626
$$ plain form
41302 29335355 23110131 12564450 5294048 10483498 25253648 38705075 46011283 49773233
41294 49773233 50928306 47730342 42232793 39441453 40239450 41539844 42746563 46207499
41286 46207499 51952123 57089456 59394781 57137895 47691489 31450895 14615306 2588100
41278 2588100 -6342448 -14528162 -16338379 -5396144 11540574 18812875 11407430 695237
41270 695237 -2131248 560568 312773 -4453774 -8941600 -9986812 -7508762 -1430065
41262 -1430065 7556085 16239996 21884327 25294772 28285673 30344146 30010169 26849931
41254 26849931 20307619 10491873 2323830 3653482 14959047 25761482 26965425 22407868
41246 22407868 20941237 21000801 13490598 -385384 -5966643 5506036 23738536 32831162
41238C2831162j899142l252110n19098k567359n968491l477959J144712k12242
41230A6079473m209887j346245N439376L309736q007562j2905531m660530K852925
41222c448245j648910p086489J369766J5566287J5419019M67256r916866o386014
41214D335804L75734J813785L879474J0472048J2254493K606871q901462j0351039
41206A6485708m219498R3582N66356j037636o938846j5455852j4731853J390079
41198b3847960J8295561J6770868k03993j2137703r751205l239623k310424m077831
41190b0502310l865338l752472m995565l429699J835110M650459K100442j05325
41182b8064698K246287M665965K792438Q22065M126887R354156R283633L880861
$$ plain form
41238 32831162 30932020 27679910 27160812 24593453 18624962 15147003 16291715 16079473
41230 16079473 11869586 10523341 15962717 19272453 11264891 -1640640 -6301170 -3448245
41222 -3448245 -5097155 -12183644 -10813878 4752409 20171428 20638684 10721818 4335804
41214 4335804 4711538 6525323 10404797 20876845 33131338 35738209 26836747 16485708
41206 16485708 12266210 12359792 12926148 11888512 4949666 -10506186 -25238039 -23847960
41198 -23847960 -5552399 11218469 11014476 -1123227 -10874432 -14114055 -16424479 -20502310
41190 -20502310 -24367648 -28120120 -33115685 -36545384 -34710274 -30059815 -27959373 -28064698
41182 -28064698 -25818411 -21152446 -18360008 -17537943 -13411056 -4056900 5226733 9107594
41174I107594l69K126090Q243186J3237717J2925128O543066j994702p088553
41166D3099157p260425n600690l959491q70988L572879N714045L380884j402688
41158C6672683o334964j0344797r942918j298649J0853538J4339489N254613m587858
41150C4611137l244269M584576N543478k200140p645878m261076K283370M845760
41142C4516958L532923P70832l684998q322639p736611p18972N005960K581946
41134B5945399l377281k986681M362682R097930N011114l351632q618054r562361
41126A6521116q668204o039064j029769L255678K976724j35390q63602J451792
41118G469281K312434j06170k209362j674803j240093k879508l301484P67957
$$ plain form
41174 9107594 9107225 11233315 19476501 32714218 45639346 52182412 50187710 43099157
41166 43099157 35838732 30238042 26278551 25407563 28980442 34694487 38075371 36672683
41158 36672683 30337719 19992922 10050004 8751355 19604893 33944382 39198995 34611137
41150 34611137 31366868 35951444 41494922 39294782 31648904 27387828 29671198 34516958
41142 34516958 38049881 38820713 35135715 26813076 19076465 18357493 23363453 25945399
41134 25945399 22568118 19581437 23944119 33042049 38053163 34701531 26083477 16521116
41126 16521116 7852912 1813848 784079 4039757 7016481 6881091 6017489 7469281
41118 7469281 9781715 9675545 7466183 5791380 4551287 1671779 -1629705 -861748
41110h61748O912641J0711580J1286754R094044K706215o602327j1241933n634974
41102A6370252M202754P024028J389776k904482J468732J0719927J5449592R452041
41094F3172620o212775k2098371k5082772j1770932M152133O599644k172082n952801
41086F34664J098275Q085323P447576N729888P506331M103209r693979k0362868
41078D548419j2631643O318755J5867238J0500600L042473J354052j071361q686949
41070A9241584j3521014p965279K808258Q297385N414483j441316o750455n934672
41062A48974K721118J3552324J6314759Q040470k505834o128636m147073l751924
41054B4244178p024161r878227r113695n764807k766207k116449k875366j046125
$$ plain form
41110 -861748 6050893 16762473 28049227 37143271 39849486 33247159 22005226 16370252
41102 16370252 20573006 27597034 28986810 26082328 27551060 38270987 53720579 63172620
41094 63172620 56959845 34861474 9778702 -1992230 2159903 8759547 6587465 634664
41086 634664 1732939 9818262 17265838 22995726 30502057 34605266 24911287 4548419
41078 4548419 -8083224 -1764469 14102769 24603369 27645842 28999894 27928533 19241584
41070 19241584 5720570 -2244709 563549 8860934 14275417 12834101 6083646 148974
41062 148974 2870092 16422416 32737175 40777645 38271811 32143175 27996102 24244178
41054 24244178 17220017 7341790 -1771905 -7536712 -10302919 -12419368 -15294734 -16340859
41046a6340859N150524R396976K909023j1297206j7214086n246977J3032275J8032430
41038a577900O699783n376996n437773K602523P816078O931618M222450K628968
41030A8508751J276323o08333k321148l440498l781517k602576l41163N86590
41022G276429l53616O22506N762226R129382K297856j2266133k0379869j2958563
41014b0869782J496575P233805Q06478o785561o097878O33730O532972R391324
41006g658337J0218026Q829446N866692M444889M761346J561476p317229j4389893
40998F316416j1891274m222965k170661o491746p346030o93473N240858L371022
40990a7887853j759087k313629J818512O661469J1819405J6882200J6106267O052307
$$ plain form
41046 -16340859 -11190335 -1793359 1115664 -10181542 -27395628 -32642605 -19610330 -1577900
41038 -1577900 5121883 -255113 -5692886 -3090363 4725715 11657333 15879783 18508751
41030 18508751 19785074 19176741 16855593 13415095 9633578 7031002 6689839 7276429
41022 7276429 6922813 7545319 13307545 22436927 24734783 12468650 -7911219 -20869782
41014 -20869782 -19373207 -12139402 -11332924 -18118485 -24216363 -23582633 -17049661 -7658337
41006 -7658337 2559689 11389135 17255827 21700716 26462062 28023538 20706309 6316416
40998 6316416 -5574858 -9797823 -11968484 -18460230 -25806260 -26499733 -21258875 -17887853
40990 -17887853 -19646940 -21960569 -20142057 -13480588 -1661183 15221017 31327284 37379591
40982C7379591n103449n883961K152335O062794j84690q725442j1273745r946427
40974D477006r612768p618658J005506J2631808J7559697J2344331L141206l339186
40966C0588942o666080r322272j1323152j1001959q498934n512414k413929K058983
40958b2090815P815678J1566538R459439J816340n977987q493685n398867k27128
40950a1530487M563443Q244951Q496438K649257o086517q973314k429492N563505
40942D97784M854992l776344j0391385q750949j542923N650215Q955959N686259
40934A183608l267742j0239057p728728O28607M377731K348764L678072R917964
40926H99219R425599k942887j3636793r715324Q18418K949767l85962M020367
$$ plain form
40982 37379591 32276142 26392181 28544516 34607310 34422620 25697178 14423433 4477006
40974 4477006 -5135762 -12754420 -11748914 882894 18442591 30786922 33928128 30588942
40966 30588942 23922862 14600590 3277438 -7724521 -16223455 -21735869 -24149798 -22090815
40958 -22090815 -14275137 -2708599 6750840 8567180 2589193 -5904492 -11303359 -11530487
40950 -11530487 -6967044 1277907 9774345 12423602 6337085 -2636229 -5065721 497784
40942 497784 5352776 1576432 -8814953 -17565902 -19108825 -13458610 -4502651 1183608
40934 1183608 -2084134 -12323191 -20051919 -19423312 -15045581 -12696817 -9018745 899219
40926 899219 10324818 7381931 -6254862 -15970186 -15151768 -12202001 -12587963 -8567596
40918h567596J2947618R927118n070620j2131077k980859N790173R90532o031805
40910e126516j007146Q007047N657875l379927l108213N725121P792927k782m810223
40901I748163j381718K60151n343382q983616l213629N270289P316996M121165
40893G794419J147801j017539k999350k615165q47096l404629j0303550j2650135
40885b4895244o328060L11202J49676q39229M463866R126634K033313j2170604
40877b8148446j7044349p134711N768742J0237293P899918N742103N477681N307017
40869a1894752N117161M780625K047507l304271o447185k554175O752085J4220368
40861H717363J3035082J939184j2675843j9527085j1849290L814635J2349646
$$ plain form
40918 -8567596 4380022 14307140 9236520 -2894557 -5875416 -85243 905289 -5126516
40910 -5126516 -6133662 1873385 7531260 4151333 1043120 6768241 14561168 14558386 9748163
40901 9748163 8366445 8626596 3283214 -5700402 -8914031 -3643742 3673254 7794419
40893 7794419 8942220 7924681 4925331 2310166 1463070 -1941559 -12245109 -24895244
40885 -24895244 -31223304 -30912102 -30762426 -31601655 -27137789 -18011155 -15977842 -28148446
40877 -28148446 -45192795 -52327506 -46558764 -36321471 -28421553 -22679450 -17201769 -11894752
40869 -11894752 -6777591 -1996966 50541 -3253730 -9700915 -12255090 -5503005 8717363
40861 8717363 21752445 23691629 11015786 -8511299 -20360589 -16545954 -4196308
40854d196308O804930l099262l348824O353166J2806030O952371n140383j1334610
40846E797110q153600j854344J685020J836446q91928o538014j1289237q194929
40838b7603476L118916J2611381J1635346M678324K313694N486700N772300M62924
40830A8476109k932457Q5012K989752q64526o998211o944755j438097J607668
40822C980495p01511m079834n935902q565811j2449284j3076186p465599N13594
40814d7780038M771975M636805M732417P947137J1264112R849547M059362j46631
40806f65314J198581M456370L177794l042791q381364q814062n888245k431188
40798b0390219L97865P79272l424639r485114r913622j125077J1490023J9449035
$$ plain form
40854 -4196308 2608622 -490640 -3839464 2513702 15319732 22272103 17131720 5797110
40846 5797110 -2356490 -4210834 -2525814 -689368 -1581296 -8119310 -19408547 -27603476
40838 -27603476 -24484560 -11873179 -237833 4440491 6754185 12240885 18013185 18476109
40830 18476109 15543652 15628664 18618416 17753890 10755679 3810924 2372827 3980495
40822 3980495 3278984 -800850 -6736752 -15302563 -27751847 -40828033 -48293632 -47780038
40814 -47780038 -43008063 -38371258 -33638841 -25691704 -14427592 -4578045 -518683 -665314
40806 -665314 533267 4989637 8167431 5124640 -3256724 -12070786 -17959031 -20390219
40798 -20390219 -19992354 -19213082 -22637721 -32122835 -42036457 -43161534 -31671511 -12222476
40790a2222476J8545073R368596l738833j2174063q548988L125867R031853K059652
40782E446681r370057j3841420j1142108p471007l856353J834859P131127Q778868
40774b2489410R803649J3251839J3416671M001215q648086j2222508o185838j014820
40766a0087288j223466j641104j53511p76851k648820O70722P959923R437645
40758A537250L220757k70549M168736P593580K987109k113502J018689O827926
40750B4969996N062838j945313l862447P51714L850600J602500j739645k832140
40742B5858103l577152o301505j0600657j4599102j5427642j0836527l837357
40735c9321839j325575l805251k572420O708281J4489817J0293047o47186m632840
$$ plain form
40790 -12222476 6322597 15691193 11952360 -221703 -8770691 -5644824 3387029 5446681
40782 5446681 -3923376 -17764796 -28906904 -36377911 -40234264 -38399405 -31268278 -22489410
40774 -22489410 -12685761 566078 13982749 17983964 9335878 -2886630 -9072468 -10087288
40766 -10087288 -11310754 -12951858 -13105369 -13882220 -16531040 -15860318 -7900395 1537250
40758 1537250 4758007 4487458 8656194 16249774 19236883 17123381 18142070 24969996
40750 24969996 30032834 28087521 24225074 24976788 28827388 30429888 28690243 25858103
40742 25858103 22280951 15979446 5378789 -9220313 -24647955 -35484482 -39321839
40735 -39321839 -40647414 -44452665 -47025085 -40316804 -25826987 -15533940 -16181126 -20813966
40727b0813966L91152L948176P18219l091775k023496J141112K746284L590484
40719a3393810L989476K087456j17550K458790Q186205Q522603J566906l240459
40711A0059617N24743N899694L859651k521126m159933l38133L138220N956734
40703B2419467J1740868J5835149P693108j1147110k3140287j6299142j320316
40696E781737K634766n905012j0697802l117075N526600K264107p735235r931842
40688b1179756k870325R01063m393982r019279m215434L433697K601123m804226
40680c9547119o482918K198874J2613941J5484068J0985930M547388o09247l669977
40672d479060m093999k920867l075041n479059p262397o159258m301120m863296
$$ plain form
40727 -20813966 -20422814 -16474638 -15756419 -18848194 -20871690 -19730578 -16984294 -13393810
40719 -13393810 -9404334 -7316878 -7434428 -4975638 3210567 11733170 13300076 10059617
40711 10059617 10584360 16484054 20343705 17822579 13662646 13324513 16462733 22419467
40703 22419467 34160335 49995484 57688592 46541482 23401195 7102053 5781737
40696 5781737 8416503 2511491 -8186311 -11303386 -5776786 -3512679 -11247914 -21179756
40688 -21179756 -24050081 -23149018 -27543000 -36562279 -40777713 -37344016 -34742893 -39547119
40680 -39547119 -46030037 -43831163 -31217222 -15733154 -4747224 -199836 -809083 -4479060
40672 -4479060 -8573059 -11493926 -14568967 -20048026 -27310423 -33469681 -37770801 -42634097
40664d2634097o467798l957595N055394J6152455K1476094J7005129O286015l117992
40656I797605o372327l943893J256563O529352R298862Q160030N321388M203387
40648C4250967L067707l653777j4457570j7900849p546877N723832O265823m358021
40640A391235r720455l106318L270518j563909r972470p915554L584697J0679044
40632a3353212O775550p35554l583458k468777j355027j14759K410125L477591
40624h947521K55473l999428k880676M280512J0588125R856832L976841O2778
40616A3192936J792949O016927P673742N472524J652121j660875l682000l971870
40608B6486454l080230l891904r265902j7280136k1124640j5562059k693309R695518
$$ plain form
40664 -42634097 -49101895 -53059490 -48004096 -31851641 -10375547 6629582 12915597 9797605
40656 9797605 3425278 -518615 737948 7267300 16566162 24726192 30047580 34250967
40648 34250967 37318674 33664897 19207327 1306478 -6240399 -516567 5749256 1391235
40640 1391235 -8329220 -11435538 -8165020 -9728929 -19701399 -27616953 -24032256 -13353212
40632 -13353212 -6577662 -7313216 -10896674 -13365451 -14720478 -14835237 -12425112 -8947521
40624 -8947521 -8692048 -12691476 -15572152 -11291640 -703515 9153317 13130158 13192936
40616 13192936 14985885 21002812 28676554 34149078 35801199 34140324 30458324 26486454
40608 26486454 23406224 19514320 10248418 -7031718 -28156358 -43718417 -46411726 -36716208
40600c6716208J4897748J2050708N511072P47930L65008K856718M441494K072589
40592F227059m329213j1061997j2252994m837054O748690J3166014R721277J570567
40584D952349l023620k649942k415465m885239n877211l32110J0449935J8671106
40576A4889803J6227785K058653j4817588k1387564j3012446J382069R439346
40569e219942Q587700N002332K294067j507000o204357o997115k344179K547797
40561c840697L613295L526688N527014P016743M142668j379989m880931m975454
40553H749337k959660O17044M200194L464323l175940r689764q877889k377102
40545a0049457J448017q77827m132470l084418J49469R5859l711512n591880r10352
$$ plain form
40600 -36716208 -21818460 -9767752 -4256680 -3508750 -3143742 -287024 4154470 6227059
40592 6227059 1897846 -9164151 -21417145 -26254199 -19505509 -6339495 3381782 4952349
40584 4952349 1928729 -721213 -3136678 -8021917 -13899128 -14231238 -3781303 14889803
40576 14889803 31117588 33176241 18358653 -3028911 -16041357 -14659288 -5219942
40569 -5219942 3367758 8370090 10664157 9157157 2952800 -4044315 -6388494 -3840697
40561 -3840697 -227402 3299286 8826300 15843043 19985711 18605722 13724791 8749337
40553 8749337 5789677 6406721 10606915 14071238 10895298 1205534 -7672355 -10049457
40545 -10049457 -8601440 -9479267 -13611737 -16696155 -16546686 -16450827 -20162339 -25754219 -26664571
40536b6664571P174319R898204L072635o372961p506585R53604Q770457P692094
40528b982804J564523j098257q5054k528791j0531162j6327072j1661459J519126
40520d2130950J2129930J1337048K218031l289988J321511Q250558N705504m564300
40512i022656q670552j127380O493110L440659l755491k857732L755281L496324
40504h248437n531423j1953165r231598l424685p61724Q32551M098380O522686
40496b7697415O566519P102556Q319362N439993k184305p940033q337349p817652
40488b6548324q184563l191057Q727804J5872869Q065662o781824j2427173o241964
40480c0708570J81421l37071l312205l655422k476373p76067L637377R342725
$$ plain form
40536 -26664571 -19490252 -9592048 -6519413 -12892374 -20398959 -19445355 -10674898 -2982804
40528 -2982804 -1418281 -2516538 -2601592 -5130383 -15661545 -31988617 -43650076 -42130950
40520 -42130950 -30001020 -18663972 -16445941 -19735929 -18414418 -10163860 -4458356 -9022656
40512 -9022656 -17693208 -18820588 -12327478 -8886819 -12642310 -15500042 -11744761 -8248437
40504 -8248437 -13779860 -25733025 -34964623 -38389308 -39151032 -38318481 -34220101 -27697415
40496 -27697415 -21130896 -14028340 -5708978 -268985 -2453290 -10393323 -18730672 -26548324
40488 -26548324 -34732887 -37923944 -29196140 -13323271 -5257609 -12039433 -24466606 -30708570
40480 -30708570 -30527149 -30864220 -34176425 -37831847 -40308220 -41084287 -37446910 -28104185
40472b8104185R706749K651939m258446l184593M003011R078500P286687M58549
40464b361789o629257r695109o764311O71408Q814862J4312508J4813287Q597231
40456B1758830k421719j0441762q308338Q88639O544769M521377K039509N462991
40448B0044296R980643P466039l60016m414842j847028O66383k199405p012668
40440B2323402p743311m345689j110405Q41418M498453R938280J0571474M43846
40432C5417468j5253602k1933654j1486425O491804J4801589Q920161L34014j281250
40424A6010105m36931n133114j1769482j0528184j946553L127747L48835k120663
40416a2448240K179166P373756N261653j136539k394461K739743O200930L210197
$$ plain form
40472 -28104185 -18397436 -15745497 -20003943 -23188536 -19185525 -10107025 -2820338 -2361789
40464 -2361789 -8991046 -18686155 -25450466 -24779058 -15964196 -1651688 13161599 21758830
40456 21758830 19337111 8895349 587011 1475650 8020419 12541796 14581305 20044296
40448 20044296 30024939 37490978 37130962 32716120 30869092 31535475 29336070 22323402
40440 22323402 14580091 10234402 9123997 9965415 14463868 24402148 34973622 35417468
40432 35417468 20163866 -1769788 -13256213 -6764409 8037180 16957341 17291355 16010105
40424 16010105 15573174 10440060 -1329422 -11857606 -13804159 -10676412 -10327577 -12448240
40416 -12448240 -10269074 -2895318 2366335 1229796 -1164665 1575078 7776008 10986205
40408A0986205j824867l529338l195418m749417p431993p026548k790030Q86299
40400a8675107L44307k242979j251045N387197J2719517J3076496M069408p880226
40392E547568j2608419n797931N934989J0623800L492128o623311o633991M296720
40384a768447J2262690N984183q112144j4683070j0030562m553839m948524n101275
40376c0950988Q87235O739873L474589n686742r296951l256586N903974J1113323
40368b1072273J0566231N365220j212078l719006r80813l60933p686210j5600531
40360c4700393j2032529J091728R031349M712640l594457o908427n751255k574185
40352e0725529L274601Q004597L892036n684372n174032R495149J9530974Q936118
$$ plain form
40408 10986205 9161338 5632000 2436582 -2312835 -9744828 -16771376 -19561406 -18675107
40400 -18675107 -18330800 -20573779 -21824824 -16437627 -3718110 9358386 13427794 5547568
40392 5547568 -7060851 -12858782 -6923793 3700007 7192135 568824 -6065167 -1768447
40384 -1768447 10494243 16478426 8366282 -6316788 -16347350 -20901189 -25849713 -30950988
40376 -30950988 -30063753 -23323880 -19849291 -25536033 -34832984 -38089570 -32185596 -21072273
40368 -21072273 -10506042 -5140822 -6352900 -10071906 -11052719 -11413652 -19099862 -34700393
40360 -34700393 -46732922 -45641194 -36609845 -31897205 -35491662 -42400089 -48151344 -50725529
40352 -50725529 -47450928 -39446331 -35554295 -41238667 -46412699 -36917550 -17386576 -8450458
40344h450458r800062j2291283L228022J6138476J4168966N302622p69958n020945
40336B505380r127415q528017j653866N256187P819756Q320156P120511k72877
40328A1439815j2927473k1178986j8955209j0962662l461071K937031P277893
40321d5830662N807728J189359L218065J2870479J6325895M384716j1709028j5002489
40313b8745937n587569L437968O486448Q666433J2130726J2704242R559791O760703
40305B5412805M739324J66851n463278o887881n249607p231450j2458734j1880019
40297a8851989k165718P393349P487241J211837j762249J665856O373705P356846
40289H708878M585969N83230l251086p246478j1170819j2009968o326613L634950
$$ plain form
40344 -8450458 -18250520 -30541803 -27313781 -11175305 2993661 8296283 7526325 2505380
40336 2505380 -6622035 -15150052 -16803918 -11547731 -3727975 4592181 11712692 11439815
40328 11439815 -1487658 -22666644 -41621853 -52584515 -56045586 -53108555 -45830662
40321 -45830662 -40022934 -38833575 -35615510 -22745031 -6419136 -2034420 -13743448 -28745937
40313 -28745937 -34333506 -30895538 -24409090 -15742657 -3611931 9092311 18652102 25412805
40305 25412805 30152129 30318980 24855702 17967821 12718214 5486764 -6971970 -18851989
40297 -18851989 -21017707 -13624358 -6137117 -4925280 -6687529 -5021673 1352032 8708878
40289 8708878 13294847 13878077 10626991 3380513 -7790306 -19800274 -26126887 -22491937
40281b2491937R574941O645609K73899j421505J212928K269465J155195J800054
40273i81351K779146j183620p279804n619419M555681J0801290N268453l593274
40265D747102m616569q2101J109038j032982j11962L241655K163062l908428p881010
40256f372195o010318j356574L425918P846593Q278813P42743r641569j1892648
40248a4979237m670997J126166q86238l499546K61761M445577R75969m750822
40240b1977367j277313J0125357J6747109J3367803P522743M533601n06419j1189041
40232A7346473k0522804k0000712j0733330O44390J0547576J6559284J4009575
40225G850452L009500o393833n511852L96328N46898m023594l503904J972915
$$ plain form
40281 -22491937 -12916996 -6271387 -5997488 -7418993 -6206065 -3936600 -2781405 -981351
40273 -981351 1797795 614175 -6665629 -12285048 -7729367 3071923 8340376 4747102
40265 4747102 130533 48432 1157470 124488 12526 3254181 5417243 1508815 -6372195
40256 -6372195 -12382513 -13739087 -10313169 -2466576 5812237 6554980 -3086589 -14979237
40248 -14979237 -19650234 -18524068 -19410306 -22909852 -22648091 -18202514 -17226545 -21977367
40240 -21977367 -23254680 -13129323 3617786 16985589 24508332 29041933 28535514 17346473
40232 17346473 -3176331 -23177043 -33910373 -33265983 -22718407 -6159123 7850452
40225 7850452 10859952 4466119 -1045733 -649405 -102507 -4126101 -7630005 -5657090
40217e657090R37597r303049j5039073n729240R812172J5912154J0550048L549702
40209E033221L74512j513809l301124k300551J305094L169445J015400l247959
40201E34229p138204q544955m863251L189941Q647355N330977l336121q267656
40193a4447685n953884j36329N177010P452734L320795o498929j1803984l002903
40185b5893175J3209869J9211340R408180l069134n918904k596711j990386l800700
40177a439621k719130N58735J573248L55514k62826m62486j044760L31068M227863
40168A117605N559695J232294l387784k728991k52844j116525j264358N479964
40160D639056J3489685J0905435k014968j2212577j2229919p717560m598517p04236
$$ plain form
40217 -5657090 -4719493 -14022542 -29061615 -34790855 -24978683 -9066529 1483519 5033221
40209 5033221 5407733 3893924 592800 -1707751 -402657 2766788 3782188 534229
40201 534229 -6603975 -15148930 -20012181 -16822240 -8174885 -2843908 -6180029 -14447685
40193 -14447685 -20401569 -20537898 -15360888 -7908154 -4587359 -11086288 -22890272 -25893175
40185 -25893175 -12683306 6528034 15936214 12867080 6948176 4351465 2361079 -1439621
40177 -1439621 -4158751 -3600016 -2026768 -1671254 -1934080 -2396566 -3441326 -3110258 1117605
40168 1117605 6677300 7909594 4521810 1792819 1539975 423450 -840908 4639056
40160 4639056 18128741 29034176 27019208 14806631 2576712 -5140848 -9739365 -10443601
40152a0443601N113760O356056j269037j0898882j2891702p135748q34885J624878
40144c0379161R20730j178102k531158n97956L545537M570911P61648j741901
40136b6629452J900034O233272L038818n198210p873919j413885O604231R257835
40128a4081276Q108789O816477M444210m11852m329577l064478K414099P946234
40120G842626J1304536J1715461P752279L72850m793339l663039l65840j874048
40112B8291486p122671q254466l109540R56321j438223n185243k798331L919646
40104E258979O821464L466158l33213N75798N067345R585956J2317292J1889536
40096E4649315O562345k320378r028742q894365m063955j604524n966546j4178025
$$ plain form
40152 -10443601 -5329841 1026215 -242822 -11141704 -24033406 -31169154 -32004039 -30379161
40144 -30379161 -29458431 -30636533 -33167691 -33765647 -30220110 -25649199 -24887551 -26629452
40136 -26629452 -24729418 -18496146 -15457328 -20655538 -28529457 -29943342 -23339111 -14081276
40128 -14081276 -5972487 843990 5288200 4876348 546771 -2517707 -103608 7842626
40120 7842626 19147162 30862623 38614902 38987752 34194413 30531374 30165534 28291486
40112 28291486 21168815 12914349 9804809 10761130 9322907 4137664 1339333 5258979
40104 5258979 12080443 15546601 15213388 15789186 20856531 30442487 42759779 54649315
40096 54649315 61211660 58891282 49862540 40968175 36904220 35299696 29333150 15155125
40088A5155125j8360348j3108220j051260R209657J1225878N739766k680662j0851780
40080d721844j6312044j5197838o378720L784036P046553L872130K496054O574061
40072a8837612J0186212P481438J226721j928569J03515M842545R324907J0399952
40064B2799109N126138m737178j1832303j0801598m163633K210035N721985O087010
40056A0409565K475896l952270q724078r625992r460873r232074m350436O551385
40048b5908877J5024789J2881705M102021j728340l380508n883264q638874p033286
40040b0564634l453129m366599p221538l270392N699939P368063j063118o814177
40032c3685585j723386M714378J679910m795534j848949R446207J5800922J0688319
$$ plain form
40088 15155125 -3205223 -16313443 -17364703 -8155046 3070832 8810598 6129936 -4721844
40080 -4721844 -21033888 -36231726 -42610446 -38826410 -31779857 -27907727 -25411673 -18837612
40072 -18837612 -8651400 -1169962 56759 -1871810 -1768295 3074250 12399157 22799109
40064 22799109 27925247 23188069 11355766 554168 -3609465 -1399430 4322555 10409565
40056 10409565 12885461 8933191 209113 -9416879 -18877752 -28109826 -32460262 -25908877
40048 -25908877 -10884088 1997617 6099638 4371298 990790 -4892474 -13531348 -20564634
40040 -20564634 -24017763 -28384362 -35605900 -38876292 -33176353 -25808290 -26871408 -33685585
40032 -33685585 -35408971 -30694593 -29014683 -33810217 -35659166 -26212959 -10412037 276282
40024B76282P61395n308678n346013j287734M069082O980013M749914j084040
40016C810221o165665p089704k378326O692174J3744269J0930173n60135q541365
40008A0441642m124085O358078J0046111M117957l605625p238065p778759p285847
40000I31407o198343o096315q216239r501402o286446j058298P08320p63665o99577
39991c7180558J856162M199401O924555J2023871J4972105Q913669k406664o719541
39983B583000j019870L623075j30517m081608J592180J1326344J1406473m16025
39975B4883052j2275214j3503552m976553N086401R418066N983997j131664n047024
39967H437509l387041j000419k621305n604108m186210J404090N144243L331102
$$ plain form
40024 276282 1037677 -4271001 -9617014 -10904748 -6835666 144347 4894261 3810221
40016 3810221 -2355444 -9445148 -11823474 -5131300 8612969 19543142 18983007 10441642
40008 10441642 6317557 12675635 22721746 26839703 23234078 15996013 8217254 931407
40000 931407 -5266936 -11363251 -19579490 -29080892 -35367338 -36425636 -35717316 -36480981 -37180558
39991 -37180558 -35324396 -31124995 -24200440 -12176569 2795536 11709205 9302541 2583000
39983 2583000 1563130 5186205 5055688 974080 2566260 13892604 25299077 24883052
39975 24883052 12607838 -895714 -5872267 -785866 8632200 14616197 13484533 8437509
39967 8437509 5050468 4050049 1428744 -4175364 -8361574 -6957484 -1813241 1517861
39959A517861k050584p284716j0102335r419505n568422n96942M008760Q471378
39951b1024505J1539276R477312J978297m464254m243619n63734L00130n54284
39943g555381K340619P701384Q836272N810738N990554J0421708J0091540M32199
39935D4069633r773171j0592850m533532n64853q83870j776194k527981m497966
39927H919216m844878l38066M790890L777262j441914l124274q01685j176724
39919E759827m598244l126950M732743Q645304J894622p276239p614825o36449
39911b220211M159956L668899J076553l943871j3624510k2213770j9179641m595630
39903e6872225P805549P246019o57069j792059Q686548K0769314K0931741P024648
$$ plain form
39959 1517861 -532723 -7817439 -17919774 -27339279 -32907701 -33504643 -29495883 -21024505
39951 -21024505 -9485229 -7917 1970380 -2493874 -6737493 -7301227 -7001097 -7555381
39943 -7555381 -5214762 2486622 11322894 17133632 23124186 33545894 43637434 44069633
39935 44069633 34296462 23703612 19170080 18605227 17721357 15945163 13417182 8919216
39927 8919216 4074338 3736272 8527162 12304424 10862510 7738236 6936551 5759827
39919 5759827 1161583 -1965367 2767376 11412680 13307302 6031063 -1583762 -2220211
39911 -2220211 1939745 5608644 6685197 2741326 -10883184 -33096954 -52276595 -56872225
39903 -56872225 -49066676 -41820657 -42477726 -44269785 -35583237 -14813923 6117818 13142466
39895A3142466q688140j2339486m142287K567390m40661n499955k125765N804295
39887a1722143O153808j999096p462261m994779j224367n29912J386173N120497
39879a5272080K646736p165743j1136090j252020R553228N408745o947947p258130
39871c1423301P737386K0032785J6681195M516754m344800p436360p243066l907889
39863e387296O17559Q77396k971596k753439M645665J0061195N223246m390618
39855E922112q246047n915126m162336l712899N56724Q196037J1881535Q059301
39847A2579301J144091l799194o098796o593666n960619o646665j0180002j1698187
39839c7253737m414099Q175420J2531451K669970r483592r219814M18575L778668
$$ plain form
39895 13142466 4454326 -7885160 -12027447 -9460057 -9900718 -15400673 -17526438 -11722143
39887 -11722143 -5568335 -7567431 -15029692 -20024471 -21248838 -21778750 -20392577 -15272080
39879 -15272080 -12625344 -19791087 -30927177 -32179197 -22625969 -17217224 -24165171 -31423301
39871 -31423301 -23685915 -3653130 13028065 17544819 13200019 5763659 -1479407 -5387296
39863 -5387296 -4769737 -3892341 -6863937 -9617376 -4971711 5089484 10312730 5922112
39855 5922112 -2323935 -8239061 -12401397 -16114296 -15557572 -7361535 4520000 12579301
39847 12579301 13723392 9924198 3825402 -2768264 -8728883 -15375548 -25555550 -37253737
39839 -37253737 -41667836 -33492416 -20960965 -18290995 -27774587 -36994401 -36575826 -32797158
39831c2797158l150604o415156L409114J4475348J0595653k668048m593606Q757638
39823a2386819J6412542L256867j6081016j7475622j416349J0027423N841311
39816a1821663k776779m925200n255165r918605j3092347q520299k709487l995547
39808f3015092p109708k207072O762913P296471p89244m200752L537418J3611127
39800d6113939J6316333J2443576O443913j147938q723180r875888j935781P655249
39792b4937655J0172765O548855L671248L629180K885222k44783l248311l759729
39784e283208j791960J743627N087656M962989m61718p908154j1182374p499531
39776b2332673K5549O000482P385712M817951O59333l944110r607693j5199209
$$ plain form
39831 -32797158 -35947762 -42362918 -38953804 -24478456 -13882803 -16550851 -21144457 -12386819
39823 -12386819 4025723 7282590 -8798426 -26274048 -27690397 -17662974 -11821663
39816 -11821663 -14598442 -19523642 -24778807 -34697412 -47789759 -56310058 -59019545 -63015092
39808 -63015092 -70124800 -72331872 -65568959 -58272488 -59061732 -63262484 -59725066 -46113939
39800 -46113939 -29797606 -17354030 -10910117 -12058055 -20781235 -30657123 -32592904 -24937655
39792 -24937655 -14764890 -8216035 -4544787 -915607 1969615 1724832 -1523479 -5283208
39784 -5283208 -7075168 -5331541 -243885 4719104 4257386 -3650768 -14833142 -22332673
39776 -22332673 -22307124 -16306642 -8920930 -4102979 -3443646 -7387756 -16995449 -32194658
39768c2194658j5128776m412570J2152168K0490060J1484965p081166j7422447
39761c2112424j0721411M397310J3128457J0593292M008530J105931J368930N51767
39753g679618m24113K996368R156098R316386M71151p445972m385571M228853
39745F233582M533015m698699r544012j968944P923770O939147l014314j0027157
39737c623612q805021l378951J683746L694175m12598r211622j3013270n182999
39729c8250152N495247N364676k876502l280018P898110J5220440Q218559k094219
39721d303859r65508P617015R389711K880034q37331J832531J817485o424998
39713A1005080j5239512j4220768k783120J0715120J6924859J1414477j658977
$$ plain form
39768 -32194658 -47323434 -51736004 -39583836 -19093776 -7608811 -14689977 -32112424
39761 -32112424 -42833835 -38436525 -25308068 -14714776 -10706246 -9600315 -8231385 -7679618
39753 -7679618 -8103731 -5107363 4048735 13365121 13836272 6390300 2004729 6233582
39745 6233582 10766597 6067898 -3476114 -5445058 2478712 9417859 6403545 -3623612
39737 -3623612 -12428633 -15807584 -14123838 -10429663 -10842261 -20053883 -33067153 -38250152
39729 -38250152 -32754905 -27390229 -30266731 -33546749 -25648639 -10428199 -2209640 -4303859
39721 -4303859 -5269367 2347648 11737359 14617393 13780062 15612593 17430078 11005080
39713 11005080 -4234432 -18455200 -21238320 -10523200 6401659 17816136 16157159
39706A6157159j1074628r483071k803825k181087p244871o450772M502562J4692319
39698c886214J2902887K057851o903434q522404m440482J930888O161656M120067
39690C420815j290834o20112Q575666J5260493R520183l228255j1594232j4552818
39682E490906j6985632j5751638n378456O142050M612303o995832r833217K552588
39674c6146928J4153280J1289640J519633j569340J870711M796634P212660J0195690
39666A3321980P178354m073519j0554214j809776R452303L883672j2573736j5333943
39658a0508879N09981J1648284K327315j2672372j2374577K51238P665355N417977
39650g735678L790926P908940J1660335R912362M527433k047197r437438j4685048
$$ plain form
39706 16157159 5082531 -4400540 -7204365 -9385452 -16630323 -23081095 -18578533 -3886214
39698 -3886214 9016673 11074524 4171090 -4351314 -8791796 -6860908 -699252 3420815
39690 3420815 2129981 1509869 10085535 25346028 34866211 31637956 20043724 5490906
39682 5490906 -11494726 -27246364 -32624820 -26482770 -21870467 -28866299 -38699516 -36146928
39674 -36146928 -21993648 -10704008 -9184375 -10753715 -8883004 -4086370 3126290 13321980
39666 13321980 20500334 16426815 5872601 4062825 13515128 17398800 4825064 -10508879
39658 -10508879 -9998898 1649386 3976701 -8695671 -21070248 -20819010 -13153655 -7735678
39650 -7735678 -3944752 3964188 15624523 25536885 30064318 28017121 18579683 3894635
39642C894635j3095792n545563J129807K716595J964379L001500N173988M275719
39634C515268j554532p863450o530620M954430J7049347J6408961K737241q884517
39626A9832128o833546K325057M486667k544123r345613j0689105j0157889r559858
39618b2486282m533227O311550J5912926J6529204Q195833k854027r952141r237765
39610b113929k183234L949940K901019k771315n508099l698340j979363r38744
39602a2342065M320328J3141114J6390959R333644p66213n452834n835604o270697
39594A2518632n136078k85332K817786j630181q609753q323684o37472O011611
39586c274471P739874P293841M918353j607751p993813o329119J214822L270945
$$ plain form
39642 3894635 -9201157 -14746720 -13616913 -10900318 -8935939 -5934439 -760451 3515268
39634 3515268 1960736 -5902714 -12433334 -7478904 9570443 25979404 28716645 19832128
39626 19832128 12998582 15323639 19810306 17266183 7920570 -2768535 -12926424 -22486282
39618 -22486282 -27019509 -20707959 -4795033 11734171 19930004 17075977 7123836 -2113929
39610 -2113929 -4297163 -347223 2553796 -217519 -5725618 -9423958 -11403321 -12342065
39602 -12342065 -8021737 5119377 21510336 30843980 30077767 24624933 18789329 12518632
39594 12518632 7382554 7097222 9915008 8284827 -324926 -8648610 -9286082 -3274471
39586 -3274471 4465403 11759244 16677597 15069846 7076033 746914 1961736 5232681
39578E232681k766956n656664J219874Q207550M914950k958357l829064L66385
39570D730399j501579r781022j2235823k600609J0834951J7640917J6604035J1578106
39562C5269375M599897k507573o389373o625244p161239r935386j1687805r789073
39554a4226421o071893k081575L583233R481383R226069O90599q059715q679266
39546a6137586m271439l950331q645532j0458240n355544J395677L934035L730474
39538c9758486O091488J2421873J8222580J7279614P839351l843870p826639j126126
39530I299785P897353R069796J775930p158001j3364412j6523566j5021218p206434
39522c1230767K752596Q182431R065271J0189633J0721770N310704l522357n297478
$$ plain form
39578 5232681 2465725 -3190939 -1971065 6236485 11151435 8193078 4364014 4730399
39570 4730399 3228820 -6552202 -18788025 -21388634 -10553683 7087234 23691269 35269375
39562 35269375 39869272 37361699 30972326 24347082 17185843 7250457 -4437348 -14226421
39554 -14226421 -20298314 -22379889 -18796656 -9315273 -89204 601395 -7458320 -16137586
39546 -16137586 -20409025 -24359356 -33004888 -43463128 -48818672 -47422995 -43488960 -39758486
39538 -39758486 -33666998 -21245125 -3022545 14257069 22096420 18252550 10425911 9299785
39530 9299785 17197138 26266934 28042864 20884863 7520451 -9003115 -24024333 -31230767
39522 -31230767 -28478171 -20295740 -11230469 -1040836 9680934 14991638 11469281 6171803
39514F171803K472539R057839O703582J625548J665761L064217r47717o921068
39506B2892504p596351m795479m258919l335114L226467R436880M550569q107130
39498A2013427j3576114p497149j359815k471499l467793J750074N242668j513549
39490a0879750j1166735r425944M472962J6620161J5699513L676074r142424j3327400
39482a3473543o094247O354839J2886540Q001852k531587r052039q098854k372282
39474a4379321M726451R588525P737597p19990p639948n502547K177436N559416
39466A547619K076474j855925k186254k298890m988932o527709k604918M377142
39458a2461393P825568M552552k174575n400990j86450J0350119J5126874O234706
$$ plain form
39514 6171803 8644342 17702181 24405763 26031311 27697072 30761289 29813572 22892504
39506 22892504 15296153 10500674 6241755 2906641 6133108 15569988 20120557 12013427
39498 12013427 -1562687 -9059836 -10419651 -12891150 -16358943 -14608869 -9366201 -10879750
39490 -10879750 -22046485 -31472429 -26999467 -10379306 5320207 8996281 -146143 -13473543
39482 -13473543 -19567790 -13212951 -326411 7675441 5143854 -3908185 -12007039 -14379321
39474 -14379321 -9652870 -64345 7673252 6953262 -686686 -6189233 -4011797 1547619
39466 1547619 3624093 1768168 -418086 -2716976 -7705908 -14233617 -16838535 -12461393
39458 -12461393 -4635825 -83273 -2257848 -7658838 -7845288 2504831 17631705 23866411
39450B3866411r368600j5374081n747197P391272R590836J529263n764135p669667
39442a545898q407550r056813m550077M933090R847482M626132k533125j132374
39434g819133N763939O407702j832687r583568r892083n463218j72972O097179
39426a6494841J0623716O795303l600812p369213J594192J0134583M197606q675123
39418b794589j0688444k228621J25767o637011n743874R437338J9799250Q197982
39410I467798j2902524j8521400n737679O831444Q329020N880701O398466N585242
39402E331068o59348o911500o461778p26922M170708M541547N10185m566919n407568
39393a0180527q52419K376386j568058p370934n782739J022607K600413k071268
$$ plain form
39450 23866411 14497811 -876270 -6623467 767805 10358641 11887904 6123769 -1545898
39442 -1545898 -9953448 -19010261 -23560338 -18627248 -8779766 -4153634 -6686759 -7819133
39434 -7819133 -2055194 4352508 2519821 -7063747 -16955830 -22419048 -22592020 -16494841
39426 -16494841 -5871125 924178 -2676634 -10045847 -8451655 1682928 5880534 -2794589
39418 -2794589 -13483033 -15711654 -15585887 -22222898 -27966772 -18529434 1269816 9467798
39410 9467798 -3434726 -21956126 -27693805 -20862361 -12533341 -6652640 -254174 5331068
39402 5331068 4671720 -2239780 -8701558 -9428480 -5257772 -716225 -206040 -4772959 -10180527
39393 -10180527 -11032946 -8656560 -10224618 -17595552 -23378291 -22355684 -19755271 -21826539
39385b1826539l534822O7207p41210p363839o188027R014064K2106182J6022283
39377G555299j388548q767487j476972O123386M656866j169979o824855j3969400
39369a5261690j8772002j0390666J1054618K7573849K4282556Q572239j536844
39362B5522060j256720q4208l296189n264187k189354j18921m748970j0673643
39354b110132q360281J447807Q054556N716636J152953K838835Q254448P800361
39346B4795183j073282j0436775j2685203q508148k709774J674451K572978j251044
39338g621614n433951j758748R337537J4438842L837639j2569787j6859981p589764
39330b4219827n5736k085298l822661L614055J2635545J1569311K730952l051796
$$ plain form
39385 -21826539 -25361361 -25294154 -26035364 -33399203 -39587230 -30573166 -8466984 7555299
39377 7555299 6166751 -2600736 -4077708 2045678 6702544 5532565 -1292290 -15261690
39369 -15261690 -34033692 -44424358 -33369740 -5795891 18486665 27058904 25522060
39362 25522060 24265340 24181132 20884943 15620756 13431402 13312481 8563511 -2110132
39354 -2110132 -10470413 -9022606 -968050 4748586 5901539 8740374 16994822 24795183
39346 24795183 23721901 13285126 599923 -7908225 -10617999 -8943548 -6370570 -7621614
39338 -7621614 -13055565 -14814313 -5476776 8962066 12799705 229918 -16630063 -24219827
39330 -24219827 -24275563 -26360861 -30183522 -26569467 -13933922 -2364611 366341 -2685455
39322b685455l536610m926810q288476p954375k595218K826916O386866J0122026
39314a0651136J0896603K269338j0811180j1556819O202105K4804823K2951439
39307C4105173L038728j3276338j3211509m028551L055782O434384P764769M256085
39299B8138523m740117j1588582r743750m273048m652045j0677051j4071990j1697200
39291d3305260p985848m886589R33516Q923497J1724291N931688j029596l13295
39283c0007596O784399J2114326J1963487R291932O742826L256836k148397p400748
39275A0597065r391295p142292k662912O13151J126285J394502M982428J0651234
39267A0168166J2468909P106537k199682j0431979j5224425j4265917m279049
$$ plain form
39322 -2685455 -6222065 -11148875 -19437351 -27391726 -29986944 -27160028 -20773162 -10651136
39314 -10651136 245467 2514805 -8296375 -19853194 -13651089 11153734 34105173
39307 34105173 37143901 23867563 10656054 6627503 9683285 16117669 23882438 28138523
39299 28138523 23398406 11809824 2066074 -2206974 -6859019 -17536070 -31608060 -43305260
39291 -43305260 -51291108 -56177697 -55244181 -46320684 -34596393 -28664705 -29694301 -30007596
39283 -30007596 -23223197 -11108871 854616 10146548 16889374 20146210 17997813 10597065
39275 10597065 1205770 -5936522 -8599434 -7986283 -6859998 -5465496 -483068 10168166
39267 10168166 22637075 29743612 27543930 17111951 1887526 -12378391 -16657440
39260a6657440J1921125K2260104J7154482K252545q280730r941401j0656538
39253H052147j4980983j5734970o370900O191197Q954010l88642j1192769j3328965
39245c8799875o847802K136727R425422J3747945J3681658Q263857K46153n175699
39237c321614o250200o285285p266217n377552K413246R847518P084190m300845
39229a3456759j0431147l386640P297260Q039918l02047o185583m966278k122528
39221b5513804r72596J464378N540107O576845M031202L394485N420462K994936
$$ plain form
39260 -16657440 -4736315 17523789 34678271 36930816 28650086 18708685 8052147
39253 8052147 -6928836 -22663806 -29034706 -22843509 -13889499 -14278141 -25470910 -38799875
39245 -38799875 -45647677 -43510950 -34085528 -20337583 -6655925 1607932 1854085 -3321614
39237 -3321614 -9571814 -15857099 -23123316 -28500868 -26087622 -16240104 -9155914 -13456759
39229 -13456759 -23887906 -27274546 -19977286 -11937368 -12239415 -18424998 -23391276 -25513804
39221 -25513804 -26486400 -25022022 -19481915 -12905070 -8873868 -5479383 -58921 2936015
$$ [...]
##END NTUPLES=NMR SPECTRUM
##END=
