##TITLE=31Pdec_LR-691-R2-CRB-C1
 CDCl3, 64 sc
 6.9.2024
##JCAMPDX= 6.0         $$ Bruker NMR JCAMP-DX V2.0
##DATA TYPE= NMR SPECTRUM
##DATA CLASS= NTUPLES
##ORIGIN= UXNMR, Bruker Analytische Messtechnik GmbH
##OWNER= root
$$ XWIN-NMR		Version 3.5
$$ Fri Sep  6 15:46:02 2024 Russian Standard Time (UT+4h)  she@DPX200
##.OBSERVE FREQUENCY= 81.013821
##.OBSERVE NUCLEUS= ^31P
##.ACQUISITION MODE= SIMULTANEOUS
##.ACQUISITION SCHEME= undefined
##.AVERAGES= 64
##.DIGITISER RES= 17
##SPECTROMETER/DATA SYSTEM= spect
##.PULSE SEQUENCE= zgpg30
##.SOLVENT NAME= CDCl3
##.SHIFT REFERENCE= (INTERNAL, CDCl3, 0, 198.062)
##AUDIT TRAIL= $$ (NUMBER, WHEN, WHO, WHERE, WHAT)
$$ ##TITLE= Audit trail, XWIN-NMR		Version 3.5
$$ ##JCAMPDX= 5.01
$$ ##ORIGIN= Bruker BioSpin GmbH
$$ ##OWNER= she
$$ F:/spectra/data/she/nmr/P31/2/pdata/1/auditp.txt
$$ ##AUDIT TRAIL=  $$ (NUMBER, WHEN, WHO, WHERE, WHAT)
(   1,<2024-09-06 15:45:01.81 +0400>,<she>,<DPX200>,
      <continue with go, POWCHK disabled, PULCHK disabled
       configuration hash MD5:
       00 E9 B6 7A A2 85 ED C7 34 08 36 98 17 FE 4E 26
       data hash MD5: 32K
       36 3E F0 9B 60 EE 76 47 62 AE 4C FB A7 D8 45 36>)
(   2,<2024-09-06 15:45:03.68 +0400>,<she>,<DPX200>,
      <Start of raw data processing
       efp BC_mod = 2 LB = 1.5 FT_mod = 6 PKNL = 1 PHC0 = 2677.036 PHC1 = 63.68747 SI = 64K 
       data hash MD5: 64K
       C4 F1 DF 56 87 D5 14 CC 00 96 71 01 60 37 54 28>)
(   3,<2024-09-06 15:45:19.96 +0400>,<she>,<DPX200>,
      <pk PHC0 = 16.96568 PHC1 = 0 
       data hash MD5: 64K
       9A 27 67 55 E8 3F E6 FB 14 B7 69 83 E1 E1 92 DE>)
(   4,<2024-09-06 15:45:26.09 +0400>,<she>,<DPX200>,
      <abs ABSG = 5 
       data hash MD5: 64K
       1E 1C 25 61 78 C4 40 23 A7 CE 6F 12 4F 08 58 07>)
$$ ##END=
$$ 
$$ hash MD5
$$ 27 61 49 6B 6B 25 B8 9C E8 F5 50 DB FB CE E7 2C
##$RELAX= 
##$RELAX= 
##$RELAX= 
##$RELAX= 
##$RELAX= 
##$RELAX= 
##$RELAX= 
##$RELAX= 
$$ Bruker specific parameters
$$ --------------------------
##$DU= <F:/spectra>
##$EXPNO= 2
##$NAME= <P31>
##$PROCNO= 1
##$TYPE= <nmr>
##$USER= <she>
##$AMP= (0..31)
100 100 100 100 100 100 100 100 100 100 100 100 100 100 100 100 100 100 
100 100 100 100 100 100 100 100 100 100 100 100 100 100 
##$AQSEQ= 0
##$AQ_mod= 1
##$AUNM= <au_zg>
##$AUTOPOS= <>
##$BF1= 81.014009
##$BF2= 200.13
##$BF3= 200.13
##$BF4= 200.13
##$BF5= 200.13
##$BF6= 200.13
##$BF7= 200.13
##$BF8= 200.13
##$BYTORDA= 1
##$CFDGTYP= 0
##$CFRGTYP= 5
##$CHEMSTR= <none>
##$CNST= (0..31)
1 1 145 1 1 1 1 1 1 1 1 1 1 1 1 1 1 1 1 1 1 1 1 1 1 1 1 1 1 1 1 1 
##$CPDPRG= <waltz16>
##$CPDPRG1= <>
##$CPDPRG2= <waltz16>
##$CPDPRG3= <>
##$CPDPRG4= <mlev>
##$CPDPRG5= <mlev>
##$CPDPRG6= <mlev>
##$CPDPRG7= <mlev>
##$CPDPRG8= <mlev>
##$CPDPRGB= <>
##$CPDPRGT= <>
##$D= (0..31)
0 1 0 0 0 0 0 0 0 0.06 0 0.03 2e-05 3e-06 0 0 0.0002 0 0 0 0 0 0 0 0 0 
0 0 0 0 0 0 
##$DATE= 1725623021
##$DBL= (0..7)
120 120 120 11 120 120 24 19 
##$DBP= (0..7)
150 150 150 150 150 150 150 150 
##$DBP07= 0
##$DBPNAM0= <>
##$DBPNAM1= <>
$$ [...]
##$SUBNAM3= <"">
##$SUBNAM4= <"">
##$SUBNAM5= <"">
##$SUBNAM6= <"">
##$SUBNAM7= <"">
##$SUBNAM8= <"">
##$SUBNAM9= <"">
##$SW= 400.765351723535
##$SWIBOX= (0..15)
0 1 3 0 0 0 0 0 0 0 0 0 0 0 0 0 
##$SW_h= 32467.5324675325
##$TD= 32768
##$TD0= 1
##$TE= 0
##$TE2= 300
##$TE3= 300
##$TEG= 300
##$TL= (0..7)
0 120 53 12 22 120 120 120 
##$TP= (0..7)
150 150 150 150 150 150 150 150 
##$TP07= 0
##$TPNAME0= <>
##$TPNAME1= <>
##$TPNAME2= <>
##$TPNAME3= <>
##$TPNAME4= <>
##$TPNAME5= <>
##$TPNAME6= <>
##$TPNAME7= <>
##$TPOAL= (0..7)
0.5 0.5 0.5 0.5 0.5 0.5 0.5 0.5 
##$TPOFFS= (0..7)
0 0 0 0 0 0 0 0 
##$TUNHIN= 0
##$TUNHOUT= 0
##$TUNXOUT= 0
##$USERA1= <user>
##$USERA2= <user>
##$USERA3= <user>
##$USERA4= <user>
##$USERA5= <user>
##$V9= 5
##$VALIST= <valist>
##$VCLIST= <CCCCCCCCCCCCCCC>
##$VD= 0
##$VDLIST= <DDDDDDDDDDDDDDD>
##$VPLIST= <PPPPPPPPPPPPPPP>
##$VTLIST= <TTTTTTTTTTTTTTT>
##$WBST= 1024
##$WBSW= 4
##$XGAIN= (0..3)
0 0 0 0 
##$XL= 0
##$YL= 0
##$YMAX_a= 13185
##$YMIN_a= -10998
##$ZGOPTNS= <>
##$ZL1= 120
##$ZL2= 120
##$ZL3= 120
##$ZL4= 120
##$ABSF1= 198.0616
##$ABSF2= -202.7028
##$ABSG= 5
##$ABSL= 3
##$ALPHA= 0
##$AQORDER= 0
##$ASSFAC= 0
##$ASSFACI= 0
##$ASSFACX= 0
##$ASSWID= 0
##$AUNMP= <proc_1d>
##$AZFE= 0.1
##$AZFW= 0.5
##$BCFW= 0
##$BC_mod= 2
##$BYTORDP= 0
##$COROFFS= 0
##$CY= -3
##$DATMOD= 1
##$DC= 0
##$DFILT= <>
##$DTYPP= 0
##$F1P= 0
##$F2P= 0
##$FCOR= 1
##$FTSIZE= 65536
##$FT_mod= 6
##$GAMMA= 0
##$GB= 0
##$INTBC= 1
##$INTSCL= 9.790993e-09
##$ISEN= 30
##$LB= 1.5
##$LEV0= 0
##$LPBIN= 0
##$MAXI= 10000
##$MC2= 0
##$MEAN= 0
##$ME_mod= 0
##$MI= 50
##$NCOEF= 0
##$NC_proc= -9
##$NLEV= 6
##$NOISF1= 182.463
##$NOISF2= 159.3651
##$NSP= 0
##$NTH_PI= 0
##$NZP= 0
##$OFFSET= 198.0616
##$PC= 4
##$PHC0= 2694.001
##$PHC1= 63.68747
##$PH_mod= 1
##$PKNL= yes
##$PPARMOD= 0
##$PSCAL= 0
##$PSIGN= 0
##$REVERSE= no
##$SF= 81.0140089999434
##$SI= 65536
##$SIGF1= 159.3651
##$SIGF2= -187.1042
##$SINO= 113.3802
##$SIOLD= 16384
##$SREGLST= <1H.CDCl3>
##$SSB= 0
##$STSI= 65536
##$STSR= 0
##$SW_p= 32467.5324675325
##$SYMM= 0
##$S_DEV= 0
##$TDeff= 32768
##$TDoff= 0
##$TI= <>
##$TILT= no
##$TM1= 0
##$TM2= 0
##$TOPLEV= 0
##$USERP1= <user>
##$USERP2= <user>
##$USERP3= <user>
##$USERP4= <user>
##$USERP5= <user>
##$WDW= 1
##$XDIM= 65536
##$YMAX_p= 382158752
##$YMIN_p= -222770846
$$ End of Bruker specific parameters
$$ ---------------------------------
##NTUPLES= NMR SPECTRUM
##VAR_NAME=  FREQUENCY,     SPECTRUM/REAL,   SPECTRUM/IMAG
##SYMBOL=    X,             R,               I
##VAR_TYPE=  INDEPENDENT,   DEPENDENT,       DEPENDENT
##VAR_FORM=  AFFN,          ASDF,            ASDF
##VAR_DIM=   65536,         65536,           65536
##UNITS=     HZ,            ARBITRARY UNITS, ARBITRARY UNITS
##FACTOR=    0.49542278885378, 1,            1
##FIRST=     16045.7642231865, 0,            0
##LAST=      -16421.768244346, 0,            0
##MIN=       -16421.768244346, -222770846,   0
##MAX=       16045.7642231865, 382158752,    0
$$ Real data points
##PAGE= N=1
##DATA TABLE= (X++(R..R)), XYDATA
$$ [...]
45914 18913448 18053322 11693777 3752560 -687395 1573114 7728235 10415676 5845010
45906 5845010 -1477589 -4300672 -976204 4012655 6213432 5238277 3269489 1848482
45898 1848482 651275 -1407032 -4225495 -5899809 -4455976 207371 6652981 13044140
45890 13044140 16723482 14510992 6369355 -2203784 -5059070 -2593633 -425313 -779525
45882 -779525 228558 5300532 10680321 11297618 7721605 4469222 3944657 5536934 8454951
45873 8454951 11481889 11493540 6567555 56882 -2560690 -1132329 -1181262 -5698347 -10247356
45864 -10247356 -8792564 -2240995 1960205 -1308926 -8597533 -11773491 -7498119 -1199127
45856 -1199127 -662069 -6808404 -13058287 -13892576 -11296742 -11248357 -16197687 -23400562 -28834242
45847 -28834242 -29653660 -24034505 -12756494 -1495082 2367839 -2518069 -9202473 -10232651
45839 -10232651 -6206868 -4003967 -7296672 -11948839 -11787528 -6475258 -1183361 782379
45831 782379 2073657 6801105 14125626 19020260 18897985 16592133 15859572 16321436 14749278
45822 14749278 10009717 4688028 2199068 3658171 7238111 9578778 8418977 4846411
45814 4846411 2227877 2044625 2126376 451380 -1011758 1064012 5779398 8292977 5969715
45805 5969715 1258674 -2618922 -6201289 -12036883 -19946977 -26217885 -27421691 -23965104
45797 -23965104 -19699798 -18192215 -19233381 -19308917 -15818345 -9913630 -4428906 -730294
45789 -730294 500226 -2389540 -8864763 -12606428 -6882414 5188640 11538080 5669398
45781 5669398 -4716354 -8374348 -5438807 -4974864 -10098513 -13681314 -9624545 -1104442
45773 -1104442 5259675 7691328 7928843 6168800 2023535 -2124805 -3017814 -372089
45765 -372089 4164480 9902358 15672233 17708199 13329992 5780806 1367984 2294048
45757 2294048 5887052 9775219 13028650 12676183 5230031 -6481227 -13407939 -10486463
45749 -10486463 -2748458 2135745 3586831 6005169 10060631 11957835 10596888 9740990
45741 9740990 11659588 12922790 9078840 1036294 -5822321 -7894657 -6720761 -6242553
45733 -6242553 -8147508 -10634421 -11364972 -10511341 -9987471 -10435850 -10915027 -11583550 -14005107
45724 -14005107 -17545309 -18271621 -14034124 -8518810 -6787176 -7901351 -5823213 2278890
45716 2278890 12101930 17359924 15945080 9914806 2072259 -5632316 -11933019 -16217131
45708 -16217131 -18240737 -17530926 -13907438 -8493693 -2995336 1856318 6039008 9271203
45700 9271203 11858910 15031878 17969967 16372345 7979163 -1835022 -5243213 -2432432
45692 -2432432 -829568 -3212541 -3905441 361591 3532977 -155655 -6039455 -6173809
45684 -6173809 -2242524 -2561153 -8345544 -12021158 -9191373 -3647297 1128793 7236263
45676 7236263 15795705 22225126 22771772 20311032 18659242 15810041 8721811 1386653
45668 1386653 1167962 7884445 12571293 8034210 -3627332 -14894408 -20337554 -18843643
45660 -18843643 -11921131 -2738316 4449351 6473420 3529759 -1083292 -3634438 -2750955
45652 -2750955 -143924 1479051 1368805 1031163 1465628 1565317 357299 -481928 1845547
45643 1845547 7712873 14412462 18418802 17163979 10064229 177905 -6186561 -4830122
45635 -4830122 1074552 3980602 863597 -3760424 -4608462 -2007081 602640 2319827
45627 2319827 4397435 6077505 4856601 571421 -4217877 -8096246 -11874035 -15280896
45619 -15280896 -15802859 -12122838 -6032950 530391 7626641 14465335 17147144 12596361
45611 12596361 3569604 -3375400 -4675891 -2318764 -252953 -758107 -3905778 -7758849
45603 -7758849 -8938975 -5629540 -360369 2683140 3239229 4748494 8070474 9373740
45595 9373740 6259472 2332523 2458537 6126143 9196129 10281085 11154193 11835998 9988188
45586 9988188 5777568 3271851 5398832 10420971 14828396 16957558 16170901 11585275
45578 11585275 4530348 46134 2118228 7957746 10467446 6823804 1588107 244505
45570 244505 2574778 4552861 4363828 3180224 1220719 -2641111 -6728968 -6462135 -1072956
45561 -1072956 3076931 74521 -6697860 -8234181 -1785939 6260165 10056266 11115480
45553 11115480 12991745 14601593 13280779 10406711 8562607 5893155 -695223 -8271624
45545 -8271624 -10362262 -6727568 -4247824 -6638621 -9360532 -7605957 -4055381 -4464175
45537 -4464175 -9086603 -12834857 -11787188 -5853146 3047820 11585044 15211890 11881616
45529 11881616 5352517 1551711 1777557 2369581 734950 -1699381 -2825624 -2643073
45521 -2643073 -1510607 1260460 4999587 6218968 2325691 -4232207 -8101340 -7195886
45513 -7195886 -4634386 -4238554 -6233340 -8608413 -10965516 -14599435 -19049996 -21091591
45505 -21091591 -18297786 -12059851 -5760061 -1251079 1299229 1445869 -1173530 -5062419
45497 -5062419 -8069251 -10338308 -13285609 -15290537 -11861364 -1931159 8884440 14143793
45489 14143793 13918302 13280599 14583809 14725617 10320320 2459113 -5052289 -10009631
45481 -10009631 -12426961 -12107652 -8145778 -1384433 4434311 5752746 3234874 1194308
45473 1194308 2531360 5683333 7560530 7844452 8280146 8767919 7159578 3302150 627449
45464 627449 2405583 7942118 13416805 15324638 12838809 8508293 6996963 11071215
45456 11071215 18051987 22052764 20287854 15207138 10240831 6314078 3117618 183233
45448 183233 -4697383 -14001044 -24784379 -28492835 -20606725 -7814070 -1211312 -4063233
45440 -4063233 -10316116 -13610753 -13310638 -12498449 -14359730 -20174537 -26875167 -27060457 -15953723
45431 -15953723 1204956 12769928 12616808 5329956 -656183 -1353132 1762640 4849785
45423 4849785 4329654 -324061 -5044763 -5155063 -1637897 -332029 -4183300 -9792414
45415 -9792414 -12570787 -11437513 -7019267 512684 9219334 14562590 13924075 9661491
45407 9661491 5444992 2143165 -508748 -1227778 839025 3871843 6109047 8805653
45399 8805653 13650105 19180051 22658452 23770595 23621467 21785446 17371739 11554336
45391 11554336 6005674 73772 -7451048 -14851005 -18887460 -19038494 -17524174 -15658569
45383 -15658569 -12837334 -8798450 -4513554 -982130 1228591 1953579 2282719 3958564
45375 3958564 6413578 6641321 4091341 2799652 5453441 8296440 6383015 1535942
45367 1535942 -260104 2127944 4453167 4856924 5690322 7091290 5632494 1705495
45359 1705495 1968982 10387417 21275162 25541944 20896342 12265665 4877752 775846
45351 775846 133535 1985615 4181130 5145694 5111188 4370822 2339139 31389 702918
45342 702918 5226764 9348207 9126032 7241417 9799011 17733581 25416822 27766514
45334 27766514 25230345 21468227 19412229 20300423 23561464 26352492 25316490 19891897
45326 19891897 12484008 5251195 -1218743 -5942259 -7074037 -4522957 -690327 2738651
45318 2738651 6513922 10652850 11852888 6967958 -1803428 -8005126 -7494177 -2111015
45310 -2111015 3333870 5729689 4621632 586729 -5191016 -10176993 -11424649 -8321373
45302 -8321373 -3727915 -1565989 -3375051 -7417800 -10531034 -10407863 -7096150 -3584608
45294 -3584608 -4223321 -10463157 -17842787 -19304241 -12711812 -3577981 1046154 64893
45286 64893 -1871757 -771788 2829302 5920259 6509934 4684160 1992486 326338 100078
45277 100078 -557726 -3251426 -6079070 -5362663 -1293821 960940 -2125911 -6817748 -6100156
45268 -6100156 1499333 10133756 13990639 13706095 14168868 17889219 22439719 23663244
45260 23663244 19732137 12179752 4318023 -932594 -2477580 -1111323 1608848 4488318
45252 4488318 6944244 8845270 10427932 11703580 11451232 7702343 349995 -7306628
45244 -7306628 -11049753 -9613753 -4834833 1407932 8048539 12633949 11642356 4980904
45236 4980904 -2283671 -5334981 -5041389 -5223961 -6278135 -5427811 -2541871 -1126202 -2839417
45227 -2839417 -5199362 -6084190 -6443991 -6623312 -4313094 686434 3637245 1169344 -2666787
45218 -2666787 -1874847 2075034 2425525 -1858230 -3854555 965841 7960123 10080746
45210 10080746 7174004 4685308 5807332 8724247 10282600 9281654 6836238 5733896
45202 5733896 8547876 14246445 17489140 13543222 3797692 -4986433 -6641980 -299948
45194 -299948 9254189 14578779 10825645 499416 -7774381 -7275002 552924 9200402
45186 9200402 14720013 17558594 18141030 14819627 7314587 -771553 -4991586 -4577855
45178 -4577855 -2649601 -2351274 -3536772 -3324021 209038 5441826 9342492 11688670
45170 11688670 14670681 17700536 16164788 8008326 -1485519 -5563031 -4648414 -4414451
45162 -4414451 -6505581 -6896561 -3695972 -478726 227550 1322680 5544778 9729209
45154 9729209 8821559 2874121 -3821803 -8431225 -10596756 -9484942 -4023744 4173767
45146 4173767 11322158 15128647 16049305 15423199 14165396 12578273 9920019 5332320
45138 5332320 558429 -363680 3749746 8671550 10065942 8875376 7929076 5859015
45130 5859015 -460010 -8829036 -13019067 -11479490 -9282987 -10074556 -11158960 -8894406
45122 -8894406 -4619185 -2034851 -1660744 -1084835 855402 2444570 831629 -5263084
45114 -5263084 -13073391 -16322852 -11294302 -2507108 1618879 -467960 -1759116 2560831
45106 2560831 8314010 9957681 9587784 12411502 16985371 17183280 12450905 8809719
45098 8809719 9062452 8758973 4350495 -295474 334453 4628818 5609457 423816 -5926873
45089 -5926873 -7075496 -2852272 1345150 1535577 -743015 -1762444 -837052 -20186 178177
45080 178177 1332701 3150957 2831081 -82133 -2068469 -1608746 -3035562 -10165646 -18942969
45071 -18942969 -21788018 -17840227 -13196437 -11241221 -8706055 -2674525 3904505 6429489
45063 6429489 4508355 866209 -2665400 -5582612 -7596679 -9379437 -12377074 -16035494
45055 -16035494 -17363514 -15039460 -11681324 -10083404 -9446945 -7567852 -4740938 -3018152
45047 -3018152 -3041084 -3801760 -4414518 -4504392 -4181068 -4799952 -7677074 -10717095 -9172053
45038 -9172053 -2000238 5426548 7964364 7279253 7962418 9512932 7314233 789676
45030 789676 -4605917 -4328781 386284 5660252 9346712 10758107 9139227 4639868
45022 4639868 -849851 -5419079 -8704422 -11121889 -12773887 -13468756 -12565149 -8925966
45014 -8925966 -2778832 2561032 3132344 -1160287 -6588003 -10403655 -13204289 -16030491
45006 -16030491 -17895554 -17526438 -15352181 -12341150 -8706301 -5000478 -2565280 -1471648
44998 -1471648 169329 3304324 6018489 6100937 3932103 1136552 -2046488 -6007437
44990 -6007437 -9571662 -10683290 -8691686 -4480113 715674 5076466 6101652 3006747
44982 3006747 -1427832 -3533461 -2893532 -1869300 -1514109 -409904 2234606 4731884
44974 4731884 5268329 4620987 5193156 7721378 9722857 7603217 690163 -7054085 -10579771
44965 -10579771 -9318878 -7479835 -7995984 -8676178 -6424241 -2654101 -884276 -767717
44957 -767717 719175 2712847 589348 -6240481 -12135684 -13517494 -14393855 -19446392
44949 -19446392 -25616419 -26134854 -20779226 -16248543 -16686650 -19091545 -18804021 -14936367
44941 -14936367 -9077848 -2741342 2078584 3364003 2306775 3277150 8445565 14778956
44933 14778956 18120335 17768252 15421166 12592147 11040047 12261548 13800989 9932834
44925 9932834 75463 -7147955 -3851010 5695472 10155582 6295480 1689328 2097679
44917 2097679 4243476 3795153 3009809 5508609 9081122 9485801 7570019 6898849 7183507
44908 7183507 5898083 4452085 6691860 11860059 14461587 11304143 4204025 -4184890
44900 -4184890 -12606391 -19116163 -21547889 -20958563 -20455725 -19936514 -16409657 -10298643 -6215425
44891 -6215425 -5519660 -3302888 3873172 11487096 12478937 6334039 -1244511 -5748016
44883 -5748016 -7210735 -7544774 -8060006 -9083214 -9511491 -7464801 -3338917 -841303 -2740405
44874 -2740405 -7050939 -9963174 -11117756 -13019699 -16214704 -18205784 -16997188 -13274675
44866 -13274675 -9267443 -7437867 -9668344 -15483607 -21395638 -23853425 -22352846 -18318782
44858 -18318782 -12547373 -5966678 -1126276 311807 667313 3816343 10328925 17573224
44850 17573224 23307651 26057105 23659898 15839674 7383790 4076535 5586723 6819068
44842 6819068 5977097 6084920 8438477 10647474 12362608 16409980 21714266 21698046 13831756
44833 13831756 4853745 1235060 -319255 -6311033 -14431895 -15943655 -8510483 746024
44825 746024 5178932 5282675 4536084 4234740 4224915 4323840 3194691 -608055 -5139034
44816 -5139034 -6156205 -3006523 166846 516859 -2306 823212 1305102 -686052 -3087783
44807 -3087783 -2152315 2087528 6200501 8227752 9121999 9741499 9238134 6822608 3141785
44798 3141785 -610107 -3580799 -4967033 -4171768 -1904911 -224466 -534240 -1702771
44790 -1702771 -1107217 1777111 3455772 -199612 -8071952 -13305183 -10659871 -3000815
44782 -3000815 2245027 2285668 1155189 2618876 5070942 5446651 4653257 5709041 8410841
44773 8410841 9382395 6800880 2117446 -2842255 -7836366 -12698601 -15906473 -15751768
44765 -15751768 -12149827 -6846960 -2241190 292621 1638588 4053178 8052545 10683249
44757 10683249 8383372 1717152 -4052895 -3899333 1812622 7443385 7315851 938293
44749 938293 -6823377 -10696323 -9657619 -6204851 -2048076 3301368 9333947 12489757
44741 12489757 9507831 2014877 -4232970 -5008957 -1598194 1138304 257972 -2152546
44733 -2152546 -1932730 1203128 2599357 -925538 -5844594 -6640237 -4338353 -5189303 -10672788
44724 -10672788 -14898456 -14044891 -12037224 -12761189 -12755836 -7932043 -2559016 -3347357 -7542278
44715 -7542278 -6097324 2036955 8118659 7220785 4412833 4281138 3043226 -3492515
44707 -3492515 -11094902 -12931574 -9475702 -6001854 -3640738 375214 5567583 7801345
44699 7801345 5650420 2046265 -536435 -2517579 -4817969 -7365705 -9889417 -11624125
44691 -11624125 -11013932 -8069628 -5435408 -4459318 -2532090 2177731 6073096 5003760
44683 5003760 1429213 706273 1650101 -2144500 -11286423 -18141984 -17561100 -13721015 -13028943
44674 -13028943 -15513266 -17185829 -16674199 -15159468 -12834039 -9689470 -7658978 -8061132
44666 -8061132 -8462966 -5638066 -509243 3147461 4192655 5216823 8212807 11636465
44658 11636465 12263807 8635566 2410504 -3190150 -6471391 -8491514 -10120021 -8895220
44650 -8895220 -1914269 8034727 13300161 10223065 3787510 1087836 3388925 7522827
44642 7522827 11781670 16125379 18607623 16391933 10224730 4600496 3294828 6476606
44634 6476606 11085618 12195221 6093421 -5161886 -14099140 -15589608 -12139550 -8700021
44626 -8700021 -5823750 -2627945 -2606504 -8996641 -16283832 -15115311 -6250220 -935162
44618 -935162 -5047826 -11422352 -12222891 -10811052 -14482293 -21542239 -24064502 -20319959
44610 -20319959 -16217788 -15366870 -15015963 -12287423 -8240727 -4565849 -1410114 136932
44602 136932 -1941582 -6418839 -8881694 -7931619 -7487965 -10563175 -14255684 -13880711 -9247855
44593 -9247855 -3506172 2125126 8710985 15635959 19838350 19218992 14399160 7166634
44585 7166634 -326352 -4739040 -2955229 4191905 11550390 14579348 13286153 9962544
44577 9962544 4932741 -2741493 -11136349 -15453151 -13290515 -7693689 -3371770 -1515300
44569 -1515300 -284476 806130 -214214 -4072443 -7568460 -6209097 691709 8407919
44561 8407919 10955717 7150492 1775097 -537677 -1675375 -7115728 -16108089 -19538584
44553 -19538584 -11446525 968341 4981401 -1417890 -7948195 -7425969 -5218042 -9784411
44545 -9784411 -20258579 -29227536 -33548634 -35674793 -36313955 -32532542 -23432900 -12616087
44537 -12616087 -4061487 960750 2819454 2958579 4416135 9223434 14919630 16840049
44529 16840049 13856461 8696322 3342140 -1619689 -3654424 135504 7159182 10592897
44521 10592897 8449369 6291605 8467656 11824107 11540076 8302012 5171241 1403886
44513 1403886 -5254789 -12890331 -17485822 -19060170 -20737176 -22694657 -21795448 -16953117
44505 -16953117 -10790706 -6029594 -3543846 -3395425 -4401948 -3518853 654021 4577581
44497 4577581 3881658 -183235 -2859306 -3569625 -6026882 -10565048 -12372852 -8958078
44489 -8958078 -3842666 -433016 2615816 6725702 8853901 5951353 581562 -2365416
44481 -2365416 -2309695 -2290104 -3490996 -4540622 -5119711 -6370199 -8117284 -8977280 -9072352
44472 -9072352 -9801749 -11024929 -11128828 -9997879 -9475593 -10422891 -11267270 -10105943 -6962047
44463 -6962047 -3487278 -1196401 -209721 484954 1278344 809424 -2134530 -5925731 -7640073
44454 -7640073 -7544313 -8978598 -12661204 -14567383 -11602990 -6076651 -1801375 896259
44446 896259 2840465 2191025 -2269993 -6723893 -6673322 -3930936 -3526495 -5055726 -3770841
44437 -3770841 -6531 -138763 -6440339 -12675558 -12769874 -8281605 -3954830 -998239 1249025
44428 1249025 1464341 -1157852 -3751475 -3604536 -2818484 -5203000 -10533182 -15491082 -18404043
44419 -18404043 -19613381 -18966776 -16264809 -12539216 -8132822 -1892272 4817994 6670673
44411 6670673 1250290 -5732362 -7437364 -5580260 -6941265 -12088675 -15021426 -13912342
44403 -13912342 -14327592 -19605060 -24860241 -24087723 -17944154 -10772579 -4449443 672651
44395 672651 2501774 -255625 -4332962 -4855110 -1142708 3142086 4352502 1288360
44387 1288360 -4539009 -8534574 -5501501 3916910 11258630 8886564 -356174 -6110001
44379 -6110001 -2528204 6760601 15458266 21336232 24474273 23285388 16296963 6328829
44371 6328829 -591245 -883260 3621571 8435151 10666653 10050451 7149692 2473592
44363 2473592 -2139327 -3127057 1284145 7196183 7551767 257929 -8281189 -10265025
44355 -10265025 -5791065 -1984409 -3349879 -6593468 -6019071 -831124 5231522 9381629
44347 9381629 11803983 12744063 10646809 4512712 -3420864 -9092553 -10595088 -9550436
44339 -9550436 -8246251 -6735594 -4114354 -1838108 -3225807 -8708435 -13744046 -13656458
44331 -13656458 -9397092 -5924531 -5321480 -4621873 -1240246 2515860 2694473 -253042
44323 -253042 -1453268 2526824 9742478 14965056 14300944 7699082 -1493326 -8796049
44315 -8796049 -11623300 -11114799 -10645712 -12082270 -13869524 -12994525 -8275906 -1619250 3132650
44306 3132650 2520744 -3737381 -11178138 -13288089 -7846623 -51459 2819897 -215042
44298 -215042 -3130262 -879255 4746028 8677352 9174098 8073466 6374316 3278267
44290 3278267 -829508 -3998869 -5691204 -6838245 -6197427 -466885 9750632 17413306
44282 17413306 16136337 8249486 2207848 2650238 6552504 9206025 9941412 10146360
44274 10146360 9008749 4918859 95380 -46211 6328658 13475419 13373462 4866494
44266 4866494 -4606538 -7327414 -3770118 -1185660 -4891834 -13353717 -21567488 -26258680
44258 -26258680 -26624468 -22781467 -16024379 -9186539 -4260836 -383893 3729185 6254735
44250 6254735 3915088 -2885474 -9235742 -10732385 -7316597 -1527635 4789673 10625063
44242 10625063 14402718 14586975 11506393 7352272 4141994 2031508 -370577 -3988867
44234 -3988867 -7468896 -7985243 -4558958 233519 3245019 4797901 7708546 12446978
44226 12446978 15867046 15607395 13317981 11863172 11295334 9853361 7649334 6649171
44218 6649171 7190720 6986748 4271424 147603 -3277602 -5880244 -9158465 -13210747
44210 -13210747 -15678893 -14681142 -12061065 -12011247 -15851918 -19685981 -18917621 -14281721 -11057462
44201 -11057462 -12163682 -14543300 -13516582 -8500528 -2568584 1839815 4199083 4000389
44193 4000389 765785 -3752903 -6160076 -5390667 -4109827 -4726926 -5713714 -3987142 -152478
44184 -152478 1030846 -4004535 -13245392 -20810970 -22252525 -17740982 -11104928 -6668188
44176 -6668188 -6185096 -7494614 -6437674 -1359830 4471002 6382413 4093841 1893787
44168 1893787 2491287 3334301 1003718 -2958019 -3894687 -976682 1111009 -1940016 -8988441
44159 -8988441 -15138790 -16582456 -13108176 -7773166 -4819722 -5937093 -7762027 -5101672
44151 -5101672 2560226 10151145 13674966 14907725 17435846 20834448 21883325 19617361
44143 19617361 15710312 11058951 5573812 779558 -1062970 -692487 -1471166 -4559694
44135 -4559694 -7091129 -5827588 -432598 6993917 12938446 13060171 5559543 -4788819
44127 -4788819 -9612921 -6098466 -120216 2036856 1659408 3777193 8329164 10353380
44119 10353380 8134252 5885803 7208572 10084812 10439068 7472155 2877563 -2800803
44111 -2800803 -9648361 -15193484 -15302559 -9283468 -1939579 1182147 -140229 -987901
44103 -987901 2391557 7868696 10080262 7023686 2223885 48999 859179 2202678
44095 2202678 3039671 4158410 5243650 4884523 3934967 5414214 9448838 11532300 8490853
44086 8490853 3389451 833022 -264042 -4055487 -8897199 -7584716 1777365 11013685
44078 11013685 11694819 5149874 -1830608 -7125801 -12876626 -17714428 -17290761 -12660920
44070 -12660920 -10538841 -13107809 -14463200 -10576174 -6150692 -6303223 -7210373 -2420360
44062 -2420360 5274303 6978313 1643346 -1942892 1405737 5963426 4905729 688591
44054 688591 146231 3825877 6455833 5715093 4555000 5266501 6222795 5167475 2150684
44045 2150684 -1456875 -4148128 -4405573 -2455786 -1729029 -5175203 -9864734 -9162895 -1576399
44036 -1576399 6335463 8116098 5194679 3545661 5316387 7740207 8960511 10616126
44028 10616126 14318864 18865940 21829020 21596892 17424246 10026324 2859403 62430
44020 62430 1587442 2573551 -642024 -5681624 -7183526 -3187503 3462020 8642867 9767096
44011 9767096 6602363 2035261 854490 4545917 8041040 5434271 -1240454 -3563294
44003 -3563294 1797605 8177473 8494188 5118706 4999238 7881149 6294110 -2466468
43995 -2466468 -10856818 -10630006 -3407035 2517755 3396247 3169282 5710505 8688127 7481810
43986 7481810 2437383 -1220501 -239693 2964986 4411089 3790933 3438242 3740499 2763550
43977 2763550 166860 -1879193 -2552053 -3897502 -6636746 -7443345 -3382040 2961044
43969 2961044 6139845 4476769 841684 -2191557 -4339813 -5101056 -3068534 1503367
43961 1503367 6287154 9564830 11016774 10349305 8376863 8759049 14035425 19715380
43953 19715380 17744678 7443920 -2410769 -4892520 -2787543 -1716488 -1281844 1451764
43945 1451764 4555047 4380209 3125564 5958521 12128326 15962777 15882757 15413588 15640332
43936 15640332 14270071 12724578 15886480 22621718 24843470 19832194 15496047 17686914
43928 17686914 19507338 11222998 -4050057 -13528945 -11502090 -4507032 -251435 722762
43920 722762 1119526 1713402 2917051 6247860 10894011 12377532 7630000 -997162 -8908612
43911 -8908612 -14187333 -17493475 -19251451 -19085370 -16839246 -12888711 -8546818 -6428435
43903 -6428435 -8242109 -11546115 -11189781 -5250942 2485586 6897200 6099932 991461
43895 991461 -6449230 -12578876 -13147728 -8085514 -3172125 -3927964 -9298923 -13966329 -15154466
43886 -15154466 -14115412 -12453128 -10692705 -9921663 -11370311 -14210878 -16343598 -16994328
43878 -16994328 -15922225 -11102272 -1202868 9632711 13986048 9726496 2772112 -680576
43870 -680576 -1403050 -3951511 -8970013 -12305946 -10781510 -5655220 -272396 3405907
43862 3405907 5441175 6713417 7909130 9052825 9393899 7644811 2620733 -5374597
43854 -5374597 -12997295 -14858149 -8250743 3158137 12459170 16461453 17230627 16782145
43846 16782145 14183577 9775374 8192421 12835890 19209479 18543150 8246326 -5073460
43838 -5073460 -13927596 -17881263 -21329897 -26046207 -29045571 -27251235 -21534270 -15173220
43830 -15173220 -9988804 -5822919 -3295993 -4458451 -9175682 -12735272 -9973215 -1522796
43822 -1522796 6811192 11186359 13305595 16096468 19109165 20004160 17623029 11305287
43814 11305287 181648 -13716881 -24291466 -27193685 -24958661 -22453749 -19236652 -11603369
43806 -11603369 -1318661 3804275 -474338 -9349669 -15301808 -16315434 -15541130 -15662066
43798 -15662066 -16111292 -14290163 -7939804 2491614 13195814 20132396 22689687 22278865
43790 22278865 18285216 9192734 -2271509 -9669455 -10068882 -7072242 -5178794 -4810821
43782 -4810821 -4485180 -3803966 -1938661 3069765 10774402 17315163 20226969 20734568 19268874
43773 19268874 13469865 3858145 -3571275 -5002899 -4500315 -6713328 -8259790 -3132801
43765 -3132801 6469663 12208016 10826818 6112383 742118 -6199866 -13465629 -16925780
43757 -16925780 -16091068 -15039641 -15375533 -14188508 -10370427 -6842749 -4837970 -2135301
43749 -2135301 1251544 2415343 2917681 9025593 20331170 25853802 18160250 5358803
43741 5358803 1076013 6487579 10765993 7334791 935545 -2127114 -3280133 -8215987
43733 -8215987 -18397843 -28729154 -31940271 -24716123 -11173124 157929 4578535 5206623
43725 5206623 6844681 8740286 7465940 4404206 4212325 6288082 4270104 -4292544
43717 -4292544 -13381728 -16622530 -15677304 -16772612 -21470889 -24645847 -20727842 -9445511
43709 -9445511 4111069 13380957 14654722 8866572 -455546 -10391020 -18993010 -23929152
43701 -23929152 -23635622 -19738485 -15419232 -11164418 -5413015 258403 1232559 -2754636
43693 -2754636 -4996170 -684203 5148309 4003696 -3652090 -8556125 -5443070 458556
43685 458556 1990859 -234889 -1028476 61745 -1545843 -7044119 -10944105 -8015799
43677 -8015799 183215 8276752 13881348 18117382 20837885 19505290 13562961 6845076
43669 6845076 3891874 5404475 8396732 9293428 6079003 -417964 -5787293 -4736622
43661 -4736622 3095838 11577144 14810065 13922398 14153987 16594344 16905943 12040444 4013513
43652 4013513 -3606891 -8735045 -9102468 -2386894 8926445 16588385 14548722 5764408
43644 5764408 -2210076 -5988521 -6940758 -5799066 -2420604 -5578 -3222132 -10830568
43636 -10830568 -15554034 -13536596 -9189307 -7754550 -7760557 -5303556 -2063805 -3042891 -7931462
43627 -7931462 -11036192 -10216708 -10021550 -13795738 -17695697 -16292590 -10747373 -6948450
43619 -6948450 -7166370 -8012139 -6472133 -3825913 -2384979 -1556100 734968 4474208 7339650
43610 7339650 7115574 3033021 -4147758 -11720328 -15513870 -12961802 -6113711 -320310
43602 -320310 592151 -2761649 -7042692 -9579504 -9702374 -7969462 -5249390 -2353209 206476
43593 206476 2297701 3930244 5166706 6407073 8306951 10925393 13157107 13541612
43585 13541612 11684378 8532317 5252985 2325961 13583 -665414 1831184 7844406
43577 7844406 14995492 18953808 16720593 9817173 3684417 2654052 5266279 5917480
43569 5917480 1967259 -2493464 -2221267 872229 -1151082 -11510799 -22814984 -25503353
43561 -25503353 -20001911 -15541656 -17014499 -18576899 -12984752 -2744857 3010577 751500
43553 751500 -3856366 -4863609 -3398555 -3781171 -6253739 -7572986 -7052991 -7827894 -11959970
43544 -11959970 -17571030 -21733794 -23548826 -23044965 -19543826 -13415447 -7882365 -6377912
43536 -6377912 -8553188 -11047547 -11761879 -11005056 -8740401 -3859121 2875836 7934704
43528 7934704 8750153 6477194 3830337 2396802 3438678 8371450 15761633 20316112
43520 20316112 18240205 11909159 6052591 1505841 -3054540 -5434205 -2159399 4003948
43512 4003948 5439643 117302 -5406381 -5851967 -4211306 -5259872 -7476904 -6441504
43504 -6441504 -2286163 1628920 4641519 8114524 10968366 10985283 8939967 6682627
43496 6682627 2967536 -3589741 -9187328 -8625578 -3609310 -893503 -2214549 -2688419
43488 -2688419 135446 2858585 3877622 6913059 12667578 13503130 2855413 -13827278
43480 -13827278 -24088168 -22981724 -17244279 -15408914 -18493758 -21423000 -20307007 -16410311
43472 -16410311 -13901384 -14772041 -16631289 -16190437 -13926719 -12917604 -13459813 -12465315 -9030146
43463 -9030146 -6534545 -7023968 -7251210 -3504761 2546560 6292259 6112051 3443106 -822585
43454 -822585 -6128258 -10175938 -11127180 -10758398 -11619983 -12224211 -9300385 -4081704 -1592672
43445 -1592672 -3377813 -5536246 -5236267 -5010917 -8261014 -13511816 -16049077 -14003761
43437 -14003761 -10527335 -9906028 -12517267 -14237270 -11479311 -6564396 -5940937 -11931612
43429 -11931612 -18859927 -19876736 -15161932 -9737152 -5415913 -221353 4920203 4991538
43421 4991538 -1972797 -11257949 -17175381 -18747043 -17876197 -15699225 -13137951 -11523361
43413 -11523361 -9842366 -4503381 5045913 13245879 14399636 9517781 3840915 -297477
43405 -297477 -4247133 -8414615 -11410153 -13315808 -15546354 -17249910 -15840971 -11880845
43397 -11880845 -9578912 -10896679 -12576338 -11279573 -8801471 -9086067 -11856258 -12808972
43389 -12808972 -9889717 -6134487 -5287789 -6982338 -8002521 -6941124 -5522313 -5636850
43381 -5636850 -7010622 -8310015 -8994046 -8957778 -7318655 -3051394 3186056 8772407 10862977
43372 10862977 8288366 2457463 -2936900 -4059434 -341639 4331716 5052121 541580
43364 541580 -6390805 -12312080 -15483301 -15328709 -12173829 -8167634 -6175836 -6329017 -5323759
43355 -5323759 -897998 4071137 3966988 -3056592 -12343940 -17017065 -14463299 -8221442
43347 -8221442 -3599643 -2013809 -526463 3076719 6724297 7368030 6499377 9148959
43339 9148959 16869030 24644967 26657828 23293122 20047196 20035555 19924885 14369451 3544105
43330 3544105 -5538933 -6351534 -453899 4693346 5550559 6331803 10998069 15870692 15213249
43321 15213249 11004603 10051547 12410281 10965571 4045130 -6861 5043351 13978391
43313 13978391 18521519 18665688 18755742 17908119 13043132 7711031 8143820 11984374 10677100
43304 10677100 3321148 -1443925 828213 4103259 2737573 -151968 -359998 -930792
43296 -930792 -6052814 -12470166 -14465293 -13398828 -14849929 -19008244 -21310040 -20923308
43288 -20923308 -21052815 -21224194 -16837446 -7748186 -638528 -202290 -3127381 -3713895 -1183772
43279 -1183772 1693457 3662859 5256291 6606339 8159710 11465904 16200198 18277462
43271 18277462 14350403 7086182 2599793 3057883 4995820 5092793 4494498 6234057 10468768
43262 10468768 13709901 11941592 4217035 -5591293 -10647061 -6835550 2569497 9626385
43254 9626385 9868073 5741479 1154005 -4057811 -11280134 -17595407 -18212381 -13973964
43246 -13973964 -11160010 -12429193 -12919551 -8277711 -2088991 -574457 -2861547 -2458335
43238 -2458335 2425907 6088669 4154338 182458 787703 7368474 15169579 18285178
43230 18285178 13788241 3437421 -6599533 -10015157 -6618682 -2500419 -2363130 -4392642
43222 -4392642 -4771049 -3573425 -2309222 1132668 9370309 18708096 21615975 16800266
43214 16800266 11500130 11849856 15262767 14903122 8408960 -562631 -7141834 -9166919
43206 -9166919 -8024549 -7419083 -9671744 -11982352 -8696306 1063831 10651601 13111073
43198 13111073 8760432 2899826 -1494580 -4892305 -6777537 -5195999 -1286093 53309
43190 53309 -3928813 -9936915 -12777190 -11659432 -10077806 -10130775 -9299889 -3855428 5447166
43181 5447166 12627240 12286069 5419473 -2020325 -6014793 -7636045 -8890361 -8648784
43173 -8648784 -5187391 -371714 2288076 2673415 3510898 5226195 5273318 3144888 2203160
43164 2203160 4857940 8865482 10309478 7988638 3229422 -2341018 -7031793 -9348789
43156 -9348789 -10048328 -11855382 -15122179 -16295987 -13593298 -11699036 -16464657 -25949389
43148 -25949389 -31429033 -27901697 -19625750 -13988609 -13486495 -15766519 -18380031 -20279229
43140 -20279229 -20325300 -17761419 -14135096 -12322437 -13103046 -14185491 -13070664 -9820443
43132 -9820443 -6654626 -5634667 -6929970 -8510037 -7342099 -1965653 5395407 10026481
43124 10026481 9011163 4062760 -722993 -3494788 -5655513 -8348879 -10157614 -9760853
43116 -9760853 -9132879 -11405829 -15983245 -18627595 -16873163 -12520423 -7708911 -1889976
43108 -1889976 4662433 7460902 2747028 -5054851 -6158801 2712783 13453821 16288222
43100 16288222 11145073 5707660 4389587 4208706 1639809 -1432429 -1182007 2012955
43092 2012955 4621863 5743115 7755700 10858896 10938362 5179919 -2922296 -7501108
43084 -7501108 -7942140 -8942320 -13193728 -17940328 -19917584 -19971792 -20374880 -20566568 -18841922
43075 -18841922 -16195290 -14753002 -13549062 -9798515 -4070240 -199373 585167 1740351
43067 1740351 6176863 12014736 15463512 15633217 14580140 14352967 15723046 18336007
43059 18336007 20517608 20154602 17030721 13114842 9830393 6913813 4812703 5528418
43051 5528418 9149052 12002415 11020467 8321400 8614157 13043175 18142941 20047660
43043 20047660 17377370 10971312 3507415 -1256103 -1690159 -551467 -1527817 -3826278
43035 -3826278 -2933582 3167983 11200237 16403702 16921558 14192521 11294482 11147329 14029331
43026 14029331 16553697 15325889 11616871 9708199 10536371 10375371 6593003 1047209
43018 1047209 -3807379 -8424176 -13078065 -14540538 -9769000 -1369522 4263174 3813531
43010 3813531 -628406 -5471143 -8980516 -10790136 -10780377 -9314841 -7154824 -4755890 -2553738
43001 -2553738 -1458992 -1642245 -1374502 1061189 4506426 5940208 4505306 2623732
42993 2623732 2637870 4111310 5245028 5427771 5215399 4713413 3152767 -62382 -4178683
42984 -4178683 -6668437 -4443953 3016846 11459704 14554086 10181847 3030587 -582696
42976 -582696 159796 354745 -3868136 -10425717 -14032686 -12323976 -7676713 -3774187 -2197155
42967 -2197155 -2266871 -2366735 -970639 1868240 3288858 -163330 -7675800 -13482973 -13313749
42958 -13313749 -9940313 -9280845 -12061370 -13279736 -9993822 -5268535 -2951784 -2708267
42950 -2708267 -2879133 -4560490 -8910940 -12833227 -11776830 -5960090 -109267 2442004
42942 2442004 2158591 755691 64130 2776929 9786133 16425727 15927392 7772261 -1684344
42933 -1684344 -8257672 -14679646 -23698981 -31430856 -32199779 -26752044 -20690209 -16808986
42925 -16808986 -13897387 -11654235 -11293415 -11350394 -8164386 -1770254 2943678 2557342 -919864
42916 -919864 -3956794 -6015686 -8301732 -11001632 -13794568 -16435576 -16888281 -11830270
42908 -11830270 -1659100 7554227 10182257 7279850 4015690 3027253 3530332 4772263
42900 4772263 5975498 4089991 -3477498 -13733710 -20059756 -19989416 -17135270 -14810616
42892 -14810616 -12313616 -9105142 -7866382 -10145813 -12518855 -10866740 -6077770 -1796777
42884 -1796777 1637220 6926282 14119357 18891519 17264338 10218614 3408668 2947887
42876 2947887 10047050 18630243 20455537 14495788 8538052 8781760 11296077 8427065
42868 8427065 719436 -4144038 -3127753 -1089564 -1367855 -694242 3485705 7333499
42860 7333499 6827326 4299514 3570175 3036529 -414145 -4129703 -3233936 419144 -136028
42851 -136028 -6635619 -13293378 -15505394 -14795517 -13640645 -11344028 -7915746 -6981296 -10806846
42842 -10806846 -15813795 -17028193 -14762373 -13228235 -14030028 -14483407 -11788279 -6228940
42834 -6228940 -509695 2429753 1777735 433291 2733843 8925984 13894089 13712884
42826 13712884 11071119 10547583 10622246 5932093 -2597884 -6164395 458982 10604368
42818 10604368 13409259 7209426 191812 -1556467 -1373708 -5668689 -14154465 -19933207
42810 -19933207 -18043207 -10779729 -4188778 -1553286 -1539852 -1333314 318382 3059172
42802 3059172 6146203 8688791 9499601 8012195 5406544 3903960 4531264 6018443
42794 6018443 6219486 4400332 1995577 1299110 3417352 7351291 11225382 14408461
42786 14408461 17602962 20316330 19641450 13540241 4785805 -1027089 -1917868 -1283790
42778 -1283790 -2094500 -2519201 -105359 2341937 -583148 -9190922 -18044138 -23212288
42770 -23212288 -25713555 -26513660 -22892801 -13064336 -1037259 7162111 10249979 11008890
42762 11008890 10507026 7339959 2132221 -1681368 -2454482 -2179860 -2752651 -3906551 -6368910
42753 -6368910 -13148479 -24287401 -32885105 -30927574 -19029425 -6614092 -1144902 -182650
42745 -182650 3360451 10129442 12745425 6099408 -4896096 -11512781 -12834784 -15638114
42737 -15638114 -22308144 -25213616 -17052242 -2203275 8029996 9096275 5962544 3468793
42729 3468793 1141138 -1276178 -235482 5969468 13033104 16328444 17101819 18904317
42721 18904317 21026271 20087665 16057509 12133727 9782220 7921953 6242682 5550422
42713 5550422 5188935 3440757 276336 -3023981 -6239490 -9322083 -10277849 -7537238
42705 -7537238 -3636039 -2422086 -2822931 52432 6804766 11264256 8268878 572813
42697 572813 -4554694 -3470570 1247836 4671016 3915358 -390931 -5332185 -8309025
42689 -8309025 -8632089 -6493284 -1846538 3800763 5843765 241214 -11136069 -21868092
42681 -21868092 -28072039 -30993586 -32051171 -29274125 -20788098 -8921940 1658259 8202939
42673 8202939 10721259 10578751 9755317 9496806 8430169 4340252 -1042615 -2259780 2778117
42664 2778117 9178860 11470218 10571818 10742152 12410895 12892606 12511433 14455554 18609073
42655 18609073 20771998 19083439 16566856 15616232 14435880 11579175 9822797 11466705
42647 11466705 12823759 8584526 487329 -3863433 -1567616 1346210 -1201232 -6611804
42639 -6611804 -8158936 -5612672 -5622873 -11522082 -18193221 -19232830 -14966606 -10019297
42631 -10019297 -6036215 -1129588 4894842 9215657 10199152 9632788 9926937 11249046
42623 11249046 11940879 10215518 5643283 528438 -1164569 1463888 3816942 1195460
42615 1195460 -4488156 -7325143 -5975105 -4697091 -5628739 -5634936 -2576447 617365 1008988
42606 1008988 193608 481466 739785 -234222 -149534 2640697 5019197 4126119 3475247
42597 3475247 8210627 16071439 19227811 14785104 7982053 4618176 5265260 7617494
42589 7617494 9606528 8675589 2537569 -6703132 -12383672 -10183040 -3687635 -1041753
42581 -1041753 -6771888 -17821731 -26806087 -28683360 -24985554 -21567393 -21785761 -22979447
42573 -22979447 -20748931 -14948548 -9200567 -5896923 -4403058 -3084130 -234992 5692587
42565 5692587 13187045 16072994 9362260 -3089369 -11052012 -8940836 -774666 6321692
42557 6321692 9251746 8434521 4898198 651745 -1508911 -1571053 -3208395 -8506452 -14031936
42548 -14031936 -14853769 -10730471 -5735165 -3087427 -2796155 -3533726 -4595288 -6085414
42540 -6085414 -8299732 -10740246 -11691419 -9993823 -7308863 -6830174 -9471655 -13293396
42532 -13293396 -16733676 -19678199 -20973885 -18328454 -11995892 -5349326 -268989 4601279
42524 4601279 9128506 9312389 3024885 -5192892 -9279876 -9384583 -10231572 -13459314 -16188963
42515 -16188963 -16576226 -16284096 -16896777 -17395434 -16090791 -12606685 -7607656 -2798377 -1009391
42506 -1009391 -3558022 -7459989 -8184186 -5688210 -4880391 -9168184 -16166323 -21100400
42498 -21100400 -22171301 -20884279 -18860688 -16329588 -12960154 -8636733 -3716642 634845
42490 634845 2896476 2821775 2296248 3899941 8631206 15081255 20413354 22160000 19849416
42481 19849416 15343780 11285497 9062415 8541736 9440834 11858029 14981486 16193303
42473 16193303 12773602 4929432 -3484477 -8113788 -8147048 -6691175 -7008525 -9280670
42465 -9280670 -11540907 -12394990 -11402174 -8082753 -2996230 788525 327217 -2718684 -3200327
42456 -3200327 992337 6447092 9517582 10835173 12531573 14351368 15569686 17660670
42448 17660670 20999152 21451963 15367674 6588421 2844090 5251885 7191657 4718259
42440 4718259 2101012 4090727 7909511 7555600 2797985 -986035 -227714 3917897
42432 3917897 9001129 13438227 15631517 14892271 13503138 14429093 16760593 17065179 15639238
42423 15639238 16899661 21759817 24142776 18675999 8616502 1752528 441800 475621
42415 475621 -1094663 -2201722 -542122 2511987 4661488 5785377 6192758 4855056
42407 4855056 1887975 375778 3107666 9187016 15846762 21568375 25403114 25815376
42399 25815376 23014872 20061528 18511289 15427862 8492725 1526516 -105211 2105766
42391 2105766 1713666 -3082575 -7801022 -9820018 -11651374 -14512257 -15040288 -11520573
42383 -11520573 -7985944 -8300286 -10541350 -11167519 -10833977 -11810742 -12905088 -11326808 -6962443
42374 -6962443 -797679 7955392 18476587 24791118 21426644 11653519 4752736 5072283
42366 5072283 8364701 9246759 7828398 7653561 10364651 14027878 15137915 11873366
42358 11873366 6522707 3826644 5363289 7305031 6082740 3922745 4947563 7713380
42350 7713380 6830126 1698630 -1623035 1555347 8890254 14826036 16480450 14267626
42342 14267626 10190868 7502780 9035878 13500079 15705679 12777419 8296391 7749778
42334 7749778 11071595 12576630 8556405 2624048 1735872 7475610 13550948 13378470
42326 13378470 8470922 6260778 10064980 15272375 16615902 14838522 13363174 12354812
42318 12354812 10300259 8599646 9752711 12545018 13385907 11260850 7570204 2751373
42310 2751373 -2739306 -5927688 -4658125 -2007061 -2444841 -5015248 -5451952 -3308196
42302 -3308196 -1072161 1849057 6950916 9863607 4624830 -5044250 -8274440 -2965619
42294 -2965619 325132 -5766189 -14714897 -16752267 -12174755 -7201731 -3239837 1754752
42286 1754752 5845780 5252640 1694007 926992 5211446 12075850 18623062 22607797
42278 22607797 21701603 16458969 11941780 12084901 14622988 15366187 14405297 13870061 13241486
42269 13241486 12062232 13595046 19618778 24793852 23137628 17709736 16599403 21092230
42261 21092230 25527209 27728320 31034800 35597089 36322853 31761845 27471478 27271743
42253 27271743 27547052 23928770 18038473 13379290 9268175 3714582 -1057324 -1118623
42245 -1118623 2715596 5400913 4398776 2547935 3552062 6735829 7696208 3885648
42237 3885648 -1566451 -2859642 1799737 8618098 13981649 18674739 23977623 26882908
42229 26882908 23777344 17288784 14414543 17746262 22611748 23228047 18276755 10524320
42221 10524320 4423918 3714745 7637516 10061042 6391531 355233 -1087328 1528615
42213 1528615 1242942 -3363738 -5169202 51100 6769680 8705511 8245304 11266241
42205 11266241 17656082 23285622 27521406 31843252 33472220 27916924 17680984 11638403
42197 11638403 14036253 19183784 19388194 14372095 9990311 9947627 11803874 10743287
42189 10743287 5361800 -830521 -3130683 -358133 4498569 8128248 10363685 13281655
42181 13281655 17765035 21962994 22907149 19095357 11758662 3981471 -1578242 -4175988
42173 -4175988 -4259408 -2192588 1359780 4608932 5810114 5129031 4264193 4758075 7673588
42164 7673588 13414958 19794769 21972193 17681966 11608666 10628127 14916130 18109803
42156 18109803 16736295 14503915 15266478 16406254 12849302 4825558 -1965269 -2569125
42148 -2569125 3207452 11560878 17477175 18112460 15040071 12049601 10264076 7768508
42140 7768508 4517171 3797788 6832913 9633695 8371926 5001179 4019786 5888922
42132 5888922 7426986 7221777 6832518 7188126 7053799 5202576 2055490 -601941 -280942
42123 -280942 4519765 11581462 15469874 12927841 6655325 2031125 1584861 4323936
42115 4323936 8275595 11200033 10808229 7311097 4449893 5282079 8101494 8867037 6163392
42106 6163392 1418948 -3796940 -7807932 -8190259 -4517996 -199651 1596295 1915413
42098 1915413 2477440 906319 -5235827 -11386569 -9429406 1366045 12554235 16983090
42090 16983090 16038375 14740179 14522321 13776947 11958373 10007171 8820012 9247120 11316515
42081 11316515 11988444 6793013 -3830850 -12441508 -11878908 -3148425 6425559 11348740
42073 11348740 11505397 8899485 4550444 -768475 -5382176 -7833965 -8064104 -6576170
42065 -6576170 -3428652 809873 3811030 2950758 -1532445 -6243332 -8400671 -8549057
42057 -8549057 -8115795 -5985178 -415918 6456404 9810962 8269550 5139371 2753256
42049 2753256 -32993 -2958483 -2104636 3811111 9402580 9830476 8465221 11612864
42041 11612864 18391589 22416523 21873983 20867584 21249196 20415306 18042811 17910518 21019168
42032 21019168 23365961 23124478 23781516 26817132 27445391 22378119 16669274 17058008 22055683
42023 22055683 24596490 22316853 19299198 18460863 17734140 14474810 9452320 5073230
42015 5073230 2320120 666321 -612842 -1872961 -2987559 -3551995 -3515564 -3129167 -2146883
42006 -2146883 -265352 1480571 1583717 691373 901643 1625207 -651294 -6487007 -10614144
41997 -10614144 -8378867 -2898437 -1599479 -6165197 -9887072 -5989501 4192391 13059739
41989 13059739 15470781 13812805 14016942 17635578 19884237 16445707 9923971 6477606
41981 6477606 7180091 6921193 2262175 -4005460 -7751211 -9006504 -10358101 -13291182
41973 -13291182 -18310816 -24997263 -29363484 -25239634 -11876274 3401186 13728692 19798841
41965 19798841 24114517 23364940 13972392 1967757 -1781310 3957203 9342931 7675438
41957 7675438 3163078 1986540 3180922 2874397 1505962 1128717 -311593 -5875146
41949 -5875146 -12870853 -14766881 -9497595 -1701212 3475473 5567711 7321823 10430258
41941 10430258 13556876 13734785 9951954 5787813 6903452 14422528 22385773 24038163
41933 24038163 19629143 15469979 15819119 18594746 19582632 18213342 17566014 20132534
41925 20132534 25277270 30216550 31970542 28666606 20830075 12122696 7146055 6854882
41917 6854882 7203212 4531058 1444574 3807724 11455792 16505453 13739033 8443802
41909 8443802 8861407 13699536 14020730 7094259 851245 2240519 7839240 10431143
41901 10431143 9748396 10926265 15444631 19639085 20800085 19201340 14608093 6318379
41893 6318379 -2553774 -5876702 -1733399 4556590 6759306 4648660 2934981 5395029
41885 5395029 11628015 17862371 19565812 14789380 6275509 -676477 -2877067 -686117
41877 -686117 4408980 10670997 14651324 13109200 8069379 5926704 8852448 11068756
41869 11068756 7497266 2330910 3450216 10762606 16753284 17965965 18820893 22716774
41861 22716774 26250615 25611964 22971418 21921785 21004085 17149449 12454119 11586696
41853 11586696 13931089 14133127 10456585 7507180 9746750 16374474 23584993 28187542
41845 28187542 27978105 22318631 14117929 8247115 6303159 5498402 3925048 3697415
41837 3697415 6889785 11348193 13256596 11871251 9324485 7450304 6991201 8333159
41829 8333159 10923843 13396100 15897245 20271442 26078284 29031875 26241657 20855586
41821 20855586 18335403 19968453 23301029 26836582 30047513 30321373 25013709 16339838
41813 16339838 9592393 6401560 4355165 3317444 6365773 12898428 16612981 13584862
41805 13584862 7685250 4235941 2542918 -580972 -3422139 -1477201 4590953 8931163
41797 8931163 8463046 5927506 4464332 3911243 3922883 6307311 11525400 15988651 15940353
41788 15940353 12258626 8885959 7966372 8968114 11261950 14591570 17393257 17503274
41780 17503274 15040431 12487898 11317438 10363583 8273414 5789307 4412914 4136226
41772 4136226 3818631 2842620 1147668 -1322895 -3457614 -1978374 5914996 18130168
41764 18130168 27603416 28160576 20322761 10812296 6569349 9355474 15417315 19500525
41756 19500525 19047437 15071265 9941331 5197074 1255294 -2088887 -5231594 -7389331
41748 -7389331 -5275950 4227308 18099646 26627634 22956012 12283588 7168973 13480273
41740 13480273 25237324 33802506 36861128 36359162 33439168 29983011 30834754 38692294
41732 38692294 49135576 56104981 60409180 67043037 75555364 80046348 79026168 78089051
41724 78089051 80518692 81764237 77224483 70285118 67363420 68231798 66791269 60166689
41716 60166689 52256306 48226867 48935375 51012874 49885469 42859555 31858619 23256686
41708 23256686 22508818 28272636 33576052 33184220 28206827 23250435 21115970 21364992
41700 21364992 22458583 23373067 23246691 20947964 16094271 10488148 7646434 9900026
41692 9900026 15873266 21580292 24226586 24301908 24007343 24906615 27622356 32393146 38539944
41683 38539944 43990622 46604146 45890191 42791221 38283023 33105849 28485005 26004180
41675 26004180 26648719 30503531 36988718 44392830 49461867 49178496 44017679 38559206
41667 38559206 37414027 40573365 44099631 45623677 47227815 51396034 55908500 55957238
41659 55957238 51196800 47183244 48503406 53627429 58735780 63589258 70112442 77289075
41651 77289075 81857907 83515947 85396571 89126149 92845212 94534438 94200078 92643510
41643 92643510 91484176 94391028 103854326 115728411 121739356 119758958 117477852 123007014
41635 123007014 135656722 149617397 163297955 180198139 202440636 228306596 255447448
41628 255447448 281665360 301618538 306923527 292668497 263291014 230499286 204579945
41621 204579945 187171136 172490251 155746386 138883578 126336437 117281172 106618723
41614 106618723 93182629 81203057 72323615 62704953 51455303 45162634 47961524
41607 47961524 52668775 49964686 42805206 42250003 50252591 56854446 56149914 55106050
41599 55106050 61551104 71055561 72731298 63778868 51578154 43401940 39990756 38854519
41591 38854519 38823395 40016533 42250207 44895755 47164574 48227888 47937318 47264466 47208275
41582 47208275 47577757 47552300 47031264 46772474 47506479 49356642 51924537 54844238 58387118
41573 58387118 63072167 68405401 73160430 77750446 84544900 93823628 101096834 101686771
41565 101686771 97388470 95237924 99613858 108672295 118451418 126428062 130126079 126717408
41557 126717408 116864696 106173209 100027622 98671720 99221954 100286733 102171304 104351954
41549 104351954 105591331 105826084 105772883 104994327 101824586 95053267 85233888 75158364
41541 75158364 69007932 69135722 73138235 76033664 75726435 73841734 70818889 64042248
41533 64042248 52892686 42120887 36870711 36558293 36885131 36226495 36792980 40474118
41525 40474118 46309419 51407369 52496447 48119000 41506710 39355665 44864107 53578217
41517 53578217 58929378 59723375 58496830 54932887 46588505 35535867 28156659 26934227
41509 26934227 27606216 26617827 26591223 30977495 37035678 38673270 34721214 30549681 31819832
41500 31819832 39266000 49175635 56532377 57949752 54008378 49099644 47162368 47380620
41492 47380620 45865819 41637874 38470997 39733842 43666244 45850267 44986236 43862387
41484 43862387 45385928 50261838 58269453 68668485 78758850 85555778 90742961 100671313
41476 100671313 118503519 139208099 156270731 171052191 190317114 215458135 239908073
41469 239908073 257788116 269750926 279229317 288795466 302389188 324616220 353049203
41462 353049203 375829804 382158752 372064810 351617229 323016280 286009603 245993190
41455 245993190 212528378 189595582 173304745 159223296 146195131 133134437 118817680
41448 118817680 106123109 100113941 99758080 97319302 88582555 78317217 72665803 71402815
41440 71402815 71275499 71816883 73299676 73455981 71486120 71603344 76883480 82603376 81897289
41431 81897289 75792560 70877046 68456608 63895082 57200709 55848391 63516734 72781121
41423 72781121 74383712 69282861 65691943 67102975 69588611 69830628 69239504 69041816
41415 69041816 67139802 62799816 60043049 62278357 66316904 66237423 61914714 59200189
41407 59200189 61731131 66837371 70331481 71204120 69953990 66363510 61806988 60404142
41399 60404142 64073884 68539483 67990816 62277462 55996303 51932656 49270899 46966455
41391 46966455 44373017 39309724 30528960 22053195 19719124 22688801 23932633 20554969
41383 20554969 17616428 19062553 21162574 19526728 17123200 19030445 23030309 22618198
41375 22618198 17666751 15046364 18533593 24204177 26898309 25996543 23174512 19158470
41367 19158470 15191108 14139106 17303459 22223496 25725126 27568110 29631436 32989284
41359 32989284 36939746 39658935 39339980 36377842 34639978 38113838 45432394 50139316
41351 50139316 47676931 40080398 32640947 28276802 26750193 26972099 27586557 26841631
41343 26841631 24437737 22679977 23663945 26004715 26396619 23902595 20667302 18669225
41335 18669225 17838748 17431151 17108161 16018146 12827258 8169388 5764145 8850296
41327 8850296 15274640 18070670 12614321 2736938 -2094649 3628169 15836648 25633321
41319 25633321 28411871 26910854 26314592 28544383 31469055 31973120 29207249 25612926
41311 25612926 24550627 26147392 26671995 23730185 20380923 20732081 22610529 19730808
41303 19730808 11918662 7399216 11710915 19390100 21781164 19378243 19682876 24442252
41295 24442252 26810385 22760712 18413070 21726001 31300560 38632038 39456328 37764178
41287 37764178 38620464 41535857 42819792 41465327 39618779 38222230 35607953 31702798
41279 31702798 30994274 37862104 49185324 55417004 51089516 41481081 35786984 35856775
41271 35856775 36019205 32910774 29648525 28896088 27591928 22577353 17288227 17196950 20404218
41262 20404218 18841234 9571934 -158887 -1548333 5429399 13033034 14875510 11084773
41254 11084773 5555837 1261498 -1243418 -2822226 -4397261 -5618234 -4180473 2528078
41246 2528078 13858888 24405148 27853284 23345564 16960537 15227909 17557624 17326673
41238 17326673 11047141 3678860 2314161 6417864 8376765 4010938 -1676813 -1704099
41230 -1704099 3079351 5547654 2632479 -669260 860363 4757592 4560079 -295964
41222 -295964 -2739364 2932501 13910502 22946608 26863698 27733225 27400206 25544602
41214 25544602 23483984 24897588 30025856 32905779 28445402 19924097 14768782 14120463
41206 14120463 12227746 6838742 4160433 10008246 20295552 25262667 21359676 14423269
41198 14423269 11659402 14621594 20370283 25554784 27854334 26485853 23412619 22108787
41190 22108787 23329793 23790356 20764486 16156719 13620927 13156694 11834551 9423658
41182 9423658 9544181 14090982 19750713 22352940 22299168 22621305 23186211 20759967 14894314
41173 14894314 9816091 8844103 10024588 9671091 7751284 6731317 6941901 6895709 7342879
41164 7342879 10639577 15534705 16991181 13402546 10500784 14779877 25104799 34319561
41156 34319561 38044889 38198888 37865005 36528057 32179295 25618250 20026533 17048086
41148 17048086 15571327 14603656 15335015 18935797 23323719 24223522 19959122 13778007
41140 13778007 10639828 12916745 19898468 29356591 37601353 40126426 35792750 29683422
41132 29683422 28211787 31582922 34787438 35680808 36933964 39123278 38071052 32210693
41124 32210693 27008889 27359509 30152727 29941579 28059485 29442606 33204223 33909582
41116 33909582 30952147 28964671 28986004 27075306 22940951 22145540 27010941 32481014
41108 32481014 34781115 37593202 44609441 51416254 50808298 42646894 32907916 25626621
41100 25626621 21034702 19545149 22189890 27917398 34697309 42569418 52044979 60497328
41092 60497328 63598156 59610831 49766043 36199201 22399538 13296119 11072132 12745362
41084 12745362 15339065 20710003 30876009 41716621 47428457 49111906 52024075 55539045
41076 55539045 53721345 46354986 41426837 44351236 51597888 57707641 61903869 64242989
41068 64242989 61894288 54360889 47169105 44995853 45526910 45559458 48675135 59709011
41060 59709011 74301333 81753985 78210956 70721751 67515697 69482007 72238660 71870034
41052 71870034 67027480 59107108 51971934 48756405 48166343 46712467 44691761 46110103
41044 46110103 51817775 56846948 56534124 51940502 47139389 44278805 43616639 45277424
41036 45277424 47961906 48443362 45465174 41847287 39473791 34881000 24534628 12714592
41028 12714592 8220709 13031602 20046383 23663525 26731631 33472265 40701988 41984356
41020 41984356 37889848 35705740 39091255 43658068 44138665 41225581 39081483 39954089
41012 39954089 44145343 52173248 63270342 73457750 78625914 78862102 77129572 74688712
41004 74688712 70733529 65653150 61177769 57499388 53841731 52120310 55840184 63772046
40996 63772046 68776359 66097977 60044286 58561345 62763568 66169582 64223988 60269854
40988 60269854 60461775 66143280 74154194 82780641 93828907 108704128 125419005 141163498
40980 141163498 156557078 175661605 201678055 232980686 262979600 283913811 292331482
40973 292331482 292133746 291291059 293953502 296113099 290137400 272650930 246412429 216076241
40965 216076241 185525041 158918758 139900862 127927831 118473258 108716740 100196744
40958 100196744 94117831 87733357 78646096 69792156 66233709 68806083 74279899 79662389
40950 79662389 82662781 80460378 72977163 65707752 64093761 66352800 67271835 67503097
40942 67503097 72100844 80351531 85306603 84995330 85907523 92071030 98409121 99662151
40934 99662151 98903708 101270104 105337571 107713942 111141382 119976769 131012798 137230266
40926 137230266 139011918 143654443 154594508 169239336 187733069 215186869 252162748
40919 252162748 289663317 317757172 334838993 344727337 347994033 340105844 317196135
40912 317196135 282044688 245124293 219080307 209339809 210470044 215006863 224492579
40905 224492579 245690483 275212501 295649390 292176869 268727648 242488089 225289740
40898 225289740 216009425 209871407 208895099 220791610 249985865 290927404 328920964
40891 328920964 347830611 339975068 310939604 274884745 244191266 222386531 205547366
40884 205547366 189314902 174105413 163648789 159495802 158848427 158204817 156722898 154371475
40876 154371475 149591042 142119099 135748145 133359784 130443373 119633960 102198965 88516384
40868 88516384 84801094 85665222 84007153 82603958 89402618 104286875 117283917 119664607
40860 119664607 112033813 101479901 94726367 94143101 96980751 98223677 96574731 96556454
40852 96556454 101643231 107255992 105794093 98197001 94365372 100268348 110225462 115666330
40844 115666330 117233655 122886725 135756540 149210067 154674006 150533524 141599560 132524616
40836 132524616 124495904 117438151 112395515 110368764 110133130 108886672 104936554 98708314
40828 98708314 91408258 84157123 78587256 76581122 78326671 81368387 82291898 79125320
40820 79125320 72632318 66544925 65704282 71199143 77228476 76245936 68424148 62305548
40812 62305548 63821569 68572839 68694848 63830550 59920105 59306681 58594078 56267682
40804 56267682 55865802 59462133 63297863 63044877 59458188 55521621 51500227 46914829
40796 46914829 44728130 48266852 54472764 55408624 48344990 40668387 41436662 49636885
40788 49636885 54632968 48942795 37334380 30803470 33735232 40907701 46341993 49720984
40780 49720984 52294738 52034872 47665274 43719788 45212487 48906219 46702063 37862980
40772 37862980 30878889 31083057 32953208 28844040 20399868 16018369 19862348 28489495
40764 28489495 36874921 42972418 46400682 46512919 43007387 36956698 31038709 29060982
40756 29060982 33343955 41011022 44991990 41215265 33428479 28726234 29942606 34698262
40748 34698262 39661833 42345401 40567138 34546012 29014862 29129329 34081985 38388474
40740 38388474 39675596 41210599 45760873 50905291 52567281 50310608 46736483 43740718
40732 43740718 42059069 43451676 50457365 63121572 77349928 88262388 95840484 105843405
40724 105843405 122967939 144160654 163119624 182076094 212233036 257029225 300341186
40717 300341186 320334115 313454782 295660265 280567894 268361844 259798866 267037971
40710 267037971 297735380 335006269 347898045 322902084 275237144 227915757 190071572
40703 190071572 159613595 136426139 123024404 116447113 109298074 99601421 93290823
40696 93290823 95231529 102364610 107924451 108968367 107044227 103942639 100286219 97517106
40688 97517106 97880220 101490390 105459541 107115953 106722871 105814844 104091823 99759107
40680 99759107 92504735 84399728 77716224 73230834 70842935 70331256 70757902 70194249
40672 70194249 67040888 61505384 55693996 52446249 53354210 56890956 59150196 57835762
40664 57835762 54779518 52815986 51558398 49427265 48746975 53770936 62737042 67272036
40656 67272036 62515063 53144854 45648289 39346833 30607052 22016108 19685665 22622351
40648 22622351 22581406 15698316 7656939 5059173 7401432 10549221 13034655 15076175
40640 15076175 15420378 13431593 11473249 11280847 10369762 5920662 85196 -2768681
40632 -2768681 -2491810 -2349742 -2654711 -21794 6499412 12881467 15457091 15746995 17853438
40623 17853438 22950873 28409374 31426448 31778379 31088643 30525675 29750198 27963031 25465877
40614 25465877 23546601 22828800 22469902 21132944 18067680 13480744 9100698 8004758
40606 8004758 11666691 16956843 18849075 17047502 16763832 21089459 26008494 26108466 22267438
40597 22267438 19404818 18625221 16655169 12429425 9034202 8297295 7949462 5789594
40589 5789594 3065106 1904919 2424686 4173995 7602285 11985342 14416286 13366404
40581 13366404 11434902 12009946 14385222 14755343 11756317 8832750 10317030 15900480
40573 15900480 19870496 16754987 8116449 2298089 5677999 15249098 22291465 22434075
40565 22434075 18635164 14628523 10259853 5008592 1619006 2637350 5914433 7057103
40557 7057103 4980340 2333977 1697946 3694826 7400833 10204224 8890742 3781337
40549 3781337 438175 3882909 11741518 16479186 14416200 9323247 6488417 6165386
40541 6165386 4422380 -1209010 -8395001 -11842147 -8191788 442559 8211142 11495280
40533 11495280 12222987 14110315 17113198 18110013 16403759 15354696 17659495 21404255
40525 21404255 22444229 19470969 15084380 12064074 9910100 6037293 223149 -3754809
40517 -3754809 -2587461 1423540 2668244 26061 -1081207 3954115 12892900 20439699
40509 20439699 24535743 25182658 20523825 9918013 -798493 -3795777 452154 3225882
40501 3225882 -608217 -6327678 -7344538 -4374193 -2946873 -5626123 -10880266 -16979521
40493 -16979521 -22543841 -24593219 -20414921 -11728210 -4195139 -2082675 -4754501 -8474011
40485 -8474011 -10647203 -12255007 -16211447 -22664549 -26587329 -22396236 -11225458 -694821
40477 -694821 3727416 4232410 5855678 9159775 10415493 7006346 64525 -6687381
40469 -6687381 -8773558 -3915289 4442934 8921403 6274192 1226632 -692302 -839974
40461 -839974 -3322411 -6053111 -2685901 6842826 14308324 13494241 7314662 2241573
40453 2241573 -131006 -2875126 -7888188 -13217572 -14986993 -10668457 -1948807 5179071
40445 5179071 5528598 564355 -3338645 -2737009 133054 2898222 6645329 11728532
40437 11728532 14423909 11609074 5843180 1873816 204853 -2008570 -5253703 -6825382
40429 -6825382 -5035802 -944093 3722900 7662583 9630921 9567971 9400199 10395191 10929213
40420 10929213 9572009 8830404 12222896 18649727 23585304 25244331 25327117 23852627
40412 23852627 18155837 8272786 -821852 -4210842 -1370194 5267102 12445082 15862309
40404 15862309 12323102 4422249 -737854 -113835 1479396 -1246782 -6732049 -10156916
40396 -10156916 -10716222 -10736256 -10257333 -7643401 -4053320 -2288259 -1947255 -448902 1552164
40387 1552164 584934 -3584576 -6917365 -6806420 -4501267 -1061075 4360421 10486795
40379 10486795 12936372 10364505 7923924 10842876 16934703 19301817 15215120 8749382
40371 8749382 4893133 4163829 3849165 2504569 1662721 3347766 6872920 9057523 7839241
40362 7839241 4485874 1255690 -1719263 -5390912 -9020655 -11056407 -11633847 -11043924
40354 -11043924 -7025664 1861591 10783870 12514110 7960281 6540747 13088075 20406425
40346 20406425 19642194 13001396 9784548 12931487 16471564 15420714 11966425 11093847
40338 11093847 14589129 20301703 24252755 23318465 18439185 14597068 15121826 17442647
40330 17442647 17353942 15216312 13873384 12756987 9436842 5535350 5133081 7878859
40322 7878859 9652623 9763485 11079870 12958741 11340191 7041354 6166860 9636235
40314 9636235 10111562 3626238 -2947952 -1906957 3655499 4988138 252394 -4988079
40306 -4988079 -7030270 -6927966 -5569163 -2203428 2234510 5335347 6948882 8982238
40298 8982238 11837231 14303721 16041379 16859256 14860526 8980396 2126719 -1968978
40290 -1968978 -3758205 -5877383 -7718428 -6676545 -3871593 -3623799 -7266500 -11933929
40282 -11933929 -15445254 -17912226 -18491952 -15446724 -10230760 -6984051 -6837019 -6812511 -5301623
40273 -5301623 -4217240 -4361694 -3168698 831046 5178013 7234495 7071545 4550417
40265 4550417 -2199679 -11989566 -17813328 -13508390 -1886522 7391520 7732600 1244198
40257 1244198 -4642112 -4007312 3392796 12668677 18362299 19346701 18931929 20138573 22323483
40248 22323483 22852867 20268736 15059895 9190421 5692629 6569382 9897709 11196442
40240 11196442 9217801 8199335 12225439 19128125 22746178 20614694 16828201 16652182
40232 16652182 19817568 20608631 14999226 6644894 3423023 7252640 10612792 6373811
40224 6373811 -1726736 -3864187 1748048 6280856 3055690 -3925383 -7448509 -6860232
40216 -6860232 -5431171 -3143248 1388203 5078146 3517744 -1292929 -2786539 779652
40208 779652 4599706 5313742 4942541 5609767 6000032 5659760 7992938 15167643 23226706
40199 23226706 26312120 24051887 21050409 19787993 17652414 11792542 4281908 489826
40191 489826 2981351 8603717 12084852 11583275 9581517 8679433 8325771 6609516 3824753
40182 3824753 2441811 3768513 6014136 6138292 3473661 1571051 5627946 16324202
40174 16324202 26458235 26796397 16743669 6322915 5025175 11164263 15611420 13925196
40166 13925196 10102489 8891251 9456587 8217712 4374792 498884 -350394 3104843
40158 3104843 8991707 12380741 9127089 828675 -6218649 -8278876 -8091990 -9750776
40150 -9750776 -11817812 -8492445 2623205 16067082 22787721 18775779 9301572 3886812
40142 3886812 6455343 11705475 12746225 10373220 11098991 16941492 22584020 24029668
40134 24029668 24296475 26538859 26275986 16851871 734420 -11188158 -12043625 -5314315
40126 -5314315 2334224 9047738 15777846 20938475 21739245 18792790 15244092 12106273
40118 12106273 7811924 1891009 -4033926 -8612606 -10994515 -8994827 -1020155 9291627
40110 9291627 14482836 11682143 6395238 5166573 7530989 8977067 9186690 11895794
40102 11895794 17248699 19987652 16653115 10014928 4225002 -486227 -5480316 -9374637
40094 -9374637 -9534393 -5882199 -151509 6867413 14251883 18942628 18686461 16101559
40086 16101559 15802891 17466605 15705616 7912168 -1173165 -4699798 -1292099 4659757
40078 4659757 8815343 10594287 11215195 10252306 6079464 -178620 -3274722 1058752
40070 1058752 10030174 15989984 15687250 13978700 16193523 20359808 20858034 17090296
40062 17090296 13469365 12121458 11041096 9312460 8487215 7697597 3016048 -5758523
40054 -5758523 -12412239 -11932920 -7407689 -5684448 -8521259 -11340275 -9002573 -124472
40046 -124472 12335825 21987730 22720282 15077030 7471276 7457650 12794887 14747755 9391047
40037 9391047 1446302 -3167620 -4163219 -4815526 -6836355 -9846844 -13438161 -16849462
40029 -16849462 -17869045 -14717492 -8557860 -1931375 4909440 13360815 21503273 22754777
40021 22754777 12328709 -5781404 -20960979 -25565178 -20681554 -12572279 -6377378 -4478646
40013 -4478646 -7687524 -14553091 -20773220 -22588917 -20592693 -17898431 -15355388 -11393863
40005 -11393863 -5913724 -945910 2402978 4245086 3278385 -2054566 -9218358 -12837273
39997 -12837273 -11781969 -10775263 -13027740 -15702774 -15392643 -13592325 -12873169 -11547144
39989 -11547144 -6877105 -575094 4042731 8130202 15053522 23441029 28151800 27844881
39981 27844881 26224104 25471391 23725909 20180091 17630996 17806348 18217233 16241567
39973 16241567 13267117 12127478 12519844 11385194 6865999 632367 -3023623 -577798
39965 -577798 6632705 12450607 12683400 10897829 13428523 19192699 20338895 14471781
39957 14471781 9686977 13229712 20474140 21277482 14093242 7117049 6629841 10572239
39949 10572239 13888340 14297145 11274571 4541554 -3789204 -9435438 -11061527 -12108225
39941 -12108225 -14964525 -16444896 -12414004 -4445472 2061227 4944414 6453759 8058343
39933 8058343 8204129 5591512 1083530 -4319398 -9962093 -13229194 -10827701 -4270832
39925 -4270832 -62532 -1294505 -2528503 2812489 12616304 18596349 17006442 11398212
39917 11398212 5414061 -847841 -6195846 -6526114 -1070737 4304563 4212937 831711
39909 831711 -136628 2232211 4167764 3515999 1428108 -1049144 -3697511 -4999651 -3335428
39900 -3335428 -180546 1434585 1370786 1701048 2079491 93603 -3606875 -5204548 -3830853
39891 -3830853 -3237818 -5430490 -6858963 -3726100 2410373 7451687 10188617 11493223
39883 11493223 10690861 6851798 2089511 -687330 -2489434 -6286487 -10337817 -8404706
39875 -8404706 1473109 12529617 16961616 15367419 14308882 15734003 14071539 5379429
39867 5379429 -5121203 -8635389 -3772589 2638289 5423275 6971611 11493596 17435000
39859 17435000 19339867 15494378 10150228 8394628 11189381 15261855 16130716 11985730
39851 11985730 6526585 6858767 15831830 27052263 30613293 24017343 14636435 10826487
39843 10826487 13347589 16703807 16631153 14379979 14460586 19405994 26837468 31745954 31511268
39834 31511268 27315201 20280355 9143504 -5777140 -18848530 -23378844 -18788620 -10290950
39826 -10290950 -2599864 2485964 3933950 2055747 778195 4026878 9467184 10876304
39818 10876304 7124387 3331839 2467668 2058542 798007 1670024 5536490 7920628
39810 7920628 5907762 2476342 96195 -3853046 -10458486 -14169286 -10426842 -3362053
39802 -3362053 355111 527811 -162494 -3331446 -10340482 -15487958 -13612776 -10930445
39794 -10930445 -17037395 -27875472 -29178818 -17971356 -7988140 -9407674 -14483058 -10333916
39786 -10333916 2603247 13172906 14948755 11214975 7862766 8082869 12175775 17257776
39778 17257776 18559230 14930278 10965067 10127613 8883793 2439527 -6223544 -8752241
39770 -8752241 -2077001 8276948 15448637 17496667 16102716 13148264 10065537 8001578
39762 8001578 7183384 7365507 9268733 14181482 21712447 28929376 32233468 30122399
39754 30122399 24521161 19155463 15530188 10931044 2345403 -7953377 -13695815 -12032769
39746 -12032769 -6532540 -1838116 1159140 3375756 4775727 6022819 9121973 13420648
39738 13420648 14719459 11894475 10353325 14105435 18158715 15193797 7385494 4128269
39730 4128269 8242012 11651972 6498995 -5274917 -15789631 -19906145 -17397045 -10474882
39722 -10474882 -2534086 2801900 4001011 2296177 -255263 -1658198 423137 6506262
39714 6506262 12531446 13167536 8847640 5716383 7336132 10475574 10979000 9748689
39706 9748689 10153552 12783359 15621631 16768689 14669709 8619458 1516723 -1035862
39698 -1035862 2801072 8500027 11533701 12453978 12307634 7795840 -3205565 -14574417
39690 -14574417 -17221296 -10335863 -1583489 2916517 3031409 160034 -4747229 -8372920
39682 -8372920 -6959972 -2326549 143367 484616 4039297 10552984 11691757 3783461
39674 3783461 -4691481 -4679326 802934 3222945 2472950 4991433 10908906 12991627 8190443
39665 8190443 1268685 -4223497 -10169467 -16647491 -18339608 -12325421 -3420153 2549002
39657 2549002 5672974 7964750 7614777 2697084 -3315459 -5674343 -5402844 -6556753
39649 -6556753 -8539564 -7264333 -2943887 -322803 -622162 809577 6822671 13173423
39641 13173423 13778240 8302682 1976750 -339533 1820554 4992394 5163695 1904891
39633 1904891 -727350 809986 4074415 3235073 -2683235 -8094053 -8843352 -7857045 -9816531
39624 -9816531 -13353089 -12627399 -5327838 4524318 11301622 12434503 8785920 3311748
39616 3311748 -370223 -413819 1672044 3247981 4021815 5529341 7794165 9209499 9825086
39607 9825086 11703308 14955682 16347572 13964231 11064656 12316641 17010018 18965120
39599 18965120 13683289 3474137 -5502027 -9840189 -11283233 -13279350 -16515939 -18085442
39591 -18085442 -14498549 -5251942 6468220 16420565 22277774 23841955 21396605 15737143
39583 15737143 10132798 9873084 17459210 28805961 36427699 36665435 32169500 27306193
39575 27306193 23454724 19700585 15865501 12850187 10983051 9599995 7783277 4876018
39567 4876018 1410929 314 3176756 9125772 12139592 9535006 5514170 4849527
39559 4849527 5102844 -52429 -10634456 -18811018 -18491973 -12009558 -5725497 -3032409
39551 -3032409 -3750762 -6657837 -9572080 -9490642 -5688016 -1346108 -208962 -3014805 -8204952
39542 -8204952 -13649222 -16360462 -13792997 -7848037 -4623599 -7242317 -11465855 -11441648
39534 -11441648 -7193645 -2928068 -468215 1290323 2142598 400042 -3762983 -8557565
39526 -8557565 -13163655 -16456663 -15035747 -7530989 390261 1300675 -3739149 -6382369
39518 -6382369 -3329306 -836811 -4324475 -9686584 -9368133 -2576015 5528210 11796264
39510 11796264 17241745 22792197 27326850 29544173 28677274 23943521 16030090 8587326
39502 8587326 5673426 7730777 11576195 13695433 12415791 8422321 4838552 5065399
39494 5065399 8516123 10347474 7702422 3951644 3573544 5093249 3624846 -770994
39486 -770994 -2623584 488828 4011011 2923644 -1772922 -5687793 -7069492 -7158544 -6613462
39477 -6613462 -4837893 -2016689 770377 3047101 4531619 3831382 -110120 -5252605
39469 -5252605 -7372491 -4474189 1129476 5595981 6868571 4584136 -1337049 -9973908
39461 -9973908 -18073992 -21763045 -20115517 -15621939 -10779747 -5929241 -1185539 1795553
39453 1795553 2239785 2848307 6638646 11540204 12036743 7372311 4124989 7481480 12916778
39444 12916778 11229469 874967 -9727480 -13024093 -10713412 -8859681 -8916129 -8270218
39436 -8270218 -7351909 -9971598 -15549422 -16434523 -6765332 8775553 19172334 18963442
39428 18963442 12203144 5253711 389072 -2257394 -1355872 3129248 6998193 5959961
39420 5959961 1705357 -304589 1253997 2242412 270993 -1289706 1190693 5487017
39412 5487017 6044847 892539 -6485093 -11048709 -10197790 -5285107 -1038531 -2227981
39404 -2227981 -9046926 -16665501 -20452322 -20135492 -17967760 -15481427 -13795358 -13959010
39396 -13959010 -14241930 -10367161 -2131361 3698295 2293870 -596778 3929896 13617580
39388 13617580 16992544 10455096 4034720 6260524 11986538 11918451 7427854 7077466
39380 7077466 12210390 15334611 12054728 6416955 3633293 4482986 8115012 13523724
39372 13523724 16117771 9754372 -3864534 -13560963 -11478114 -3237399 121501 -2980602
39364 -2980602 -4128675 2310009 12224166 17902349 15875237 7616459 -2857506 -10267580
39356 -10267580 -10878956 -6394986 -2355279 -1123095 301547 3749516 5469624 2114920
39348 2114920 -2230772 -567906 6631159 11204420 8081335 1037879 -4349138 -8654717
39340 -8654717 -15472995 -23330013 -25883618 -20121829 -10572498 -4382236 -4679416 -9610833
39332 -9610833 -15454867 -19006673 -18591132 -15035938 -11494055 -10813591 -12782942 -14645518
39324 -14645518 -14241629 -11904026 -9359428 -7694289 -6650232 -5162224 -2269837 1747542
39316 1747542 4788319 4618407 2150522 1864967 6930815 14320725 17442723 14300751
39308 14300751 10120087 9882261 11074067 7696436 123280 -4026919 29651 7573089
39300 7573089 10514678 7291623 3205071 2418668 3315012 2052557 -1888996 -4841762
39292 -4841762 -2824043 3872284 9716805 8610934 388794 -8656766 -12854503 -12924869
39284 -12924869 -12932205 -13885552 -13747925 -12242880 -11307581 -10941446 -8863708 -4955627 -1987680
39275 -1987680 -769774 1372354 5546083 8727219 8579616 6897400 5345687 2000841
39267 2000841 -3669655 -6416610 -1828570 5188030 5594668 -786006 -4787117 -1412338
39259 -1412338 3675080 4277155 3103535 5302189 7812557 3038308 -8663187 -17816054
39251 -17816054 -18130190 -13833581 -12313059 -14250802 -14675205 -10773312 -4587685 953479
39243 953479 5102719 7965153 8572416 5794775 748689 -2668944 -738930 5712748
39235 5712748 10718420 9042830 2818295 -226383 3763367 9825424 10864454 6633613
39227 6633613 2565250 1503997 1301743 430105 978800 4448935 8706752 11530622 13676926
39218 13676926 15554550 14260982 8009497 1105016 -291999 3728453 7705140 9292056
39210 9292056 11465119 15322617 16371731 11231225 3819444 482196 1392507 1346169 -1977916
39201 -1977916 -5196029 -5209687 -4082594 -5893550 -10903287 -15044006 -14553058 -9818751 -4937970
39192 -4937970 -4177656 -8452421 -14563307 -18027360 -17103853 -14016182 -12177289 -12755058 -14449956
39183 -14449956 -16037758 -17739133 -19661854 -20411538 -18954138 -17078186 -17440354 -18876436
39175 -18876436 -16813767 -10138941 -4468230 -4990361 -8282347 -6171408 2943965 12043523
39167 12043523 15341970 14396528 12385885 8604236 3090999 1354015 7830034 17572229
39159 17572229 21337598 17690686 13452144 12629483 12053377 9069985 6361348 6022846
39151 6022846 4883240 83709 -5099798 -5682292 -2180081 933008 1627240 1069141 -57881
39142 -57881 -1772079 -2610815 -1190426 882887 1250947 1054606 3026373 5718306 3865308
39133 3865308 -4491928 -14304174 -18215746 -13364516 -3421736 4423303 5016160 -144460
39125 -144460 -4443987 -4115269 -2798709 -5128258 -8318607 -5627838 2780504 9027463
39117 9027463 8609972 5934018 6435612 9319880 11774183 14731978 19447720 22860980
39109 22860980 22005039 19574161 19360841 19217505 14940743 8746509 6716700 9113199
39101 9113199 10803064 11025554 14533736 21670210 25592209 22650972 18171267 17540350
39093 17540350 18223560 16079341 13602577 15004095 17583286 15677918 10478895 8266557
39085 8266557 10355380 12353214 12936367 15609698 20750127 23263060 20481520 15925948
39077 15925948 12254887 6656805 -2510760 -9707146 -8352274 -65406 7045727 7455921
39069 7455921 1785610 -6431178 -13105634 -14195900 -8672209 -925022 3274046 3309644
39061 3309644 3359527 5692718 7459990 4835525 -1858982 -8000223 -8769617 -3862864 1062709
39052 1062709 -828752 -9707631 -17810745 -18134575 -12256134 -6627791 -3645077 -957764
39044 -957764 1954989 2362514 -75185 -1544516 173318 2146775 478574 -4822345
39036 -4822345 -10298108 -11532433 -5006123 8324082 20525894 22828830 16266111 11262273
39028 11262273 14078580 19072224 18176002 12382992 7974840 5939120 2705348 -952713
39020 -952713 265982 7417212 15072220 18800452 19241607 17799868 14048781 9237404
39012 9237404 7110374 8677223 10398985 9812260 8685618 8183316 5603621 -357346
39004 -357346 -5058208 -3280582 3315666 8493069 9462181 8389120 7156627 5148149
38996 5148149 2245497 125359 -282148 129346 755055 2012136 3133283 1425832 -4674710
38987 -4674710 -12533754 -16417933 -12298114 -2237444 6310906 7395353 3290327 2129816
38979 2129816 7899569 15961750 20700945 23566124 28595749 32791344 28272540 14593377
38971 14593377 1950904 -1065542 2357982 3598295 972426 89565 3715133 7412383
38963 7412383 6295420 1615178 -1728923 -1589151 45842 696377 -160300 -2313130 -6379009
38954 -6379009 -12748720 -19558114 -23135519 -21073273 -14429390 -6759795 -1730275 -1700014
38946 -1700014 -6786232 -13802716 -17519373 -15293809 -9932029 -5926105 -3804120 -1067896
38938 -1067896 2301344 3819086 4282435 7914150 14071983 14364746 3352329 -11524377
38930 -11524377 -17309021 -11499802 -4143859 -3764235 -7712806 -8701120 -5276701 -1891092
38922 -1891092 -2150299 -6077853 -12045319 -17782586 -20371836 -17937513 -10995748 -997312
38914 -997312 10725877 21049252 24748025 19379996 9354007 2273182 1801353 6078780
38906 6078780 11467352 14745087 12998957 5610157 -3336046 -8162729 -8058535 -7779847
38898 -7779847 -11296836 -17394915 -22273368 -23741909 -21724495 -17101576 -11543292 -6825401
38890 -6825401 -3435251 -1270286 -1343294 -3957404 -5406519 -847849 8143024 13345189
38882 13345189 10016549 3462269 1998628 6617165 11753323 13604046 12876558 11096642
38874 11096642 9301817 9490218 12272017 13381310 7804927 -2029775 -7410414 -4298278
38866 -4298278 1487574 2259675 -2451831 -7556925 -9646684 -9133938 -7376286 -5012362
38858 -5012362 -2363634 484052 3239776 4311764 2110213 -1590963 -2188988 2237755
38850 2237755 8510667 13295035 17611248 23687577 29717596 31185965 26314065 17521128
38842 17521128 8438690 1669064 -1701516 -2643507 -3397175 -4630516 -4771457 -3280901
38834 -3280901 -2128317 -2439120 -2793794 -2922451 -5097218 -8689624 -8027972 -771360 5807265
38825 5807265 3678976 -3799616 -6314555 -1322553 4171762 5995573 7522035 10459724
38817 10459724 10351740 5098608 -86850 -991999 -615625 -1953171 -1551168 3204439 6454898
38808 6454898 1509852 -7973593 -12522168 -9848937 -5484100 -2450366 1226528 5160235
38800 5160235 5395580 2294973 2230128 8339169 15450992 17728680 16483686 16109435 15778019
38791 15778019 10326287 -1447629 -13416169 -17994426 -13460242 -4474774 3569002 8937531
38783 8937531 11754493 10105104 1701506 -10217590 -17075967 -13986378 -5529038 874784
38775 874784 4447607 9397014 16018619 19377283 16937453 12339899 10223942 11003150
38767 11003150 12085376 11424035 8831298 5830345 4402744 4145038 1704954 -4606124
38759 -4606124 -11471799 -15138539 -17023616 -20158765 -22331883 -19064363 -12291878 -8927059
38751 -8927059 -10535782 -11688090 -9630898 -7936961 -8281651 -6484391 -805842 2687829
38743 2687829 -1782151 -11363066 -18887710 -20952544 -17848702 -10675542 -2878743 550676
38735 550676 -23033 1793461 7535747 8981045 714412 -8933754 -8294470 1060424 7620801
38726 7620801 6422787 2361818 -691480 -3533021 -4793757 -846712 5929364 7775841
38718 7775841 2603194 -3300154 -5284401 -5299259 -5175400 -3334852 -869876 -2529477 -7956877
38709 -7956877 -9935032 -5748182 -2344153 -4579526 -5944041 1497008 13678924 19404044
38701 19404044 15273412 8149870 4703894 5253026 6959336 7431931 5670105 3705421
38693 3705421 5981896 13164273 18830646 16995677 10548408 6790990 6808211 5821764 2977366
38684 2977366 3451660 9833767 17609332 20969222 18126323 9697220 -2573718 -13295743
38676 -13295743 -15173910 -7053807 3411712 8412288 8181236 7685900 8749888 9588833
38668 9588833 9611949 10000467 10536423 9890388 8597452 8149139 7424603 3739760 -2247533
38659 -2247533 -6229930 -5597008 -1753482 3660372 10724480 17487185 18841102 13234409
38651 13234409 7049757 6893030 9758185 7501698 426818 -1608263 6169051 15618265
38643 15618265 17452662 14003366 12963808 13681067 9340536 450341 -4650596 -3789452
38635 -3789452 -5013606 -12580192 -18081819 -12452622 -374948 5456683 1059110 -5537241
38627 -5537241 -6324791 -1788257 2884044 4492391 3397449 1884656 1823073 2016621 -1187781
38618 -1187781 -8355382 -14121785 -13522992 -9159181 -7425380 -9217055 -9999105 -8303937
38610 -8303937 -7520018 -8431009 -6968110 -2216953 -291849 -5472872 -12182970 -11642823 -3909195
38601 -3909195 2632775 2915769 691724 1509694 4980344 6641419 4672298 1650774
38593 1650774 592263 1828726 3997486 6187265 8140803 9436142 9716898 9420513
38585 9420513 9395656 10116068 12003100 15596224 19880768 21579738 18991106 16160312 19281833
38576 19281833 27885682 33856290 31623907 25048712 20379723 16634174 8995024 -970036
38568 -970036 -6140506 -4910957 -4045839 -8223920 -12806039 -10525127 -990486 9972829
38560 9972829 16988347 17832016 12635519 4132668 -3200654 -7144989 -9307875 -11094887
38552 -11094887 -11160000 -9150334 -8153587 -9699745 -9872044 -5242797 260041 362278 -3550992
38543 -3550992 -4277533 -350629 1546007 -2562256 -7548067 -7253521 -3257705 -739732
38535 -739732 -19972 1889692 4191735 3416896 707938 1288535 5635125 7333990 2483878
38526 2483878 -3902457 -4975746 -1732802 -587972 -3450391 -5720410 -3804388 522161
38518 522161 4178240 6623505 7730030 5711181 14847 -6330023 -9940841 -10666642
38510 -10666642 -9766243 -6990918 -2414811 1087231 1007743 -357504 1565794 7222564
38502 7222564 12645551 15264427 16141880 16077986 13460176 7426711 18429 -6506217 -11912756
38493 -11912756 -15870481 -16084081 -10903780 -2393744 5287056 9878440 11978811 12733357
38485 12733357 12122885 9773215 6779412 5947857 9174625 14277480 16072589 12064591
38477 12064591 5701753 2190714 2709689 5189300 8731737 13177964 15496529 11857681
38469 11857681 4013707 -1066681 493760 5381693 8665682 9369979 8652255 6708089
38461 6708089 4397275 4439112 7620367 10306016 8767444 4030588 -90567 -1851246
38453 -1851246 -2236556 -2691283 -4116003 -6201773 -6489574 -2765583 2483758 3711699 91873
38444 91873 -2724035 -1095010 1302044 267242 -1984639 -1808138 -1362080 -4246906 -7256492
38435 -7256492 -3868722 5660531 14654749 19563949 22382209 23978864 22183492 17410397
38427 17410397 13609225 11912316 9110023 4310544 1546577 3279751 6299409 6994016
38419 6994016 6440034 7128674 8166085 7007272 3574627 125384 -1067309 1584316
38411 1584316 8056158 14934959 17230693 13713523 8173367 4214368 1697406 -232452
38403 -232452 -71221 3344085 7444064 8181142 4620097 -617973 -4536548 -5984475 -5461453
38394 -5461453 -3634465 32836 6227311 12283917 12122422 3284631 -7545095 -11024381
38386 -11024381 -6727835 -2606301 -2462493 -820779 6918121 15649591 17005105 10555695
38378 10555695 3451371 1359393 4087103 8136757 9467587 5221812 -3450926 -11037795
38370 -11037795 -12911795 -10050413 -6620999 -4672844 -3299191 -877366 4138588 12219931
38362 12219931 20130680 22120447 16672614 9223348 5037334 2696180 -1378485 -5523083
38354 -5523083 -5512232 -2170468 -23125 559759 3526915 9325247 12933089 10991014 5829928
38345 5829928 767364 -4049610 -9029052 -12328098 -12279437 -9886003 -6709898 -2524205
38337 -2524205 2936936 7638281 8510182 4316332 -3224432 -10061387 -11938118 -8153583
38329 -8153583 -3282485 -2685493 -6051101 -8122058 -6338198 -4584875 -7868545 -15914347
38321 -15914347 -23966847 -27961946 -26936799 -21832224 -14165217 -5699223 1648371 5667440
38313 5667440 4271630 -2139768 -8622646 -8606305 -695505 8756920 11689327 6508981
38305 6508981 -947507 -4178442 -2405410 45756 -310398 -2156226 -1949751 614235
38297 614235 1795026 -1146767 -6165507 -8900088 -7087292 -1107272 7485433 15377736
38289 15377736 17567429 11910892 2978748 -2242787 -2390041 -2002878 -3839827 -5141716
38281 -5141716 -2829314 1468401 3984269 3627363 1616064 -1633967 -6309554 -10864825
38273 -10864825 -12749642 -11853529 -11387124 -14248147 -19035262 -20812792 -16582386 -9341228
38265 -9341228 -4917324 -4541873 -3083760 3824732 13498450 19681352 20091246 17050267
38257 17050267 12565652 7374520 3888411 4744864 7866819 7797958 3093658 -2063783
38249 -2063783 -4678436 -6289302 -7672538 -5859341 -104675 4062365 1808193 -3284045
38241 -3284045 -3805247 1240596 6237526 8086360 9873672 14292069 17890022 14692846
38233 14692846 3764368 -9052470 -16769722 -17573899 -15039253 -12486959 -9011566 -2791143
38225 -2791143 3589153 5219793 2104046 -621808 -1058007 -3567538 -10069187 -13839873
38217 -13839873 -8064049 2915803 8095829 4422508 -112764 1470291 6614433 8871130
38209 8871130 6272011 554069 -7430446 -16832010 -23844085 -24493375 -20050773 -16010036
38201 -16010036 -15213934 -14840409 -11170231 -4838166 672461 4237401 7884259 12287361
38193 12287361 14593870 12757513 9756101 10127959 13241610 13955030 10301940 6389362
38185 6389362 6129336 8110326 9364149 10669080 14360175 19234462 21423379 18817791
38177 18817791 11648912 984761 -9669520 -13910008 -8811142 -488611 1974763 -2470167
38169 -2470167 -7023756 -7315867 -5159003 -2092512 3123970 8377774 7364973 -333559
38161 -333559 -4679135 2871394 17069041 25375424 23995461 20049513 18808197 16756981
38153 16756981 9409874 -429435 -6358620 -6660580 -4750121 -3181890 -1060540 2779493
38145 2779493 6964773 8876219 7343450 3529672 325872 1357851 8927995 21005133
38137 21005133 30796801 31936613 25320029 18923863 18994981 22915896 23323801 18106964
38129 18106964 12568783 11383374 12409466 10506426 4511968 -2177928 -5857256 -4709224
38121 -4709224 1363848 9971728 16399623 17690974 16077284 15543651 15742478 12967172
38113 12967172 7148624 3447211 5023172 7922916 6293394 281780 -4887495 -6418357
38105 -6418357 -6478917 -7073761 -6376371 -2139008 4007139 8504154 10740626 12964875 15622208
38096 15622208 15858688 11729434 5568942 1457842 868124 2612300 5704286 9700932
38088 9700932 12750570 12290117 8461828 4451358 2163159 -225369 -4292510 -6756083
38080 -6756083 -2392716 8005452 15791567 13000603 1483934 -8999791 -11682550 -9206290
38072 -9206290 -8249635 -10452750 -11495963 -7957821 -1528610 4054223 7085497 7526384
38064 7526384 5322628 1218582 -2731678 -5548831 -8405712 -11383117 -11671606 -7994116
38056 -7994116 -4294859 -4717021 -6625905 -3856735 3700927 9583134 10533988 10723187 13756638
38047 13756638 16095297 12708243 5528366 1654786 5043051 13416757 21671485 25467495
38039 25467495 23465471 18856111 16611979 16700390 13038784 2536868 -8413942 -11499980
38031 -11499980 -7663539 -4504455 -4240331 -1575367 6063899 13494101 15644463 14762178
38023 14762178 16162295 20735583 25096092 26335142 23834838 18884191 14890462 15334022
38015 15334022 18950077 19423787 12704897 2622288 -3564653 -3566932 -1365903 -1464179 -4360899
38006 -4360899 -6881428 -5174053 1533060 8848507 10796564 7039546 3914434 5930915
37998 5930915 9308403 7764864 2186839 -600327 2383276 7316603 10875525 14883106
37990 14883106 21207840 26359769 24990359 16749396 6500254 -1174845 -5061559 -5781754
37982 -5781754 -4196467 -1943412 -1430958 -3758837 -7208713 -8912252 -8049219 -6510190
37974 -6510190 -6011055 -5628060 -3556254 -666875 -5409 -2247040 -4114712 -2829553 126602
37965 126602 2004054 3526754 7235878 12002674 13058174 8156847 804817 -3623878
37957 -3623878 -2861560 1592268 6309613 7756729 4854564 837614 337366 3609492
37949 3609492 6023939 4401410 1135394 251255 1965176 3561220 3573702 2350319 -7487
37940 -7487 -3352581 -5992899 -6154160 -4583132 -3583496 -3934918 -4706345 -5396736 -5983154
37931 -5983154 -5348396 -2193161 2331253 4965549 3637831 -1008343 -7032823 -12299820
37923 -12299820 -14486563 -12285694 -7022495 -1468260 2995571 6428744 8027211 6324829
37915 6324829 2066794 -1625685 -3014795 -3756194 -6055820 -9429250 -11472929 -10694112
37907 -10694112 -7648482 -4226114 -2331436 -2114845 -1150976 3122480 9615569 13945235
37899 13945235 13415077 9804115 5910875 1294079 -6087364 -14863451 -19865662 -17799267
37891 -17799267 -11552586 -7110421 -6781717 -7593588 -6945797 -7196199 -11682189 -17681028 -18329105
37882 -18329105 -12875888 -9924742 -16462401 -27320474 -30967453 -23837893 -13167855 -6523200
37874 -6523200 -4769812 -5750725 -8272041 -10208605 -8332369 -3170012 314000 -447003
37866 -447003 -2318172 -2351641 -2164575 -3602552 -5264658 -6902613 -11590534 -18691127 -20421922
37857 -20421922 -12074904 -1151003 1115327 -5918390 -13749329 -17261920 -17522109 -14672652
37849 -14672652 -7747993 -900529 -41390 -2528973 315194 8949807 13764224 10164053
37841 10164053 5198416 4574190 3355269 -3341744 -9468079 -7077378 520037 4659396
37833 4659396 5506001 9629079 16226824 17105715 10616960 5352340 7471246 12652416
37825 12652416 14053660 11498496 8806710 7417797 6907840 7682697 8863243 6524530
37817 6524530 -1726148 -12199295 -18684806 -19348221 -17098435 -14275680 -10414050 -5275214
37809 -5275214 -975674 317962 -692719 -1178327 616486 3747886 5981612 6123924
37801 6123924 4868149 4070552 5624105 10178210 15873941 18981627 17437387 13580585
37793 13580585 11584204 12270061 12824843 11822694 11213177 11912164 10979482 6200321 777957
37784 777957 -535121 1410216 1126057 -3471795 -7916305 -7216576 -2088944 2647647 4270325
37775 4270325 4861122 7925275 13296078 16426813 13583530 7020227 2851420 3605584
37767 3605584 5641266 4926038 2110618 -194501 -1847229 -3724771 -4756660 -4278222
37759 -4278222 -4911496 -8586853 -11486342 -7969601 1253880 9569803 12511668 10799358
37751 10799358 6180581 -188366 -5056724 -4569264 186378 3946045 4614630 4813795
37743 4813795 5193653 2379991 -4079241 -8887688 -8755141 -7446694 -8669767 -9081179 -4083589
37734 -4083589 3383493 6410732 4229818 2275854 3032706 3043727 -438989 -5379202 -9282360
37725 -9282360 -13221000 -18966187 -24991124 -28141237 -27895490 -26555569 -25579536 -23819417
37717 -23819417 -20100480 -15916290 -13462673 -11395668 -5759563 3286891 9172394 7196193
37709 7196193 2440468 3706091 10748439 14558241 10994434 6337857 6449816 8263153
37701 8263153 7077457 5015318 5108426 3178812 -5168808 -13556304 -11451047 -689803
37693 -689803 4964746 -1841482 -13280772 -18536945 -16481687 -12254487 -8479217 -5243918
37685 -5243918 -3602117 -3648697 -2535020 1295216 5060390 6387575 7189037 8619448 6454628
37676 6454628 -2636193 -13283044 -16627525 -11960659 -6544408 -4275621 -1652009 3656683
37668 3656683 7370763 5584392 1828891 1982073 5332934 6158624 2765569 -360688
37660 -360688 402326 3427737 6092232 9483383 15852926 23414571 26823527 22674568
37652 22674568 12844428 2584082 -3602261 -4705971 -3064154 -1379953 285420 3461710
37644 3461710 7303892 8590399 7245055 8373526 15089978 22021734 21273028 13616347
37636 13616347 7570112 7067016 6871500 2541333 -1867649 -717681 3879252 5625851
37628 5625851 3577511 1925191 2102428 1174694 -2265988 -5759227 -6900993 -5654299
37620 -5654299 -2681518 1105484 3662744 4062073 5100628 9820861 15859866 17368226
37612 17368226 12493566 5069239 -899516 -4342276 -5167867 -4014200 -4078237 -8218764
37604 -8218764 -13641626 -14333051 -9307260 -3169859 1963958 8568989 16174051 19143303
37596 19143303 15696494 12386828 14384893 17002332 13140576 4713192 -460885 -526686
37588 -526686 -1403638 -7722491 -17756862 -26788716 -30416562 -25378690 -12765339 -607865
37580 -607865 2085377 -4896210 -13136601 -16055721 -14864996 -13328007 -11682746 -8516183
37572 -8516183 -5028080 -3958930 -5962148 -9498304 -13001207 -15048515 -13606158 -7624906
37564 -7624906 664409 6955173 8957686 8197733 7164659 5845863 2689554 -1342374
37556 -1342374 -2204202 2254376 8722780 12399831 13176956 14614648 17724544 20075410
37548 20075410 21036068 22674797 23982063 19748226 8514961 -2988155 -7480664 -5449694
37540 -5449694 -1732770 2084516 6430420 8410481 4438590 -3450499 -10110870 -14803634
37532 -14803634 -19981120 -23955007 -22326043 -16782680 -14442447 -16597678 -15834927 -7743054
37524 -7743054 1544444 4377765 2405022 2290997 4486677 2991555 -4778192 -13374704
37516 -13374704 -15331988 -8815955 1171114 7633113 7841729 5532119 5984626 9082421
37508 9082421 9742228 5371134 -947482 -5920199 -10192075 -14491991 -16259279 -14219004
37500 -14219004 -12470086 -14895112 -18266194 -16443283 -9489366 -2739398 1882923 6920565
37492 6920565 11738048 11156632 4193686 -2115649 -1713522 2322662 3307366 1054904 778869
37483 778869 3674343 4868000 1608771 -1810118 -213680 4691869 6472053 2700212
37475 2700212 -1989835 -2122610 1968410 5309795 4704993 1980795 925464 2611971
37467 2611971 4573768 3949759 653367 -2483637 -2265498 2109841 8274462 12248918
37459 12248918 11108379 5158636 -1740079 -4557203 -1147767 5642346 10580013 10799041
37451 10799041 7256523 2210598 -2430559 -3979301 575522 10546160 19820379 21941753
37443 21941753 16313087 7679098 918544 -1543060 705416 5350061 7282902 3390194
37435 3390194 -2670075 -4365914 -1141144 783512 -2737222 -8359994 -10377501 -7548418
37427 -7548418 -2732854 1140527 2596431 1773698 965744 2629149 5628677 6329560 4277146
37418 4277146 2842772 2945146 1163884 -3362932 -5706312 -3098453 -1133984 -6376084
37410 -6376084 -16608372 -24693324 -29088399 -33475753 -37765380 -37191649 -30670706 -23342820
37402 -23342820 -19453721 -18088573 -17155057 -16563736 -16075556 -14491418 -12211265 -10526306
37394 -10526306 -7950888 -2185492 3702605 2988983 -5023341 -12845939 -14837346 -13504239
37386 -13504239 -12387772 -8858920 421364 11446383 16933106 16208985 15056537 16781575
37378 16781575 18802289 17834739 13663448 7383011 52612 -6040298 -8266847 -7092746
37370 -7092746 -6118537 -7534544 -9376594 -8216974 -3228689 3025020 6825377 6106874
37362 6106874 2020057 -2093331 -3747412 -3035349 -1204126 1056899 2934697 2673018
37354 2673018 -790526 -6216983 -11493512 -15597434 -17677777 -15666010 -8208759 2531667
37346 2531667 12001269 16962669 16902521 12950881 7346214 2915507 714767 -1233852
37338 -1233852 -4734708 -7862667 -7330189 -3809307 -1609470 -2723656 -4361389 -3526130
37330 -3526130 -1328484 -917897 -2855145 -4466029 -3158956 832925 4790567 6095380
37322 6095380 4696230 2937157 2669982 3340363 3732118 4254778 5652456 6605369 5381824
37313 5381824 3455280 4251152 7773065 9697501 7257762 3227381 1868849 2974321
37305 2974321 2607094 -1105399 -5328328 -5869722 -1945713 2650004 3001689 -1669235 -6233560
37296 -6233560 -4645571 2797562 9021461 8109259 1800728 -3692613 -5644930 -6886713
37288 -6886713 -10586525 -15906879 -19594841 -19883270 -17623517 -14670904 -12330442 -10959026
37280 -10959026 -10002159 -7957777 -2704765 6972851 18997281 27505021 26822860 17139983
37272 17139983 4911229 -3700864 -8366215 -11769004 -13188919 -9004260 98063 6950960
37264 6950960 5955924 538450 -1396654 1807470 4013676 1100862 -2423205 222926
37256 222926 8197294 13990539 13420202 10107111 8960427 9223706 6797533 1059555 -4112292
37247 -4112292 -5568821 -4349594 -3602514 -5005509 -7816079 -10182401 -10901184 -10569716 -10909511
37238 -10909511 -12238865 -12215766 -8328172 -1146457 6265229 11525975 13764797 12102014
37230 12102014 6212917 -1183372 -5184739 -3452655 1608463 6241988 8920464 9656328
37222 9656328 8263100 5237590 2575966 1656421 1556267 1106230 1085205 2545078 4638130
37213 4638130 6342507 8662991 12347820 14913055 13352419 8875253 5172290 2466424
37205 2466424 -2242719 -8513039 -11082064 -7540216 -3143758 -4268593 -9905379 -13782361
37197 -13782361 -13176023 -11146475 -10515026 -10099823 -7999791 -5151198 -3839788 -4958547
37189 -4958547 -8236746 -13105953 -17688215 -18914134 -15878863 -11728906 -9819101 -8887860
37181 -8887860 -4682869 3921626 13169325 19036417 20763579 18942409 13399692 5550941
37173 5550941 422029 2375380 9090682 13166096 10456900 4170682 -376640 -2485650
37165 -2485650 -5537762 -11379017 -17644530 -20429115 -18166559 -12986032 -9059661 -9138980
37157 -9138980 -12021893 -14164300 -14325178 -15121814 -18726234 -22742840 -22727988 -17896160 -11740920
37148 -11740920 -7410985 -5277393 -5133195 -7497817 -11373434 -13395752 -11345598 -6893357
37140 -6893357 -3023610 -264518 2401280 4242927 3366186 483404 -757497 1684325
37132 1684325 5393776 6875795 6517775 7886552 12079027 15240132 13463803 8765784
37124 8765784 7343766 11637670 16989510 17758596 14154604 10241776 7296912 3382160
37116 3382160 -1148974 -2680239 -121680 2732368 2950674 2652385 4258620 5115458 1393996
37107 1393996 -4826580 -7418326 -4483998 -211191 1479807 645586 -1850948 -6497078
37099 -6497078 -12221468 -15255408 -13668049 -10471717 -9719126 -11505794 -13035107 -12681823
37091 -12681823 -10551998 -6624000 -1165259 3619878 4799390 1860939 -2417116 -4090316
37083 -4090316 -802922 6264728 12480981 13360488 9099801 4051469 1091800 -1003501
37075 -1003501 -3426174 -4071023 -1395889 1246862 -731859 -6592006 -11446382 -13315730
37067 -13315730 -14953032 -18603036 -22672945 -24145468 -21252420 -13663187 -3383029 4418010
37059 4418010 5404352 1782821 344352 3848112 8295179 10003792 10640807 12480156
37051 12480156 13180125 9781797 5137312 5388557 11736027 18523175 19652597 14507020
$$ [...]
##END NTUPLES=NMR SPECTRUM
##END=
