##TITLE=31Pdec_LR-691-H1-C2
 CDCl3, 64 sc
 11.9.2024
##JCAMPDX= 6.0         $$ Bruker NMR JCAMP-DX V2.0
##DATA TYPE= NMR SPECTRUM
##DATA CLASS= NTUPLES
##ORIGIN= UXNMR, Bruker Analytische Messtechnik GmbH
##OWNER= root
$$ XWIN-NMR		Version 3.5
$$ Wed Sep 11 13:53:21 2024 Russian Standard Time (UT+4h)  she@DPX200
##.OBSERVE FREQUENCY= 81.013821
##.OBSERVE NUCLEUS= ^31P
##.ACQUISITION MODE= SIMULTANEOUS
##.ACQUISITION SCHEME= undefined
##.AVERAGES= 64
##.DIGITISER RES= 17
##SPECTROMETER/DATA SYSTEM= spect
##.PULSE SEQUENCE= zgpg30
##.SOLVENT NAME= CDCl3
##.SHIFT REFERENCE= (INTERNAL, CDCl3, 0, 198.062)
##AUDIT TRAIL= $$ (NUMBER, WHEN, WHO, WHERE, WHAT)
$$ ##TITLE= Audit trail, XWIN-NMR		Version 3.5
$$ ##JCAMPDX= 5.01
$$ ##ORIGIN= Bruker BioSpin GmbH
$$ ##OWNER= she
$$ F:/spectra/data/she/nmr/P31/2/pdata/1/auditp.txt
$$ ##AUDIT TRAIL=  $$ (NUMBER, WHEN, WHO, WHERE, WHAT)
(   1,<2024-09-11 13:52:35.82 +0400>,<she>,<DPX200>,
      <continue with go, POWCHK disabled, PULCHK disabled
       configuration hash MD5:
       00 E9 B6 7A A2 85 ED C7 34 08 36 98 17 FE 4E 26
       data hash MD5: 32K
       FF BD 57 F2 31 18 55 5C 9C F6 A9 64 1C B0 83 D1>)
(   2,<2024-09-11 13:52:38.53 +0400>,<she>,<DPX200>,
      <Start of raw data processing
       efp BC_mod = 2 LB = 1.5 FT_mod = 6 PKNL = 1 PHC0 = 2715.623 PHC1 = 11.48747 SI = 64K 
       data hash MD5: 64K
       B8 17 C1 6F 5E 00 BE 18 0D DD 7C 14 A0 6B D3 D1>)
(   3,<2024-09-11 13:52:53.15 +0400>,<she>,<DPX200>,
      <abs ABSG = 5 
       data hash MD5: 64K
       8D 27 18 D4 01 C5 4B 3C 82 82 8C 6B 26 56 B3 0E>)
$$ ##END=
$$ 
$$ hash MD5
$$ E0 E2 96 5D 50 3E 8C D2 A5 D0 12 27 89 F1 57 C9
##$RELAX= 
##$RELAX= 
##$RELAX= 
##$RELAX= 
##$RELAX= 
##$RELAX= 
##$RELAX= 
##$RELAX= 
$$ Bruker specific parameters
$$ --------------------------
##$DU= <F:/spectra>
##$EXPNO= 2
##$NAME= <P31>
##$PROCNO= 1
##$TYPE= <nmr>
##$USER= <she>
##$AMP= (0..31)
100 100 100 100 100 100 100 100 100 100 100 100 100 100 100 100 100 100 
100 100 100 100 100 100 100 100 100 100 100 100 100 100 
##$AQSEQ= 0
##$AQ_mod= 1
##$AUNM= <au_zg>
##$AUTOPOS= <>
##$BF1= 81.014009
##$BF2= 200.13
##$BF3= 200.13
##$BF4= 200.13
##$BF5= 200.13
##$BF6= 200.13
##$BF7= 200.13
##$BF8= 200.13
##$BYTORDA= 1
##$CFDGTYP= 0
##$CFRGTYP= 5
##$CHEMSTR= <none>
##$CNST= (0..31)
1 1 145 1 1 1 1 1 1 1 1 1 1 1 1 1 1 1 1 1 1 1 1 1 1 1 1 1 1 1 1 1 
##$CPDPRG= <waltz16>
##$CPDPRG1= <>
##$CPDPRG2= <waltz16>
##$CPDPRG3= <>
##$CPDPRG4= <mlev>
##$CPDPRG5= <mlev>
##$CPDPRG6= <mlev>
##$CPDPRG7= <mlev>
##$CPDPRG8= <mlev>
##$CPDPRGB= <>
##$CPDPRGT= <>
##$D= (0..31)
0 1 0 0 0 0 0 0 0 0.06 0 0.03 2e-05 3e-06 0 0 0.0002 0 0 0 0 0 0 0 0 0 
0 0 0 0 0 0 
##$DATE= 1726048275
##$DBL= (0..7)
120 120 120 11 120 120 24 19 
##$DBP= (0..7)
150 150 150 150 150 150 150 150 
##$DBP07= 0
##$DBPNAM0= <>
##$DBPNAM1= <>
##$DBPNAM2= <>
##$DBPNAM3= <>
##$DBPNAM4= <>
##$DBPNAM5= <>
##$DBPNAM6= <>
##$DBPNAM7= <>
##$DBPOAL= (0..7)
0.5 0.5 0.5 0.5 0.5 0.5 0.5 0.5 
##$DBPOFFS= (0..7)
0 0 0 0 0 0 0 0 
$$ [...]
##$SUBNAM3= <"">
##$SUBNAM4= <"">
##$SUBNAM5= <"">
##$SUBNAM6= <"">
##$SUBNAM7= <"">
##$SUBNAM8= <"">
##$SUBNAM9= <"">
##$SW= 400.765351723535
##$SWIBOX= (0..15)
0 1 3 0 0 0 0 0 0 0 0 0 0 0 0 0 
##$SW_h= 32467.5324675325
##$TD= 32768
##$TD0= 1
##$TE= 0
##$TE2= 300
##$TE3= 300
##$TEG= 300
##$TL= (0..7)
0 120 53 12 22 120 120 120 
##$TP= (0..7)
150 150 150 150 150 150 150 150 
##$TP07= 0
##$TPNAME0= <>
##$TPNAME1= <>
##$TPNAME2= <>
##$TPNAME3= <>
##$TPNAME4= <>
##$TPNAME5= <>
##$TPNAME6= <>
##$TPNAME7= <>
##$TPOAL= (0..7)
0.5 0.5 0.5 0.5 0.5 0.5 0.5 0.5 
##$TPOFFS= (0..7)
0 0 0 0 0 0 0 0 
##$TUNHIN= 0
##$TUNHOUT= 0
##$TUNXOUT= 0
##$USERA1= <user>
##$USERA2= <user>
##$USERA3= <user>
##$USERA4= <user>
##$USERA5= <user>
##$V9= 5
##$VALIST= <valist>
##$VCLIST= <CCCCCCCCCCCCCCC>
##$VD= 0
##$VDLIST= <DDDDDDDDDDDDDDD>
##$VPLIST= <PPPPPPPPPPPPPPP>
##$VTLIST= <TTTTTTTTTTTTTTT>
##$WBST= 1024
##$WBSW= 4
##$XGAIN= (0..3)
0 0 0 0 
##$XL= 0
##$YL= 0
##$YMAX_a= 2830
##$YMIN_a= -5688
##$ZGOPTNS= <>
##$ZL1= 120
##$ZL2= 120
##$ZL3= 120
##$ZL4= 120
##$ABSF1= 198.0616
##$ABSF2= -202.7028
##$ABSG= 5
##$ABSL= 3
##$ALPHA= 0
##$AQORDER= 0
##$ASSFAC= 0
##$ASSFACI= 0
##$ASSFACX= 0
##$ASSWID= 0
##$AUNMP= <proc_1d>
##$AZFE= 0.1
##$AZFW= 0.5
##$BCFW= 0
##$BC_mod= 2
##$BYTORDP= 0
##$COROFFS= 0
##$CY= -3
##$DATMOD= 1
##$DC= 0
##$DFILT= <>
##$DTYPP= 0
##$F1P= 0
##$F2P= 0
##$FCOR= 1
##$FTSIZE= 65536
##$FT_mod= 6
##$GAMMA= 0
##$GB= 0
##$INTBC= 1
##$INTSCL= 9.790993e-09
##$ISEN= 30
##$LB= 1.5
##$LEV0= 0
##$LPBIN= 0
##$MAXI= 10000
##$MC2= 0
##$MEAN= 0
##$ME_mod= 0
##$MI= 50
##$NCOEF= 0
##$NC_proc= -9
##$NLEV= 6
##$NOISF1= 182.463
##$NOISF2= 159.3651
##$NSP= 0
##$NTH_PI= 0
##$NZP= 0
##$OFFSET= 198.0616
##$PC= 4
##$PHC0= 2715.623
##$PHC1= 11.48747
##$PH_mod= 1
##$PKNL= yes
##$PPARMOD= 0
##$PSCAL= 0
##$PSIGN= 0
##$REVERSE= no
##$SF= 81.0140089999434
##$SI= 65536
##$SIGF1= 159.3651
##$SIGF2= -187.1042
##$SINO= 113.3802
##$SIOLD= 16384
##$SREGLST= <1H.CDCl3>
##$SSB= 0
##$STSI= 65536
##$STSR= 0
##$SW_p= 32467.5324675325
##$SYMM= 0
##$S_DEV= 0
##$TDeff= 32768
##$TDoff= 0
##$TI= <>
##$TILT= no
##$TM1= 0
##$TM2= 0
##$TOPLEV= 0
##$USERP1= <user>
##$USERP2= <user>
##$USERP3= <user>
##$USERP4= <user>
##$USERP5= <user>
##$WDW= 1
##$XDIM= 65536
##$YMAX_p= 81413852
##$YMIN_p= -326926734
$$ End of Bruker specific parameters
$$ ---------------------------------
##NTUPLES= NMR SPECTRUM
##VAR_NAME=  FREQUENCY,     SPECTRUM/REAL,   SPECTRUM/IMAG
##SYMBOL=    X,             R,               I
##VAR_TYPE=  INDEPENDENT,   DEPENDENT,       DEPENDENT
##VAR_FORM=  AFFN,          ASDF,            ASDF
##VAR_DIM=   65536,         65536,           65536
##UNITS=     HZ,            ARBITRARY UNITS, ARBITRARY UNITS
##FACTOR=    0.49542278885378, 1,            1
##FIRST=     16045.7642231865, 0,            0
##LAST=      -16421.768244346, 0,            0
##MIN=       -16421.768244346, -326926734,   0
##MAX=       16045.7642231865, 81413852,     0
$$ Real data points
##PAGE= N=1
##DATA TABLE= (X++(R..R)), XYDATA
$$ [...]
##PAGE= N=2
##DATA TABLE= (X++(I..I)), XYDATA
9356 -2020646 3376918 3052897 26198 -643536 2976813 9047108 14374402 16616092 15777826
9347 15777826 14390993 14948443 16770267 16734556 13173597 7392035 1329322 -4162032 -8277227
9338 -8277227 -9703418 -8214216 -5427999 -3205144 -2407889 -3423979 -6179959 -9041335
9330 -9041335 -9459420 -6766898 -3003792 113462 3791736 10063792 17460138 20707025
9322 20707025 16155049 7099924 1854015 5377383 14053297 20324771 20927806 17673253
9314 17673253 11717032 2408559 -7468860 -11327828 -7006437 -802390 627566 -1716371
9306 -1716371 -3656776 -5895237 -11277663 -17090021 -17479239 -12556262 -8241911 -7228752
9298 -7228752 -6715950 -5552740 -6803706 -11409722 -15314210 -15555428 -14542268 -15802091 -19328650
9289 -19328650 -23091498 -25619880 -25667081 -22863878 -19674786 -18936119 -18999416 -15837926 -10308022
9280 -10308022 -7676361 -8885734 -8736413 -5060175 -3045106 -6554553 -11055590 -10198944
9272 -10198944 -4902109 -689007 544888 975370 1477605 544321 -2619165 -7181240 -11772439
9263 -11772439 -14709932 -15204300 -15536961 -18920802 -24041812 -25690738 -22068897 -16731924
9255 -16731924 -12107318 -7271828 -3999988 -7079832 -14614735 -16261240 -7125765 4260824
9247 4260824 8846751 9950814 14288873 17975297 13534187 5300661 3954784 8396804
9239 8396804 7549565 151213 -1986593 6523021 15555662 15241793 8871385 3478495 -1377868
9230 -1377868 -6946149 -7046455 2720135 13924330 14631800 6265179 766157 2862879
9222 2862879 5635625 4093077 2965043 7456648 14207302 16914482 15873696 15944908 17765154
9213 17765154 17214147 13377531 11162884 13631546 16217521 12879328 5367193 777370
9205 777370 576571 -1245163 -7171695 -10287239 -4417896 5380821 9457153 6952712 4545283
9196 4545283 4285081 2331404 -259685 3847124 15373482 23512663 19845448 10101270
9188 10101270 5288406 6578040 6571604 2074127 -2225425 -1701213 2993612 8556858 12021229
9179 12021229 11364193 7306056 4089747 4825829 6972746 6110901 2737430 820696 866963
9170 866963 -204898 -2638124 -3092494 -1192394 -1109626 -4418186 -6472331 -3370008 1267403
9161 1267403 625494 -6213844 -13191924 -14306477 -8684509 844064 11174132 20033441
9153 20033441 25494176 26184004 22677790 18448681 17884791 21516108 23779537 18213171
9145 18213171 5533006 -6055651 -9912043 -7699565 -5085034 -3678473 -1138034 2422518
9137 2422518 3347912 465282 -2443057 -2356725 -1434653 -2746545 -4917284 -5229497 -5651384
9128 -5651384 -10170744 -16532117 -16647795 -7215192 5000469 11608255 12278437 11932048 11534101
9119 11534101 7374790 -1206290 -8748296 -9784552 -4760412 1429652 4330050 2395155
9111 2395155 -2921891 -8021170 -9654552 -7777834 -5019574 -3195966 -2070313 -1858268
9103 -1858268 -4551993 -11096378 -18530593 -21788338 -18517798 -11549662 -6304647 -5375148
9095 -5375148 -5686831 -2148896 5454476 11100410 9512451 2610083 -3201787 -4306298
9087 -4306298 -1569008 3231281 8368400 10481595 6909700 386445 -2925140 -1240210
9079 -1240210 911464 -286767 -3174159 -4717368 -5244858 -6293113 -6979832 -5530244 -2071407
9070 -2071407 2504790 8044341 13191912 14622097 11044008 5792404 2625826 981801
9062 981801 -1589257 -4103205 -2911536 2606686 7995846 7984091 1860674 -5207302 -6355261
9053 -6355261 -141482 6596193 5670421 -2442396 -9174945 -9329746 -7200515 -8651582 -11913127
9044 -11913127 -10976288 -5110661 185423 528247 -3226143 -7539085 -9570470 -8555809
9036 -8555809 -6252343 -5125191 -4565699 -1273674 4585132 7102589 2105752 -6150256
9028 -6150256 -10122080 -8313929 -4900379 -2543448 -1133173 -1925542 -6533450 -11856508
9020 -11856508 -11948611 -6142090 -669322 -795418 -4866480 -7088944 -3266472 6363656 16881857
9011 16881857 21447686 17629560 10776006 8071731 10318356 13200961 14756715 16078094
9003 16078094 15624482 9632291 -660100 -8159974 -8314789 -3537121 2290081 8471854
8995 8471854 14414704 17031580 14660609 10019363 6435589 4116058 2067284 220530
8987 220530 -2151696 -6049589 -8629122 -4193483 7281905 16937819 16883137 10153065 6068763
8978 6068763 7924730 10518095 9087379 5404539 3623527 3822609 2440086 -2021831
8970 -2021831 -6222077 -5927855 -1580295 2295958 3451029 4603707 7946874 10517506
8962 10517506 9002901 6196035 6991704 9748738 8486414 3309416 1082042 4539077
8954 4539077 8557522 9946582 12965595 20461998 26758806 25714734 20207160 16584837
8946 16584837 14208691 8362863 668171 -1808394 2595673 7386119 7008847 3232692
8938 3232692 1300420 4112641 11285601 20083839 25854457 24524408 16451247 6631963
8930 6631963 530670 -7987 2066406 999018 -6613539 -17178327 -22939649 -21104202
8922 -21104202 -17032894 -15989546 -15635109 -10831116 -2584840 3143517 3698442 1541384
8914 1541384 -1101233 -4256202 -7194482 -8142930 -7353146 -6772584 -6716280 -6153803 -5549602
8905 -5549602 -5673306 -4431323 826639 8174283 12495837 11937671 9010368 5549159 1027897
8896 1027897 -3858450 -6451916 -6058676 -5011012 -4875367 -4622068 -2932951 644211 6608128
8887 6608128 14041776 18465457 15178812 5190475 -5558029 -12708748 -15623244 -13926773
8879 -13926773 -7150332 1642222 6832336 6225526 2323896 -2595548 -8146744 -12385940
8871 -12385940 -12158068 -8114309 -4280889 -1431260 3625593 10692022 14327755 11964685
8863 11964685 7929564 6169363 4935043 2696107 3241177 9322565 16289629 18551871
8855 18551871 18579681 22398729 28516948 28878072 20745315 11203289 8361943 12484066 17312785
8846 17312785 17105557 11204182 3782504 -209166 -22536 293031 -2825087 -8081430 -11712464
8837 -11712464 -12229683 -10680990 -8356961 -6859497 -8201534 -11583670 -12197123 -7208900
8829 -7208900 -1264849 -1334747 -6759437 -9395881 -4231899 4699947 10457446 11228930 9898389
8820 9898389 8706061 7654766 6963813 7915564 10598611 12607793 11514898 8372302 7121778
8811 7121778 9438319 11481004 8021422 -727705 -9293704 -14116595 -17056265 -20610240
8803 -20610240 -23525199 -23726034 -22201234 -20420369 -16467758 -7913232 2844754 9987542
8795 9987542 10458885 5888386 -382767 -4970370 -4620421 1103464 7632998 9562794 6874346
8786 6874346 3758823 1963917 -469582 -3829620 -4842423 -1785173 2153787 2785431
8778 2785431 -102056 -3238988 -3522932 -132030 5307512 9946182 12556965 15073876
8770 15073876 19280756 22473320 19705288 10981806 2947337 1716361 6184700 9956096
8762 9956096 8281678 1977703 -4072003 -5363421 -1834101 2102279 2500498 304241
8754 304241 -750178 467110 1890923 2257640 2164048 1255704 -1723266 -5363465 -5881884
8745 -5881884 -2292853 2052654 4347941 5357458 6308944 6639535 6789755 9312999 14363391
8736 14363391 17402290 14637117 8229940 3239063 1825481 3047393 5314715 5811260
8728 5811260 769547 -9289013 -17123489 -16466831 -10343990 -6606781 -6690842 -4996484 627063
8719 627063 4549958 1784003 -4823024 -9428371 -11186821 -13129789 -15617620 -15641940 -12167684
8710 -12167684 -8248100 -6964705 -7897224 -8879572 -9407675 -10514765 -12019378 -11890626 -9028022
8701 -9028022 -5506647 -4745174 -7583601 -11214978 -12163739 -9526949 -5248578 -2185522 -2007005
8692 -2007005 -3877497 -5059116 -4001033 -2672714 -3990110 -7067658 -7941421 -5755402
8684 -5755402 -4629231 -7200551 -9863406 -8132841 -4070233 -3583231 -7581595 -10822789
8676 -10822789 -9518379 -5282343 -740840 3975467 8405758 9722467 6684951 2803180
8668 2803180 2307184 4653476 5817167 3789511 211489 -2614783 -3907257 -3894705 -3106657
8659 -3106657 -2263277 -1632255 -571912 1480071 4008380 6192443 8074174 10040023 11478070
8650 11478070 10589522 5447462 -4482038 -17006886 -27824572 -33988652 -36415604 -37071787
8642 -37071787 -34598295 -26353008 -14833546 -7113481 -5780440 -5247604 -743986 3459031
8634 3459031 180896 -9468788 -17514254 -20301353 -21553619 -24349912 -26881672 -27551652
8626 -27551652 -27759274 -27048960 -21664128 -11825965 -5071901 -7234041 -13997113 -16713874
8618 -16713874 -13471311 -8732895 -4603459 808970 7280870 11675036 14067246 18355252
8610 18355252 24835971 28103501 25600325 23009731 26247222 31654819 30021148 19091236
8602 19091236 6543401 75643 -610084 -153939 -88099 1321423 3902703 4592575 2117293
8593 2117293 -596174 -525441 930575 -31401 -4114609 -8416420 -11593341 -16191682 -23840961
8584 -23840961 -30623411 -30557683 -23041484 -13829342 -8375273 -6776002 -5923243 -4026799 -1386479
8575 -1386479 1403495 3715337 3997392 788157 -4743530 -8406898 -6340700 950969
8567 950969 8480392 11369725 9203844 4810595 -451390 -7304552 -13959772 -15164931
8559 -15164931 -9298582 -3255367 -5004915 -12626475 -16536863 -12544146 -6266278 -3064621
8551 -3064621 -472386 5391637 11668014 12730603 8598675 3687299 -74427 -3132169
8543 -3132169 -3736308 -143073 3744989 1905725 -4431540 -7756679 -5730884 -4551852
8535 -4551852 -8136298 -10847358 -5965317 3726799 9805059 9521141 7330314 6898786 7539655
8526 7539655 8354939 10362860 13154373 13687940 10464100 6043874 3578600 3094452 2989447
8517 2989447 3219198 4780545 7208498 8889012 9660886 11242949 14565436 17793059 17794614
8508 17794614 13337851 6414361 321083 -3485687 -6426458 -10480914 -15122249 -17422273
8500 -17422273 -15573944 -11353022 -7958607 -6049558 -3827781 -1234606 -1466874 -6352297
8492 -6352297 -12123607 -13058528 -8831021 -4646691 -3507604 -2382000 1749496 5828961
8484 5828961 4725208 -931021 -5552425 -6358460 -5525161 -4364480 -562462 6549320 12140864
8475 12140864 10895004 3739262 -3495047 -6709469 -6120806 -3534317 -312207 2027804
8467 2027804 2012801 -59044 -2073250 -2388984 -1314954 -252648 -258212 -1273469 -1729187
8458 -1729187 879912 7680942 16436623 22919160 24557053 21870661 16290281 8081931
8450 8081931 -2532089 -13196120 -20092117 -21187421 -17983193 -13664464 -10228417 -7892817
8442 -7892817 -6372080 -5461352 -4691957 -3849150 -3946930 -6240006 -9934061 -12553215 -13351925
8433 -13351925 -14549923 -17783141 -20951906 -20561521 -16191261 -10757767 -7128228 -6192720
8425 -6192720 -7302114 -8538355 -7297180 -2769792 2531984 5314453 4663301 1302966
8417 1302966 -4158820 -9752040 -11471655 -8032801 -4257334 -4981677 -7440537 -5640761
8409 -5640761 -888284 -163134 -3593871 -2530337 6626849 15217529 14698010 9221630 8471778
8400 8471778 13043927 15367892 12321610 8300299 6145608 2670265 -5220490 -15356367
8392 -15356367 -23005022 -25231418 -21918562 -15599859 -10422433 -8454309 -7450407 -4808089
8384 -4808089 -2008223 -1483975 -1137586 2812418 8416305 9086192 2632143 -5655904 -9905305
8375 -9905305 -9497771 -7161622 -5049317 -3700926 -1984377 2096136 8001663 11511734
8367 11511734 10594364 10031667 14630634 19966948 17430510 7822918 1328748 2807944
8359 2807944 5947558 4780858 2269233 3024503 5486937 6830894 8519388 10994936
8351 10994936 9795264 3967515 1666975 8685019 16846866 13968492 2030093 -5147296
8343 -5147296 -1085490 6734450 9700006 7559684 3119768 -3261266 -9981463 -12447767
8335 -12447767 -9702946 -7335153 -9583116 -13194853 -13070037 -9683836 -6705096 -4964937
8327 -4964937 -3337292 -2916416 -5909378 -11969420 -18975129 -25647829 -30338365 -29626158 -22313806
8318 -22313806 -13432483 -9860872 -12065968 -13856034 -10592793 -4274124 342768 1603514
8310 1603514 1228176 694472 -457857 -2887716 -5292144 -4988387 -1372483 1588083 -1711686
8301 -1711686 -11896604 -22572492 -26786658 -24185869 -19460387 -15301889 -10887757 -7011747
8293 -7011747 -7420401 -12473264 -15690669 -11150360 -2265631 1772427 -1989020 -6708500
8285 -6708500 -5537103 -488763 1609168 -981127 -3358708 -1682566 1384392 121284
8277 121284 -7358507 -16943119 -22460092 -20969198 -14337362 -6208145 1433909 7636386
8269 7636386 9828386 5396044 -3114559 -8181144 -5710813 -599637 -325967 -5218833
8261 -5218833 -9432255 -9884209 -8891127 -8442715 -7599810 -6324198 -6358479 -6814361 -4378061
8252 -4378061 -63094 -47483 -6423690 -12536706 -12105608 -8257710 -7815507 -10265385 -9119618
8243 -9119618 -2534742 3998726 5613892 3335348 652769 -820061 -1177181 -1007116 -1356582
8234 -1356582 -2649782 -3337560 -1439324 2936644 8098845 12363419 13384710 8553049
8226 8553049 -679084 -7333590 -6039289 34076 3579040 2655602 954002 281566 -1298476
8217 -1298476 -4310721 -6641901 -7730630 -8822540 -9072883 -6748212 -4068396 -4735570 -6552921
8208 -6552921 -3431168 4330127 9201583 7808748 5511183 6550318 7366175 4291915
8200 4291915 743477 806691 1526364 -1831174 -7217679 -8869658 -5598258 -509364 4119138
8191 4119138 6368911 2975169 -5801512 -12891752 -12207081 -6726841 -2808192 -198153
8183 -198153 4851246 9939138 9200846 4149624 2299651 4710397 4198070 -2308582 -8422853
8174 -8422853 -8408490 -4848752 -2235018 263107 4737090 8657517 8282197 4313993 -94593
8165 -94593 -3801794 -6487710 -6279267 -2425635 2316754 5435332 8193722 12092589 14645568
8156 14645568 12771708 8425235 6650441 8893232 11673567 11423418 7853093 2782510
8148 2782510 -2211477 -7018919 -12843417 -20098516 -26341910 -28481660 -27359602 -26736366
8140 -26736366 -26666845 -22476204 -13109206 -5694017 -6877725 -13070781 -15146619 -10711332
8132 -10711332 -5454228 -3342917 -2304347 -383570 402960 -1114548 -2014103 -383412
8124 -383412 481599 -2948344 -8221294 -10097230 -8260366 -7247552 -8932631 -9545903 -5771478
8115 -5771478 -524157 322064 -4243268 -8814712 -8383090 -4431466 -2494364 -4829315 -7926974
8106 -7926974 -7444970 -3315072 1161681 3451832 3336323 1650634 -490487 -1875455 -2505662
8097 -2505662 -4315208 -8676698 -13347971 -13919197 -8748195 -963054 4918786 7202685
8089 7202685 7533818 8315160 10109197 11136479 9450410 5906662 3916636 5162673 6880732
8080 6880732 5450799 1782684 452016 3539792 7868948 8738546 4279742 -3906680
8072 -3906680 -11828397 -14660572 -10562589 -4134781 -3055618 -9594420 -17972181 -21459116
8064 -21459116 -18893239 -12360401 -2638475 8945223 17093191 16354811 7834782 -1928910
8056 -1928910 -8268495 -10868623 -10049945 -5732619 -629237 498745 -3447300 -8706317
8048 -8706317 -12427953 -15374802 -17307122 -14984230 -8268729 -3429393 -5285293 -9582854
8040 -9582854 -9045913 -4491296 -3058725 -6285312 -7500630 -2604673 3392518 3877004 -769209
8031 -769209 -6118563 -10735740 -15331847 -18147543 -16734512 -12738549 -9747731 -7259417
8023 -7259417 -2041911 4492458 5827859 -933586 -10252282 -14562505 -12282203 -6979654
8015 -6979654 -1589371 3162113 6314329 6258407 2835360 -2149756 -6535665 -8892806 -8743645
8006 -8743645 -6919539 -5052468 -3885640 -3132766 -3495648 -6528530 -10950796 -11774668 -6131728
7997 -6131728 1908403 5987217 5744549 6309155 9889663 12550387 10411570 4784005 -884858
7988 -884858 -5609876 -9952046 -13477490 -15783907 -17557610 -18103516 -14643605 -7216360 -1334069
7979 -1334069 -1367307 -3473382 -538721 6724863 9682905 3727027 -5355808 -9415894 -7583389
7970 -7583389 -4505219 -2831321 -1744545 -495793 1074663 4327192 10005105 15035678
7962 15035678 14839053 8995065 1569474 -4190966 -8322207 -11294901 -12539596 -12821305
7954 -12821305 -14257646 -16005902 -13613508 -5944093 143900 -3226907 -13999660 -20854359
7946 -20854359 -16148432 -4811586 1889688 -808983 -7469204 -10645118 -9334818 -7861991
7938 -7861991 -8528777 -8323269 -3343380 5537279 12910829 13958649 8258164 -390931 -6047605
7929 -6047605 -3554687 7145727 18650725 21291766 13175888 2913787 -366522 2406016
7921 2406016 3495276 456164 -1022804 2579732 5843040 2337950 -5077736 -8201860
7913 -8201860 -5884689 -5426197 -10601627 -14961286 -10887098 -645630 6815508 7643997
7905 7643997 6165510 6867093 8719571 8730133 6784003 4634459 3066984 2337181 3002496
7896 3002496 4148007 3235423 276981 -394852 3851937 8113953 4948715 -5047637 -12560656
7887 -12560656 -10862864 -3678874 618385 -693499 -3478295 -3651796 -1485500 456050
7879 456050 380004 -2245868 -6787071 -10930029 -11658433 -8053041 -2527667 1558432 3161146
7870 3161146 3723471 4347799 3967031 1166339 -2919047 -5333546 -5343640 -5750416 -8661511
7861 -8661511 -11747523 -11167532 -6960053 -2480364 613144 2991085 3700849 522058 -4749531
7852 -4749531 -6699634 -4348747 -3398256 -6648942 -7664612 61527 11976414 18112174
7844 18112174 17224531 16588557 18395158 16141351 7085236 -778320 360309 6735692
7836 6735692 8834920 4192907 -1876931 -5170029 -5861783 -4782190 -2658901 -2539044 -7377797
7827 -7377797 -14785747 -18670681 -16520026 -11147180 -5429241 -69462 3049239 818900
7819 818900 -5669114 -10336596 -9602836 -6718495 -5566684 -4282273 351281 5340937 4473083
7810 4473083 -1934954 -6305021 -3983601 969107 2461719 384938 -1530178 -2269490
7802 -2269490 -3099930 -2472333 2985033 11835067 17038855 13860767 5181632 -3142228 -8976497
7793 -8976497 -13248719 -15669501 -15192707 -13245056 -12458560 -12635604 -11418170 -8578074 -6127907
7784 -6127907 -4442359 -2185115 -209125 -1052445 -3483548 -2158829 5025903 13164736
7776 13164736 16560338 15171571 12001717 7764242 2060267 -3144393 -5794260 -7482079
7768 -7482079 -10349959 -11853618 -7734616 263356 4798430 1956742 -4251149 -7720723
7760 -7720723 -7192048 -5842056 -6630381 -9700695 -12748222 -12964359 -9842004 -6249353 -5374167
7751 -5374167 -6988522 -8475691 -8800979 -9052618 -9600249 -9543981 -9001310 -9427416 -11485961
7742 -11485961 -14368928 -16515471 -15345462 -8577031 1018826 5039817 -1169181 -10650794
7734 -10650794 -12823874 -7969406 -5737707 -9265498 -10615242 -4994276 547147 -1081624
7726 -1081624 -4930340 -2274800 5008288 7874261 4377597 943301 943666 1130797 -515493
7717 -515493 -1764713 -2030068 -3606921 -5228782 -1770575 6569326 11279114 5878355 -5572140
7708 -5572140 -14378680 -17700121 -18998837 -21169615 -23683328 -24984866 -24081821 -20443313
7700 -20443313 -14722511 -8821146 -3763292 977242 4594394 3639816 -3897049 -14530407
7692 -14530407 -21626974 -21108798 -13465770 -1815701 9637702 16342779 15731422 9737638
7684 9737638 3739607 2242709 5555637 10250291 12604306 11998017 10817266 10507122 8900195
7675 8900195 3561417 -2982944 -4793513 -57226 6313794 9460190 10908445 15250992
7667 15250992 22531775 27310381 24778694 15299460 3114822 -7285857 -13344346 -14743264
7659 -14743264 -12530270 -8030516 -2810285 1013250 2134241 1694032 1494844 532496 -3830074
7650 -3830074 -10717963 -15527512 -16476742 -17232734 -20128613 -21125950 -16321910 -9988661 -9648540
7641 -9648540 -14661919 -16730137 -12105807 -6218650 -3816553 -1247852 6407281 14970658
7633 14970658 14482758 2098848 -13450331 -21294912 -19050029 -12799263 -9184019 -9901723
7625 -9901723 -13006333 -16603332 -19499208 -19563495 -14590246 -5940321 1167586 3492013 4305702
7616 4305702 8899880 16422602 20271818 17126510 11258249 7780948 5573861 694338
7608 694338 -5745328 -8052289 -4127740 1213963 2685627 1222021 1683530 5368051 7776530
7599 7776530 4407394 -3119120 -8363006 -7127743 -1688340 2602228 3613378 3862198
7591 3862198 6206044 10048930 12360701 10984827 6009166 -984735 -7695212 -11669585
7583 -11669585 -11550616 -8128608 -3605775 257602 2803293 3426047 942380 -5008791
7575 -5008791 -12228775 -17037228 -17868594 -16717253 -15804873 -14193235 -10245637 -6481587 -7610508
7566 -7610508 -12581866 -13360853 -5083781 6381435 11776300 10395976 8746253 9305921
7558 9305921 8250181 4528600 2809294 4407749 3008720 -5260297 -13634895 -13386463
7550 -13386463 -6460470 -1958619 -2462332 -1845198 3606609 9664087 11746991 11844818 14435374
7541 14435374 19378002 22137528 19052706 10505516 587189 -5515931 -5962911 -4651955
7533 -4651955 -6724116 -11525677 -13463048 -10408189 -6837349 -6583986 -6825385 -2929725 3795418
7524 3795418 7546910 5785930 1753134 -122461 1879853 7038357 13246562 17628329
7516 17628329 18671834 18274855 19884770 24410895 29424191 32015642 30624349 24611590
7508 24611590 14693226 4192415 -2546856 -4042907 -2532851 -661615 749344 1316564
7500 1316564 218597 -1869349 -2499279 -1359226 -2269884 -8040502 -14648819 -14656017 -6748307
7491 -6748307 2018786 4936854 2981444 957038 -222164 -3045447 -7030583 -8125589
7483 -8125589 -4925049 -895109 1120418 2579548 5222705 7148165 6076958 3428419
7475 3428419 1324486 -1896414 -8528582 -15517799 -16922746 -12077351 -6172765 -2250234
7467 -2250234 1989192 7809859 11483326 10244309 7862680 9606370 14264492 15955456
7459 15955456 12557657 7766962 5070517 4048655 3519147 4539329 8193473 12784166
7451 12784166 15591333 16308475 16641722 16879724 14997556 9989664 4477189 1956499 1791894
7442 1791894 -381544 -6002429 -9988034 -6920970 585717 3868632 -1094067 -8890486
7434 -8890486 -11946770 -9021398 -4282060 -1069491 372962 975019 1654547 3036068 4403226
7425 4403226 4272091 3315308 4132997 6099359 3902963 -4948469 -13955834 -14097308 -5347754
7416 -5347754 3244662 4702632 443284 -4848531 -9307431 -12672575 -13215600 -9391674
7408 -9391674 -2906171 2226004 3111164 -189019 -4985532 -7661523 -6402445 -2557966
7400 -2557966 1637500 5792449 9962450 12003816 9811419 5744800 4810948 7762762
7392 7762762 9661875 6412459 -646531 -7825503 -13159667 -15662992 -14005464 -8561442
7384 -8561442 -2471455 1451359 2937200 2200729 -1268064 -5888819 -7314184 -3887684
7376 -3887684 -662281 -4497951 -15905711 -28076290 -33297563 -28990787 -19065889 -11062525
7368 -11062525 -10247643 -14637566 -17313115 -14932071 -11555105 -12288905 -16193650 -18548483
7360 -18548483 -17673948 -15717420 -14107870 -12013120 -8884167 -5547803 -2865803 -1206308
7352 -1206308 -471546 784685 4336307 8393064 7441688 -710901 -10023183 -12350376 -6854147
7343 -6854147 731035 6404201 10384642 12298004 9844179 3345014 -3093461 -6469604
7335 -6469604 -7341444 -6657221 -4176020 -1104272 -115215 -1092022 -676800 2236998 4532773
7326 4532773 4484043 5106715 8701295 11813539 10030927 5396335 4089933 7263360 8659087
7317 8659087 2591612 -8494568 -16240649 -15194287 -8208034 -2845126 -2727671 -3467019
7309 -3467019 1572240 12097419 19944676 18174211 8951481 629096 -1542860 396407
7301 396407 1586600 534034 -164985 1957729 5976941 8946727 9408513 8243780 6655560
7292 6655560 5357418 5801683 9444537 14728339 17719534 17426773 17045419 17304489 12865969
7283 12865969 313189 -13638043 -18510420 -13047965 -5139450 37936 3883507 6378943
7275 6378943 3674603 -3210108 -5831292 285373 8272494 9389207 4058087 -2264551
7267 -2264551 -8511265 -16146931 -22176489 -21828345 -16119139 -10305477 -6731877 -4853495
7259 -4853495 -5518840 -8646276 -9243758 -3201182 4628118 5694425 -131837 -5492755 -7414402
7250 -7414402 -9150166 -10009639 -3512120 11306227 25491584 31156139 29531091 24310915
7242 24310915 14942352 2094501 -7244357 -7371246 -2189095 251604 -2194347 -6570060
7234 -6570060 -11373725 -16005149 -17328159 -13660998 -9459260 -9091627 -8350339 17473 13417913
7225 13417913 20344157 15144690 4590456 -2163545 -3612767 -3210174 -2518173 -985996
7217 -985996 1303235 4101777 7435116 9242973 5830596 -2673459 -10331190 -11787530
7209 -11787530 -8185678 -4094909 -1280739 1261879 3514989 4571525 5105304 5973270
7201 5973270 5396536 1449237 -3097205 -2649198 3704737 10203422 11404723 8171402 4861364
7192 4861364 3344515 2648707 2796065 5416231 10399753 14819108 16551903 17345007 20463925
7183 20463925 25634387 27952491 22790514 11443726 930595 -2394067 1297814 6331814
7175 6331814 7876342 5927062 2915065 -411060 -4589580 -7950702 -6706868 80640
7167 80640 7410635 8239101 342619 -11524349 -19887053 -20411538 -14553200 -7723329 -4576648
7158 -4576648 -5263448 -6526141 -6415731 -6213068 -6999689 -7154947 -5872393 -6589402 -12400017
7149 -12400017 -19179397 -18883933 -10552344 -2399194 -534438 -1068360 2422306 8460286
7141 8460286 10808649 8943336 8220357 10477061 11642196 9712698 8484420 10777492
7133 10777492 13503114 12935404 10453006 9252211 9032464 7902115 6267394 4480162
7125 4480162 -324961 -9737884 -18508347 -19467215 -13434333 -8430225 -8690765 -10346564 -9509605
7116 -9509605 -8663386 -11482955 -15870370 -16856379 -13961763 -11195375 -10750838 -10505832 -7763629
7107 -7763629 -2748517 1840380 2997861 -613250 -7288891 -13247236 -16146515 -16836131
7099 -16836131 -16669852 -14955574 -10989873 -6573245 -3567161 -617159 4023488 7670918
7091 7670918 5976186 601486 -1047093 4358169 10944694 11307807 5830439 738286
7083 738286 -553825 185837 1165671 3649548 9045605 15897518 21211735 23369725 22915419
7074 22915419 21404512 20011096 18828860 17493890 16544509 17270098 19695889 21967008
7066 21967008 22681409 22377117 21342407 17834954 11107567 5021945 5101755 11483991 17700134
7057 17700134 17793056 12676363 8021596 7356116 9040775 9526300 7906169 6550408 7745809
7048 7745809 10760921 13061405 13804307 14244750 14397807 11978011 6614848 2831689 5417148
7039 5417148 12591634 17206806 14998252 8693764 3372295 730353 -671961 -1823207
7031 -1823207 -1850798 734173 6253011 12511184 15345499 12240597 5526854 15128 -2760650
7022 -2760650 -5688666 -11055521 -16909279 -19470861 -17184896 -11655145 -6562522 -5882190
7014 -5882190 -10334315 -14988631 -13639976 -6567210 -371520 1120289 1245660 3378633
7006 3378633 4523383 683416 -5317801 -7436058 -5787167 -6265852 -11347331 -17058894
6998 -17058894 -19571413 -19353118 -17342456 -12042805 -3171105 5416601 9537219 9330097
6990 9330097 7782893 6429822 4802215 2858891 1559188 1174956 623160 -1074693 -3208147
6981 -3208147 -3801540 -2112955 -411417 -1731272 -5335454 -6522724 -2470936 3911174
6973 3911174 8184056 10012694 11353464 11434531 8335193 4189340 3102099 3900413 958400
6964 958400 -6562565 -12340255 -12041155 -8833744 -6340460 -2301575 5119191 9870458 4739618
6955 4739618 -6606793 -12285102 -7319215 728962 2978687 -37559 -2104992 -846070
6947 -846070 1297581 2940088 5381496 8479434 9156828 5785562 1664700 1820836 7026755
6938 7026755 12918282 15271387 14546525 14176222 15453595 15878377 12611927 6176468 210597
6929 210597 -1666247 1395674 6852890 10597247 10326055 7448493 5085509 4472870 4337066
6920 4337066 3175406 319765 -4813939 -11855377 -17427551 -16869401 -9560966 -487057
6912 -487057 4968381 5984441 4907337 3286808 1286251 -930074 -3597959 -7903788
6904 -7903788 -14149434 -20450477 -24821236 -27132580 -27532454 -24997084 -19653226 -14535228
6896 -14535228 -12163355 -10748274 -6718420 -156279 4885996 4835158 -569616 -8481572
6888 -8481572 -13859992 -12267996 -4836838 1327051 925896 -3392781 -6445505 -9314857
6880 -9314857 -16870865 -27916603 -34874815 -34058807 -29625666 -25429582 -19485221 -9987209
6872 -9987209 -1121090 2033850 628073 -672528 -789015 -2008023 -4490530 -5483750 -3501540
6863 -3501540 -82379 2243697 1607617 -2480528 -8008837 -11421649 -11582889 -10969238 -11084970
6854 -11084970 -9486029 -4290063 1266369 2960583 2136252 3299776 6462725 7193319
6846 7193319 4144888 1174837 976147 1589752 1164431 1651156 4811537 8084317 8050259
6837 8050259 5896806 5957605 9816418 14711920 17294204 16642981 13954508 11449897 11463168
6828 11463168 14334554 16630930 13330568 3018331 -9938482 -19313388 -22579656 -21945085
6820 -21945085 -20835156 -20912830 -22293092 -24455088 -25697330 -23371043 -16810932 -9268340
6812 -9268340 -4579683 -2226017 1562506 7582463 11857577 11400810 8517619 6939188
6804 6939188 6420581 4429297 1239121 -336467 759924 3232317 6281082 9505339
6796 9505339 10661281 7586406 2383501 -430392 -493490 -2126608 -7201974 -11790436 -11848066
6787 -11848066 -8203244 -3322562 3019522 11278696 18315658 20108763 16691145 11152348
6779 11152348 5496062 778830 -767429 1750827 4266885 1356733 -6418219 -12962088
6771 -12962088 -14762882 -14067545 -12868333 -8755941 -48113 8561328 10100722 4077443
6763 4077443 -2595593 -3751245 -491515 1207896 -2261727 -8426188 -11821386 -10131121
6755 -10131121 -6738630 -6685478 -10618320 -14328322 -14476053 -12433534 -10852546 -8582124 -2188262
6746 -2188262 8002886 16747210 19712178 17927581 15102620 12899699 11018639 10036065
6738 10036065 10892610 11922739 9573906 3054535 -3943238 -7350056 -6820008 -4563271
6730 -4563271 -1993589 451187 1439630 -631549 -4979031 -8240831 -7557931 -3050291 2689587
6721 2689587 6731902 7910125 7944951 9926649 14307828 17165965 14433035 7308456 953313
6712 953313 -2085727 -4144096 -7474804 -10213136 -9146010 -4212881 1709274 5766683
6704 5766683 6354739 3598364 591791 1800317 7454464 11521502 8638075 1625072
6696 1625072 -1850616 458264 2769084 -283346 -6484174 -9375946 -6132014 322857
6688 322857 5597001 7717526 6727602 2378257 -5840644 -15703744 -21100294 -17378351 -8549395
6679 -8549395 -5005235 -10938634 -17765000 -15238952 -6353705 -3689187 -11045589 -17174923
6671 -17174923 -11173029 3118952 13802365 16715364 17277379 19314405 20028183 16747134
6663 16747134 12308805 11025376 12897958 14205253 11794929 5442644 -2192777 -6893438
6655 -6893438 -5952145 -1273030 1570738 -1647347 -10003038 -18490956 -22144771 -19534238
6647 -19534238 -13495518 -8590041 -7229400 -8477074 -10607117 -13175314 -15653638 -16184495
6639 -16184495 -13859145 -10711278 -9081843 -8342139 -6750336 -5078413 -5254729 -6596537
6631 -6596537 -6973307 -6883483 -8445496 -10809309 -10908831 -8873667 -8155240 -9650674 -10394276
6622 -10394276 -9203398 -8682789 -9840098 -9882469 -8069490 -8539952 -13380400 -17601170 -16159934
6613 -16159934 -12434335 -13878477 -21231858 -27541322 -26987311 -20106658 -11265983 -5360388
6605 -5360388 -5847669 -11296985 -14812403 -11827670 -7491201 -10475791 -19840806 -24996762
6597 -24996762 -20119819 -11623502 -8135127 -9393383 -9976405 -9056361 -10104443 -13407209
6589 -13407209 -15117388 -13420447 -10609398 -8260057 -4329901 3173010 12015884 17267611
6581 17267611 16460024 12156218 9106802 9105832 9524416 7535560 4256749 2506807 1806886
6572 1806886 -442971 -2930264 -759095 6128601 9886152 4165392 -7107139 -15186877
6564 -15186877 -18062195 -21003683 -26909335 -31990312 -31656245 -26062159 -18839436 -14019843
6556 -14019843 -14615602 -20014343 -23811473 -18643933 -5230301 6935258 10011495 5804418
6548 5804418 1433810 684039 2787697 6736023 12338286 17783885 19784609 16884820
6540 16884820 11269681 7435394 9463983 17791985 27270152 30425739 24895432 16245367
6532 16245367 11337954 10480215 8671904 3115717 -3796666 -8269669 -8523824 -4539759
6524 -4539759 2249495 8301616 9885848 6902900 2824410 153938 -1778758 -3717347
6516 -3717347 -4076844 -1786102 572916 -519562 -4216281 -5432777 -881583 6932334
6508 6932334 12833887 14676282 14058300 11848066 5822885 -5258269 -16887437 -21614058
6500 -21614058 -17279559 -9563144 -4910362 -3867563 -3882110 -5571503 -11448302 -19496285
6492 -19496285 -23397419 -20406594 -14782448 -11410367 -9629824 -6122647 -1102290 1775461
6484 1775461 335340 -3980071 -8011368 -8998569 -6172399 -2330546 -2281310 -7271286 -12561486
6475 -12561486 -13432768 -11758269 -12401793 -14193479 -10186212 1773886 13967402 17555413
6467 17555413 12882973 7465279 6418014 8930675 12161113 13586459 10058782 78726
6459 78726 -11384006 -15063645 -7596923 3520577 8586973 6928540 5525418 8168397
6451 8168397 11222177 10527553 7308120 4763275 2754236 -539347 -4170476 -5547150
6443 -5547150 -4768478 -4120315 -3678906 -944395 4905370 11553604 16859647 20607337 22150469
6434 22150469 19525765 12633355 4791465 -816451 -4281320 -6770004 -7214595 -3627283
6426 -3627283 3332469 10175479 13557729 12450711 8431228 4803741 4134720 5760550
6418 5760550 7200164 8304658 11153680 14984222 15445026 11651288 9709299 14493171
6410 14493171 21092153 20437674 11836558 3495199 888160 1385387 1737593 4046418 10579600
6401 10579600 17708088 19874091 17066280 14318349 15082309 18083218 19884009 18361836
6393 18361836 14113885 9463189 5415222 -2331 -8242327 -15940024 -18193466 -16143248
6385 -16143248 -15739891 -17438371 -13801917 -1535789 10305472 10695621 883604 -9144394
6377 -9144394 -15277304 -21604399 -29266295 -32706015 -29270235 -24204194 -21966153 -19377717
6369 -19377717 -12812539 -6855132 -8898757 -17612692 -23348976 -19814562 -10269640 -1674745
6361 -1674745 2819363 4120890 3700791 2480837 1314602 175537 -2385519 -7235855
6353 -7235855 -12651970 -15999156 -17135491 -18199571 -19779955 -19658848 -16673227 -13482407
6345 -13482407 -12943334 -13575246 -12311536 -10617886 -12769722 -17550946 -17680656 -10434209 -3277831
6336 -3277831 -3984843 -9509272 -10951552 -6472985 -1897926 -76098 2059638 5373214
6328 5373214 5921060 3143049 3038512 8793116 14528389 13762039 9129327 7761589 10745604
6319 10745604 13377243 13201122 11444676 8216869 2864508 -1491393 -338677 4647277
6311 4647277 6496007 3005597 204258 3099242 8151811 8976523 5556439 2733930
6303 2733930 1820781 -644401 -5871816 -9800169 -9070906 -6156198 -5317881 -5867423 -3610110
6294 -3610110 1633744 4689840 2964468 1568615 6442784 14569302 16318463 7981848
6286 7981848 -2706097 -5677646 201201 7555345 9565178 5446193 -1511725 -7779564
6278 -7779564 -11226973 -11313162 -8804574 -5079524 -1708053 -106758 -107182 816714 4492170
6269 4492170 8170692 7040263 1448125 -2472563 -1452581 54463 -2720729 -6648879
6261 -6648879 -5163717 1589927 6870020 6643279 3457616 1233327 1057949 2345378 3690890
6252 3690890 2284543 -3264604 -9396477 -11322452 -10185869 -11211062 -14294676 -12827461
6244 -12827461 -4148363 4928895 6993401 3814898 2799396 6974705 12798383 15527863
6236 15527863 12854000 5169748 -4015371 -9383049 -8924154 -6691708 -7754476 -11852327
6228 -11852327 -14774651 -14335385 -11807756 -8820243 -6213440 -5050425 -5453328 -5051739 -1776460
6219 -1776460 2280667 3120613 831710 -229915 1962132 3667903 570690 -5686606
6211 -5686606 -8843976 -5730778 -445014 686097 -2556347 -3791866 844044 6307675
6203 6307675 5419132 6905 -1092678 4294797 7441279 1803906 -6607388 -8550686
6195 -8550686 -6138750 -9401228 -20433464 -30204559 -31940758 -29306314 -28379244 -28531947
6187 -28531947 -25823497 -20503642 -16128198 -14103739 -13377038 -13527836 -14384307 -14043371 -10916808
6178 -10916808 -7107493 -6602087 -10020493 -13495732 -13237729 -9854791 -7779046 -10847728
6170 -10847728 -18134050 -24016650 -23437056 -17552171 -12943666 -14547795 -20600679 -25318491
6162 -25318491 -25218202 -21716544 -18559231 -17897987 -18494123 -17271143 -13030359 -8327093 -6515396
6153 -6515396 -7382845 -7606379 -5333473 -1864965 1422933 4887894 8325308 9707874 7936053
6144 7936053 4665659 1914688 74317 -433164 1484818 4498285 4312388 -642761 -5681621
6135 -5681621 -5872002 -3455393 -4698276 -10482571 -15082686 -14601301 -11852444 -11286243 -12957966
6126 -12957966 -13931540 -12954008 -11073803 -9098602 -6809667 -4306042 -2630268 -2857492 -4767106
6117 -4767106 -6249683 -4731663 -332364 3136319 2164318 -1932704 -4671214 -4130836 -2132239
6108 -2132239 173869 3894103 8281014 9334145 5718596 2829321 6568461 14778147
6100 14778147 19537406 17574878 13723052 13221378 15188418 16157721 16385564 18775584 23298960
6091 23298960 26446277 26085528 23594551 20529330 16038224 9160717 1767599 -2749425
6083 -2749425 -2867127 417591 5406447 10396685 13104277 11666649 6940982 2381868
6075 2381868 767944 1944858 4370933 7621205 11995996 16269033 17590759 14366972
6067 14366972 8561472 4258139 3646596 4775797 3969741 623309 -1484477 1183089
6059 1183089 6715604 9164486 5394927 -1481088 -6343577 -7592523 -6771265 -4715821
6051 -4715821 -1084648 2963939 4891290 4225547 3176599 2496340 -822642 -9266790 -19517468
6042 -19517468 -24495647 -21192436 -14187658 -9983624 -9425667 -8024060 -3327232 1032448
6034 1032448 215518 -5089441 -9661611 -10635303 -10092222 -10511392 -11289890 -11511231 -12769051
6025 -12769051 -16085335 -18464353 -16556246 -12522936 -11837343 -15231424 -17246503 -14074971
6017 -14074971 -8945516 -7352530 -9779874 -12008682 -10993754 -7695804 -4660157 -2881966
6009 -2881966 -1330635 1120840 3345604 2245675 -3124626 -8503986 -8492899 -3815785 -710798
6000 -710798 -1828638 -2140352 3154375 10762053 13924749 12030240 10140202 10433077 10011357
5991 10011357 7293750 4892722 4580105 4108700 1303321 -2387194 -4762193 -6177154
5983 -6177154 -7604521 -8114491 -6866887 -5481784 -5865949 -7143124 -6823267 -3856155 783194
5974 783194 4854355 5143904 -347282 -8600217 -12696221 -9480682 -3881245 -2568448 -5336248
5965 -5336248 -6326228 -2328233 4062433 8859175 10379662 8588360 4419320 402274
5957 402274 -985650 -330740 -374505 -1942909 -3201254 -2876469 -1444856 795274 3614531
5948 3614531 4752037 1806299 -2957074 -3868151 276461 3654766 1494443 -2927859
5940 -2927859 -3162914 1169980 4486996 3367040 119626 -1956749 -3026669 -4986181
5932 -4986181 -7748425 -9158050 -7846937 -4988627 -2950931 -2225884 -273384 5315086
5924 5315086 12634398 16713508 15837423 13976646 14878309 16349258 13797507 7672506 3022568
5915 3022568 2039561 1648646 -458192 -1799108 305248 3487650 3432182 596450 -92620
5906 -92620 3672344 8183563 8822642 6172958 4624869 5799528 6161209 2049197 -5047505
5897 -5047505 -10358493 -12057485 -13021862 -16025564 -19640098 -20352093 -17019974 -11407930 -5465089
5888 -5465089 -140441 3572296 4373672 1775695 -3421338 -9622454 -14837513 -17430591
5880 -17430591 -17520724 -16963285 -17131864 -17773410 -18749451 -20871738 -23400819 -23117971 -18759808
5871 -18759808 -14472039 -15154218 -19494940 -21659501 -19315177 -15585754 -13065239 -10825025
5863 -10825025 -8320065 -7069602 -6256280 -1689544 7247997 13745572 11186098 1873999
5855 1873999 -6325194 -9855368 -11087543 -11541993 -9189124 -3137854 3630255 7738417
5847 7738417 8258065 4971303 -2467565 -11494810 -16066242 -12612346 -5114480 -996613
5839 -996613 -2355246 -4242693 -2049233 2496884 4706278 4162891 5108867 9568353 13550976
5830 13550976 12095643 5761611 -643542 -4196192 -5306889 -4030186 544887 6404876
5822 6404876 8476586 4692296 -1036035 -4257572 -5190735 -5593614 -3800448 2631218 11243204
5813 11243204 16479865 16617441 14626401 12383725 8622614 3455497 507651 2303522
5805 2303522 6514707 9237576 10204037 12578171 18363474 25414302 28921019 25780199
5797 25780199 17822692 9811292 3448753 -4480125 -15678145 -24778998 -25111747 -18867615
5789 -18867615 -15290740 -17706006 -18705776 -11283466 988778 9602927 12336174 12882214
5781 12882214 12439802 8865899 3664043 2894575 9064523 16821129 19241684 15383231
5773 15383231 9665848 6425663 7062400 10397512 13614531 13909478 10682495 5524755
5765 5524755 -48989 -5118380 -7551401 -4720241 2332211 8002237 7914509 4012742 1406721
5756 1406721 1436214 762786 -3093352 -8184530 -10625986 -8685362 -3877523 482603 1472145
5747 1472145 -1231959 -4858179 -6215469 -4756402 -1863543 2103179 7691355 13429392
5739 13429392 15949874 14020051 10007262 6263748 2759264 -144830 241045 5041014
5731 5041014 10217356 10512190 5879596 728095 -2181476 -3497551 -3840440 -2926309 -2141038
5722 -2141038 -3512907 -5348798 -3483260 1572710 3488878 -1129275 -7194521 -8179974
5714 -8179974 -5106991 -3742319 -5344160 -5718946 -2696562 762007 1611256 558844 -498578
5705 -498578 -1468871 -2829779 -4003623 -4698477 -5931221 -7977765 -8591607 -4952574 2937990
5696 2937990 11653468 17021339 17327520 14326153 11187386 9292929 7346144 3605384
5688 3605384 -1887728 -7358845 -10372066 -9162889 -5186774 -4181559 -10858097 -21307951
5680 -21307951 -25303728 -19155136 -11691796 -12715224 -19397279 -20405767 -11041776 2555362
5672 2555362 12778348 16780843 13941273 5275174 -3285362 -4659526 -96067 1935893
5664 1935893 -1339168 -2845669 1885367 6079715 1640493 -8670653 -16094748 -18101847
5656 -18101847 -18203078 -17040519 -11753226 -2941432 4720871 8646862 9837679 9156899
5648 9156899 7318435 7364322 11406268 15605672 14207225 8236301 4249269 4396372 4105049
5639 4105049 658012 -2454953 -2300971 -1990018 -5624967 -11516057 -14105068 -10517213 -2697287
5630 -2697287 5096557 9003601 7600220 3140328 -202346 -192172 2161487 4656781 5423996
5621 5423996 3133418 -1676472 -5876113 -6943937 -6009573 -4666653 -489787 9274552
5613 9274552 20293982 23579594 16463523 5717259 -1603743 -4719642 -4912515 -1585586
5605 -1585586 3828613 6289596 4495849 4600901 11007014 18183753 18336376 13465868 12022876
5596 12022876 15655481 17611193 14278670 10228295 9727566 10187123 7688084 3890804
5588 3890804 3063001 5387173 7407736 7517981 7355978 8020530 7576511 3220863 -4754130
5579 -4754130 -11627086 -11577444 -3326056 7934485 15399147 16783125 14147704 9158264
5571 9158264 2031376 -5015510 -7759062 -5450529 -2875792 -4091821 -6724866 -5936039
5563 -5936039 -2072097 72050 -844151 -362208 4662551 10719617 12709279 11698655 13079466
5554 13079466 17482703 18473017 11513096 1540944 -2462120 1141714 5451315 5628816
5546 5628816 5647370 11262843 19855135 22602242 16228259 7426728 3781576 4266195 2113493
5537 2113493 -5201459 -12984467 -15969300 -14148003 -10898796 -8477354 -7684392 -9870602
5529 -9870602 -15845782 -22835360 -25373740 -20620730 -11583994 -4080011 -1241977 -1603106
5521 -1603106 -1639636 710876 4481414 6794033 5867113 3363717 3180832 7352560 13661786
5512 13661786 17771793 17193028 12915959 8088489 5612362 6091022 7501745 7620111 6790605
5503 6790605 6751458 6680007 3215610 -4235809 -11227979 -13939772 -14536326 -17187969 -20591972
5494 -20591972 -19234239 -11920036 -4319657 -1688525 -2905582 -3895781 -4033985 -6175652
5486 -6175652 -11379821 -16028437 -14907075 -6998495 2112325 4943642 61995 -6469159
5478 -6469159 -9103520 -9546531 -12241128 -15927021 -15207220 -9458525 -3889225 -1137638 1800487
5469 1800487 6299041 8006488 3604256 -3347936 -7374735 -7827486 -6725198 -3840463
5461 -3840463 1436021 6513201 8654652 9150192 10023329 9189439 3874231 -3279594 -6980533
5452 -6980533 -6927269 -7274767 -9035113 -8531792 -4085163 605487 1420919 -1115399 -3137141
5443 -3137141 -1621855 3266895 8112085 8548726 3467421 -3482259 -8068858 -9801279
5435 -9801279 -10307384 -9767407 -7987704 -6765946 -7331272 -7296461 -4449583 -1894449 -4377289
5426 -4377289 -10401701 -13273376 -9904381 -3593134 2122588 7276371 12309532 15823471
5418 15823471 16872472 15830753 12330498 6096147 101669 -1369851 1484924 3982449
5410 3982449 2993824 -854313 -6430180 -12577475 -15805676 -13467891 -9482543 -10445644 -15275689
5401 -15275689 -15755969 -8924323 -1418531 1051333 816807 1251849 507352 -2763187 -4644641
5392 -4644641 -2857394 -1931008 -5123538 -7472249 -4219707 -288143 -2715552 -8307244
5384 -8307244 -8333152 -2466554 1689819 1420781 1716757 5444156 9417267 10887837 10159298
5375 10159298 6326889 -1575088 -8439194 -6693039 1925640 6466756 1593627 -5620493
5367 -5620493 -7504397 -6441650 -8108485 -10856205 -9107644 -3053421 2266081 5162112
5359 5162112 7957889 10495522 9041322 2299573 -5831493 -10588915 -10702753 -8009425
5351 -8009425 -5145480 -4223006 -5974678 -9260951 -11824407 -11694729 -8338437 -3636793 -1350817
5342 -1350817 -3351458 -6191326 -4339882 2297524 7509938 7274465 5479815 7864939
5334 7864939 13192088 15015488 10953260 5550266 3694268 5138388 6685475 6711986 5874509
5325 5874509 5412392 6344850 8971782 11912030 12849418 11454261 10372351 11672972 13122368
5316 13122368 10233469 2365029 -5352652 -7671472 -5397602 -3726515 -5078882 -6533250
5308 -6533250 -5035847 -2054079 -874274 -1613477 -1913664 -1094467 -195565 1312386 4984766
5299 4984766 9288097 9723983 4285510 -4030794 -11129215 -15321701 -16011771 -12530048 -6418608
5290 -6418608 -1682000 43879 2030103 7216861 12835497 13885152 10283020 6562541
5282 6562541 5385094 5590727 6585752 9989178 15245323 17382808 12131649 1421358
5274 1421358 -8761282 -14830357 -17594161 -18821238 -19006207 -19053428 -21028655 -24885344 -26355008
5265 -26355008 -21579993 -13651883 -10666293 -15559868 -21256735 -19199623 -10411611 -3763013
5257 -3763013 -4191727 -7554714 -7937597 -5476768 -4684683 -8284632 -15032464 -21194647 -22498196
5248 -22498196 -17502170 -10889622 -10071800 -15995791 -20739984 -17377690 -8634874 -1668078
5240 -1668078 1984726 5281741 7165520 2856036 -7126068 -15317345 -16801392 -14688852
5232 -14688852 -13619222 -13068974 -10599140 -7200148 -4876792 -2142436 3034579 7531510
5224 7531510 5471096 -3593204 -13009070 -16521058 -14333736 -10377979 -6268160 -581736
5216 -581736 6823659 12706255 14063120 12538963 12874478 16508169 19012596 15785973 8603640
5207 8603640 3558486 3194896 4158768 2862226 -441911 -4639739 -10711621 -18537363 -23799293
5198 -23799293 -22462211 -17143547 -14766109 -17851838 -22018536 -22909956 -21707546 -21501934
5190 -21501934 -21396432 -18217551 -13060266 -11605563 -16223396 -21097328 -18876190 -11076821
5182 -11076821 -7608977 -14751850 -27168090 -34437660 -32778741 -26841958 -22130425 -20510525
5174 -20510525 -22503797 -28362760 -35301593 -38229997 -35579366 -30836781 -26422609 -20382778
5166 -20382778 -12015161 -6034051 -6281076 -8720335 -6449084 247618 4692722 3778521
5158 3778521 1198980 391005 -108501 -2629700 -6230181 -8657320 -9161931 -7913835 -5647294
5149 -5647294 -4744649 -7159561 -10403187 -9714288 -5573133 -4411483 -9439817 -15348612 -15650806
5140 -15650806 -11332208 -7927093 -7241468 -6942038 -6122379 -5858323 -5136283 -1485188 4046919
5131 4046919 7157973 6534768 5815511 7679986 9396865 6767570 403787 -4707441 -5453299
5122 -5453299 -4356286 -6318973 -12305136 -17529397 -16870481 -11270336 -6572936 -5821991 -5657064
5113 -5657064 -1957566 3885354 7347831 7344988 6701114 7042008 7016686 5559009 3516444
5104 3516444 1576249 -552845 -2405059 -2848725 -2398280 -2931757 -4648670 -5759418 -5563842
5095 -5563842 -5226965 -5048799 -3756729 -1228649 838972 1806213 2846058 3972784 3390358
5086 3390358 985210 -862512 -1685076 -4650267 -11238727 -17325342 -18064357 -14424512 -11028418
5077 -11028418 -9037903 -5534137 258854 4376933 3062575 -2578906 -8448029 -11862912
5069 -11862912 -12335095 -9584718 -3402068 4409051 9973452 10462146 6554564 975617
5061 975617 -4437375 -8789069 -10440845 -8295305 -4854528 -4253056 -5773344 -3505625 4387576
5052 4387576 10334505 6688945 -2579123 -6534852 -2593255 497347 -4012159 -12191602
5044 -12191602 -17049942 -18032936 -18462830 -18939269 -18531455 -18711320 -21050903 -23678400 -24148193
5035 -24148193 -23138715 -21604303 -17479270 -9398609 -631765 4993160 7924486 9134364
5027 9134364 5276889 -6338465 -20546102 -28675861 -28974602 -27023881 -26874829 -27222837
5019 -27222837 -25367962 -19839568 -10561724 -1555611 -797367 -10451054 -19605990 -15426092
5011 -15426092 -631977 9615535 8640549 5505995 8709819 13547295 11777020 5053690
5003 5053690 814841 775127 1467012 2200821 4772259 7408533 5790512 -580202 -7967017
4994 -7967017 -13494893 -16685465 -17273911 -15484637 -13439045 -12924378 -12982224 -12479340 -12918902
4985 -12918902 -15408207 -17319308 -16033150 -13687490 -13350273 -12297911 -5012800 7293474
4977 7293474 16005290 15501197 9569205 5223148 4050897 2964849 906781 493414 3033461
4968 3033461 5509351 4571882 1705513 1399465 4195045 4884337 -504860 -8655299 -12871182
4959 -12871182 -10970315 -5672340 824327 7489103 10704433 6361863 -3036068 -9266096
4951 -9266096 -8656709 -6222649 -7062282 -9234073 -8831098 -6833493 -6092285 -5844360 -4651083
4942 -4651083 -5423683 -11642532 -20470503 -24996477 -22515250 -16482696 -11235656 -8316232
4934 -8316232 -6879752 -4677574 -103049 4273852 2873990 -5135525 -12522849 -12447054 -7073986
4925 -7073986 -3212527 -2784010 -3491959 -6110294 -13699110 -24229730 -31068113 -31793104 -30732293
4916 -30732293 -31342002 -31320494 -27522442 -21594283 -17908201 -18254588 -20842824 -23325802 -25079123
4907 -25079123 -26476721 -26744002 -24034170 -19001860 -16562619 -20409226 -26449299 -26690517
4899 -26690517 -20125665 -14095397 -13635078 -15912275 -17193031 -18008523 -18456209 -16343053 -13857180
4890 -13857180 -17507184 -26950752 -33601662 -35562654 -42076040 -55657892 -63468399 -57445475
4882 -57445475 -49111426 -50613049 -55809440 -57354710 -66066229 -89995042 -111119214 -114846499
4874 -114846499 -127724725 -180240301 -234730311 -205466270 -71091805 79184778 144524001
4867 144524001 122949345 86568332 77385879 77065147 65510834 54900374 57261472 59898041
4859 59898041 50678608 40218344 41756149 48553196 46890047 37333254 29441537 25614453
4851 25614453 21617524 15941963 10286585 6459148 7695291 16339499 26854504 29184592
4843 29184592 22340373 16027830 15652939 15373508 10135596 4529965 3985932 6243915 7847401
4834 7847401 10775819 15883615 17400419 11407760 3491209 688993 1394217 534613 -343177
4825 -343177 3682493 10977511 14759365 13138544 10950796 11561748 12140771 8120456 -737910
4816 -737910 -9606931 -12756474 -8623741 -965244 5701823 10508093 14015551 14158636 9261998
4807 9261998 3587217 3607412 8875346 12952190 13524736 14353035 16286915 14473561 6986156
4798 6986156 -1409178 -7098542 -11798506 -15881351 -15766964 -12116840 -12118426 -17976876 -21107266
4789 -21107266 -14458020 -3394726 2919927 4177441 5032165 5059374 1810206 -1254683
4781 -1254683 416325 3550464 2465007 -9168 2836299 8488381 7728240 -283871
4773 -283871 -6265117 -5465237 -3949360 -7148302 -10860140 -8290996 123360 8321911 11731143
4764 11731143 9554642 3800716 -1045840 -420529 5695116 12282842 14283145 10351924
4756 10351924 2516184 -4658537 -5562776 1330425 9963009 12599700 8953643 4862863
4748 4862863 2706097 -597531 -5633562 -7758203 -4923314 -1818220 -2282419 -2924880 903738
4739 903738 6885966 8874826 5821382 2504846 2605680 5580751 9928626 15207273 20020372
4730 20020372 21439601 18286695 13310736 10538527 11187462 13325776 15097122 16761696
4722 16761696 18980886 20547618 19777790 17712621 17267213 18414489 17049268 10657244
4714 10657244 2700022 -1575349 -2077643 -3276442 -7414570 -11655295 -12157948 -8344916
4706 -8344916 -2760530 1241942 1466997 -1691451 -5530191 -7664508 -7783631 -6267214 -3106384
4697 -3106384 464115 2073750 2269374 5204888 11835954 15937373 11995430 4235870
4689 4235870 1432035 4421545 5951838 2528068 -1315798 -1805777 -1412340 -2729036 -3567104
4680 -3567104 -1977640 -494865 -1054577 -516016 4006418 9185768 9659342 5301287 15208
4671 15208 -4127295 -7303763 -8853794 -8212986 -7295798 -7817685 -7477840 -2680295 5762466
4662 5762466 12975833 15260792 12183326 4950954 -3735300 -9239374 -8292162 -2840749
4654 -2840749 2130728 4242609 4644144 4281482 2593968 -362970 -3683196 -7363890 -11096889
4645 -11096889 -11465408 -4374584 8441578 18768543 19986275 13701584 6526916 2374149
4637 2374149 448480 -539573 404843 4397268 9992280 14293791 15841866 14921356 11521229
4628 11521229 5018562 -3479558 -10319582 -12471068 -10660950 -7947484 -6080681 -4894634
4620 -4894634 -4213501 -3914372 -2540434 1508952 7175637 11241371 11636706 8376203 2171623
4611 2171623 -4793441 -7645620 -2961432 5419397 9379315 6449654 1927190 -348454
4603 -348454 -3259091 -9063687 -12905841 -9487977 -1956687 2464559 2897217 3984264 6431679
4594 6431679 5959891 1895758 -411103 2232293 6106811 6688378 4786875 3646989 3922946
4585 3922946 4939285 7927100 14249737 21875362 26558296 25902834 20717008 13738186
4577 13738186 8634619 8467253 12646071 16332103 15304274 11187953 9719827 13613439
4569 13613439 19122982 20638496 17261668 13165175 11880632 12315006 11373346 8666898
4561 8666898 6185097 4020609 -273090 -7065140 -12271143 -11676444 -5854617 1020575
4553 1020575 5559297 6763603 5589097 5105748 8468760 13669569 13058510 2494822
4545 2494822 -11030393 -16221905 -11054076 -3966273 -1770757 -2826630 -3527054 -4590107
4537 -4590107 -7026228 -7453509 -2974494 2501129 2298160 -4085842 -10606968 -12371465 -9592515
4528 -9592515 -4312465 2563869 9976844 15471190 16750570 13232704 5954153 -2465735
4520 -2465735 -7968036 -7493942 -2102179 3893872 7604089 9961855 12590709 13772605
4512 13772605 9605029 -576895 -11478271 -16060467 -12519389 -5955060 -2731555 -4397690
4504 -4397690 -7870714 -9773512 -8541822 -3685429 3760728 10038407 11049120 6909190
4496 6909190 1973889 -25932 1654788 7179238 16753445 27321387 32816097 30753243
4488 30753243 25556031 22298937 20134235 15477853 8761348 3377716 -54545 -3350723
4480 -3350723 -6036955 -6404498 -6708115 -11292039 -18648046 -21209384 -15390538 -6930490 -3336874
4471 -3336874 -5255343 -8620248 -11321613 -13334889 -13183726 -9381038 -4181176 -1447879
4463 -1447879 -1283114 -628518 1332074 2640830 3544984 7281766 14198780 19135664 17560995
4454 17560995 11604418 6811719 4701304 2026517 -3261355 -8833652 -11378738 -10444144
4446 -10444144 -7656755 -4138242 -298548 3141001 5641910 7642599 9407786 9825471
4438 9825471 8066998 5852183 5821482 7654947 8325487 6827264 5776958 6662089 6483069
4429 6483069 2395276 -2277129 -1074061 6683433 14182332 15382995 11418851 7245309
4421 7245309 5526829 6352686 9706606 14338308 15970727 10706001 48525 -10118750
4413 -10118750 -14986752 -13142423 -5511909 4067655 8739602 4557220 -3191518 -5040814
4405 -5040814 30823 2875706 -2321937 -9060208 -8094401 -967693 2915304 -264957
4397 -264957 -5920816 -10627878 -16310632 -23403500 -27331193 -25390221 -21401577 -19310717
4389 -19310717 -16924474 -10965672 -4559476 -3710233 -8189472 -11745696 -11060878 -9410192
4381 -9410192 -10784438 -14643622 -17730047 -17781401 -14269877 -8283831 -2815480 -723628 -1430070
4372 -1430070 -1797835 -744089 -309113 -1589347 -2832870 -2766088 -2458203 -2053079 962798
4363 962798 7502343 13685427 15012130 11514582 5837146 -1061702 -8206369 -11044664
4355 -11044664 -5296091 5964500 14317385 15670474 13129705 9655639 3840083 -4482877
4347 -4482877 -10290934 -9888267 -7387264 -9071691 -13646263 -14048095 -8246405 -2441534 -2597740
4338 -2597740 -7595439 -12491346 -14607688 -14140042 -11840350 -8782286 -6663032 -6332300 -7168709
4329 -7168709 -8712423 -10902125 -11924202 -8780432 -1844008 3885370 4547405 2111850
4321 2111850 558478 -317636 -3548736 -8717489 -11095777 -7312079 927361 8889961
4313 8889961 12308073 9339381 1973412 -4430368 -5697873 -3231759 -1594604 -1957128
4305 -1957128 -902592 3965852 10320309 14059098 13652499 10680940 7933631 7330728 7850703
4296 7850703 5798537 -434887 -6558222 -6754872 -1483800 3309293 4852083 6312347
4288 6312347 9786125 12121306 10394647 6573671 3472442 752254 -1392410 478508
4280 478508 7125423 12330764 10496246 5302524 4470300 8380630 10725241 8883972 6305374
4271 6305374 4812059 2007657 -2224561 -3358636 836474 6077769 7226243 4308361
4263 4308361 414792 -2923169 -5695862 -7528819 -8267406 -8665932 -9033961 -8768004 -7779479
4254 -7779479 -6594070 -5265866 -4529654 -7021481 -13619762 -19207465 -16852027 -6786615
4246 -6786615 3179154 6896818 5160865 1460040 -2089245 -3376943 -713985 3130143
4238 3130143 2766379 -1412478 -2334771 3109825 8448276 6926919 973331 -2735182 -2702573
4229 -2702573 -1188221 2411657 9799863 17816208 20861348 18292510 14160933 10752919
4221 10752919 7314877 4008270 2221425 1685099 1410495 2197006 4094927 3315705 -3346570
4212 -3346570 -12548536 -18101203 -19423888 -20866010 -23587120 -24086039 -20787048 -16385830
4204 -16385830 -13008762 -10038797 -7280425 -5480083 -3266642 1559652 7170518 9083775
4196 9083775 7122554 6017687 7894686 8830487 4418166 -5009247 -15460818 -21909836
4188 -21909836 -20130964 -10706716 -1056186 1908006 1025594 4621825 13059175 17349344
4180 17349344 12741464 5353272 1932913 1131465 -204717 279533 4934486 9496508
4172 9496508 9351644 7755037 10403865 15558064 17289206 15859298 16732046 20393203 21136607
4163 21136607 16642470 11930977 11948309 15357398 17645567 16594418 13153136 9897988
4155 9897988 9520034 12035130 12977817 7338456 -3889714 -13696829 -16541248 -13726180
4147 -13726180 -10281393 -8230305 -4735846 2902152 11550952 13916143 7528843 -578735
4139 -578735 -2511348 -897688 -4491725 -12320440 -12161625 624030 12867971 11485348
4131 11485348 4017014 8769996 28001799 44558239 45764600 37742021 32227217 30715889
4123 30715889 28401227 25003822 23176220 21319896 16065013 9478248 7217492 10266120
4115 10266120 13153180 10199782 852352 -10219558 -16440894 -14465578 -7708441 -2809068
4107 -2809068 -1614379 156283 5143302 9847586 10613509 9532593 10234392 11430004 9463287
4098 9463287 4794036 1165774 -77057 -583347 -1226888 -1590099 -1943737 -2229688 -614514
4089 -614514 3423805 6503018 5780673 3835887 4460017 5831919 3856960 762048 2916459
4080 2916459 9570932 11556213 4290769 -4339921 -3699301 6453457 17292806 22157030
4072 22157030 21403215 17958847 13316259 8218885 3549932 -525597 -4223858 -6597261
4064 -6597261 -6244997 -3912553 -2525019 -3803482 -6141567 -6880364 -5952909 -5954211 -8337587
4055 -8337587 -10640467 -8911273 -2994132 2235175 2166849 -2057793 -5025739 -3350243 1504124
4046 1504124 6370254 9812477 11627094 11022678 7020648 215058 -6591756 -9639224
4038 -9639224 -7153348 -2308493 -1818155 -8628103 -16451885 -15354134 -3795840 8368132
4030 8368132 10721904 3004768 -7185299 -14049678 -17302647 -18462101 -17948477 -15842960
4022 -15842960 -12413946 -7624372 -2117937 1903342 3100850 3537400 6018820 9350791
4014 9350791 9296551 4406646 -1908786 -5510528 -5295287 -2781036 -727399 -2369176 -8817792
4005 -8817792 -16348587 -19196646 -16101606 -11393129 -8883570 -8056370 -7423796 -7587471 -8584495
3996 -8584495 -7976206 -4851755 -2585058 -3987636 -6622819 -7103760 -7286274 -10905518 -15926090
3987 -15926090 -16463140 -12022785 -8492550 -8792100 -8655855 -4332435 895271 1736367 -1618078
3978 -1618078 -5325694 -8183965 -11414288 -14056430 -13486969 -10201384 -7971614 -8780257 -10732110
3969 -10732110 -11437549 -10647522 -8977066 -6706497 -4772000 -4658911 -6273597 -7884249 -9106595
3960 -9106595 -11803362 -16596620 -20436816 -19616326 -13891736 -5674208 3482356 12696002
3952 12696002 18625647 16450986 5962299 -5789516 -10834024 -8439946 -4478696 -3403421
3944 -3403421 -4243123 -4915791 -6299849 -9297101 -11068778 -8468482 -3737847 -2150285 -4146503
3935 -4146503 -4503712 -238819 5423267 9067865 12374894 17628434 21575387 18689999
3927 18689999 8770494 -3225003 -13595785 -21479106 -25080684 -22182254 -15296646 -10764820
3919 -10764820 -10235448 -7618915 2016444 14070571 19270251 15043682 7918977 5281185
3911 5281185 8411609 13763627 17753708 19132716 18769148 18330856 18209961 16659533 12468466
3902 12468466 8316225 8940794 14988201 21124835 22324748 20277150 20714774 25113669
3894 25113669 28350430 25328103 17068279 8596243 3192444 1255728 3080871 9075935
3886 9075935 17043715 22307751 21850424 16834156 10697138 6605825 6789296 11424529 17006576
3877 17006576 18576468 15316553 11521246 10278412 9223993 5454631 1718511 3215306
3869 3215306 9509466 14292818 13375694 8974141 5274316 3121628 417812 -4662687
3861 -4662687 -12004394 -19369245 -23475503 -23010335 -20481384 -19099592 -18398189 -15541572 -10185687
3852 -10185687 -4456676 1536451 9679681 18486842 22207979 17444033 7566186 -1075966
3844 -1075966 -4589489 -2545627 2465138 5108289 1725276 -3567371 -2049110 7674052
3836 7674052 16130384 15153048 8291365 3856381 2529573 -978774 -7205268 -11090174
3828 -11090174 -10979017 -10685949 -11706114 -10216770 -3937623 3529269 7725363 8382513 7155028
3819 7155028 4185253 -466956 -4892046 -7223548 -7504811 -6346601 -3915673 -1181701
3811 -1181701 385376 1323549 3690240 7059428 7909424 4398548 -889038 -4346573 -4933421
3802 -4933421 -3114450 825480 5484581 7939526 6948088 4821714 4321789 5388880 6522639
3793 6522639 7557203 9198509 11108125 11977889 10641629 6576598 755285 -3876439
3785 -3876439 -5037089 -4530405 -6305570 -10680632 -13840229 -13913471 -13619657 -15243249 -17097890
3776 -17097890 -17398746 -17543177 -18305902 -16589566 -9953787 -1272569 5168867 9246452 12404352
3767 12404352 12754649 8204975 1952189 -1293797 -2939323 -7811785 -14725600 -17010756
3759 -17010756 -13105615 -9419947 -10575933 -13419790 -13734540 -12667808 -12343881 -10580631
3751 -10580631 -5212332 537772 2623049 2846585 5007733 6935748 3333808 -4217923
3743 -4217923 -7397394 -2811047 2643890 996572 -7033178 -14974557 -19286281 -20638645
3735 -20638645 -19296738 -14683398 -9142334 -7270074 -10132704 -13474870 -13359582 -11045013
3727 -11045013 -10284371 -11678837 -12054256 -8567602 -1434531 7023988 14354144 19045393
3719 19045393 20910620 20548988 18079391 13289768 7643118 4301000 4270154 4149196 506164
3710 506164 -4612051 -6042717 -2959363 132573 414520 316443 2193178 3724364 1975984
3701 1975984 -1016852 -581398 4400285 10800768 15170900 15568243 11575275 5851935 3520249
3692 3520249 5959403 7233777 1659577 -6644190 -7968481 -666203 6146350 5262785
3684 5262785 305362 -1497232 52008 -257031 -4280008 -8698398 -10367570 -9049363
3676 -9049363 -5626357 -1390533 1204172 346534 -2378923 -3361431 -1104269 2634185 5178375
3667 5178375 4768007 1252411 -2899874 -3536020 608848 5302178 5708432 2976734 2345198
3658 2345198 5015143 6336063 3401934 338465 2949300 10522485 16559976 17012980
3650 17012980 14574088 13984529 15454948 14904967 10208824 4794684 3463061 5802506
3642 5802506 6366211 1834286 -4541275 -7187825 -4735864 34957 4913731 9440722
3634 9440722 11975612 9585795 2314836 -4949474 -6757686 -2367591 3965148 7106616
3626 7106616 5419707 2148335 2066710 5425023 6496382 777501 -7716506 -10681004 -6760180
3617 -6760180 -2975874 -3454942 -3078045 3472374 11928163 14289699 11034573 9808290 13095093
3608 13095093 15141892 12182167 8125364 7002735 6317289 2606139 -1419938 -1023621
3600 -1023621 2460945 3519720 713001 -2560733 -4754037 -7931256 -12252382 -13889293
3592 -13889293 -10360925 -4133416 1043997 4171620 5453694 3952961 -470104 -5198030
3584 -5198030 -7758309 -9228794 -12081264 -15654135 -16443703 -12691294 -6685293 -2435480
3576 -2435480 -2207346 -4928244 -7046793 -5785478 -2525699 -1730084 -5255434 -9349215 -9202441
3567 -9202441 -5027806 -1331862 -1469083 -5493490 -11984283 -18533914 -21225937 -17700918
3559 -17700918 -11069952 -7105430 -7012037 -6781628 -4387463 -2927089 -4614351 -6415659 -5230220
3550 -5230220 -3429845 -4559089 -6467135 -4384767 520985 1751193 -2749961 -6837956
3542 -6837956 -4324601 3168995 9206425 10404249 8359158 5774489 3890519 3045740
3534 3045740 3063638 2830334 1178292 -1455597 -3202920 -2650940 65220 3657021 6230104
3525 6230104 5766030 1413976 -5163029 -10459019 -11885111 -9902892 -7247728 -6158705
3517 -6158705 -6580885 -6921108 -5952306 -3566880 -207759 3422114 6123329 6956493 6807138
3508 6807138 7968848 11052591 13272493 11382268 5907518 777614 -1361349 -1863025
3500 -1863025 -3449757 -6060771 -6516232 -2263722 5143523 10850851 11497551 9072270 8852250
3491 8852250 12971448 17350626 16208345 8511809 -1491332 -8923191 -11480983 -9340916
3483 -9340916 -5009394 -2990498 -6155309 -11594300 -13012538 -8353455 -2147505 1075292
3475 1075292 2279539 4181716 5156180 1312681 -6367007 -11427878 -9395234 -2728421
3467 -2728421 3049089 5779693 7219489 8508687 7737005 2911099 -3926846 -7561254
3459 -7561254 -5555313 -2092634 -3672153 -11013271 -17884078 -19015020 -16254700 -14321399
3451 -14321399 -12960461 -7719683 1903025 9780222 10495269 6178265 3469618 5736805
3443 5736805 11115100 16899141 22243681 26046468 25441579 18803149 9032137 1580916
3435 1580916 -772425 327491 2071782 3406942 4145719 3552004 1719236 775889 2321119
3426 2321119 4594960 4741553 3162201 2577162 3127180 2236200 7764 616040 6341167
3417 6341167 13754696 18268312 19152803 17305861 11877948 3448406 -2536092 -1176566
3409 -1176566 4199264 5085100 -1666641 -10982199 -16989918 -18407840 -16418693 -12597196
3401 -12597196 -10181699 -12278926 -16750174 -17261458 -11433720 -3706428 1745770 5926596
3393 5926596 10099815 11363093 7620878 2644689 933992 790297 -2032951 -6407137
3385 -6407137 -7493726 -4654586 -1566864 832726 5260973 11548693 15237694 14294833
3377 14294833 11909079 10330588 6758838 -1318099 -10306228 -13887824 -10386045 -3763785
3369 -3763785 1512741 4291978 6454323 10753920 18094240 25449316 27544300 22283667
3361 22283667 13851992 8952321 10268794 14563508 16689242 14481468 9922870 6276119
3353 6276119 4443418 2540509 -851237 -4321967 -5798995 -5758715 -5910990 -5428579 -1617993
3344 -1617993 5374835 11658619 14396135 14704361 14543031 13630153 11313044 8838162 7333713
3335 7333713 5645024 2754679 552794 1300035 3586928 3868455 1468635 -799079 -1014915
3326 -1014915 -661835 -2209994 -5888860 -9372002 -9707081 -5710638 472252 4467867 3394952
3317 3394952 -1790967 -8304346 -14738461 -20924930 -25762838 -27330149 -25020329 -20136187
3309 -20136187 -14648009 -10441321 -8887501 -9546379 -9996295 -8572223 -6585197 -6337609 -8041011
3300 -8041011 -10510014 -13463262 -16643491 -18150413 -17071259 -16789801 -21495853 -29377229
3292 -29377229 -33606912 -30937646 -25046009 -20039887 -15505137 -10752907 -9146316 -13263810
3284 -13263810 -18743381 -18701106 -13354201 -9733551 -11215246 -12469357 -7231798 2534387
3276 2534387 8516182 5310923 -4948584 -15994689 -22412689 -21508495 -13659757 -2754080
3268 -2754080 5434180 7726878 6293187 5334906 5297755 2667346 -3884799 -9992850 -10651049
3259 -10651049 -6847787 -3584254 -1902486 2681659 12212245 20577667 19315504 7670408
3251 7670408 -6295673 -14233315 -14549377 -11041444 -7422577 -4749496 -2877993 -2415688
3243 -2415688 -4349013 -7898638 -9865039 -7720993 -3463872 -2277136 -6008640 -9830942
3235 -9830942 -7652404 319403 8065829 11192963 10918786 10621550 11702382 13904881 16576932
3226 16576932 17527000 13151067 2599115 -9528640 -17409209 -20125082 -20930033 -21186099
3218 -21186099 -18619426 -12212354 -5276998 -1550350 -698901 -317761 -586456 -3507470 -7983269
3209 -7983269 -9339360 -5121231 1086585 3534137 598643 -4578673 -8736645 -11651821
3201 -11651821 -14704125 -18117661 -20486214 -20340122 -17513372 -13014074 -7872701 -2702187
3193 -2702187 1070735 422501 -6635148 -17021972 -23491814 -21506727 -13834148 -6422918
3185 -6422918 -1365901 3213773 7592689 8872892 5499178 -127153 -4759318 -7179610
3177 -7179610 -6810870 -2621498 4479726 10647076 12953035 12654880 12743191 13890757 14552706
3168 14552706 13300303 9502384 3972136 598230 4095229 13214008 19412569 16389024
3160 16389024 8335941 4007945 5020440 6031518 4953340 5447198 8530127 9277669
3152 9277669 4935494 83063 -411695 1349928 606767 -2523597 -4663957 -5100800 -4897407
3143 -4897407 -2470535 4319918 12581618 16075908 12845986 7417463 5199700 7641663
3135 7641663 12416985 15247670 12277309 4186820 -2544142 -2008768 4043532 8979916
3127 8979916 9853228 8530692 5541504 -609081 -7392055 -8640072 -3617776 645993
3119 645993 -375122 -2235520 98846 3517229 2895652 835024 2964742 6702007 4202444
3110 4202444 -4038539 -8100394 -3107660 3854148 5114530 3209216 4747283 9201393
3102 9201393 10526742 6698806 1243270 -3108815 -6648125 -9385275 -10643244 -11783437
3094 -11783437 -14761798 -17813923 -16873114 -11712496 -6476977 -3310089 334599 6591111
3086 6591111 13320135 17351833 18238152 16720690 12804602 7909579 5762951 7852071
3078 7852071 10379107 9085142 4982883 1757441 -262386 -2800907 -3728978 1567500
3070 1567500 12037709 19690485 19224411 14982543 14929417 20404653 25463164 24751015 18437301
3061 18437301 10058889 3003200 -548437 -218437 1770890 2239178 486302 -1380820
3053 -1380820 -2268884 -4301821 -9583822 -16246088 -20138867 -20085173 -18941668 -18875309 -18098708
3044 -18098708 -14093736 -8165709 -3896312 -1812803 873376 4547799 5067215 90474
3036 90474 -5307027 -3670046 4952435 12475167 12725344 7840555 3099898 -461878 -4691135
3027 -4691135 -8451993 -8199957 -4181538 -1620785 -4248375 -9622057 -12674881 -11797962 -9509349
3018 -9509349 -8616688 -9700713 -11483444 -11877963 -9235665 -4120198 685165 3416949 5758008
3009 5758008 9965995 14303802 14455778 9979724 5929799 6118185 7716034 5709156 649700
3000 649700 -2213933 -943361 461962 -1507394 -4800389 -5430676 -3171986 -806254 258057
2991 258057 673388 824906 713060 1359170 3660935 6342339 7423794 7204947 7461822
2982 7461822 8351577 8644327 8287609 7884144 6466299 3349419 1591671 5079179 11688172
2973 11688172 14170068 9513468 2993040 673368 2285011 4584097 7456968 12281911
2965 12281911 17344816 19685711 19571790 18851580 16821504 12415446 8839581 10537722
2957 10537722 15916449 18321786 14685016 8483323 3571520 66494 -2322548 -1901549
2949 -1901549 1455090 4245064 3719436 1406822 -293551 -2266640 -6500451 -11755295
2941 -11755295 -14351879 -12421298 -7567869 -3125829 -1579729 -2245469 -1197608 4104703
2933 4104703 9956161 9961503 4471430 1482023 5191913 8825108 4161835 -5612987 -9621840
2924 -9621840 -4425805 1922281 1910051 -2080514 -3532065 -1691769 -981508 -3119045 -4704543
2915 -4704543 -2701174 1142437 2910377 2091036 2542254 7229041 13211203 14155957 8423743
2906 8423743 2117025 1937702 7064219 11365348 12241563 12746076 14749629 14954307 10043927
2897 10043927 2142961 -3897376 -6043327 -4801353 104158 8371102 15320611 14244617
2889 14244617 3936014 -9255473 -18406622 -22404530 -23597866 -22063646 -16018985 -7016031
2881 -7016031 -531474 26615 -2783952 -4257994 -3073666 -868904 1588315 4371929
2873 4371929 5475684 2047590 -4675323 -9268219 -8556693 -4992219 -1632178 2671748
2865 2671748 9422358 14517849 11407721 159771 -10983919 -14313981 -9934544 -3405853
2857 -3405853 834842 1940179 914905 -1018660 -2799371 -3756295 -3644604 -2325926 200823
2848 200823 3557006 7168864 10148239 10663031 6957516 96516 -6268051 -10636532 -15638169
2839 -15638169 -22419761 -26183930 -22438041 -15604758 -14603301 -20021929 -23102019 -19053232
2831 -19053232 -13540983 -12189711 -11217900 -4830691 3810681 6694343 2616514 -2734906
2823 -2734906 -6073107 -8352756 -8738193 -4898161 309119 334396 -4950346 -7704778 -3596947
2814 -3596947 1622283 1050752 -3425948 -5318042 -3550229 -2371675 -3494164 -4306787 -3678845
2805 -3678845 -4277480 -7532347 -9881432 -6621049 1780447 9289813 10532469 6467301
2797 6467301 2828893 2919409 3690780 562303 -5462064 -8720186 -6726314 -3301531 -2556484
2788 -2556484 -3177728 -1232998 3737837 8356337 9741266 7559547 2684387 -3553881
2780 -3553881 -8979356 -11620701 -11575809 -10738236 -10618642 -11017928 -10433767 -7413937 -2365629
2771 -2365629 1774803 2181888 -133883 -1309409 -253975 -823016 -6550816 -15305852 -21357963
2762 -21357963 -21060993 -14601785 -4586473 4080307 5193620 -3353356 -15453627 -21800086
2754 -21800086 -19341853 -12933340 -7987298 -5235658 -3193741 -1713104 -1076454 -375876
2746 -375876 987095 1968642 1819527 1830374 3385856 5332820 4951538 1194807 -4004469
2737 -4004469 -7429483 -7218431 -4205335 -744026 1949588 4439688 6412031 5176620
2729 5176620 -900084 -8741282 -13503741 -14670706 -15645509 -17281834 -16202208 -10929646
2721 -10929646 -5294663 -2882215 -1615106 2429492 8279563 11248237 9565210 5980886
2713 5980886 3334408 2109191 2289868 4126885 6425452 7085682 6311697 6733714 9347520
2704 9347520 11906361 12785758 13924151 17598994 22091983 23575179 21758586 20656262
2696 20656262 23091362 26911861 28102019 25770468 22010644 18203675 14416367 12156437
2688 12156437 14000360 18798756 20373816 14208559 3854574 -2647732 -1898397 2616656
2680 2616656 6522769 8266848 6489018 -850291 -11802155 -19093728 -17660272 -11113336
2672 -11113336 -6857851 -6876530 -7694434 -7806974 -9563519 -13301881 -14829488 -10876711 -3458802
2663 -3458802 3417178 8485476 12324204 14327023 13634854 11659481 10647011 10112786 7246299
2654 7246299 1190087 -4903708 -6763720 -3085325 3410740 8178947 8138155 3852489 -1030865
2645 -1030865 -2960338 -1396255 1610704 4463454 7681348 12024295 15770484 15297872
2637 15297872 8973949 -242217 -6964101 -8049074 -4661504 -291815 2090497 1250906
2629 1250906 -2043760 -5344939 -6781389 -7921639 -12471267 -20474475 -25870291 -22895561
2621 -22895561 -13950961 -7298475 -6498389 -6182286 -592014 7124037 8524070 1834218
2613 1834218 -4444762 -1761342 7742466 13845896 10383591 1371066 -5297606 -6863643
2605 -6863643 -6297767 -6326870 -6390088 -5131110 -2735152 -111088 1843674 1496074 -2529802
2596 -2529802 -8621144 -12879545 -13741974 -13322011 -12878251 -10436117 -5494970 -2474290 -5126660
2587 -5126660 -9934102 -10158108 -5220232 -660031 891131 2723737 6864519 9812525
2579 9812525 8539266 6082162 7045983 10648644 12563170 11801646 11416815 12824535 13181391
2570 13181391 9207609 1420475 -6161835 -9419905 -7332832 -3002716 -1315871 -4336941
2562 -4336941 -8987614 -10284587 -6964216 -2992006 -2999601 -6629149 -8347143 -3696590 4810691
2553 4810691 9955032 8374517 4198330 2420098 1927286 -963461 -4585465 -3448835
2545 -3448835 2745536 7904428 8614082 8289776 9740182 9653312 4738494 -1701416 -4679216
2536 -4679216 -5215093 -7315400 -10057612 -9144154 -5194607 -4122812 -8570299 -13906671 -14008644
2527 -14008644 -7511594 2356032 10875175 14103295 11049772 4614599 -1353112 -5696114
2519 -5696114 -8856927 -9581851 -6055702 230533 5188835 6835310 6573115 6098941 5774564
2510 5774564 5518788 4459710 548202 -6300936 -11741763 -11370530 -6648509 -2623867 -1061321
2501 -1061321 -435513 -1123924 -4278252 -6086308 -768991 9117672 12803838 5157502 -5789360
2492 -5789360 -9326376 -4835256 506602 2290232 1865045 1679226 2515402 3942144 4467554
2483 4467554 3079994 2349761 6319401 13029058 14181943 6346727 -2384659 -2472323 4304039
2474 4304039 8409815 5684582 -34023 -5063852 -8863649 -9652014 -5081155 1533555
2466 1533555 2770071 -2699869 -7204586 -4023802 4622606 12155208 15539508 15398212
2458 15398212 12385548 7682855 4681196 6191574 10906684 15273767 17945601 20173501
2450 20173501 22678105 24340955 23847364 21222125 17737197 14869765 12934582 10429577
2442 10429577 5398485 -2267853 -10371858 -16080895 -17603869 -15216438 -11837173 -11299404
2434 -11299404 -14036618 -15730663 -12943300 -8787291 -8990367 -12734904 -12576212 -5127512
2426 -5127512 3059586 3894689 -1237116 -3276861 3025702 13457580 20131569 19633864
2418 19633864 14573398 9489448 6814561 5821176 4107862 84459 -5363254 -9473735
2410 -9473735 -10198706 -8408396 -7057963 -7657518 -8396767 -7168553 -5440565 -5951512 -6439374
2401 -6439374 -440781 12856646 24157044 24776782 18722246 17051042 21290537 20718505
2393 20718505 8132891 -9250204 -19038717 -18100993 -12468018 -7132155 -2266366 2410787
2385 2410787 5498417 6221664 4935424 1504318 -3662149 -7720545 -7991102 -5974421 -5442344
2376 -5442344 -6869814 -7146473 -4741741 -1687582 51364 1024655 2265676 3471126 4171311
2367 4171311 4606520 4742854 4298886 4013089 4649656 4448870 298949 -7466046 -13836185
2358 -13836185 -14307612 -9714858 -4526263 -1665833 -441943 1252281 4007908 6145864
2350 6145864 5723437 3547037 3306601 7182121 11976204 12021191 6035338 -1530561 -6631717
2341 -6631717 -10235511 -15154133 -20716595 -23063601 -19568632 -11111354 -1103136 6052440
2333 6052440 7031433 2658050 -1700329 -1127287 3559658 7245585 6677456 3000011 -1501509
2324 -1501509 -6400194 -12072353 -17723586 -21548651 -21709265 -17138738 -9398334 -3852087
2316 -3852087 -5907823 -14530987 -22109357 -22818482 -18720253 -15253697 -13738576 -12394975
2308 -12394975 -12300614 -16306660 -22258308 -23717098 -19434953 -16387250 -19918209 -25858373
2300 -25858373 -27280237 -25120916 -25797186 -30209684 -31792454 -25792609 -15014836 -5388079
2292 -5388079 -558281 -1874706 -8676249 -16400838 -18750705 -14571709 -9346691 -7603997
2284 -7603997 -7486007 -5605314 -3317057 -3860172 -6033855 -5733079 -2700933 -1173991 -3734280
2275 -3734280 -8217495 -11278528 -12036749 -11352612 -9853908 -7878473 -6162420 -5784598 -7631695
2266 -7631695 -11447265 -15025430 -15602807 -13059965 -10469994 -10345204 -11793093 -12586271 -12171176
2257 -12171176 -10964558 -8643461 -5226826 -2042816 515115 4191210 9485776 13417520
2249 13417520 13630801 12391193 12897864 13833875 11978092 8692625 9007374 14764624 22741582
2240 22741582 28809726 30027547 24186912 12442776 1346789 -3392802 -4475659 -8302588
2232 -8302588 -13696808 -13265228 -6568189 -2721565 -6578970 -11021341 -8489736 -2801308
2224 -2801308 -2359264 -6967861 -9147167 -5425400 632030 4556163 4076158 -1889976 -11288650
2215 -11288650 -17404574 -15051161 -7422291 -1908262 -728753 -1017778 -2012770 -5155411
2207 -5155411 -7975424 -5719593 -157940 511780 -6956750 -15721183 -18164622 -15087191
2199 -15087191 -12168768 -11902553 -13149202 -15215283 -17940688 -19584891 -18181264 -13988766
2191 -13988766 -8400603 -1941737 4666152 9235981 10088416 7866861 3689453 -2692959
2183 -2692959 -10991106 -18508687 -22462507 -22820859 -20982318 -17369974 -12576709 -9133439
2175 -9133439 -9131347 -10898034 -10839567 -8354459 -6566102 -8206926 -12741408 -17480585 -19712049
2166 -19712049 -17927656 -13068650 -8837045 -8785805 -12309529 -14879051 -12904326 -7220499
2158 -7220499 -1306436 2433060 3506183 1813219 -2538509 -7663450 -9915046 -6941183
2150 -6941183 -401488 5458960 7991743 7994527 7422769 6756005 5452996 3695481 2217800
2141 2217800 1132806 349916 505133 1845023 2756905 1484117 -765784 -650553 2819744
2132 2819744 6601226 7405404 5692871 4834753 7269487 12181250 16071084 15242753 8951199
2123 8951199 708559 -4588330 -5433787 -4905204 -7104435 -13533166 -22681546 -31202115 -35129939
2114 -35129939 -32103132 -23628957 -14100670 -7145681 -4039389 -5069429 -9636039 -14596319
2106 -14596319 -15775886 -12740602 -9497062 -8843219 -8726504 -6263608 -2619295 -1009038
2098 -1009038 -1933054 -3523797 -5176906 -7755430 -11117240 -14150807 -16437845 -17542722
2090 -17542722 -15947810 -11390784 -6829030 -4824946 -3242010 1553228 7939559 10081499
2082 10081499 6266739 1838020 2152669 6198493 9449034 10313695 11096642 14029053 18483748
2073 18483748 21396128 19339400 11399856 1276035 -4570801 -2528352 4289635 8316929
2065 8316929 4010819 -7005033 -16381762 -15811114 -5434795 4931621 5226544 -4220706
2057 -4220706 -13564079 -14623264 -8354634 -1053775 3212625 4635448 5043316 5963124 8089800
2048 8089800 10755602 12442469 12543694 11576924 9426759 5288219 -46593 -4064911 -5687446
2039 -5687446 -6326477 -6655735 -4828116 285430 6232950 9488845 9342222 7613497 6025098
2030 6025098 5300427 5152659 3877005 80095 -3916494 -3276335 2825674 9051135 10822951
2021 10822951 9888737 9484890 7809271 1712043 -5816746 -8433066 -5806629 -3671352
2013 -3671352 -4348997 -3964869 -691954 947970 -2385526 -6302897 -4380984 2819156 8800462
2004 8800462 9192534 5096168 -93285 -3863565 -5536738 -6651406 -9436524 -12907152
1996 -12907152 -12169423 -4168048 7407283 15767334 18269964 17100060 14113483 8945741
1988 8945741 2217156 -3093902 -4688180 -3112172 -197529 2678947 4383753 4295050 3542964
1979 3542964 4069391 5672502 5807461 3244277 205467 -352669 1698014 3995000 4598945
1970 4598945 3463587 1715771 507099 296185 728190 1457220 3029425 6146965 10046398
1961 10046398 12756386 13306208 12638074 12025720 11701085 11257664 9975002 6419299 -380417
1952 -380417 -8491642 -13807910 -14557786 -13031475 -11038392 -6238852 3537301 14081039
1944 14081039 17880940 13893983 9542460 10852517 14539527 13230400 5685256 -2368278
1936 -2368278 -6133340 -6150535 -5119299 -4562436 -5497022 -8661807 -12366756 -13093516 -10222974
1927 -10222974 -7691366 -8823991 -11745463 -12274266 -9329290 -4751079 377373 5859102
1919 5859102 10003850 10789646 9170255 7951013 7330390 4704310 -873464 -7186425 -12181601
1910 -12181601 -15575950 -16732626 -14736299 -11679624 -11765669 -14999088 -15570740 -9431816 -190488
1901 -190488 5879065 7694591 8242086 8224487 5951831 2489639 1664163 4315697 6713512
1892 6713512 5891803 3299538 1785041 1594335 983584 -851979 -2811772 -3183244 -1589548
1883 -1589548 -15035 -989909 -3960136 -5300038 -3529513 -1915079 -2929287 -2929795 2938993
1874 2938993 12438196 18586690 19538219 19714074 20795331 18772724 12089902 5625537 2658255
1865 2658255 -836647 -8605033 -16025285 -16041809 -9860260 -5229505 -5851769 -8400501 -9077592
1856 -9077592 -7671659 -5352361 -3130725 -2468167 -3439757 -2799133 2013185 7509967 7295848
1847 7295848 544471 -6847033 -9570339 -7248379 -1739261 4939829 9280995 7749476
1839 7749476 1346382 -4855015 -7772538 -8285112 -6662087 -928626 8250614 15452856
1831 15452856 16150844 11597412 6072303 2141861 217436 -488089 -2359510 -7479892
1823 -7479892 -13668329 -15840284 -12746204 -8212846 -4089403 2637706 12570320 19391863
1815 19391863 17775678 11650721 9024942 11699742 15560631 18029974 18959936 16395819
1807 16395819 8526303 -761606 -4870809 -3352825 -1925533 -3293128 -4134659 -2497058
1799 -2497058 -1922245 -5312821 -9556258 -9670280 -4978632 1574551 7300311 10439984 9746751
1790 9746751 6195450 3287038 3383000 4955108 4721408 996713 -5737744 -13391178 -18544451
1781 -18544451 -18546466 -14360919 -9338903 -4977226 -666643 2532242 2203100 -359261 -238477
1772 -238477 3660436 5864391 2291166 -3134787 -3818561 811968 5974385 7882739 5225956
1763 5225956 -2536814 -13065795 -19631075 -17604209 -11339902 -8871063 -10467779 -8789785
1755 -8789785 -856842 6837023 7597183 3320968 409420 997064 2320783 2160405 847736
1746 847736 -865186 -2444967 -2344817 1202787 7622647 13512980 15144336 11317603 4293744
1737 4293744 -1906642 -4844766 -5411578 -5696015 -5979233 -5412992 -4622994 -4805840 -4574681
1728 -4574681 -1243335 4100468 6594139 4389673 1885236 3538279 7521390 9016910
1720 9016910 7614758 7347006 10208771 13466868 13690381 10587791 6297032 3021256 1919562
1711 1919562 2787428 4385751 5744334 6512472 5371631 63545 -8982197 -16996587 -19898218
1702 -19898218 -19494617 -20011264 -20765475 -17350315 -10148506 -5797325 -7925596 -11570083 -10500830
1693 -10500830 -6050725 -4005507 -5502310 -6326287 -4134548 -1336845 -665293 -2153992
1685 -2153992 -5083749 -9006842 -11870551 -10823806 -6396916 -2677338 -1745158 -1080257 1706930
1676 1706930 5017475 6759972 8289705 11010706 11719215 6332961 -2776235 -8223601
1668 -8223601 -6656501 -1839238 2046411 5422013 9698134 13158646 13861608 13439482 14214804
1659 14214804 14825193 12698485 9200687 7900215 8437099 6726538 1645746 -2849002
1651 -2849002 -3602261 -2442124 -2607940 -4351921 -6437567 -9015240 -12033927 -13126845 -10468174
1642 -10468174 -6292890 -4367490 -5041372 -5934897 -6416097 -7645363 -8749147 -7252230 -3769930
1633 -3769930 -1982772 -2708185 -2338986 664373 2185680 -888902 -4017641 -212886 9691276
1624 9691276 17128661 16004752 8433967 251521 -4510624 -3839975 2415962 10182001
1616 10182001 12480539 6566824 -2568047 -8354028 -9580603 -8428904 -5059136 1140434
1608 1140434 7104173 8443518 5709570 3106294 1013141 -4346532 -12418639 -15694576
1600 -15694576 -9382650 724974 4744276 484678 -5549994 -7125703 -4035202 -23247
1592 -23247 908062 -3514655 -11753900 -18115745 -17639491 -11780999 -6842441 -6967183 -11203610
1583 -11203610 -16635532 -20716864 -20716633 -15194350 -7086681 -1681467 -516127 -940609 -2317895
1574 -2317895 -7398285 -15298908 -18896898 -13929060 -6342234 -4678144 -7984253 -7923074 -1701503
1565 -1701503 4073945 3256950 -2310727 -7223634 -9317853 -9307401 -7985680 -7113610 -9572623
1556 -9572623 -14963103 -17857757 -14374029 -8244342 -5927492 -7159525 -5488539 1697612
1548 1697612 8763154 9305181 4073937 -1450855 -4624035 -7133240 -10032603 -10965194 -7247045
1539 -7247045 357960 8133935 12800202 13822719 13123840 12984928 13698317 13207089 9905298
1530 9905298 5600107 3747794 3931791 641217 -9622116 -21508223 -25325744 -18960619
1522 -18960619 -10946905 -9197531 -10634970 -6641690 3520160 10916172 9022561 1732685
1514 1732685 -3323011 -4490572 -4720881 -4079810 167627 6684832 9379440 5504607 -41811
1505 -41811 -1477184 39921 -937639 -5625111 -9498300 -9090339 -6033744 -2863928 1546435
1496 1546435 9159020 17331126 20194259 15766446 8637653 4447392 4119986 5143630
1488 5143630 6242145 8051947 10316215 11376591 10390024 7644138 2815598 -4157699
1480 -4157699 -9983541 -9232007 -724177 9638155 14727180 13143213 8305995 2983267
1472 2983267 -1821947 -4057822 -1309342 4998179 9608752 9083550 5108271 1319437
1464 1319437 -595343 -671097 443286 590893 -3019655 -9468840 -13040232 -9675271 -2813478
1455 -2813478 768100 -156609 -549724 2951577 7775514 10214185 10389450 10051001 8685398
1446 8685398 5151703 1224943 -74347 1015155 1269139 -883358 -3736389 -5380514
1438 -5380514 -5595530 -4207731 -565856 3994756 5882831 3589515 262818 -488438 354987
1429 354987 -578704 -2941557 -2644650 1685636 5916351 5652925 1387067 -3554085 -7511959
1420 -7511959 -10192285 -10122274 -6362201 -2047636 -2134792 -6792751 -10335434 -8180980 -2210538
1411 -2210538 2465899 3502525 1723926 -2111459 -7222844 -10123542 -6057942 5179069
1403 5179069 17041680 21998567 19035715 14156557 13561359 17332842 20182109 17687982
1395 17687982 10772094 3886440 129959 -473066 1118440 3977448 5645975 2736593
1387 2736593 -4544599 -10639151 -10533154 -6225598 -3915213 -5350071 -6032376 -2680776 1684827
1378 1684827 2361768 -426262 -2511703 -1581990 837242 2270093 1770892 -101689 -2138466
1369 -2138466 -3663827 -5598096 -8926391 -11318292 -8042082 1350170 9871156 10349542
1361 10349542 4152307 -1520640 -3824821 -6525015 -11899561 -16074668 -14695880 -8892505
1353 -8892505 -2875564 846098 1227003 -2576518 -8745473 -12350584 -11433369 -10754063 -14903665
1344 -14903665 -20223177 -19346856 -12374355 -6854468 -6332229 -5826824 -984731 4751053 6426394
1335 6426394 5968444 8510511 13224397 14016353 8705149 2006491 -1474214 -2779306 -5366397
1326 -5366397 -9571852 -12542996 -11981822 -8371952 -4586770 -4079099 -8073528 -13697064 -16016283
1317 -16016283 -12425952 -3995932 6963849 17967624 24748682 22553628 11749262 -381896
1309 -381896 -6609071 -6992480 -6428256 -7119282 -7739713 -8849715 -13485396 -21047319 -25359674
1300 -25359674 -21492106 -11369381 -476251 7596058 10825084 7120564 -2419338 -11226126
1292 -11226126 -13317470 -10383833 -8282199 -8005159 -5860915 -1930542 -1263690 -4986606
1284 -4986606 -6897743 -2393624 4723311 8587811 9601935 11308423 12921423 11086028
1276 11086028 6674465 3718032 2841515 1427247 -634891 -1117886 -744160 -2143094 -3542593
1267 -3542593 -151533 7183193 11610526 10625503 9664591 11877607 11494160 3120190 -8176271
1258 -8176271 -13406360 -12646075 -13729569 -19570851 -24333362 -22617997 -16063173 -9285859
1250 -9285859 -4344208 -1232092 -23542 -432624 -1643091 -3542022 -5921443 -6494450 -2733704
1241 -2733704 4139207 10104294 13288478 14548857 13488904 8679802 2600620 1009936
1233 1009936 5045274 8658590 7026653 3281053 3063865 6126796 8005680 7273959 5955110
1224 5955110 4368270 963730 -3019082 -3774547 -683687 2225858 1895261 46962 -58804
1215 -58804 2046971 4535652 5950423 5841056 4395960 2809397 2708332 4111763 5073147
1206 5073147 4085842 1571017 -1581174 -5215056 -8690335 -10329209 -9691681 -8907067 -9766418
1197 -9766418 -10640890 -8762921 -5079283 -3833286 -6388192 -8076003 -3515232 6134373
1189 6134373 13915957 15224989 12769533 12150855 14433138 15417521 11592572 4303908 -2350965
1180 -2350965 -5624697 -5207073 -2177597 1383132 2735693 232573 -5177476 -10707721
1172 -10707721 -13456341 -11282037 -3811990 5972119 12589923 12637693 8075769 3469389
1164 3469389 774430 -1365818 -4140935 -6987842 -9238091 -10695646 -10211717 -6143961
1156 -6143961 926103 7844304 11896313 12388811 9087618 1878877 -6915437 -12771914
1148 -12771914 -13724645 -12914208 -14095313 -16227637 -15171111 -9802667 -3764134 -1264400
1140 -1264400 -3158309 -7060643 -9583868 -8596515 -4882948 -1499790 -330510 -39797 1050375
1131 1050375 1460442 -1232470 -5452492 -6692434 -4187245 -2745020 -5850423 -9927299
1123 -9927299 -8529043 -697071 7814268 11107606 8532214 3697587 314981 -443780
1115 -443780 205495 670577 803033 1251466 1288156 -722918 -3887740 -4446316 -1097321
1106 -1097321 1799935 -186096 -4629835 -5485459 -2373234 -1016845 -3607426 -4802711
1098 -4802711 -426832 4978819 4061060 -3177231 -10102577 -12307487 -10913755 -8355026
1090 -8355026 -5755836 -4150468 -3984244 -3466983 -1138675 712741 -350826 -802352 5477962
1081 5477962 17217506 25351394 24494137 19068035 15575863 14726303 14702112 16159555 18774523
1072 18774523 17905376 11017891 3741909 2889833 6123021 5401382 -1177262 -8152341 -12262468
1063 -12262468 -15592861 -18780627 -18630414 -14516871 -10681694 -9480751 -7933028 -3875128
1055 -3875128 -390158 -739581 -3300506 -5010625 -6006766 -7469099 -8432271 -8108155 -7964657
1046 -7964657 -8161243 -5567543 797343 6002589 5677861 3294579 5573220 12618682 18325608
1037 18325608 19560835 18997384 18602384 16247803 10852755 6219530 6521887 10671636 14242879
1028 14242879 15545480 16793369 19243591 19776766 14303122 4012650 -4348044 -6067609
1020 -6067609 -4401145 -5846235 -10573967 -11882124 -5571610 4723704 12850650 15825553
1012 15825553 12243409 1144336 -13198615 -21059919 -18209078 -12936054 -15106088 -21656751
1004 -21656751 -21360560 -11982893 -3156397 -1853265 -4431613 -5509527 -6023188 -8252702
996 -8252702 -10065567 -9321238 -8566370 -10319398 -12206536 -11583447 -10787959 -12657616 -14342457
987 -14342457 -10960348 -2965885 4827569 9196591 9062567 3057772 -7809008 -16908315
979 -16908315 -17457099 -11049450 -5985372 -7370685 -13141934 -19015223 -22108716 -19759761
971 -19759761 -10644889 1184432 8145006 7379319 3665799 2146192 1714210 -1787432
963 -1787432 -8754388 -15321285 -17953600 -15929427 -10537637 -4286647 -217064 129009 -2082984
954 -2082984 -5025984 -8713535 -13779405 -18236180 -17719415 -10053741 1415114 10332293
946 10332293 13322617 12818150 13563205 16901411 19499308 17681177 11746917 5236350 869165
937 869165 -1513188 -3192468 -3983967 -2113469 3254753 9646178 12418179 9404450 4005153
928 4005153 2051966 5470785 10563521 12523615 9622843 2996012 -4555461 -8526033
920 -8526033 -5074706 4091301 12052538 14676211 15436801 18804775 21888388 18005260 7213041
911 7213041 -2622602 -5828224 -4902992 -5202695 -8285046 -12590414 -16576789 -18222300 -14543079
902 -14543079 -5045479 5981226 13320664 15837442 15657580 13887490 9690618 2865489
894 2865489 -5111701 -12763666 -19694315 -25578013 -29007354 -28064641 -22405107 -14852920 -9940561
885 -9940561 -9675894 -11517996 -12190996 -12497328 -15439311 -19798737 -19575176 -11699679 -1354941
876 -1354941 3139569 -782418 -8415599 -13850250 -15075874 -13597306 -11491815 -9725552
868 -9725552 -8393551 -7597297 -7373720 -6532237 -2869696 3736647 9260244 9098881 3720185
859 3720185 -1814216 -3991088 -3399189 -1010514 3562210 8184317 7272962 -1120244 -10261570
850 -10261570 -11453242 -4474387 2790089 4321732 1546752 -820635 -481612 1775016
842 1775016 4014920 4490886 2903887 948591 113167 -803536 -3841118 -7793568 -8723048
833 -8723048 -5015080 676629 5268183 8282628 9661757 7344513 -47622 -9295082
825 -9295082 -14598336 -14253055 -13064501 -16267334 -22058633 -22779739 -14256831 -1530397 6975853
816 6975853 9270950 10339649 13633324 16622911 15904870 12018050 6493405 -1541672 -11638421
807 -11638421 -18320265 -16433458 -8492257 -1638578 1568100 4184231 7550331 8799399
799 8799399 6189972 1415681 -4484260 -12077028 -18833688 -19312182 -13014414 -6874246 -6137373
790 -6137373 -7384915 -5134530 -1182211 -1516431 -6505678 -10441902 -10138904 -8346877 -8219732
781 -8219732 -9271531 -9902724 -9705708 -7681105 -1898852 6807252 13703500 15378274 14125378
772 14125378 14244028 15098010 11207886 -99872 -13739659 -21519799 -20617595 -15207978
764 -15207978 -9993787 -5194664 486198 4907065 4428869 -8566 -2971864 -1526013
756 -1526013 1447286 2243343 1066323 -253430 -1729857 -3461650 -3477331 -920524 1184220
747 1184220 388665 -238480 3485087 9014297 9356971 3260821 -2392989 -1655783 3837153
738 3837153 9038724 11804945 12611246 11967176 11139049 12242427 14559990 13659066 7432427
729 7432427 331950 -2121019 -740512 -397342 -2150285 -2593324 -432154 1431277 1079152
720 1079152 109995 -590722 -3158701 -8086391 -10959832 -7696332 -728912 4133384 5645830
711 5645830 7350414 10011321 9097758 2311359 -4401685 -2858553 6652895 15004743 15060342
702 15060342 9314006 5275327 6364652 10022060 12641054 12715789 9685619 3440026 -3926642
693 -3926642 -8596498 -8910225 -7008746 -5298003 -3273209 197977 3256468 2739537 -962994
684 -962994 -3693067 -2843688 -599032 -627731 -3237084 -5542703 -5684020 -5100845 -6336328
675 -6336328 -9599779 -12202372 -11327181 -7077274 -2538655 -699715 -1512299 -2257012 -531620
666 -531620 3600301 8062519 10372136 8754743 2987420 -4823078 -10847922 -12168326 -9254382
657 -9254382 -5494218 -4021238 -4947842 -5503891 -2825769 2929967 7875240 7303207 136282
648 136282 -9549695 -15990223 -16592408 -12864626 -7293667 -1147907 4271113 6423130 3674771
639 3674771 -2062995 -6828562 -8747870 -9118117 -9456520 -9471042 -8484334 -6829388 -4647315
630 -4647315 -1038557 3983429 8068219 8956096 7472499 6357089 6887406 8350355 9818892
621 9818892 10287730 8038825 2600996 -3271137 -6500102 -7907751 -9950430 -10986879 -7224155
612 -7224155 -1318656 -2535193 -14417374 -27578767 -30369483 -23115766 -15686685 -13784082
604 -13784082 -14898401 -16332354 -18618121 -19735585 -14301651 -2445022 6943362 6725245
596 6725245 567222 -3306714 -3152754 -2995647 -4339701 -5057778 -4844179 -5396675 -5447929
587 -5447929 -1436445 6151503 12127150 13427626 12177678 10672745 7779116 2532324
579 2532324 -2380624 -3517630 -725796 3749402 8056225 10963788 11576580 10653090 10274928
570 10274928 10767157 10166573 8107840 7364439 9389817 11200029 9646501 6376362 4986123
561 4986123 5007053 2819614 -2104870 -5965628 -6190366 -4942691 -5872476 -9599978 -13573942
552 -13573942 -14872770 -12266085 -6665260 -321977 4881625 8390274 9992830 8973171
544 8973171 5455109 1522801 -893102 -2711009 -6388943 -12218885 -17732245 -20606382
536 -20606382 -20531644 -18581133 -16455753 -15745506 -15840404 -13217225 -5452540 4334872 10061066
527 10061066 9975141 8285986 8722818 9741781 7965325 3815798 1247498 3009875 7836450
518 7836450 11580146 10351371 3725969 -4488663 -9877419 -11899103 -12955595 -13386174 -10849189
509 -10849189 -5577426 -2215427 -3753894 -6727138 -5765955 -751076 3883478 5133273
501 5133273 3168031 -1378402 -7825530 -13771855 -16886848 -18380586 -21191926 -24634032
493 -24634032 -24520657 -19235443 -12062141 -6353940 -1889211 2241026 4408009 2728397
485 2728397 -1635981 -5981556 -9215079 -11213520 -10717427 -6764947 -1469190 1374609 416850
476 416850 -2587644 -6000851 -9776876 -13389367 -14714258 -12303744 -7365033 -2287526 1767715
467 1767715 4767118 6389032 6208845 4766961 2996781 864044 -1890282 -3755659 -2220843
458 -2220843 2655998 7215286 8147032 6116930 3777735 1564130 -1863601 -5576156 -6205548
449 -6205548 -2937638 31799 -1927373 -8321160 -14319545 -16070786 -13721027 -10091370
441 -10091370 -7890028 -7578805 -6780790 -2571309 4616597 10558105 11981734 10300731 8882618
432 8882618 8204128 6294601 2942079 419523 188960 1583921 3820102 6655398 8743894
423 8743894 8040277 4713846 1497616 304859 313909 -132182 -1746570 -4744583 -8621912
414 -8621912 -10872873 -8625068 -2705586 2368001 3647054 2516808 1105975 -825089
406 -825089 -3322967 -3846819 -735273 3258797 4463517 3532991 3375040 3298471 -98392
397 -98392 -6348658 -10171038 -8387069 -3894173 -868216 620612 2623466 4572240 3828802
388 3828802 -114210 -4775471 -7647966 -7796823 -4839268 1137928 7989452 11837271 10410704
379 10410704 5364845 448075 -2088261 -2681038 -2873586 -3656799 -5136226 -6719748 -7354263
370 -7354263 -6348160 -4348032 -2923804 -2784681 -2930743 -2051145 -301290 881014 435651
361 435651 -1264607 -2644585 -1935136 1243678 4679873 4961968 1296302 -2798141 -3081101
352 -3081101 625613 4835873 7071413 8016738 8997395 9694624 9256531 7874184 6237033
343 6237033 4772273 4078187 4611826 5416183 4965506 3804450 3952008 4700393 2051051
334 2051051 -5356315 -12386660 -12854389 -7373403 -2331994 -1764574 -3712198 -4622156 -3843363
$$ [...]
##END NTUPLES=NMR SPECTRUM
##END=
