##TITLE=31Pdec_LR-691-H1-C1
 CDCl3, 64 sc
 10.9.2024
##JCAMPDX= 6.0         $$ Bruker NMR JCAMP-DX V2.0
##DATA TYPE= NMR SPECTRUM
##DATA CLASS= NTUPLES
##ORIGIN= UXNMR, Bruker Analytische Messtechnik GmbH
##OWNER= root
$$ XWIN-NMR		Version 3.5
$$ Tue Sep 10 16:32:25 2024 Russian Standard Time (UT+4h)  she@DPX200
##.OBSERVE FREQUENCY= 81.013821
##.OBSERVE NUCLEUS= ^31P
##.ACQUISITION MODE= SIMULTANEOUS
##.ACQUISITION SCHEME= undefined
##.AVERAGES= 64
##.DIGITISER RES= 17
##SPECTROMETER/DATA SYSTEM= spect
##.PULSE SEQUENCE= zgpg30
##.SOLVENT NAME= CDCl3
##.SHIFT REFERENCE= (INTERNAL, CDCl3, 0, 198.062)
##AUDIT TRAIL= $$ (NUMBER, WHEN, WHO, WHERE, WHAT)
$$ ##TITLE= Audit trail, XWIN-NMR		Version 3.5
$$ ##JCAMPDX= 5.01
$$ ##ORIGIN= Bruker BioSpin GmbH
$$ ##OWNER= she
$$ F:/spectra/data/she/nmr/P31/2/pdata/1/auditp.txt
$$ ##AUDIT TRAIL=  $$ (NUMBER, WHEN, WHO, WHERE, WHAT)
(   1,<2024-09-10 16:31:11.29 +0400>,<she>,<DPX200>,
      <continue with go, POWCHK disabled, PULCHK disabled
       configuration hash MD5:
       00 E9 B6 7A A2 85 ED C7 34 08 36 98 17 FE 4E 26
       data hash MD5: 32K
       B5 FD F9 34 84 9A 62 C2 50 0A 5A 24 BF E4 21 9B>)
(   2,<2024-09-10 16:31:24.98 +0400>,<she>,<DPX200>,
      <Start of raw data processing
       efp BC_mod = 2 LB = 1.5 FT_mod = 6 PKNL = 1 PHC0 = 2695.173 PHC1 = 63.68747 SI = 64K 
       data hash MD5: 64K
       C1 06 5B 78 CD 20 F7 F6 01 2A 83 73 32 1B 5A 6A>)
(   3,<2024-09-10 16:31:49.34 +0400>,<she>,<DPX200>,
      <pk PHC0 = 20.44955 PHC1 = -52.2 
       data hash MD5: 64K
       A9 44 73 21 96 75 B8 FB 58 C2 C8 AB 64 F6 D9 39>)
$$ ##END=
$$ 
$$ hash MD5
$$ FC 4E 44 86 A3 B2 54 CE 6E B2 E9 E1 6D E5 D1 76
##$RELAX= 
##$RELAX= 
##$RELAX= 
##$RELAX= 
##$RELAX= 
##$RELAX= 
##$RELAX= 
##$RELAX= 
$$ Bruker specific parameters
$$ --------------------------
##$DU= <F:/spectra>
##$EXPNO= 2
##$NAME= <P31>
##$PROCNO= 1
##$TYPE= <nmr>
##$USER= <she>
##$AMP= (0..31)
100 100 100 100 100 100 100 100 100 100 100 100 100 100 100 100 100 100 
100 100 100 100 100 100 100 100 100 100 100 100 100 100 
##$AQSEQ= 0
##$AQ_mod= 1
##$AUNM= <au_zg>
##$AUTOPOS= <>
##$BF1= 81.014009
##$BF2= 200.13
##$BF3= 200.13
##$BF4= 200.13
##$BF5= 200.13
##$BF6= 200.13
##$BF7= 200.13
##$BF8= 200.13
##$BYTORDA= 1
##$CFDGTYP= 0
##$CFRGTYP= 5
##$CHEMSTR= <none>
##$CNST= (0..31)
1 1 145 1 1 1 1 1 1 1 1 1 1 1 1 1 1 1 1 1 1 1 1 1 1 1 1 1 1 1 1 1 
##$CPDPRG= <waltz16>
##$CPDPRG1= <>
##$CPDPRG2= <waltz16>
##$CPDPRG3= <>
##$CPDPRG4= <mlev>
##$CPDPRG5= <mlev>
##$CPDPRG6= <mlev>
##$CPDPRG7= <mlev>
##$CPDPRG8= <mlev>
##$CPDPRGB= <>
##$CPDPRGT= <>
##$D= (0..31)
0 1 0 0 0 0 0 0 0 0.06 0 0.03 2e-05 3e-06 0 0 0.0002 0 0 0 0 0 0 0 0 0 
0 0 0 0 0 0 
##$DATE= 1725971314
##$DBL= (0..7)
120 120 120 11 120 120 24 19 
##$DBP= (0..7)
150 150 150 150 150 150 150 150 
##$DBP07= 0
##$DBPNAM0= <>
##$DBPNAM1= <>
##$DBPNAM2= <>
##$DBPNAM3= <>
##$DBPNAM4= <>
##$DBPNAM5= <>
##$DBPNAM6= <>
##$DBPNAM7= <>
##$DBPOAL= (0..7)
0.5 0.5 0.5 0.5 0.5 0.5 0.5 0.5 
##$DBPOFFS= (0..7)
$$ [...]
##$SUBNAM3= <"">
##$SUBNAM4= <"">
##$SUBNAM5= <"">
##$SUBNAM6= <"">
##$SUBNAM7= <"">
##$SUBNAM8= <"">
##$SUBNAM9= <"">
##$SW= 400.765351723535
##$SWIBOX= (0..15)
0 1 3 0 0 0 0 0 0 0 0 0 0 0 0 0 
##$SW_h= 32467.5324675325
##$TD= 32768
##$TD0= 1
##$TE= 0
##$TE2= 300
##$TE3= 300
##$TEG= 300
##$TL= (0..7)
0 120 53 12 22 120 120 120 
##$TP= (0..7)
150 150 150 150 150 150 150 150 
##$TP07= 0
##$TPNAME0= <>
##$TPNAME1= <>
##$TPNAME2= <>
##$TPNAME3= <>
##$TPNAME4= <>
##$TPNAME5= <>
##$TPNAME6= <>
##$TPNAME7= <>
##$TPOAL= (0..7)
0.5 0.5 0.5 0.5 0.5 0.5 0.5 0.5 
##$TPOFFS= (0..7)
0 0 0 0 0 0 0 0 
##$TUNHIN= 0
##$TUNHOUT= 0
##$TUNXOUT= 0
##$USERA1= <user>
##$USERA2= <user>
##$USERA3= <user>
##$USERA4= <user>
##$USERA5= <user>
##$V9= 5
##$VALIST= <valist>
##$VCLIST= <CCCCCCCCCCCCCCC>
##$VD= 0
##$VDLIST= <DDDDDDDDDDDDDDD>
##$VPLIST= <PPPPPPPPPPPPPPP>
##$VTLIST= <TTTTTTTTTTTTTTT>
##$WBST= 1024
##$WBSW= 4
##$XGAIN= (0..3)
0 0 0 0 
##$XL= 0
##$YL= 0
##$YMAX_a= 6000
##$YMIN_a= -11000
##$ZGOPTNS= <>
##$ZL1= 120
##$ZL2= 120
##$ZL3= 120
##$ZL4= 120
##$ABSF1= 0
##$ABSF2= 0
##$ABSG= 0
##$ABSL= 0
##$ALPHA= 0
##$AQORDER= 0
##$ASSFAC= 0
##$ASSFACI= 0
##$ASSFACX= 0
##$ASSWID= 0
##$AUNMP= <proc_1d>
##$AZFE= 0.1
##$AZFW= 0.5
##$BCFW= 0
##$BC_mod= 2
##$BYTORDP= 0
##$COROFFS= 0
##$CY= -3
##$DATMOD= 1
##$DC= 0
##$DFILT= <>
##$DTYPP= 0
##$F1P= 0
##$F2P= 0
##$FCOR= 1
##$FTSIZE= 65536
##$FT_mod= 6
##$GAMMA= 0
##$GB= 0
##$INTBC= 1
##$INTSCL= 9.790993e-09
##$ISEN= 30
##$LB= 1.5
##$LEV0= 0
##$LPBIN= 0
##$MAXI= 10000
##$MC2= 0
##$MEAN= 0
##$ME_mod= 0
##$MI= 50
##$NCOEF= 0
##$NC_proc= -10
##$NLEV= 6
##$NOISF1= 182.463
##$NOISF2= 159.3651
##$NSP= 0
##$NTH_PI= 0
##$NZP= 0
##$OFFSET= 198.0616
##$PC= 4
##$PHC0= 2715.623
##$PHC1= 11.48747
##$PH_mod= 1
##$PKNL= yes
##$PPARMOD= 0
##$PSCAL= 0
##$PSIGN= 0
##$REVERSE= no
##$SF= 81.0140089999434
##$SI= 65536
##$SIGF1= 159.3651
##$SIGF2= -187.1042
##$SINO= 113.3802
##$SIOLD= 16384
##$SREGLST= <1H.CDCl3>
##$SSB= 0
##$STSI= 65536
##$STSR= 0
##$SW_p= 32467.5324675325
##$SYMM= 0
##$S_DEV= 0
##$TDeff= 32768
##$TDoff= 0
##$TI= <>
##$TILT= no
##$TM1= 0
##$TM2= 0
##$TOPLEV= 0
##$USERP1= <user>
##$USERP2= <user>
##$USERP3= <user>
##$USERP4= <user>
##$USERP5= <user>
##$WDW= 1
##$XDIM= 65536
##$YMAX_p= 461591986
##$YMIN_p= -258274602
$$ End of Bruker specific parameters
$$ ---------------------------------
##NTUPLES= NMR SPECTRUM
##VAR_NAME=  FREQUENCY,     SPECTRUM/REAL,   SPECTRUM/IMAG
##SYMBOL=    X,             R,               I
##VAR_TYPE=  INDEPENDENT,   DEPENDENT,       DEPENDENT
##VAR_FORM=  AFFN,          ASDF,            ASDF
##VAR_DIM=   65536,         65536,           65536
##UNITS=     HZ,            ARBITRARY UNITS, ARBITRARY UNITS
##FACTOR=    0.49542278885378, 1,            1
##FIRST=     16045.7642231865, 0,            0
##LAST=      -16421.768244346, 0,            0
##MIN=       -16421.768244346, -258274602,   0
##MAX=       16045.7642231865, 461591986,    0
$$ Real data points
##PAGE= N=1
##DATA TABLE= (X++(R..R)), XYDATA
$$ [...]
$$ plain form
43420 -28490694 -47096085 -52252390 -36925508 -12208871 4817160 9014462 5456701
43413 5456701 -2476749 -12577217 -17917492 -14241205 -9319153 -12605788 -19055432 -16618666
43405 -16618666 -7357530 -5877742 -16252338 -25852689 -25631523 -22277667 -24253193 -28248761
43397 -28248761 -27456399 -23396017 -20667040 -17069729 -7804358 4621658 12039126 10339971
43389 10339971 3107651 -2919618 -3874491 -2128365 -3396479 -7403765 -4579479 10661660
43381 10661660 26246550 23462512 2067098 -17978278 -22493392 -17672760 -14020122 -10191741
43373 -10191741 -1958642 5378574 5481473 2326846 930538 -4808782 -21566672 -40608630
43365 -40608630 -46913723 -40245881 -33075490 -30300128 -25550710 -16885550 -11555865 -13114632
$$ packed form
43420b8490694j8605391n156305J5326882K4716637J7026031M197302l557761
43413E456701p933450j0100468n340275L676287M922052l286635o449644K436766
43405a6618666R261136J479788j0374596r600351K21166L353856j975526l995568
43397b8248761P92362M060382K728977L597311R265371J2426016P417468j699155
43389A0339971p232320o027269r54873J746126j268114m007286K824286J5241139
43381A0661660J5584890k784038k1395414k0045376m515114M820632L652638L828381
43373a0191741Q233099P337216J02899l154627j396308n739320j6757890j9041958
43365d0608630o305093O667842P170391K775362M749418Q665160N329685j558767
$$ plain form
43357 -13114632 -16425039 -18441548 -22609059 -28919816 -29802988 -20321310 -4560907 10780282
43349 10780282 21066073 20709038 6143837 -14619505 -25915852 -23097340 -17791754 -19099730
43341 -19099730 -19935994 -10281803 4972175 12008505 6452837 -4081959 -12061504 -15452021
43333 -15452021 -13851727 -8345561 -4109463 -5068476 -6384176 256759 13656038 22506514
43325 22506514 19164315 8350703 731798 2692271 13499424 27277882 35409021 31395445
43317 31395445 17218038 3487699 878262 11257228 27184972 39200342 43793417
43310 43793417 44953577 47333003 48502342 41686170 27489068 17111157 18318390 22466340
43302 22466340 14039625 -7683328 -25499777 -25156815 -11591825 -267862 886655 -4880121
$$ packed form
43357a3114632l310407k016509m167511o310757q83172R481678J5760403J5341189
43349A0780282J0285791l57035j4565201k0763342j1296347K818512N305586j307976
43341a9099730q36264R654191J5253978P036330n555668j0534796p979545l390517
43333a5452021J600294N506166M236098r59013j315700O640935J3399279Q850476
43325B2506514l342199j0813612p618905J960473J0807153J3778458Q131139m013576
43317C1395445j4177407j3730339k609437J0378966J5927744J2015370M593075
43310D3793417J160160K379426J169339o816172j4197102j0377911J207233M147950
43302B2466340q426715k1722953j7816449L42962J3564990J1323963J154517n766776
$$ plain form
43294 -4880121 -11882468 -16344692 -14519154 -4740516 7941733 15463302 16442892 16919856
43286 16919856 20184732 21974326 18826378 15326666 17731773 24547565 29836218 33160866
43278 33160866 38599098 44392719 41929790 27698919 9555608 -2723399 -7533462 -8019730
43270 -8019730 -4696342 2117294 7366781 7016481 6176641 12902372 24822626 30806576
43262 30806576 26480272 18851762 13183159 4795436 -10994860 -28879023 -40259390 -43869369
43254 -43869369 -42788073 -36467590 -24277473 -13312936 -13136588 -23230915 -33401063 -36821691
43246 -36821691 -35928305 -35214158 -35176199 -34612764 -32634223 -26928499 -16128406 -5663020
43238 -5663020 -4835059 -15021538 -26380575 -29765165 -26589898 -22700115 -17850791 -7709453
$$ packed form
43294d880121p002347m462224J825538R778638J2682249P521569R79590M76964
43286A6919856L264876J789594l147948l499712K405107O815792N288653L324648
43278C3160866N438232N793621k462929j4230871j8143311j2279007m810063m86268
43270h019730L323388O813636N249487l50300q39840O725731J1920254N983950
43262C0806576m326304p628510n668603q387723j5790296j7884163j1380367l609979
43254d3869369J081296O320483J2190117J0964537J76348j0094327j0170148l420628
43246c6821691Q93386P14147L7959N63435J978541N705724J0800093J0465386
43238e663020Q27961j0186479j1359037l384590L175267L889783M849324J0141338
$$ plain form
43230 -7709453 6705479 18491317 23328629 22835640 18831091 9437348 -6438347 -23854817
43222 -23854817 -34697778 -35740001 -31767253 -29668093 -30452338 -29055267 -22232352 -13799636
43214 -13799636 -9603383 -9592830 -9189625 -7525183 -8383302 -11400590 -8659355 4807129
43206 4807129 20692826 23881215 8939670 -14401915 -32407530 -39565816 -38519670 -32409806
43198 -32409806 -21725128 -8195749 1972812 1781153 -9015517 -21495423 -24851617
43191 -24851617 -16798825 -5589000 -1026295 -4697683 -10028398 -10662057 -6975901 -4458606
43183 -4458606 -6905777 -11730597 -12098073 -4039121 8791905 18088980 18095628 9142763 -3965575
43174 -3965575 -14105461 -14225428 -3578152 7222703 3941369 -13953702 -28728800 -23622011
$$ packed form
43230g709453J4414932J1785838M837312m92989m004549r393743j5875695j7416470
43222b3854817j0842961j042223L972748K099160p84245J397071O822915Q432716
43214a3799636M196253J0553M03205J664442q58119l017288K741235J3466484
43206D807129J5885697L188389j4941545k3341585j8005615p158286J046146O109864
43198c2409806J0684678J3529379J0168561j91659j0796670j2479906l356194
43191b4851617Q052792J1209825M562705l671388n330715o33659L686156K517295
43183d458606k447171m824820l67476Q058952J2831026R297075O648q952865j3108338
43174c965575j0139886j19967J0647276J0800855l281334j7895071j4775098N106789
$$ plain form
43166 -23622011 -3568097 10861170 8951989 392941 -1413073 2726834 2680107 -4999482
43158 -4999482 -15046956 -24615365 -36139755 -47470594 -48911948 -36585902 -22501251
43151 -22501251 -22273658 -34724324 -42793788 -35909064 -22519387 -16290481 -18420728 -21699558
43143 -21699558 -25759955 -36437499 -51115495 -56967561 -47785325 -33267316 -25697646 -24350840
43135 -24350840 -19825953 -8647661 3762117 11369536 11877791 5081250 -6399773 -15913958
43127 -15913958 -18318207 -16055797 -14701350 -14041684 -9421542 -619406 7147865 10628588
43119 10628588 10749278 8079055 2832233 -1161082 -205690 1508208 -3379110 -12014714
43111 -12014714 -12719100 -2546573 7468709 9958661 12822111 24216894 35814188 33688952
$$ packed form
43166b3622011K0053914J4429267j909181q559048j806014M139907m6727p679589
43158d999482j0047474r568409j1524390j1330839j441354J2326046J4084651
43151b2501251K27593j2450666q069464O884724J3389677O228906k130247l278830
43143b1699558m060397j0677544j4677996n852066R182236J4518009P569670J346806
43135b4350840M524887J1178292J2409778P607419N08255o796541j1481023r514185
43127a5913958k404249K262410J354447O59666M620142Q802136P767271L480723
43119A0628588J20690k670223n246822l993315R55392J713898m887318q635604
43111a2014714p04386J0172527J0015282K489952K863450J1394783J1597294k125236
$$ plain form
43103 33688952 19993051 9861176 8700680 6145003 -5964849 -21825019 -32043662
43096 -32043662 -35840138 -37136181 -35908675 -30032276 -21335902 -14270392 -11016697 -11242020
43088 -11242020 -13721239 -15577050 -13721618 -10056107 -11124220 -18978510 -26636917 -27290755
43080 -27290755 -24191737 -25491791 -31897483 -36188801 -34196085 -29627404 -27108174 -26231283
43072 -26231283 -24550961 -21740373 -18055221 -12249809 -3924610 4564410 10965396 15588541
43064 15588541 18617237 17528710 10371735 -144829 -9214257 -15380644 -19886013 -21622482
43056 -21622482 -17715477 -10325786 -8020383 -16422047 -29714468 -35841991 -30336595 -21512175
43048 -21512175 -20311344 -27279450 -32399573 -27627742 -16811954 -11060220 -15258614 -22385815
$$ packed form
43103C3688952j3695901j0131875j160496k555677j2109852j5860170j0218643
43096c2043662l796476j296043J227506N876399Q696374P065510L253695k25323
43088a1242020k479219j855811J855432L665511j068113p854290p658407o53838
43080b7290755L099018j300054o405692m291318J992716M568681K519230Q76891
43072b6231283J680322K810588L685152N805412Q325199Q489020O400986M623145
43064A5588541L028696j088527p156975j0516564r069428o166387m505369j736469
43056b1622482L907005P389691K305403q401664j3292421o127523N505396Q824420
43048b1512175J200831o968106n120123M771831J0815788N751734m198394p127201
$$ plain form
43040 -22385815 -22851329 -17120064 -15346254 -24263316 -37916126 -43556034 -35002863 -18260703
43032 -18260703 -5263173 -4083792 -14145522 -28247021 -38650569 -42418746 -41480573 -38301088
43024 -38301088 -33571849 -28448680 -25360188 -23838860 -18829635 -7668752 3398842 5348037
43016 5348037 -1518019 -7413996 -5556329 1089105 6692017 9429783 8592727 1808648
43008 1808648 -9519393 -17480979 -16624025 -11202649 -6610899 1879618 22068383 48243366
43000 48243366 62891451 57789968 44295109 37952245 40331932 42163788 38326420 31678887
42992 31678887 25178202 18580543 12826532 10477274 9987945 5268377 -5992480 -17470411
42984 -17470411 -20909713 -14980862 -4449926 6783949 17544741 25720583 28116568 25241180
$$ packed form
43040b2385815m65514N731265J773810q917062j3652810n639908Q553171J6742160
43032a8260703J2997530J179381j0061730j4101499j0403548l768177R38173L179485
43024c8301088M729239N123169L088492J521328N009225J1160883J1067594J949195
43016E348037o866056n895977J857667O645434N602912K737766q37056o784079
43008A808648j1328041p961586Q56954N421376M591750Q490517K0188765K6174983
43000D8243366J4648085n101483j3494859o342864K379687J831856l837368o647533
42992C1678887o500685o597659n754011k349258m89329m719568j1260857j1477931
42984a7470411l439302N928851J0530936J1233875J0760792Q175842K395985k875388
$$ plain form
42976 25241180 22208535 22791006 25693809 28557896 31518319 33474325 29778742 20306439
42968 20306439 16359146 29470996 52295669 61009552 42469987 11667761 -4946171
42961 -4946171 1564232 17517849 25994386 22293970 11862836 2200895 -1297500 2284930
42953 2284930 8901123 14553833 20113977 27597657 34458379 37301633 38087195 38842266
42945 38842266 33259443 14158621 -11710017 -28439485 -31742535 -32059051 -33959115 -27382810
42937 -27382810 -6962520 14035956 20820929 17215507 15484337 15012394 6478523 -8567121
42929 -8567121 -18716364 -20957462 -22123873 -22256943 -12518581 6867282 20740009 17203464
42921 17203464 1334551 -14530230 -24745644 -29445776 -28974187 -25800023 -24887006 -26210487
$$ packed form
42976B5241180l032645N82471K902803K864087K960423J956006l695583r472303
42968B0306439l947293J3111850K2824673Q713883j8539565l0802226j6613932
42961d946171O510403J5953617Q476537l700416j0431134r661941l498395L582430
42953B284930O616193N652710N560144P483680O860722K843254P85562P55071
42945C8842266n582823j9100822k5868638j6729468l303050l16516j900064O576305
42937b7382810K0420290K0998476O784973l605422j731170m71943q533871j5045644
42929h567121j0149243k241098j166411j33070R738362J9385863J3872727l536545
42921A7203464j5868913j5864781j0215414m700132M71589L174164R13017j323481
$$ plain form
42913 -26210487 -23041059 -12773245 -3132437 -2131329 -7454393 -10999616 -8775033 -1789933
42905 -1789933 7089590 12367498 8062007 -3914486 -12984668 -12553325 -7577682 -4806383
42897 -4806383 -3128605 -279187 -824676 -7706121 -12339054 -4763981 9903929 16524530
42889 16524530 9907766 -475524 -4976477 -3313555 210120 1736969 -2659270 -14142426
42881 -14142426 -26505447 -31332387 -28243997 -23749939 -21065156 -18523824 -16542775 -17161761
42873 -17161761 -17379864 -12432062 -5399099 -3576986 -5458028 -2395115 6426720 13121401
42865 13121401 16526518 24350621 36275508 39802518 29177150 13828911 237748
42858 237748 -18576857 -43770455 -56773462 -42233571 -14127260 30683 -5466729
$$ packed form
42913b6210487L169428J0267814R640808J001108n323064l545223K224583O985100
42905a789933Q879523N277908m305491j1976493r070182M31343M975643K771299
42897d806383J677778K849418n45489o881445m632933P575073J4667910O620601
42889A6524530o616764j0383290m500953J662922L523675J526849m396239j1483156
42881a4142426j2363021m826940L088390M494058K684783K541332J981049o18986
42873a7161761k18103M947802P032963J822113j881042L062913Q821835O694681
42865A3121401L405117P824103J1924887L527010j0625368j5348239j3591163
42858B37748j8814605k5193598j3003007J4539891K8106311J4157943n497412
$$ plain form
42851 -5466729 -13350072 -12486634 -7866064 -2708094 8284662 23453051 30311100 24841095
42843 24841095 20099724 26856078 37381114 37640745 26267220 12289239 1319849 -7002302
42835 -7002302 -12769269 -14820745 -13206427 -8003830 674367 8719171 10066911 6107184
42827 6107184 5762853 11515102 13470923 4189474 -8256289 -11043947 -4661620 -341966
42819 -341966 -3385071 -9290218 -14409027 -20022547 -25491051 -26620287 -22958834 -19574958
42811 -19574958 -19315959 -19069367 -15597525 -9800347 -3276533 4410997 12790942 19096504
42803 19096504 22267990 24908312 29134240 33686054 37235443 41181606 46049069 47584913
42795 47584913 40562210 26303207 13075928 7532186 7629179 6203421 641822 -4314698
$$ packed form
42851e466729p883343Q63438M620570N157970J0992756J5168389O858049n470005
42843B4841095m741371O756354J0525036K59631j1373525j3977981j0969390q322151
42835g002302n766967k051476J614318N202597Q678197Q044804J347740l959727
42827F107184l44331N752249J955821r281449j2445763k787658O382327M319654
42819c41966l043105n905147n118809n613520n468504j129236L661453L383876
42811a9574958K58999K46592L471842N797178O523814P687530Q379945O305562
42803A9096504L171486K640322M225928M551814L549389L946163M867463J535844
42795D7584913p022703j4259003j3227279n543742R6993j425758n561599m956520
$$ plain form
42787 -4314698 -4218937 -1180363 1111061 4959498 14742790 26736502 30852351 24227687
42779 24227687 15671229 13396643 15339883 15756989 14056635 11176371 4338525 -6430412
42771 -6430412 -12138591 -4726532 10094788 18903843 17048139 10427254 3646149 -3327803
42763 -3327803 -8120351 -6912774 -3377144 -5953010 -14015306 -16951325 -10175302 -2102174
42755 -2102174 -778269 -3046781 -2830189 -1751824 -4407738 -9601875 -13504321 -16618759
42747 -16618759 -21086149 -25257593 -26913448 -27948780 -30185530 -30493480 -26149611 -21680561
42739 -21680561 -23958307 -32373104 -39108854 -37742743 -28057023 -15242840 -7981565 -13251213
42731 -13251213 -28049192 -39788166 -39978411 -33896285 -31494421 -33433556 -33497929 -31004703
$$ packed form
42787d314698R5761L038574K291424L848437R783292J1993712M115849o624664
42779B4227687q556458k274586J943240M17106j700354k880264o837846j0768937
42771f430412n708179P412059J4821320Q809055j855704o620885o781105o973952
42763c327803m792548J207577L535630k575866q062296k936019O776023Q073128
42755b102174J323905k268512K16592J078365k655914n194137l902446l114438
42747a6618759m467390m171444j655855j035332k236750l07950M343869M469050
42739b1680561k277746q414797o735750J366111R685720J2814183P261275n269648
42731a3251213j4797979j1738974j90245O082126K401864j939135o4373K493226
$$ plain form
42723 -31004703 -31270668 -34523670 -33626197 -24967531 -14755199 -11419791 -15953657 -21723899
42715 -21723899 -20752574 -9524058 7971813 21962593 24118812 13746003 -3831238
42708 -3831238 -22573047 -37095471 -42507374 -38210950 -30539902 -27043375 -28872131 -32006450
42700 -32006450 -33621054 -32995549 -28751063 -20382211 -10614893 -1617320 8296392 19177500
42692 19177500 24951972 21668960 16322585 18459409 26057444 30088007 30525294 34739519
42684 34739519 39935133 32304775 8639622 -14596584 -21550378 -15339231 -7456101 571709
42676 571709 12793909 23480237 20991054 6146533 -5545969 -2866008 8247614 14378737
42668 14378737 11328536 6552725 7411942 11363564 9509817 -1109617 -11799414 -11380943
$$ packed form
42723c1004703k65965l253002Q97473Q658666J0212332L335408m533866n770242
42715b1723899R71325J1228516J7495871J3990780K156219j0372809j7577241
42708c831238j8741809j4522424n411903M296424P671048L496527j828756l134319
42700c2006450j614604O25505M244486Q368852R767318Q997573R913712J0881108
42692A9177500N774472l283012n346375K136824P598035M030563M37287M214225
42684C4739519N195614p630358k3665153k3236206o953794O211147P883130Q027810
42676E71709J2222200J0686328k489183j4844521j1692502K679961J1113622O131123
42668A4378737l050201m775811Q59217L951622j853747j0619434j0689797M18471
$$ plain form
42660 -11380943 660994 14093329 19819409 16868880 8486503 -1810498 -9361781 -10757224
42652 -10757224 -9208095 -10776414 -13588052 -8959901 4402515 17063871 23433717 28409658
42644 28409658 33502606 29234900 11735238 -4882776 -6609930 -721973 -3266486 -13124862
42636 -13124862 -16696242 -13174540 -14419921 -20881822 -19483902 -8496241 -2711236 -6858175
42628 -6858175 -5271165 10331818 22373027 12981187 -7558884 -16858654 -13379775 -12587759
42620 -12587759 -17537932 -15642580 -3374998 6614415 6165697 1880224 -10225 -3302018
42612 -3302018 -9898753 -12498552 -7813942 -5275185 -12664524 -22374714 -22242920 -12743450
42604 -12743450 -3148405 3056656 7531055 6538657 -5782616 -23958189 -32796230 -25420779
$$ packed form
42660a1380943J2041937J3432335N726080k950529q382377j0297001p551283j395443
42652a0757224J549129j568319k811638M628151J3362416J2661356O369846M975941
42644B8409658N092948m267706j7499662j6618014j727154N887957k544513r858376
42636a3124862l571380L521702j245381o461901J397920J0987661N785005m146939
42628f858175J587010J5602983J2041209r391840k0540071r299770L478879P92016
42620a2587759m950173J895352J2267582R989413m48718m285473j890449l291793
42612c302018o596735k599799M684610K538757p389339r710190J31794R499470
42604a2743450R595045O205061M474399r92398j2321273j8175573q838041P375451
$$ plain form
42596 -25420779 -11337617 -3674470 -5475776 -11583379 -17260597 -20459759 -20355466 -18208180
42588 -18208180 -16875777 -16594550 -14500487 -10839590 -11197329 -18213610 -24835266 -22001992
42580 -22001992 -11851553 -7081456 -15826991 -31779224 -41781852 -39906753 -30499774 -19217388
42572 -19217388 -6376938 8619720 20329282 20779124 10591691 856724 -84720 2362545
42564 2362545 -2965297 -16641136 -27719225 -28518421 -21781388 -11610559 2710806 18322018
42556 18322018 23562692 11286241 -7469429 -13941534 -4427402 7083565 9030691 4960500
42548 4960500 3367452 4033917 515586 -8988198 -19171195 -23955493 -21640635 -15103922
42540 -15103922 -8889447 -4772252 224458 9128206 18806744 22368471 17911518 10454178
$$ packed form
42596b5420779J4083162P663147j801306o107603n677218l199162J04293K147286
42588a8208180J332403K81227K094063L660897l57739p016281o621656K833274
42580b2001992J0150439M770097q745535j5952233j0002628J875099R406979J1282386
42572a9217388J2840450J4996658J1709562M49842j0187433r734967r41444K447265
42564B362545n327842j3675839j1078089p99196O737033J0170829J4321365J5611212
42556A8322018N240674j2276451j8755670o472105R514132J1510967J947126m070191
42548D960500j593048O66465l518331r503784j0182997m784298K314858O536713
42540a5103922O214475M117195M996710Q903748R678538L561727m456953p457340
$$ plain form
42532 10454178 4851286 2017402 2809212 9094922 18668450 25630570 29199131 35588621
42524 35588621 46526973 52441620 43854459 25051891 9322220 3642671 4947916 9113846
42516 9113846 15824726 24429612 31324415 33019151 28418650 18289681 5654932 -4529459
42508 -4529459 -9830929 -13168596 -17529427 -20032435 -16254419 -8815170 -5504888 -8652745
42500 -8652745 -11888935 -8852908 -858853 5729478 6650720 2856920 -1429977 -2802347
42492 -2802347 -1714751 -1173642 -2177639 -2611453 -1252882 906113 4874970 13993010
42484 13993010 26784374 35248560 35202868 32342249 31504446 26549275 10717912 -7964791
42476 -7964791 -14133034 -6602696 -305559 -5709433 -17374392 -24957409 -24819038 -17648131
$$ packed form
42532A0454178n602892k833884P91810O285710R573528O962120L568561O389490
42524C5588621J0938352N914647q587161j8802568j5729671n679549J305245M165930
42516I113846O710880Q604886O894803J694736m600501j0128969j2634749j0184391
42508d529459n301470l337667m360831k503008L778016P439249L310282l147857
42500h652745l236190L036027P994055O588331R21242l793800m286897j372370
42492b802347J087596N41109j003997m33814J358571K158995L968857R118040
42484A3993010J2791364Q464186m5692k860619q37803m955171j5831363j8682703
42476g964791o168243P530338O297137n403874j1664959p583017J38371P170907
$$ plain form
42468 -17648131 -5174402 6094446 7320544 -985123 -7639973 -5940732 -1968215 -2642049
42460 -2642049 -4341562 -636051 6050219 8581414 5448001 -355673 -7743687 -15552580
42452 -15552580 -18695383 -13799127 -5390570 -180659 1153040 754490 -2711384 -9622368
42444 -9622368 -13083161 -5891384 8432485 19310828 21679564 17536377 7796716 -8008363
42436 -8008363 -24347534 -31083762 -24324038 -9833384 5268673 18536048 29466259
42429 29466259 36786671 40081370 39806469 34983746 24771589 12219546 2349475 -3245225
42421 -3245225 -6115608 -6476848 -3575280 515556 2271632 1160839 -1468599 -6156150
42413 -6156150 -13087528 -18266281 -17725692 -13543682 -9557424 -3942410 5983690 14154758
$$ packed form
42468a7648131J2473729J1268848J226098q305667o654850J699241L972517o73834
42460b642049j699513L705511O686270K531195l133413n803674p388014p808893
42452a5552580l142803M896256Q408557N209911J333699l98550l465874o910984
42444i622368l460793P191777J4323869J0878343K368736m143187r739661j5805079
42436h008363j6339171o736228O759724J4490654J5102057J3267375J0930211
42429B9466259P320412L294699k74901m822723j0212157j2552043r870071n594700
42421c245225k870383l61240K901568M090836J756076j110793k629438m687551
42413f156150o931378n178753N40589M182010L986258N615014R926100Q171068
$$ plain form
42405 14154758 11454533 1038426 -3087910 4463213 12367270 8180789 -6535879 -21252930
42397 -21252930 -28564745 -26170430 -14938012 -2076172 121066 -13213531 -31747046
42390 -31747046 -41093136 -38728019 -33481342 -33003706 -38020269 -45818692 -52147440 -50902452
42382 -50902452 -38905311 -21960491 -11457316 -13596734 -24165742 -33347546 -33456149 -23664808
42374 -23664808 -10522146 -2986635 -4139252 -8491762 -9158487 -5400794 -554144 4489610
42366 4489610 11364334 19412858 25269287 26967104 25191917 21107068 16125353 13043305
42358 13043305 13877177 16753503 17960796 16847861 15971454 17102838 20353836 26665682
42350 26665682 36949169 47817513 51967288 45285003 31842775 19871683 13589964
$$ packed form
42405A4154758k700225j0416107m126336P551123P904057m186481j4716668j4717051
42397b1252930p311815K394315J1232418J2861840K197238j3334597j8533515
42390c1747046r346090K365117N246677M77636n016563p798423o328748J244988
42382e0902452J1997141J6944820J0503175k139418j0569008r181804j08603R791341
42374b3664808J3142662P535511j152617m352510o66725L757693M846650N043754
42366D489610O874724Q048524N856429J697817j775187m084849m981715l082048
42358A3043305Q33872K876326J207293j112935q76407J131384L250998O311846
42350B6665682J0283487J0868344M149775o682285j3442228j1971092o281719
$$ plain form
42343 13589964 10436113 5909145 -560252 -5591637 -6837805 -5479920 -2521060 4370744
42335 4370744 16078403 25567131 22713523 7665919 -6366486 -7717840 768048 8072255
42327 8072255 10080056 11633251 15757600 18631208 16448348 11503872 9156815 12151571
42319 12151571 19109342 25762357 27507486 23941184 20432909 21381743 23102285 19118401
42311 19118401 11848525 10969089 18263916 23043739 17698461 9390973 8216632 10813666
42303 10813666 7111469 -727136 -237601 9575573 12959089 466600 -14833236 -15082358
42295 -15082358 -3489253 1031521 -7976910 -15722452 -7787722 11124403 25467361 27149904
42287 27149904 18750183 4849260 -11502746 -26148220 -34693419 -36199118 -32436379 -24714898
$$ packed form
42343A3589964l153851m526968o469397n031385j246168J357885K958860O891804
42335D370744J1707659R488728k853608j5047604j4032405j351354Q485888P304207
42327H072255K007801J553195M124349K873608k182860m944476k347057K994756
42319A2151571O957771O653015J745129l566302l508275R48834J720542l983884
42311A9118401p269876q79436P294827M779823n345278q307488j174341K597034
42303A0813666l702197p838605M89535R813174L383516j2492489j5299836k49122
42295a5082358J1593105M520774r008431p745542P934730J8912125J4342958J682543
42287B7149904q399721j3900923j6352006j4645474q545199j505699L762739P721481
$$ plain form
42279 -24714898 -14543918 -5182998 1348531 6954570 13464030 18044977 16646160 10176328
42271 10176328 3445943 111643 2275029 11587379 25646153 36923273 41608749 45840392
42263 45840392 55384489 63078306 57368888 41503015 31299692 32235601 31867203 19724849
42255 19724849 2337659 -8975596 -14280957 -19058474 -20707604 -13089564 -171449 6099296
42247 6099296 478432 -11025555 -19786691 -20776567 -12389950 2112433 13736310 15232684
42239 15232684 9547923 5757517 7574569 10784564 10488410 5682182 -1883434 -8449566
42231 -8449566 -9464151 -4525974 1052944 3518360 5730725 10514908 14479448 14852119
42223 14852119 16282599 22274609 26125499 21486902 16342958 22463048 34330000 34729998
$$ packed form
42279b4714898J0170980R360920O531529N606039O509460M580947j398817o469832
42271A0176328o730385l334300K163386R312350J4058774J1277120M685476M231643
42263D5840392R544097P693817n709418j5865873j0203323R35909l68398j2142354
42255A9724849j7387190j1313255n305361m777517j649130P618040J2918115O270745
42247F099296n620864j1503987q761136r89876Q386617J4502383J1623877J496374
42239A5232684n684761l790406J817052L209995k96154m806228p565616o566132
42231h449566j014585M938177N578918K465416K212365M784183L964540L72671
42223A4852119J430480N992010L850890m638597n143944O120090J1866952L99998
$$ plain form
42215 34729998 21116476 9349387 8073243 6565498 -4938336 -18402551 -21538590
42208 -21538590 -15838065 -10262733 -6949574 -3970289 -3617636 -6963255 -7714745 -2510952
42200 -2510952 -443825 -10756112 -26848530 -34212993 -29267218 -18810223 -6427786 6993250
42192 6993250 13976024 7869324 -1948600 953982 14309700 17050368 -258838 -20656182
42184 -20656182 -24524901 -14444543 -5682736 -2846403 1026015 8858122 16234527 21068079
42176 21068079 25421613 28372468 26447486 21471181 19823287 22809235 24783447 22209484
42168 22209484 18129345 15890093 14896726 15704233 23586107 42122851 66360976 86747149
42160 86747149 98160858 101710569 99671923 93277417 85411518 81160236 83474232 89806541
$$ packed form
42215C4729998j3613522j1767089j276144j507745j1503834j3464215l136039
42208b1538590N700525N575332L313159K979285L52653l345619p51490N203793
42200b510952K067127j0312287j6092418p364463M945775J0456995J2382437J3421036
42192F993250O982774o106700r817924K902582J3355718K740668j7309206k0397344
42184b0656182l868719J0080358Q761807K836333L872418P832107P376405M833552
42176B1068079M353534K950855j924982m976305j647894K985948J974212k573963
42168B2209484m080139k239252r93367Q07507P881874J8536744K4238125K0386173
42160H6747149J1413709L549711k038646o394506p865899m251282K313996O332309
$$ plain form
42152 89806541 94342596 92990843 86180376 78127142 73813885 75571773 81926622 89731524
42144 89731524 96137444 97280296 87874083 67327010 46189828 39627495 50338103 63104161
42136 63104161 62346276 51335557 46118833 52377651 58558274 54231733 45385730 45066206
42128 45066206 55701038 68797148 78241590 85379217 92086599 96667792 97696104 96059877
42120 96059877 91995600 85310636 79905189 82504216 93559070 103085950 99529519 81869510
42112 81869510 61094728 50463886 54800472 67645760 77972041 80560632 79550952
42105 79550952 80868870 83495885 81948932 75895501 71864925 75193101 86053838 104518851
42097 104518851 132138079 164237304 187432837 192438507 186092966 183035471 186954307
$$ packed form
42152H9806541M536055j351753o810467q053234m313257J757888O354849P804902
42144H9731524O405920J142852r406213k0547073k1137182o562333J0710608J2766058
42136F3104161p57885j1010719n216724O258818O180623m326541q846003l19524
42128D5066206J0634832J3096110R444442P137627O707382M581193J028312j636227
42120I6059877m064277o684964n405447K599027J1054854R526880l556431j7660009
42112H1869510k0774782j0630842M336586J2845288J0326281K588591j009680
42105G9550952J317918K627015j546953o053431m030576L328176J0860737J8465013
42097A04518851K7619228L2099225K3195533N005670o345541l057495L918836
$$ plain form
42090 186954307 188260822 181147067 174406022 180269732 197319803 210412218 206544525 186972677
42082 186972677 163809062 147527986 138678777 130575117 118692287 105856062 97206771
42075 97206771 92296930 86266244 78617057 75334409 79675691 85810049 86309835 82188010
42067 82188010 79310753 77437382 71012073 61046556 57255060 64470213 74258274 76114984
42059 76114984 71636190 70082540 73137181 72731297 63938359 52094869 44593968 41410779
42051 41410779 37286063 29776500 22042030 19448856 24763114 34811458 41806056 40979594
42043 40979594 36768807 37339494 43007626 45795128 41884292 37801483 40214191 45305239
42035 45305239 44147456 35149519 25239836 20295289 19127724 16178768 7275432 -5670720
$$ packed form
42090A86954307J306515p113755o741045N863710J7050071J3092415l867693j9571848
42082A86972677k3163615j6281076q849209q103660j1882830j2836225q649291
42075I7206771m909841o030686p649187l282648M341282O134358M99786m121825
42067H2188010k877257j873371o425309r965517l791496P215153R788061J856710
42059G6114984m478794j553650L054641m05884q792938j1843490p500901l183189
42051D1410779m124716p509563p734470k593174N314258J0048344O994598q26462
42043D0979594m210787N70687N668132K787502l910836m082809K412708N091048
42035D5305239j157783q997937r909683m944547j167565k948956q903336j2946152
$$ plain form
42027 -5670720 -14118186 -11013694 -1492714 1040247 -6139832 -8327607 6026018 25841311
42019 25841311 31280347 21988536 15506487 18583005 18406371 7215150 -2544299 1069823
42011 1069823 8107360 1791547 -13948273 -19503612 -8983055 2344080 1821897 -4236719
42003 -4236719 -4079046 675450 -1295445 -13947316 -28463233 -33578605 -26256483 -12029391
41995 -12029391 2403853 15729130 30755475 46720224 56200919 53548247 43974753
41988 43974753 37962099 36856819 31193644 15360136 -3254977 -14082635 -16190599 -15180729
41980 -15180729 -12132721 -4023520 6282165 9116260 -400535 -15478919 -25516032 -27093649
41972 -27093649 -24321527 -21655220 -20404409 -20744719 -22854399 -25185272 -24137894 -17199506
$$ packed form
42027e670720q447466L104492R520980K532961p180079k187775J4353625J9815293
42019B5841311N439036r291811o482049L076518j76634j1191221r759449L614122
42011A069823P037537o315813j5739820n555339J0520557J1327135n22183o058616
42003d236719J57673M754496j970895j2651871j4515917n115372P322122J4227092
41995a2029391J4433244J3325277J5026345J5964749R480695k652672r573494
41988D3974753o012654j105280n663175j5833508j8615113j0827658k107964J009870
41980a5180729L048008Q109201J0305685K834095r516795j5078384j0037113j577617
41972b7093649K772122K666307J250811l40310k109680k330873J047378O938388
$$ plain form
41964 -17199506 -6284033 2341867 2025193 -8605327 -22813158 -30437571 -28007056 -23328461
41956 -23328461 -26728581 -37631930 -43929917 -36745426 -22063612 -13517139 -15567269 -19038347
41948 -19038347 -13776404 -875600 10285786 13891021 12671833 11851860 11715848 8177175
41940 8177175 12509 -6744246 -4284367 6401821 13541206 6775136 -10058700 -22921040
41932 -22921040 -24096391 -19037303 -15346935 -12076672 -5367010 652565 -2988473 -17067059
41924 -17067059 -31583889 -37233300 -33652446 -24969537 -13323009 -230432 10258935
41917 10258935 14469231 13096587 8779884 1258907 -11589117 -28444467 -43186472 -49399450
41909 -49399450 -45286871 -34793524 -24906789 -20548369 -20135656 -16574478 -4293165 14706149
$$ packed form
41964a7199506J0915473Q625900l16674j0630520j4207831p624413K430515M678595
41956b3328461l400120j0903349o297987P184491J4681814Q546473k050130l471078
41948a9038347N261943J2900804J1161386L605235j219188q19973j36012l538673
41940H177175q164666o756755K459879J0686188P139385o766070j6833836j2862340
41932b2921040j175351N059088L690368L270263O709662O019575l641038j4078586
41924a7067059j4516830n649411L580854Q682909J1646528J3092577J0489367
41917A0258935M210296j372644m316703p520977j2848024j6855350j4742005o212978
41909d9399450M112579J0493347R886735M358420M12713L561178J2281313J8999314
$$ plain form
41901 14706149 32876471 44896137 51879127 57185766 59361136 52029248 33034234 12216121
41893 12216121 4898114 14740885 27242671 25819496 11957822 2168534 5528364 13693672
41885 13693672 16622657 18446794 28785050 43833376 47417833 31285186 5729893
41878 5729893 -12539205 -17012029 -13026309 -7857196 -3292083 3908075 16691510 32111326
41870 32111326 41027976 35969713 19824233 4007720 -2702619 -957762 3582370 7479935
41862 7479935 10510276 12518393 12155817 8297851 2153436 -1661182 1939238 11773888
41854 11773888 18672709 15082902 4965461 -1753220 -3556620 -8151745 -17984626 -24383187
41846 -24383187 -20381081 -10801576 -3356043 2676089 11057412 18484936 19441793 16612049
$$ packed form
41901A4706149J8170322J2019666O982990N306639K175370p331888j8995014k0818113
41893A2216121p318007R842771J2501786j423175j3861674r789288L359830Q165308
41885A3693672K928985J824137J0338256J5048326L584457j6132647k5555293
41878E729893j8269098m472824L985720N169113M565113P200158J2783435J5419816
41870C2111326Q916650n058263j6145480j5816513o710339J744857M540132L897565
41862G479935L030341K008117l62576l857966o144415l814618L600420R834650
41854A1773888O898821l589807j0117441o718681j803400m595125r832881o398561
41846b4383187M002106R579505P445533O032132Q381323P427524R56857k829744
$$ plain form
41838 16612049 16385235 17023503 11749536 1793342 -4671125 -6283559 -9762078 -16105457
41830 -16105457 -17414204 -11260747 -6798483 -10023919 -12536846 -3504881 13823129 26284681
41822 26284681 27301039 21359689 14770030 9122582 2866914 -5899197 -17371097 -27375707
41814 -27375707 -29127762 -21141333 -10440142 -4224116 -1865525 590952 1954792 -2423701
41806 -2423701 -13087744 -25733816 -35820228 -39703960 -34518720 -21834072 -7984499
41799 -7984499 4188964 19270217 38697281 52093194 49003643 35668572 28560946
41792 28560946 32042075 34147622 26066833 14290031 9272016 11946351 17245325 22984051
41784 22984051 28494795 30224189 25729921 19099355 17050632 21150335 26845580 28367399
$$ packed form
41838A6612049k26814O38268n273967r956194o464467j612434l478519o343379
41830a6105457j308747O153457M462264l225436k512927R031965J7328010J2461552
41822B6284681J016358n941350o589659n647448o255668q766111j1471900j0004610
41814b7375707j752055P986429J0701191O216026K358591K456477J363840m378493
41806b423701j0664043j2646072j0086412l883732N185240J2684648J3849573
41799g984499J2173463J5081253J9427064J3395913l089551j3335071p107626
41792B8560946L481129K105547q080789j1776802n018015K674335N298974N738726
41784B2984051N510744J729394m494268o630566k048723M099703N695245J521819
$$ plain form
41776 28367399 23237328 14802341 10938505 16374404 26143442 31573798 32245035 34720067
41768 34720067 39062719 36421745 23698597 11098920 8841654 14079064 17813822 17739987
41760 17739987 16606920 14273829 10069191 7865992 9840067 9600675 923664 -10499151
41752 -10499151 -14216499 -10975993 -10259912 -13247654 -10792433 -347610 7008359 1857037
41744 1857037 -10054631 -16013897 -12106560 -4670872 -62100 1035072 749947 311493
41736 311493 -279750 -951289 -838912 567054 1335559 -1694451 -7711487 -10452082 -5115531
41727 -5115531 5441503 14852501 20776511 24068264 24057772 20886846 19594456 24352871
41719 24352871 30567912 30706690 26251104 24644173 25609158 21776420 13712789 11669076
$$ packed form
41776B8367399n130071q434987l863836N435899R769038N430356O71237K475032
41768C4720067M342652k640974j2723148j2599677k257266N237410L734758p3835
41760A7739987j133067k333091m204638k203199J974075k39392q677011j1422815
41752a0499151l717348L240506P16081k987742K455221J0444823P355969n151322
41744A857037j1911668n959266L907337P435688M608772J097172k85125m38454
41736C11493n91243o71539J12377J405966P68505l030010o017036k740595N336551
41727e115531J0557034R410998N924010L291753j0492l170926j292390M758415
41719B4352871O215041J38778m455586j606931R64985l832738q063631k043713
$$ plain form
41711 11669076 18211619 21019040 9755903 -9640555 -24726419 -31605124 -32439761 -26847960
41703 -26847960 -15537700 -5467840 -1148993 3518523 14699396 25628831 25465156 16454779
41695 16454779 9906143 8403104 5269816 -369663 -2719279 -3566229 -11377093 -22542559
41687 -22542559 -19839861 1833226 21634575 16535880 -9744251 -33089677 -38099001
41680 -38099001 -29379235 -17883098 -8187106 390559 9119066 18030150 23624682 19405893
41672 19405893 4099034 -12875331 -20731525 -19811657 -17108708 -12180407 1188035 18802879
41664 18802879 24567643 11311425 -6761888 -11034277 -1550418 5664929 244513 -12674797
41656 -12674797 -22579355 -24826910 -20870986 -14280637 -9052552 -7426680 -7147926 -3579392
$$ packed form
41711A1669076O542543K807421j1263137j9396458j5085864o878705q34637N591801
41703b6847960J1310260J0069860M318847M667516J1180873J0929435j63675r010377
41695A6454779o548636j503039l133288n639479k349616q46950p810864j1165466
41687b2542559K702698K1673087J9801349n098695k6280131k3345426n009324
41680c8099001Q719766J1496137R695992Q577665Q728507Q911084N594532m218789
41672A9405893j5306859j6974365p856194R19868K702949M928301J3368442J7614844
41664A8802879N764764j3256218j8073313m272389R483859P215347n420416j2919310
41656a2674797r904558k247555L955924O590349N228085J625872K78754L568534
$$ plain form
41648 -3579392 4596107 14172421 21645239 25621005 25654485 22591231 19814840 19792712 19242487
41639 19242487 12623163 1316428 -5891921 -3570109 3606057 6992666 2465140 -9180666
41631 -9180666 -24581766 -36617713 -36185351 -21157412 -738616 14241820 22753423 30196578
41623 30196578 36789440 36594385 27510512 15322699 6566993 2692349 2389021 4243888
41615 4243888 4988421 192841 -9738659 -17555911 -16723479 -9069619 -1820787 1649383
41607 1649383 4890164 12321944 23086058 32472450 37735437 39625751 37967995 29546305
41599 29546305 13787198 -2084681 -9313144 -8705685 -9007522 -13156333 -14143421 -8295160
41591 -8295160 -3914181 -9084064 -18040851 -19993094 -16531173 -17740886 -22895551 -19135600
$$ packed form
41648c579392Q175499R576314P472818L975766L3480l063254k776391k2128n50225
41639A9242487o619324j1306735p208349K321812P176166L386609m527526j1645806
41631i180666j5401100j2035947M32362J5027939K0418796J4980436Q511603P443155
41623C0196578O592862j95055r083873j2187813q755706l874644l03328J854867
41615D243888P44533m795580r931500p817252Q32432P653860P248832L470170
41607A649383L240781P431780J0764114R386392N262987J890314j657756q421690
41599B9546305j5759107j5871879p228463O07459l01837m148811r87088N848261
41591h295160M380979n169883q956787j952243L461921j209713n154665L759951
$$ plain form
41583 -19135600 -2296858 13560645 14004488 2589846 -5965878 -4528164 2063720 7316570
41575 7316570 10534117 14897368 22690773 32632734 40721468 44854980 47794787 52066453
41567 52066453 53290692 44679683 28001112 12660264 2785800 -6485492 -17519246 -24333192
41559 -24333192 -23064749 -19648306 -20390573 -21997783 -18341088 -11337964 -7457561 -7820137
41551 -7820137 -8808433 -8714449 -7548117 -4342705 -659902 -2071617 -9597776 -14538872 -9174990
41542 -9174990 1804324 8046021 7225219 4028506 175488 -5103573 -8188971 -4763669
41534 -4763669 1621421 4088685 3785883 7269893 13992857 16276721 11520265 5275503
41526 5275503 2197180 2623828 7774023 19007830 31428717 37133349 35661499 33072612
$$ packed form
41583a9135600J6838742J5857503M43843j1414642q555724J437714O591884N252850
41575G316570L217547M363251P793405R941961Q088734M133512K939807M271666
41567E2066453J224239q611009j6678571j5340848r874464r271292j1033754o813946
41559b4333192J268443L416443p42267j607210L656695P003124L880403l62576
41551g820137r88296R3984J166332L205412L682803j411715p526159m941096N363882
41542i174990J0979314O241697q20802l196713l853018n279061l085398L425302
41534d763669O385090K467264l02802L484010O722964K283864m756456o244762
41526E275503l078323M26648N150195J1233807J2420887N704632j471850k588887
$$ plain form
41518 33072612 30736353 24217022 13880285 7193401 8710980 15475567 22589890 25435662
41510 25435662 18064502 12179 -16383592 -17948593 -9973423 -9587038 -18676696 -19908177
41502 -19908177 -4530236 13050816 17660599 14953278 18246291 26147600 27599935 20553120
41494 20553120 11453845 2328117 -7889363 -13687597 -8913756 -968979 -5556150 -24768635
41486 -24768635 -40548737 -34713244 -10317636 10880893 11127728 -4695335 -14872251
41479 -14872251 -6927205 6570594 5868321 -6187501 -6592992 13662962 34670070 35394426
41471 35394426 21386835 11957632 12147259 13330758 12728958 14675384 17140734 13721725
41463 13721725 7046748 5305799 6895191 2965916 -5609409 -8498861 -3649617 -504530
$$ packed form
41518C3072612k336259o519331j0336737o686884J517579O764587P114323K845772
41510B5435662p371160j8052323j6395771j565001P975170L86385r089658j231481
41502a9908177J5377941J7581052M609783k707321L293013P901309J452335p046815
41494B0553120r099275r125728j0217480n798234M773841P944777m587171j9212485
41486b4768635j5780102N835493K4395608K1198529K46835j5823063j0176916
41479a4872251P945046J3497799p02273j2055822m05491K0255954K1007108P24356
41471C5394426j4007591r429203J89627J183499o01800J946426K465350l419009
41463A3721725o674977j740949J589392l929275q575325k889452M849244L145087
$$ plain form
41455 -504530 -3635834 -6478172 -3932083 1437520 8864693 22650597 41529603 55463431
41447 55463431 57641511 50971687 40146941 27007837 16048514 13678691 18549467 22593504
41439 22593504 24180774 29178512 36750305 37760367 31919466 31908983 42674172 50485692
41431 50485692 43172743 29351822 25141692 31068533 35111007 31504979 23503847 13051345
41423 13051345 1282812 -3769163 6885285 29602931 50561313 61642436 65355497
41416 65355497 65401399 62388899 59462837 62304562 69948764 72176592 60165967 36971816
41408 36971816 15728429 8824213 17897751 32417887 39670433 37670442 35161215 37798942
41400 37798942 40678304 38318343 34605698 35597983 38363059 35691791 27538638 18715091
$$ packed form
41455e04530l131304k842338K546089N369603P427173J3785904J8879006J3933828
41447E5463431K178080o669824j0824746j3139104j0959323k369823M870776M044037
41439B2593504J587270M997738P571793J010062n840901j0483J0765189P811520
41431E0485692p312949j3820921m210130N926841M042474l606028q001132j0452502
41423A3051345j1768533n051975J0654448K2717646K0958382J1081123L713061
41416F5355497M5902l012500k926062K841725P644202K227828j2010625k3194151
41408C6971816k1243387o904216R073538J4520136P252546j999991k509227K637727
41400C7798942K879362k359961l712645R92285K765076k671268q153153q823547
$$ plain form
41392 18715091 9324792 -1779989 -6850015 4618404 28567688 46923186 48883957
41385 48883957 41917902 37346896 34216858 24264159 6893070 -8205375 -11666323 -3434137
41377 -3434137 8208784 15124289 17763131 24099560 37569935 48988266 46658212 33021697
41369 33021697 23105932 25525237 33212118 35406798 30631022 23626523 17095444 12642423
41361 12642423 14317867 24365677 38292004 49121600 54063001 53720520 49069762 43619298
41353 43619298 43879366 51631630 59052889 57660587 49476122 43230709 42230271 43242931
41345 43242931 45537452 52174934 61443083 65625396 62207261 60312645 71372596 96994564
41337 96994564 129583037 161361875 188639438 210110420 226490568 241849230 261186993
$$ packed form
41392A8715091r390299j1104781n070026J1468419K3949284J8355498J960771
41385D8883957o966055m571006l130038r952699j7371089j5098445l460948Q232186
41377c434137J1642921O915505K638842O336429J3470375J1418331k330054j3636515
41369C3021697r915765K419305P686881K194680m775776p004499o531079m453021
41361A2642423J675444J0047810J3926327J0829596M941401l42481m650758n450464
41353D3619298K60068P752264P421259j392302q184465o245413j000438J012660
41345D3242931K294521O637482R268149M182313l418135j894616J1059951K5621968
41337I6994564L2588473L1778838K7277563K1470982J6380148J5358662J9337763
$$ plain form
41330 261186993 285020894 307731449 321781721 322986030 312409147 294540355 273342964
41323 273342964 249133113 219998664 187106943 156875090 135504003 122296185 111393916
41316 111393916 100118986 92193983 91343013 94755737 95782096 91754475 86186628 83237665
41308 83237665 82552246 80926523 77844929 77189297 82284634 90375962 95092461 95790987
41300 95790987 101054326 118753444 144984516 169346899 190564481 217747555 252794202
41293 252794202 281257542 288824079 279540401 267047745 253206946 229221424 196217756
41286 196217756 168980694 155673551 147904049 136969958 126451341 119828765 108911669
41279 108911669 88238291 70961717 73220908 87570595 90314703 75846579 66106272
$$ packed form
41330B61186993K3833901K2710555J4050272J204309j0576883j7868792k1197391
41323B73342964k4209851k9134449l2891721l0231853k1371087j3207818j0902269
41316A11393916j1274930p925003q50970L412724J026359m027621n567847k948963
41308H3237665o85419j625723l081594o55632N095337Q091328M716499O98526
41300I5790987N263339J7699118K6231072K4362383K1217582K7183074L5046647
41293B52794202K8463340P566537r283678j2492656j3840799k3985522l3003668
41286A96217756k7237062j3307143p769502j0934091j0518617o622576j0917096
41279A08911669k0673378j7276574K259191J4349687K744108j4468124r740307
$$ plain form
41272 66106272 79727304 105623478 116856720 102385126 75770911 57272239 55723938
41265 55723938 66160455 78157292 84868815 86483499 86552307 86978304 88823934 95439370
41257 95439370 109290103 126573909 141548024 156427411 179326646 210418595 238357326
41250 238357326 254867741 265756444 281447236 302076925 318696443 325590448 324930145
41243 324930145 321579870 319303615 321017121 328002458 339281722 354232025 373208865
41236 373208865 392597954 403325560 399514919 385836352 370858723 355581496 334599716
41229 334599716 306715605 277327108 250416456 224875540 199936764 178325613 162050678
41222 162050678 149998989 141735459 138938518 140491259 140755609 136502342 132018495 133013142
$$ packed form
41272F6106272J3621032K5896174J1233242j4471594k6614215j8498672j548301
41265E5723938J0436517J1996837O711523J614684O8808M25997J845630O615436
41257I5439370J3850733J7283806J4974115J4879387K2899235L1091949K7938731
41250B38357326J6510415J0888703J5690792K0629689J6619518O894005o60303
41243C24930145l350275k276255J713506O985337J1279264J4950303J8976840
41236C73208865J9389089J0727606l810641j3678567j4977629j5277227k0981780
41229C34599716k7884111k9388497k6910652k5540916k4938776k1611151j6274935
41222A62050678j2051689q263530k796941J552741K64350m253267m483847R94647
$$ plain form
41214 133013142 138481062 144580712 155224923 180382365 219744055 254740542 265808751
41207 265808751 256470128 250515553 261818228 276168851 271093444 246627603 224329547
41200 224329547 218803867 224742602 233956802 249333351 273269300 295040320 302670824
41193 302670824 299731255 297057446 292989177 276450676 247866605 222068231 208230877
41186 208230877 199715004 187264453 170149856 149356093 122201616 92306400 74743425
41179 74743425 79712307 96480576 104354734 97002445 86575848 85500237 93787517 104826656
41171 104826656 114545002 121097012 121334642 112364721 95466454 77473160 69050532 78733633
41163 78733633 103622318 127278618 133760948 125332821 120271354 130783413 149373802
$$ packed form
41214A33013142N467920O099650J0644211K5157442L9361690L4996487J1068209
41207B65808751r338623n954575J1302675J4350623n075407k4465841k2298056
41200B24329547n525680N938735R214200J5376549K3935949K1771020P630504
41193C02670824k939569k673809m068269j6538501k8584071k5798374j3837354
41186B08230877q515873j2450551j7114597k0793763k7154477k9895216j7562975
41179G4743425M968882J6768269P874158p352289j0426597j075611Q287280J1039139
41171A04826656R718346O552010K37630q969921j6898267j7993294q422628R683101
41163G8733633K4888685K3656300O482330q428127n061467J0512059J8590389
$$ plain form
41156 149373802 161012448 162263454 161352811 163888537 167918603 172057101 178527658 185430343
41148 185430343 184607167 172647764 157846806 149920351 147519521 143050967 136175318 133746897
41140 133746897 137555722 141159685 140056118 136858135 134062338 129369822 121594791 114156622
41132 114156622 108783086 102776093 97035216 98916650 110319526 120015136 116391803 102340371
41124 102340371 88628892 78071747 67088947 58288477 57975231 62612119 61723478 55327431
41116 55327431 54469822 61196830 62572084 51607079 41117933 46530232 64549036 80094883
41108 80094883 87430243 92664974 99400636 103318814 100316473 91693604 81662823 75609189
41100 75609189 78705392 90139948 101102623 104355791 102721834 102338946 102660759 101694247
$$ packed form
41156A49373802J1638646J251006r10643K535726M030066M138498O470557O902685
41148A85430343q23176j1959403j4800958p926455k400830m468554o875649k428421
41140A33746897L808825L603963j103567l197983k795797m692516p775031p438169
41132A14156622n373536o006993n740877J881434J1402876R695610l623333j4051432
41124A02340371j3711479j0557145j0982800q800470l13246M636888q88641o396047
41116E5327431q57609O727008J375254j0965005j0489146N412299J8018804J5545847
41108H0094883P335360N234731O735662L918178l002341q622869j0030781o053634
41100G5609189L096203J1434556J0962675L253168j633957l82888L21813r66512
$$ plain form
41092 101694247 106361949 126035568 157299762 186625522 208516817 230133385 256980725
41085 256980725 285682246 313755690 344654982 377570509 402629763 413500416 416574236
41078 416574236 420338580 422914960 417730720 404513552 385661415 357695176 317223237
41071 317223237 272385445 237454352 216144576 199302209 179740087 160894893 148989933
41064 148989933 144184168 142432978 140127723 133818897 120358994 100730311 80520452
41057 80520452 64832015 56066711 56664800 67312339 79925897 80141719 63335660 43348684
41049 43348684 37950168 48557202 61831263 68875604 72899020 77018062 75555974 63881776
41041 63881776 49397650 44086255 49518325 57034843 60675447 61678931 60797985 55497896
$$ packed form
41092A01694247M667702J9673619L1264194K9325760K1891295K1616568K6847340
41085B56980725K8701521K8073444L0899292L2915527K5059254J0870653L073820
41078D16574236L764344K576380n184240j3217168j8852137k7966239m0471939
41071C17223237m4837792l4931093k1309776j6842367j9562122j8845194j1904960
41064A48989933m805765j751190k305255o308826j3459903j9628683k0209859
41057H0520452j5688437q765304N98089J0647539J2613558K15822j6806059j9986976
41049D3348684n398516J0607034J3274061P044341M023416M119042j462088j1674198
41041F3881776j4484126n311395N432070P516518L640604J003484q80946n300089
$$ plain form
41033 55497896 47347096 43790992 47616663 51110786 46506305 36970871 30707285 28785953
41025 28785953 26882398 25980912 31908498 44581917 56673993 64264917 70438211 76058810
41017 76058810 75749952 67556247 58853162 56376264 56482274 52440694 46469950 46120607
41009 46120607 51607844 55864696 56857917 60949106 71479762 81229806 81011827 71744305
41001 71744305 63105863 61585241 63858667 62764822 57506443 55363749 62250650 73433000
40993 73433000 77493577 70489928 62022371 64036947 76893973 90903874 98991099 102089857
40985 102089857 103487521 105045694 110251680 124009155 145111784 163034093 166880134
40978 166880134 156150161 139979170 127323670 120230038 115009885 107065390 95037768
$$ packed form
41033E5497896q150800l556104L825671L494123m604481r535434o263586j921332
41025B8785953j903555r01486N927586J2673419J2092076P590924O173294N620599
41017G6058810l08858q193705q703085k476898J06010m041580n970744l49343
41009D6120607N487237M256852R93221M091189J0530656R750044k17979r267522
41001G1744305q638442j520622K273426j093845n258379k142694O886901J1182350
40993G3433000M060577p003649q467557K014576J2857026J4009901Q087225L098758
40985A02089857J397664J558173N205986J3757475K1102629J7922309L846041
40978A66880134j0729973j6170991j2655500p093632n220153p944495j2027622
$$ plain form
40971 95037768 82398636 74949704 75425118 80581557 84234135 82734698 77041586 70165905
40963 70165905 63483593 55904600 47020942 40463945 41438143 49069117 53826871 46491966
40955 46491966 28689801 10430856 -2116113 -11065599 -18321125 -19052905 -8088866 10494702
40947 10494702 24930821 26693015 18047470 9666977 11474821 23570261 34942723 33497038
40939 33497038 18578170 1274684 -7828695 -7049397 538169 12474742 24012258 26806213
40931 26806213 18592070 10582261 16106453 32322182 41859117 34495044 19293331 11066236
40923 11066236 11442399 10390642 3301772 -2035418 2351194 11738296 14092579 6582148
40915 6582148 -428928 1308561 5081775 -865952 -13794901 -17431667 -4464321 12234349
$$ packed form
40971I5037768j2639132p448932M75414N156439L652578j499437n693112o875681
40963G0165905o682312p578993q883658o556997R74198P630974M757754p334905
40955D6491966j7802165j8258945j2546969q949486p255526p31780J0964039J8583568
40947A0494702J4436119J762194q645545q380493J807844J2095440J1372462j445685
40939C3497038j4918868j7303486r103379P79298P587566J1936573J1537516K793955
40931B6806213q214143q009809N524192J6215729R536935p364073j5201713q227095
40923A1066236L76163j051757p088870n337190M386612R387102K354283p510431
40915F582148p011076J737489L773214n947727j2928949l636766J2967346J6698670
$$ plain form
40907 12234349 16938700 11024390 6729078 7619562 6988684 2845067 1909427 7261944
40899 7261944 12534628 11669307 6242711 211873 -4623340 -4782232 4790573 21953445
40891 21953445 35925293 39612165 36572600 30978199 19260966 -300994 -17236458
40884 -17236458 -19043861 -7840021 3637295 10291021 17931426 28732111 35248444 32412678
40876 32412678 25737411 21854128 18051708 8138406 -5669954 -14034465 -12720831 -8071610
40868 -8071610 -9308316 -18283292 -27795081 -28729820 -18616762 -4041899 5047745 3558801
40860 3558801 -5666309 -15125086 -17369205 -8193559 10740278 30987301 41737802 37959234
40852 37959234 24261207 10129794 1831719 -1148446 -3547043 -9539790 -19517618 -29929552
$$ packed form
40907A2234349M704351n914310m295312Q90484o30878m143617r35640N352517
40899G261944N272684q65321n426596o030838m835213j58892R572805J7162872
40891B1953445J3971848L686872l039565n594401j1717233j9561960j6935464
40884a7236458j807403J1203840J1477316O653726P640405J0800685O516333k835766
40876C2412678o675267l883283l802420r913302j3808360q364511J313634M649221
40868h071610j236706q974976r511789r34739J0113058J4574863R089644j488944
40860C558801r225110r458777k244119R175646J8933837K0247023J0750501l778568
40852C7959234j3698027j4131413q298075k980165k398597n992747r977828j0411934
$$ plain form
40844 -29929552 -35909387 -34680443 -27138544 -16804596 -7594628 -2249168 -2109756 -7378889
40836 -7378889 -16352141 -24214618 -24863214 -16526586 -4743217 3170545 6168966 8503741
40828 8503741 11177543 9932052 3697105 -703854 3256808 12906956 20526338 23180274
40820 23180274 23160668 21625269 18455654 16971901 21410242 28874773 30213058 21117250
40812 21117250 7603105 -1655656 -4387744 -4119228 -4322536 -5784564 -7325571 -7036073
40804 -7036073 -4298942 -1294163 -577565 -1047755 1173384 7686686 16165728 23564117
40796 23564117 28191072 29134191 26954291 24476797 23443932 21376479 15846079 10171998
40788 10171998 8992412 9287871 3362126 -8642897 -17251760 -16681984 -11064963 -4328535
$$ packed form
40844b9929552n979835J228944P541899J0333948R209968N345460J39412n269133
40836g378889q973252p862477o48596Q336628J1783369P913762K998421K334775
40828H503741K673802j245491o234947m400959L960662R650148P619382K653936
40820B3180274j9606j535399l169615j483753M438341P464531J338285r095808
40812B1117250j3514145r258761k732088K68516k03308j462028j541007K89498
40804g036073K737131L004779P16598m70190K221139O513302Q479042P398389
40796B3564117M626955R43119k179900k477494j032865k067453n530400n674081
40788A0171998j179586K95459n925745j2005023q608863N69776N617021O736428
$$ plain form
40780 -4328535 6974732 24203112 37760519 37244262 26948519 22265795 30978058 44648299
40772 44648299 49104952 38978547 21580180 9561713 9478928 15435037 15176120 4054439
40764 4054439 -9480490 -14200041 -8733815 -1343754 -252700 -6991061 -16404312 -20916442
40756 -20916442 -17967798 -14450891 -18707816 -27000347 -25929698 -11692395 2835922 6882478
40748 6882478 7403178 15348450 25318602 23684689 12006213 5926404 11432767 18204919
40740 18204919 18861466 19086269 22680774 20700433 5241537 -15715071 -27635875 -27659263
40732 -27659263 -24461303 -24091817 -24364369 -21381892 -14851823 -7295089 -1968235 -589994
40724 -589994 -956754 504076 1851916 -4367878 -20696690 -38161780 -44444765 -36339243
$$ packed form
40780d328535J1303267J7228380J3557407n16257j0295743m682724Q712263J3670241
40772D4648299M456653j0126405j7398367j2018467q2785N956109k58917j1121681
40764D054439j3534929m719551N466226P390061J091054o738361r413251m512130
40756b0916442K948644L516907m256925q292531J070649J4237303J4528317M046556
40748F882478N20700P945272R970152j633913j1678476o079809N506363O772152
40740A8204919O56547K24803L594505j980341j5458896k0956608j1920804k3388
40732b7659263L197960L69486k72552K982477O530069P556734N326854J378241
40724e89994l66760J460830J347840o219794j6328812j7465090o282985Q105522
$$ plain form
40716 -36339243 -20990223 -7500197 -297840 2047736 4598666 10485242 15819146 13454930
40708 13454930 3101612 -7515810 -14029230 -21473468 -34142053 -45621044 -46470541 -38258122
40700 -38258122 -32014532 -33972195 -39800244 -42810022 -41472450 -37709465 -33062126 -28840952
40692 -28840952 -26910967 -28275883 -32049405 -36140737 -37907926 -34751170 -25609911 -11933680
40684 -11933680 2825624 13824915 16596272 12095444 9216318 16219389 28519498 32080574
40676 32080574 21909454 9178817 4477751 2265005 -8913088 -27008399 -38931923
40669 -38931923 -39500479 -35658482 -31760623 -23024919 -7189732 8033893 15262864 17343073
40661 17343073 20418034 23361677 21424899 15881314 11922713 9142543 2383191 -7618782
$$ packed form
40716c6339243J5349020J3490026P202357K345576K550930N886576N333904k364216
40708A3454930j0353318j0617422o513420p444238j2668585j1478991q49497Q212419
40700c8258122O243590j957663n828049l009778J337572L762985M647339M221174
40692b8840952J929985j364916l773522m091332j767189L156756R141259J3676231
40684a1933680J4759304J0999291K771357m500828k879126P003071J2300109L561076
40676C2080574j0171120j2730637m701066k212746j1178093j8095311j1923524
40669c8931923n68556L841997L897859Q735704J5835187J5223625P228971K080209
40661A7343073L074961K943643j936778n543585l958601k780170o759352j0001973
$$ plain form
40653 -7618782 -12296501 -7213433 34793 -707058 -8193823 -11918857 -7501981 -2488999
40645 -2488999 -4004774 -7647607 -5323610 406004 -945767 -11464781 -20646925 -19661518
40637 -19661518 -11163527 -1085311 10764298 25495613 37575742 40693738 36850244
40630 36850244 31945663 25870465 14736483 91905 -12091780 -19662543 -23935884 -23284398
40622 -23284398 -15583766 -5808173 -2204620 -4763497 -5867612 -2757813 -745315 -3096803
40614 -3096803 -6689604 -9688623 -14481067 -19615148 -17370294 -4275943 12512046 23718473
40606 23718473 26872979 23103293 12261305 -2846954 -13101647 -11207769 -790574
40599 -790574 7874822 9450093 6930810 5378948 6216658 7431952 7271132 7100795 9494971
$$ packed form
40653g618782m677719N083068P248226p41851p486765l725034M416876N012982
40645b488999j515775l642833K323997N729614j351771j0519014r182144R85407
40637a9661518Q497991J0078216J1849609J4731315J2080129L117996l843494
40630C6850244m904581o075198j1133982j4644578j2183685p570763m273341O51486
40622b3284398P700632R775593L603553k558877j104115L109799K012498k351488
40614c096803l592801k999019m792444n134081K244854J3094351J6787989J1206427
40606B3718473L154506l769686j0841988j5108259j0254693J893878J0417195
40599g90574Q665396J575271k519283j551862Q37710J215294j60820j70337K394176
$$ plain form
40590 9494971 12618839 10206564 1254655 -4518857 1629135 13456652 17297138 12041567
40582 12041567 9558446 14363765 16444790 8709042 -1442708 -4914441 -3711023 -2864260
40574 -2864260 -318876 6005316 11092072 12518502 17038033 26294447 26788516 8982358
40566 8982358 -12247609 -13910501 3104314 16210910 13168988 3659644 -1803590 -5498544
40558 -5498544 -9550074 -6327707 8221098 23122889 24777355 14402294 5387726 7724182
40550 7724182 19945998 31734503 30897483 13352441 -10066070 -21893273 -16202989 -3546798
40542 -3546798 3622795 3046570 -2256068 -11554265 -22659493 -27890296 -22087191 -11103665
40534 -11103665 -5441021 -7421589 -10008107 -6842040 897092 6659440 4565606 -5604989
$$ packed form
40590I494971L123868k412275q951909n773512O147992J1827517L840486n255571
40582A2041567k483121M805319K081025p735748j0151750l471733J203418Q46763
40574b864260K545384O324192N086756J426430M519531R256414M94069j7806158
40566H982358k1229967j662892J7014815J3106596l041922r509344n463234l694954
40558e498544m051530L222367J4548805J4901791J654466j0375061r014568K336456
40550G724182J2221816J1788505q37020j7545042k3418511j1827203N690284J2656191
40542c546798P169593n76225n302638r298197j1105228n230803N803105J0983526
40534a1103665N662644j980568k586518L166067P739132N762348k093834j0170595
$$ plain form
40526 -5604989 -17572962 -24139357 -24474772 -23794454 -25907929 -29406164 -30847818 -27302478
40518 -27302478 -16372473 122699 12200542 8959122 -7848883 -24035405 -29140230
40511 -29140230 -25690905 -20279932 -14118767 -7193971 -3617487 -5759953 -8493614 -5524745
40503 -5524745 3019085 14085168 26829707 38473047 41312880 31561084 16801896 7410270
40495 7410270 4247210 1559409 -1921971 -2067556 3672649 14898983 30078803 43132670
40487 43132670 43206473 26699112 5939002 -3495467 -1597472 -770310 -6246019 -10358970
40479 -10358970 -6094233 4033656 14168686 21279141 23133851 17846510 7752413 -1957950
40471 -1957950 -8833712 -11952891 -7734194 4199899 13187792 7495988 -7263110 -12328828
$$ packed form
40526e604989j1967973o566395l35415O80318k113475l498235j441654L545340
40518b7302478J0930005J6495172J2077843l241420j6808005j6186522n104825
40511b9140230L449325N410973O161165O924796L576484k142466k733661K968869
40503e524745Q543830J1066083J2744539J1643340K839833r751796j4759188r391626
40495G410270l163060k687801l481380j45585N740205J1226334J5179820J3053867
40487D3132670P3803j6507361k0760110r434469J897995Q27162n475709m112951
40479a0358970M264737J0127889J0135030P110455J854710n287341j0094097r710363
40471a957950o875762l119179M218697J1934093Q987893n691804j4759098n065718
$$ plain form
40463 -12328828 -1320951 11265525 12182125 7028387 7439601 12193817 12291744 6755072
40455 6755072 1690632 -882554 -2254180 357940 8926719 15434557 9625758 -4831924
40447 -4831924 -13392917 -10487970 -4983622 -3548927 -566707 9241596 18335061 16432010
40439 16432010 7618285 6590577 18228065 29761639 26277748 8518671 -8660842
40432 -8660842 -12740964 -4819574 4242794 5461880 -892024 -7132716 -6249668 746399
40424 746399 5321494 736366 -9263382 -13924781 -8686054 -1406308 -2623006 -12624514
40416 -12624514 -22308591 -24596092 -19794505 -11043680 -1059507 5846017 5333409 -121811
40408 -121811 -1137054 7655993 20138552 26121688 23358471 18052216 15666644 15974932
$$ packed form
40463a2328828J1007877J2586476R16600n153738M11214M754216R7927n536672
40455F755072n064440k573186j371626K612120Q568779O507838n808799j4457682
40447d831924q560993K904947N504348J434695K982220R808303R093465j903051
40439A6432010q813725j027708J1637488J1533574l483891j7759077j7179513
40432h660842m080122P921390R062368J219086o353904o240692Q83048O996067
40424G46399M575095m585128r999748m661399N238727P279746j216698j0001508
40416a2624514r684077k287501M801587Q750825R984173O905524n12608n455220
40408a21811j015243Q793047J2482559N983136k763217n306255k385572L08288
$$ plain form
40400 15974932 16757731 18302934 22858820 31104299 39875372 43599284 39125462 29256650
40392 29256650 19910596 13951249 10083895 7152763 5567585 4372167 1998072 1295691
40384 1295691 8102831 21776926 32446197 31809300 22277544 11478665 2890021 -2817535
40376 -2817535 -2715341 3999394 9612045 4563511 -9822346 -22294191 -25346368 -21633730
40368 -21633730 -16895158 -13196586 -10070642 -6245027 983481 12568307 23088640 25349006
40360 25349006 20857230 19146569 24178038 27826169 20921196 5849731 -6193180 -7121578
40352 -7121578 2195171 14501399 21291505 18780937 12131115 10614088 15595190 17433916
40344 17433916 8802487 -2710013 -1849754 15337065 35604705 42464267 31770552 12200681
$$ packed form
40400A5974932P82799J545203M555886Q245479Q771073L723912m473822r868812
40392B9256650r346054n959347l867354k931132j585178j195418k374095p02381
40384A295691O807140J3674095J0669271o36897r531756j0798879q588644n707556
40376b817535J02194O714735N612651n048534j4385857j2471845l052177L712638
40368b1633730M738572L698572L125944L825615P228508J1584826J0520333K260366
40360B5349006m491776j710661N031469L648131o904973j5071465j2042911r28398
40352g121578R316749J2306228O790106k510568o649822j517027M981102J838726
40344A7433916q631429j1512500Q60259J7186819K0267640O859562j0693715j9569871
$$ plain form
40336 12200681 -5713425 -17843961 -25436999 -29664320 -29512219 -24769423 -18686613 -15255438
40328 -15255438 -14024555 -9705919 2325273 20889849 38796167 46763946 39751282 22838476
40320 22838476 9624168 10280703 21139531 30194937 32016528 30858094 28948450 21089405
40312 21089405 5615538 -7677378 -9040354 -3312312 -3605128 -12506153 -18901864 -14083017
40304 -14083017 -2553187 5918869 8200476 7697510 7271735 7125976 7353940 8293617 8773874
40295 8773874 6857735 2864408 354413 3185990 11043034 18018303 17310793 8591623
40287 8591623 -693515 -2706998 4042924 16815088 33502940 50733438 60365443 55802118
40279 55802118 42452552 34375653 37227500 40666637 32467183 15355722 3484065 4462909
$$ packed form
40336A2200681j7914106j2130536p593038m227321J52101M742796O082810L431175
40328a5255438J230883M318636J2031192J8564576J7906318P967779p012664j6912806
40320B2838476j3214308O56535J0858828R055406J821591j158434j909644p859045
40312B1089405j5473867j3292916j362976N728042k92816q901025o395711M818847
40304a4083017J1529830Q472056K281607n02966m25775j45759K27964R39677M80257
40295H773874j916139l993327k509995K831577P857044O975269p07510q719170
40287H591623r285138k013483O749922J2772164J6687852J7230498R632005m563325
40279E5802118j3349566q076899K851847L439137q199454j7111461j1871657R78844
$$ plain form
40271 4462909 11309201 12456198 4909897 -3756248 -3388986 9417760 27256080 36900613
40263 36900613 31281761 16774335 5556628 1082289 -3701186 -12333580 -16115136 -5605930
40255 -5605930 13582961 25388792 23254325 16522858 14571777 13894901 7341508 -1526815
40247 -1526815 -3407688 1261314 2972315 -1197968 -3809729 -1005708 1091744 -1120677
40239 -1120677 -841878 6141283 10017892 265442 -15687341 -20576527 -11647116 -3079828
40231 -3079828 -3355546 -4084434 3897772 15388585 19607446 15639412 10993913 10958821 16826878
40222 16826878 28745226 41817879 44367258 30185561 10186041 2065730 9063541
40215 9063541 18292962 20026719 17966089 17831444 16831521 11216032 5946061 7829625
$$ packed form
40271D462909O846292J146997p546301q666145L67262J2806746J7838320R644533
40263C6900613n618852j4507426j1217707m474339m783475q632394l781556J0509206
40255e605930J9188891J1805831k134467o731467j951081o76876o553393q868323
40247a526815j880873M669002J711001m170283k611761K804021K097452k212421
40239a120677K78799O983161L876609r752450j5952783m889186Q929411Q567288
40231c079828k75718p28888P982206J1490813M218861l968034m645499l5092N868057
40222A6826878J1918348J3072653K549379j4181697j9999520q120311O997811
40215I063541R229421J733757k060630j34645r99923n615489n269971J883564
$$ plain form
40207 7829625 13882672 15751794 13164720 13340358 16950629 14312169 -950250 -21811943
40199 -21811943 -36164401 -39637017 -35117415 -25021267 -11439738 -684063 1001196
40192 1001196 -3843792 -6847950 -5975874 -7101792 -12031443 -13862948 -8710417 -3915771
40184 -3915771 -7610288 -16211684 -20441959 -19485754 -20426962 -26197161 -32847930 -37481735
40176 -37481735 -40335025 -39586531 -32808029 -23848169 -19782296 -20677689 -21503089 -24422688
40168 -24422688 -37355686 -56961248 -65587354 -52798639 -30309261 -16726467 -15023040
40161 -15023040 -14215253 -6921942 4731210 16190862 23635533 22748147 12837872 268721
40153 268721 -8735726 -15184574 -20869912 -20727415 -10849970 1357262 6497194 8576128
$$ packed form
40207G829625O053047J869122k587074J75638L610271k638460j5262419k0861693
40199b1811943j4352458l472616M519602J0096148J3581529J0755675J685259
40192A001196m844988l004158Q72076j125918m929651j831505N152531M794646
40184c915771l694517q601396m230275R56205r41208n770199o650769m633805
40176c7481735k853290P48494O778502Q959860M065873q95393q25400k919599
40168b4422688j2932998j9605562q626106J2788715K2489378J3582794J703427
40161a5023040Q07787P293311J1653152J1459652P444671q87386r910275j2569151
40153B68721r004447o448848n685338J42497R877445J2207232N139932K078934
$$ plain form
40145 8576128 18008782 31484858 33405777 18580737 23943 -8674029 -6596025 1470889
40137 1470889 11982387 17924924 10253693 -8709217 -24096442 -27745357 -27958798 -32339785
40129 -32339785 -32385137 -16480749 10291942 31775683 41106699 44518959 48527409 53186382
40121 53186382 55365240 50533408 34790348 12994152 344172 6710295 22988609
40114 22988609 31769337 27407136 16446042 3884995 -8567982 -14753696 -9376150 -292028
40106 -292028 -1021976 -9742654 -9934142 5021343 21887822 27228959 23655374 19298593
40098 19298593 13431313 2638252 -7712129 -9055134 -1534131 8274791 17158163 25454508
40090 25454508 31806367 34677084 35187528 32608110 22289607 4849268 -8456889 -8447254
$$ packed form
40145H576128R432654J3476076J920919j4825040j8556794q697972K078004Q066914
40137A470889J0511498N942537p671231j8962910j5387225l648915k13441m380987
40129c2339785m5352J5904388K6772691K1483741R331016L412260M008450M658973
40121E3186382K178858m831832j5743060k1796196j2649980O366123J6278314
40114B2988609Q780728m362201j0961094j2561047j2452977o185714N377546R084122
40106b92028p29948q720678j91488J4955485J6866479N341137l573585m356781
40098A9298593n867280j0793061j0350381j343005P521003R808922Q883372Q296345
40090B5454508O351859K870717N10444k579418j0318503j7440339j3306157R635
$$ plain form
40082 -8447254 -1805055 -2639485 -13220560 -22890641 -24205201 -19663646 -12589807 -2175245
40074 -2175245 9955935 17727908 19270240 20281649 24791110 29260270 30274605 31509685
40066 31509685 36737250 40571547 33697167 15943413 -2083340 -10833683 -10723092 -8291450
40058 -8291450 -7480196 -7404433 -7024987 -8625990 -14828629 -22870061 -24594714 -14648362 1802502
40049 1802502 12417648 10226552 1307512 -1868499 5689700 15902539 16308201 3099567
40041 3099567 -15773877 -29752836 -35126592 -34141667 -28313175 -17755403 -6455325 -1735128
40033 -1735128 -5423242 -10122881 -8256072 -1436461 3373103 3852989 3126333 2574318 -170957
40024 -170957 -6024261 -11782914 -12970474 -6465093 7946764 24625846 33252730 28817492
$$ packed form
40082h447254O642199q34430j0581075r670081j314560M541555P073839J0414562
40074b175245J2131180P771973J542332J011409M509461M469160J014335J235080
40066C1509685N227565L834297o874380j7753754j8026753q750343J10591K431642
40058h291450Q11254P5763L79446j601003o202639q041432j724653R946352J6450864
40049A802502J0615146k191096q919040l176011P558199J0212839M05662j3208634
40041C099567j8873444j3978959n373756R84925N828492J0557772J1300078M720197
40033a735128l688114m699639J866809O819611M809564M79886p26656n52015k745275
40024a70957n853304n758653j187560O505381J4411857J6679082Q626884m435238
$$ plain form
40016 28817492 18630035 12895450 10525656 3008623 -9031553 -14799015 -10829812 -7069823
40008 -7069823 -9869662 -10839994 -1664284 10436882 14324894 14326875 23055226 38280180
40000 38280180 42950456 30069375 13430251 8108539 11204926 9194178 -3387157 -20233719
39992 -20233719 -33167915 -38707639 -37754015 -34483793 -33551019 -34023037 -28613911 -13721525
39984 -13721525 1994707 5070254 -6442296 -19221929 -19613978 -9277268 -2416015 -7891230
39976 -7891230 -18231186 -19893319 -11984464 -7459480 -13500300 -19237477 -11025105 6172065
39968 6172065 14749633 9868689 4954651 9363569 14909709 11744778 4707587 2834952
39960 2834952 2724316 -4029266 -13468471 -14071284 -5710466 413543 -380504 -2478457 -4317193
$$ packed form
40016B8817492j0187457n734585k369794p517033j2040176n767462L969203L759989
40008g069823k799839r70332R175710J2101166L888012J981Q728351J5224954
40000C8280180M670276j2881081j6639124n321712L096387k010748j2581335j6846562
39992b0233719j2934196n539724R53624L270222R32774m72018N409126J4892386
39984a3721525J5716232L075547j1512550j2779633l92049J0336710O861253n475215
39976g891230j0339956j662133P908855M524984o040820n737177Q212372J7197170
39968F172065Q577568m880944m914038M408918N546140l164931p037191j872635
39960B834952j10636o753582r439205o02813Q360818O124009p94047k097953j838736
$$ plain form
39951 -4317193 -11742732 -23889882 -29945670 -25845625 -21492921 -23964023 -25489639 -17974373
39943 -17974373 -9245583 -12311549 -24666171 -30988620 -23957486 -11608687 -4721687 -5790278
39935 -5790278 -10557071 -13156589 -9246154 640019 11191334 19310246 27775861 37418150
39927 37418150 41257191 34590088 26284114 29270385 41624549 47962287 39568494 22848465
39919 22848465 7635809 -1513257 -903520 12523028 31758653 41134216 34232497 21771427
39911 21771427 15069701 10640954 -454853 -16043234 -25959085 -26229200 -19834749 -7566364
39903 -7566364 10740694 27984902 34388311 31274871 30361172 36790681 41374451 33634593
39895 33634593 15937843 -79776 -6729859 -5333754 -765783 4547578 10942539 17779489
$$ packed form
39951d317193p425539j2147150o055788M100045M352704k471102j525616P515266
39943a7974373Q728790l065966j2354622o322449P031134J2348799O887000j068591
39935e790278m766793k599518L910435R886173J0551315Q118912Q465615R642289
39927C7418150L839041o667103q305974K986271J2354164O337738q393793j6720029
39919B2848465j5212656r149066O09737J3426548J9235625R375563o901719j2461070
39911B1771427o701726m428747j1095807j5588381r915851k70115O394451J2268385
39903g566364J8307058J7244208O403409l113440r13699O429509M583770p739858
39895C3634593j7696750j6017619o650083J396105M567971N313361O394961O836950
$$ plain form
39887 17779489 20830470 15361291 2877264 -8089558 -11224563 -10136571 -12383381 -17787883
39879 -17787883 -18805887 -12177753 -3546045 863719 666963 -3065589 -11791861 -24076770
39871 -24076770 -31523118 -27084209 -15009389 -5728984 -1700632 4343264 15425777 22044201
39863 22044201 13788078 -4602125 -16533228 -13519181 -4986286 -4522697 -12039617 -16490761
39855 -16490761 -13403870 -10388860 -13503382 -17114448 -13441290 -6288494 -7069887 -19031971
39847 -19031971 -32643978 -36955142 -30130517 -18302516 -8810797 -5358512 -5827695 -4368514
39839 -4368514 946432 3481985 -3997575 -17452222 -24376211 -19751632 -12436634 -12863191
39831 -12863191 -20834020 -29697707 -36493800 -41719313 -43391518 -38818526 -30517078 -23377090
$$ packed form
39887A7779489L050981n469179j2484027j0966822l135005J087992k246810n404502
39879a7787883j018004O628134Q631708M409764j96756l732552q726272j2284909
39871b4076770p446348M438909J2074820R280405M028352O043896J1082513O618424
39863B2044201q256123j8390203j1931103L014047Q532895M63589p516920m451144
39855a6490761L086891L015010l114522l611066L673158P152796p81393j1962084
39847a9031971j3612007m311164O824625J1828001R491719L452285m69183J459181
39839d368514N314946K535553p479560j3454647o923989M624579P314998m26557
39831a2863191p970829q863687o796093n225513j672205M572992Q301448P139988
$$ plain form
39823 -23377090 -16193907 -2817235 16760257 32758849 36845090 32627990 29757619 29768322
39815 29768322 24335900 9151410 -6409099 -9097320 915877 9298542 5433708 -5127854
39807 -5127854 -9950654 -6248377 -1763864 -2038805 -4563201 -5807225 -6855544 -9355942
39799 -9355942 -11056758 -8890140 -3606230 1159371 2688473 1382136 1409723 8448491
39791 8448491 22776717 35152950 34987043 23149315 10959102 5702163 3956739 897676
39783 897676 -2069896 -3132451 -5660432 -11711680 -16126778 -13953070 -8710174 -6369320
39775 -6369320 -5984731 -4111909 -4126719 -11648690 -22830631 -26801276 -19914684 -9437362
39767 -9437362 -2285645 2510005 8614458 16131480 22719105 26242251 24682821 16868062
$$ packed form
39823b3377090P183183J3376672J9577492J5998592M086241m217100k870371J0703
39815B9768322n432422j5184490j5560509k688221J0013197Q382665l864834j0561562
39807e127854m822800L702277M484513k74941k524396j244024j048319k500398
39799i355942j700816K166618N283910M765601J529102j306337K7587P038768
39791H448491J4328226J2376233j65907j1837728j2190213n256939j745424l059063
39783H97676k967572j062555k527981o051248m415098K173708N242896K340854
39775f369320L84589J872822j4810p521971j1181941l970645O886592J0477322
39767i437362P151717M795650O104453P517022O587625L523146j559430p814759
$$ plain form
39759 16868062 3874039 -12524924 -30694132 -45380338 -48108486 -38278726 -29404777
39752 -29404777 -34224883 -45817930 -45109148 -27160411 -7385379 904864 1806420 3857276
39744 3857276 4877762 259538 -3151241 5238181 22074605 32064732 27462837 16353217
39736 16353217 10402254 11712586 14231710 13251729 10403595 10533325 14565574 16112555
39728 16112555 7920708 -7534364 -18257678 -16288163 -6793688 -40000 973672 -495504
39720 -495504 -3870934 -11240285 -19733018 -21845804 -15184347 -6525506 -3774817 -7130112
39712 -7130112 -10174995 -7851455 -1925962 1119491 -2316368 -8049686 -9041537 -4996718
39704 -4996718 -2845969 -6609704 -12264159 -15409662 -17784909 -21382285 -22354877 -17665137
$$ packed form
39759A6868062j2994023j6398963j8169208j4686206k728148R829760Q873949
39752b9404777m820106j1593047P08782J7948737J9775032Q290243R01556K050856
39744C857276J020486m618224l410779Q389422J6836424R990127m601895j1109620
39736A6353217n950963J310332K519124r79981k848134J29730M032249J546981
39728A6112555q191847j5455072j0723314J969515R494475O753688J013672j469176
39720d95504l375430p369351q492733k112786O661457Q658841K750689l355295
39712g130112l044883K323540N925493L045453l435859n733318r91851M044819
39704d996718K150749l763735n654455l145503k375247l597376r72592M689740
$$ plain form
39696 -17665137 -12449162 -12618913 -14961136 -14276356 -15881355 -28280822 -45228635 -49952244
39688 -49952244 -39741631 -31771968 -38274323 -49265912 -49643280 -42319906 -41234875 -48055716
39680 -48055716 -50254957 -40780111 -26759807 -16662559 -9061163 1746339 16149175
39673 16149175 29898752 39918974 45536582 46617949 43318713 36053697 24484235 8835122
39665 8835122 -6627716 -14261041 -9683615 3226423 15529245 21032354 20389852 18190916
39657 18190916 16790596 13529890 4851337 -7366462 -16471568 -19415973 -21012730 -26288876
39649 -26288876 -31522995 -28591517 -17303836 -6825189 -3372255 -2662248 2110606 10118126
39641 10118126 15729955 17913196 20878123 26658770 32465646 35489752 35656278 32782179
$$ packed form
39696a7665137N215975j69751k342223O84780j604999j2399467j6947813m723609
39688d9952244J0210613P969663o502355j0991589l77368P323374J085031o820841
39680d8055716k199241R474846J4020304J0097248P601396J0807502J4402836
39673A6149175J3749577J0020222N617608J081367l299236p265016j1569462j5649113
39665H835122j5462838p633325M577426J2910038J2302822N503109o42502k198936
39657A8190916j400320l260706q678553j2217799r105106k944405j596757n276146
39649b6288876n234119K931478J1287681J0478647L452934P10007M772854Q007520
39641A0118126N611829K183241K964927N780647N806876L024106J66526k874099
$$ plain form
39633 32782179 25353947 14189413 4107101 -863683 -2529199 -6551882 -15629295 -25626772
39625 -25626772 -28581539 -19998871 -4092039 8876442 12097550 8631719 6604271 8925716
39617 8925716 10626126 6032092 -4682048 -16038189 -20696229 -12658668 7457102 28672954
39609 28672954 36723219 28197363 13397473 2728594 -3733320 -9353663 -11412907 -6184259
39601 -6184259 2387181 8390321 13670863 21351555 24214527 13683727 -1296707 -1424481
39593 -1424481 13503792 19661450 2287878 -21924701 -28366648 -17701088 -9405873 -11229381
39585 -11229381 -13915115 -12444259 -12919862 -16398878 -13160250 1095624 16736541 24414686
39577 24414686 26638684 28622903 28355744 24044017 21997827 26778559 30200122 21379248
$$ packed form
39633C2782179p428232j1164534j0082312m970784j665516m022683r077413r997477
39625b5626772k954767Q582668J5906832J2968481L221108l465831k027448K321445
39617H925716J700410m594034j0714140j1356141m658040Q037561K0115770K1215852
39609B8672954Q050265q525856j4799890j0668879o461914n620343k059244N228648
39601f184259Q571440O003140N280542P680692K862972j0530800j4980434j27774
39593a424481J4928273O157658j7373572k4212579o441947J0665560Q295215j823508
39585a1229381k685734J470856m75603l479016L238628J4255874J5640917P678145
39577B4414686K223998J984219k67159m311727k046190M780732L421563q820874
$$ plain form
39569 21379248 4180363 -6203080 -3151981 4625957 7187960 5287180 4805452 6343321
39561 6343321 6252790 4611389 5625189 9505645 9249172 -364989 -12714879 -14019796
39553 -14019796 360853 19345696 29231876 28352254 23111207 14683816 -447581 -18471731
39545 -18471731 -28345827 -26276816 -19872366 -14304005 -5255499 8225349 15180079 7632009
39537 7632009 -4274092 -4841034 4355412 7833779 531268 -5480595 -705411 8386619
39529 8386619 11261821 8412584 7233619 10202670 15121231 21998608 31119492 36823042
39521 36823042 32001019 19546490 12068103 17021317 26866838 28039551 16873598 2143309
39513 2143309 -6778706 -8661767 -6179333 1098285 14415571 29585902 39281069 41506624
$$ packed form
39569B1379248j7198885j0383443L051099P777938K562003j900780m81728J537869
39561F343321r0531j641401J013800L880456k56473r614161j2349890j304917
39553a4019796J4380649J8984843R886180q79622n241047q427391j5131397j8024150
39545a8471731r874096K069011O404450N568361R048506J3480848O954730p548070
39537G632009j1906101n66942R196446L478367p302511o011863M775184R092030
39529H386619K875202k849237j178965K969051M918561O877377R120884N703550
39521C6823042m822023j2454529p478387M953214R845521J172713j1165953j4730289
39513B143309q922015j883061K482434P277618J3317286J5170331R695167K225555
$$ plain form
39505 41506624 40901077 41465701 42934869 44486774 46066507 44925369 37431226 26385520
39497 26385520 19343847 16517947 8547253 -8324335 -23039646 -23485778 -12677693 -2339774
39489 -2339774 3429750 7433765 7607320 -632346 -11797198 -13260496 -2177239 11564580
39481 11564580 20432799 25677254 26708341 17311495 -1519861 -16077296 -15403114 -4623940
39473 -4623940 4091071 6647067 6018720 3372621 -880943 -2200546 2555902 7272108
39465 7272108 2789268 -9690511 -18586569 -16066766 -6966775 -2275890 -6929746 -15373422
39457 -15373422 -18129699 -12150450 -3489567 1607665 5242708 12498180 19968136 18038231
39449 18038231 5143665 -9294512 -18518028 -25439138 -32037654 -32364300 -23588412 -15076019
$$ packed form
39505D1506624o05547N64624J469168J551905J579733j141138p494143j1045706
39497B6385520p041673k825900p970694j6871588j4715311m46132J0808085J0337919
39489b339774N769524M004015J73555q239666j1164852j463298J1083257J3741819
39481A1564580Q868219N244455J031087r396846j8831356j4557435O74182J0779174
39473d623940Q715011K555996o28347k646099m253564j319603M756448M716206
39465G272108m482840j2479779q896058K519803R099991M690885m653856q443676
39457a5373422k756277N979249Q660883N097232L635043P255472P469956j929905
39449A8038231j2894566j4438177r223516o921110o598516l26646Q775888Q512393
$$ plain form
39441 -15076019 -16904933 -25473395 -29596433 -25711626 -18202101 -9638723 -231350 6975491
39433 6975491 9788636 12556421 19539278 26316063 26587470 22976826 20981446 17135354
39425 17135354 5660510 -6745562 -7135762 3636796 11278316 8948084 3573008 -286687
39417 -286687 -7709950 -20307455 -30273558 -33784217 -37171480 -42383083 -38996135 -20310616
39409 -20310616 3157977 16632190 18967428 17588670 13740631 4336171 -7303330 -14181435
39401 -14181435 -15868396 -16511267 -16109330 -13093530 -12106995 -18951358 -29512748 -33307749
39393 -33307749 -27357105 -18081323 -10367040 -3484969 2511329 5422942 6952048 11595984
39385 11595984 17328676 14977851 209146 -19598967 -33491173 -37438250 -34633940 -30095499
$$ packed form
39441a5076019j828914q568462m123038L884807P509525Q563378R407373P206841
39433F975491K813145K767785O982857O776785K71407l610644j995380l846092
39425A7135354j1474844j2406072l90200J0772558P641520k330232n375076l859695
39417b86687p423263j2597505r966103l510659l387263n211603L386948J8685519
39409b0310616K3468593J3474213K335238j378758l848039r404460j1639501o878105
39401a4181435j686961o42871M01937L015800R86535o844363j0561390l795001
39393c3307749N950644R275782P714283O882071N996298K911613J529106M643936
39385A1595984N732692k350825j4768705j9808113j3892206l947077K804310M538441
$$ plain form
39377 -30095499 -27540483 -27418416 -25207086 -15215514 915262 12466498 10014016 -3741949
39369 -3741949 -16614261 -20246510 -18123534 -18910760 -23753143 -24380396 -15745236 -6102756
39361 -6102756 -7928399 -19835862 -26000323 -16516510 -391753 7435491 5183630 2306100
39353 2306100 3482720 4497213 2356810 -255165 -1476236 -2838870 -3406714 1108875
39345 1108875 10015341 14431772 6759714 -10094317 -26185654 -34593409 -35413742 -31842432
39337 -31842432 -25213895 -14280770 991557 15634305 22074622 17647134 7190294
39330 7190294 -3468555 -12985649 -21035051 -24548447 -22433299 -19687520 -20907940 -23850585
39322 -23850585 -25929307 -31855585 -45430125 -57821946 -55663482 -39351939 -21750147
$$ packed form
39377c0095499K555016J22067K211330R991572J6130776J1551236k452482j3755965
39369c741949j2872312l632249K122976p87226m842383o27253Q635160R642480
39361f102756j825643j1907463o164461R483813J6124757P827244k251861k877530
39353B306100J176620J014493k140403k611975j221071j362634n67844M515589
39345A108875Q906466M416431p672058j6854031j6091337q407755q20333L571310
39337c1842432O628537J0933125J5272327J4642748O440317m427488j0456840
39330G190294j0658849r517094q049402l513396K115148K745779j220420k942645
39322b3850585k078722n926278j3574540j2391821K158464J6311543J7601792
$$ plain form
39315 -21750147 -9574705 940188 9443091 7983305 -3155435 -10748575 -7712016 -4371796
39307 -4371796 -11210937 -21736757 -24215707 -21125942 -23128527 -29610586 -29756041 -21061245
39299 -21061245 -13577654 -14476998 -18883821 -18870617 -13997415 -9610746 -8972762 -9244821 -4047117
39290 -4047117 8573661 19929600 17833735 3369347 -6646063 -676962 11190801
39283 11190801 11762512 1652649 -3267762 3473879 11463376 11831776 8921094 8537172
39275 8537172 7140791 1093335 -2669324 4496140 18496004 26859345 25758330 23788228
39267 23788228 27529254 30438684 20601160 -3164942 -27526712 -37904124 -32625932 -21216744
39259 -21216744 -10906044 -670793 10575934 17510049 15801752 10740508 10718109 14802244
$$ packed form
39315b1750147J2175442J0514893Q502903j459786j1138740p593140L036559L340220
39307d371796o839141j0525820k478950L089765k002585o482059j45455Q694796
39299b1061245P483591q99344m406823J3204M873202M386669O37984k72059N197704
39290d047117J2620778J1355939k095865j4464388j0015410N969101J1867763
39283A1190801N71711j0109863m920411O741641P989497L68400k910682l83922
39275H537172j396381o047456l762659P165464J3999864Q363341j101015j970102
39267B3788228L741026K909430r837524k3766102k4361770j0377412N278192J1409188
39259b1216744J0310700J0235251J1246727O934115j708297n061244k2399M084135
$$ plain form
39251 14802244 14894948 9091544 4308366 4872057 6750804 5555736 2979509 1697041
39243 1697041 -83376 -4625610 -9549783 -10924185 -8893624 -7265749 -9208408 -14607486
39235 -14607486 -19704763 -19523485 -13709198 -8959505 -11033005 -15446411 -12674632 -2718015
39227 -2718015 3379879 -1209840 -10217159 -15033268 -17457555 -25071498 -37722582 -45445013
39219 -45445013 -39853488 -24094726 -10601769 -9004386 -15825958 -18429049 -11436949 -4584908
39211 -4584908 -8107606 -15406009 -11313739 4510987 16210512 15333115 11156213 12257293
39203 12257293 12405401 3801069 -8397414 -15906455 -20618000 -25588473 -22982241 -6307639
39195 -6307639 12698402 16185378 5349122 -2601443 -431754 2655004 702329 373220
$$ packed form
39251A4802244R2704n803404m783178N63691J878747j195068k576227j282468
39243A697041j780417m542234m924173j374402K030561J627875j942659n399078
39235a4607486n097277J81278N814287M749693k073500m413406K771779R956617
39227b718015O097894m589719r007319m816109k424287p613943j2651084p722431
39219d5445013N591525J5758762J3492957J597383o821572k603091O992100O852041
39211d584908l522698p298403M092270J5824726J1699525q77397m176902J101080
39203A2257293J48108q604332j2198483p509041m711545m970473K606232J6674602
39195f307639J9006041L486976j0836256p950565K169689L086758j952675l29109
$$ plain form
39187 373220 6631591 13340754 14222157 12195454 11866506 11464534 7329567 -667107 -11266374
39178 -11266374 -22107150 -26414901 -18474633 -4192522 4035307 5396818 12005575 28246175
39170 28246175 41554676 40811287 32111032 26988492 25079207 19228085 9882117 3166491
39162 3166491 380413 -380010 2402454 8422410 9233597 -1120625 -13239781 -12706248
39154 -12706248 -1161795 5853239 2180207 -723378 8031219 23199224 31180140 25857194
39146 25857194 12080354 -1048089 -6739793 -4932277 -2654021 -5990190 -10998808 -8269724
39138 -8269724 2660280 10937066 9632046 6210869 12128921 26738837 37875989 36306028
39130 36306028 24243256 10273252 388458 -5094513 -8738416 -12363464 -16234241 -20434522
$$ packed form
39187C73220O258371O709163Q81403k026703l28948m01972m134967p996674j0599267
39178a1266374j0840776m307751P940268J4282111Q227829J361511O608757J6240600
39170B8246175J3308501p43389q700255n122540j909285n851122r345968o715626
39162C166491k786078p60423K782464O019956Q11187j0354222j2119156N33533
39154a2706248J1544453P015034l673032k903585Q754597J5168005P980916n322946
39146B5857194j3776840j3128443n691704J807516K278256l336169n008618K729084
39138h269724J0930004Q276786j305020l421177N918052J4609916J1137152j569961
39130C6306028j2062772j3970004r884794n482971l643903l625048l870777m200281
$$ plain form
39122 -20434522 -24716773 -26359115 -21553297 -11986031 -6868289 -13017598 -24447688 -28212118
39114 -28212118 -20655969 -11018926 -7315343 -5908551 753973 11886419 19559520 18739237
39106 18739237 10767734 -1014287 -13774741 -23834579 -27438544 -24216835 -17732201 -11679068
39098 -11679068 -6468737 -139799 7293866 11077390 5806052 -6244219 -14656892 -13389468
39090 -13389468 -10556637 -18253129 -33931809 -41365546 -31605945 -13240266 1199199 8060475
39082 8060475 6598067 -6707630 -26814643 -34227417 -16453207 10572711 19448436 7180901
39074 7180901 -3572914 467882 6509967 167625 -11764402 -14878165 -9601981 -5807648
39066 -5807648 -4594653 -475394 4258207 2142627 -5628155 -11728959 -17039555 -28045156
$$ packed form
39122b0434522m282251j642342M805818R567266N117742o149309j1430090l764430
39114b8212118P556149R637043L703583J406792O662524J1132446P673101q20283
39106A8739237p971503j1782021j2760454j0059838l603965L221709O484634O053133
39098a1679068N210331O328938P433665L783524n271338j2050271q412673J267424
39090a3389468K832831p696492j5678680p433737R759601J8365679J4439465O861276
39082H060475j462408j3305697k0107013p412774J7774210K7025918Q875725j2267535
39074G180901j0753815M040796O042085o342342j1932027l113763N276184L794333
39066e807648J212995M119259M733601k115580p770782o100804n310596j1005601
$$ plain form
39058 -28045156 -39719193 -36433729 -14827660 7227201 12199466 3958975 -840640 5060987
39050 5060987 15078079 21665152 24036831 24029255 21882488 17699075 13096712 9968185
39042 9968185 8500651 5673580 -3955714 -22358066 -42152523 -51680076 -48258977 -41024980
39034 -41024980 -37720243 -35668669 -31123680 -29587827 -37123007 -46705040 -45317453 -32925912
39026 -32925912 -22067329 -17863603 -11554658 1826300 12063555 8579205 -2900773
39019 -2900773 -9047467 -7829495 -7073669 -7723126 -1395369 14187109 28301067 30147109
39011 30147109 21355084 11202555 5023288 1911815 -437887 -3444645 -7572355 -10900710
39003 -10900710 -10175883 -6097826 -4094800 -6187160 -6170037 1395225 10578073 10121176 -747512
$$ packed form
39058b8045156j1674037L285464K1606069K2054861M972265q240491m799615N901627
39050E060987J0017092O587073K371679p576k146767m183413m602363l128527
39042I968185j467534k827071r629294j8402352j9794457r527553L421099P233997
39034d1024980L304737K051574M544989J535853p535180r582033J387587J2391541
39026c2925912J0858583M203726O308945J3380958J0237255l484350j1479978
39019b900773o146694J217972P55826o49457O327757J5582478J4113958J846042
39011C0147109q792025j0152529o179267l111473k349702l006758m127710l328355
39003a0900710P24827M078057K003026k092360J7123P565262R182848m56897j0868688
$$ plain form
38994 -747512 -10759398 -12203873 -9603218 -8934163 -6599096 3130742 15289356 18744548
38986 18744548 11795327 3606698 -449827 -4939880 -12382894 -14891126 -5659512 7532873
38978 7532873 10435242 2056517 -3522381 3221623 14057642 13968058 -65764 -16753581
38970 -16753581 -24198966 -20433695 -10929587 -894082 7618905 13526891 14997585 11090223
38962 11090223 4718910 2606085 10011000 23999118 33178562 26986678 6491642 -15281965
38954 -15281965 -24988431 -20348174 -9480205 -860235 3454024 5442020 6085605 4776736
38946 4776736 1233664 -4560069 -12691301 -21161764 -25253560 -22342127 -16039659 -11933964
38938 -11933964 -10367631 -7612023 -2929780 1166038 5323873 13189467 23529909 29506655
$$ packed form
38994g47512j0011886j444475K600655O69055K335067R729838J2158614L455192
38986A8744548o949221q188629m056525m490053p443014k508232R231614J3192385
38978G532873K902369q378725n578898O744004J0836019q9584j4033822j6687817
38970a6753581p445385L765271R504108J0035505Q512987N907986J470694l907362
38962A1090223o371313k112825P404915J3988118R179444o191884k0495036k1773607
38954a5281965r706466M640257J0867969Q619970M314259J987996O43585j308869
38946D776736l543072n793733q131232q470463m091796K911433O302468M105695
38938a1933964J566333K755608M682243M095818M157835P865594J0340442N976746
$$ plain form
38930 29506655 28195439 23617565 17321025 4862252 -12620859 -22683746 -16869085 -4561391
38922 -4561391 -477435 -4066723 -4431715 -1597735 -6545943 -19483776 -25115110 -15769103
38914 -15769103 -5033279 -8648094 -21834932 -26287152 -13654982 7389993 23651176
38907 23651176 28983446 25879061 21767044 22202832 24556216 22087682 16301104 18002439
38899 18002439 31348520 44691392 44588788 32234023 17735080 4545630 -10174465
38892 -10174465 -24496227 -32468671 -33717874 -31776647 -24349243 -6044725 19063217 37700467
38884 37700467 41707052 34267497 22130742 10372568 4273663 5828456 7301446 -1073160
38876 -1073160 -15092564 -19579829 -10395823 -1047985 -1709676 -4317923 2090703 12078047
$$ packed form
38930B9506655j311216m577874o296540j2458773j7483111j0062887N814661J2307694
38922d561391M083956l589288l64992K833980m948208j2937833n631334R346007
38914a5769103J0735824l614815j3186838m452220J2632170K1044975J6261183
38907B3651176N332270l104385m112017M35788K353384k468534n786578J701335
38899A8002439J3346081J3342872j02604j2354765j4498943j3189450j4720095
38892a0174465j4321762p972444j249203J941227P427404J8304518K5107942J8637250
38884C7700467M006585p439555j2136755j1758174o098905J554793J472990q374606
38876a073160j4019404m487265R184006R347838o61691k608247O408626R987344
$$ plain form
38868 12078047 12555313 4055048 -392230 4930577 12187771 13628748 10409274 5791711
38860 5791711 -579263 -7358005 -8213136 149717 11094500 14695115 8920711 -328300
38852 -328300 -8530257 -16708802 -26181096 -34304427 -38314899 -40200546 -43646929 -47285312
38844 -47285312 -45333671 -35454039 -22093098 -10995954 -4438810 -2995686 -6194320 -8232719
38836 -8232719 39890 18146097 30662897 24261974 6589281 -2865434 680910 2871752
38828 2871752 -5538756 -14020943 -9518792 2805146 7357363 364678 -7160678 -6286825
38820 -6286825 105713 4453082 3075204 -3760081 -13756022 -22233231 -24404851 -20451593
38812 -20451593 -15797824 -14967572 -16927820 -17040694 -12036238 -2793547 6595323 12378933
$$ packed form
38868A2078047M77266q500265m447278N322807P257194J440977l219474m617563
38860E791711o370974o778742q55131Q362853J0944783L600615n774404r249011
38852c28300q201957q178545r472294q123331m010472j885647l446383l638383
38844d7285312J951641R879632J3360941J1097144O557144J443124l198634k038399
38836h232719Q272609J8106207J2516800o400923j7672693r454715L546344K190842
38828B871752q410508q482187M502151J2323938M552217o992685p525356Q73853
38820f286825O392538M347369j377878o835285r995941q477209k171620L953258
38812b0451593M653769Q30252j960248j12874N004456R242691R388870N783610
$$ plain form
38804 12378933 14098133 13344176 9913560 1545575 -11704565 -25210122 -33383376 -34124797
38796 -34124797 -29206005 -22159666 -16016547 -11081607 -5359163 665996 1907263 -4423002
38788 -4423002 -12630886 -16063887 -18204286 -26232853 -34322172 -26711412 -1328888 23072276
38780 23072276 31011252 29210393 31005832 33295480 23770370 3789321 -12484022 -19331466
38772 -19331466 -24751186 -34358132 -43808197 -49419873 -54067239 -58711397 -58170974 -49528399
38764 -49528399 -36640132 -23052218 -8454524 4410901 7480777 -2788961 -18987207
38757 -18987207 -30745095 -35121919 -35854961 -36145252 -35235352 -29961727 -18779029 -6073669
38749 -6073669 -490337 -5106009 -12343011 -14325487 -14183971 -18595520 -23377463 -19162185
$$ packed form
38804A2378933J719200p53957l430616q367985j3250140j3505557q173254p41421
38796c4124797M918792P046339O143119M934940N722444O025159J241267o330265
38788d423002q207884l433001k140399q028567q089319P610760K5382524K4401164
38780B3072276P938976j800859J795439K289648r525110j9981049j6273343o847444
38772a9331466n419720r606946r450065n611676m647366m644158N40423Q642575
38764d9528399J2888267J3587914J4597694J2865425L069876j0269738j6198246
38757a8987207j1757888m376824p33042k90291R09900N273625J1182698J2705360
38749f073669N583332m615672p237002j982476J41516m411549m781943M215278
$$ plain form
38741 -19162185 -10030857 -11157557 -24434311 -31466913 -18726260 2708687 12858011
38734 12858011 8946248 4101701 5845567 8166041 4140743 -2858191 -2928244 8767861
38726 8767861 24603536 28995887 14249430 -8211019 -19396838 -16794455 -17494666 -33290480
38718 -33290480 -53069641 -58049187 -46292669 -32278858 -27639987 -31867511 -38183253 -39724845
38710 -39724845 -32712072 -20966047 -14293216 -16271404 -18676779 -14709283 -10228219 -11860038
$$ packed form
38741a9162185R131328j126700j3276754p032602J2740653K1434947J0149324
38734A2858011l911763m844547J743866K320474m025298o998934p0053J1696105
38726H767861J5835675M392351j4746457k2460449j1185819K602383p00211j5795814
38718c3290480j9779161m979546J1756518J4013811M638871m227524o315742j541592
38710c9724845P012773J1746025O672831j978188k405375L967496M481064j631819
$$ [...]
##END NTUPLES=NMR SPECTRUM
##END=
