##TITLE=31Pdec_LR-689-C1
 CDCl3, 88 sc
 18.11.2019
##JCAMPDX= 6.0         $$ Bruker NMR JCAMP-DX V2.0
##DATA TYPE= NMR SPECTRUM
##DATA CLASS= NTUPLES
##ORIGIN= UXNMR, Bruker Analytische Messtechnik GmbH
##OWNER= root
$$ XWIN-NMR		Version 3.5
$$ Mon Nov 18 14:50:12 2019 Russian Standard Time (UT+4h)  she@DPX200
##.OBSERVE FREQUENCY= 81.013821
##.OBSERVE NUCLEUS= ^31P
##.ACQUISITION MODE= SIMULTANEOUS
##.ACQUISITION SCHEME= undefined
##.AVERAGES= 24
##.DIGITISER RES= 17
##SPECTROMETER/DATA SYSTEM= spect
##.PULSE SEQUENCE= zgpg30
##.SOLVENT NAME= MeOD
##.SHIFT REFERENCE= (INTERNAL, MeOD, 0, 182.463)
##AUDIT TRAIL= $$ (NUMBER, WHEN, WHO, WHERE, WHAT)
$$ ##TITLE= Audit trail, XWIN-NMR		Version 3.5
$$ ##JCAMPDX= 5.01
$$ ##ORIGIN= Bruker BioSpin GmbH
$$ ##OWNER= she
$$ F:/spectra/data/she/nmr/P31/1/pdata/1/auditp.txt
$$ ##AUDIT TRAIL=  $$ (NUMBER, WHEN, WHO, WHERE, WHAT)
(   1,<2019-11-18 14:49:27.62 +0400>,<she>,<DPX200>,
      <created by zg, POWCHK disabled, PULCHK disabled
       configuration hash MD5:
       00 E9 B6 7A A2 85 ED C7 34 08 36 98 17 FE 4E 26
       data hash MD5: 32K
       68 3F C4 A4 4C 4C 6C 4E 2A CD D0 41 E9 5C 17 31>)
(   2,<2019-11-18 14:49:30.03 +0400>,<she>,<DPX200>,
      <Start of raw data processing
       efp BC_mod = 2 LB = 1 FT_mod = 6 PKNL = 1 PHC0 = -1356.878 PHC1 = 518.801 SI = 64K 
       data hash MD5: 64K
       88 04 6E 84 A8 64 08 08 6C C1 F0 A6 ED 38 6E C0>)
(   3,<2019-11-18 14:49:44.81 +0400>,<she>,<DPX200>,
      <pk PHC0 = -96.0993 PHC1 = 0 
       data hash MD5: 64K
       C4 24 01 DF 63 34 59 2B E4 9F 7B 36 06 67 51 9E>)
(   4,<2019-11-18 14:49:48.26 +0400>,<she>,<DPX200>,
      <abs ABSG = 5 
       data hash MD5: 64K
       25 97 20 C5 35 35 F5 FD 19 12 0E 32 B2 5B 78 22>)
$$ ##END=
$$ 
$$ hash MD5
$$ BC B6 4B C3 8D C7 93 DC 3C 3C 4A 02 4D 4A 06 2F
##$RELAX= 
##$RELAX= 
##$RELAX= 
##$RELAX= 
##$RELAX= 
##$RELAX= 
##$RELAX= 
##$RELAX= 
$$ Bruker specific parameters
$$ --------------------------
##$DU= <F:/spectra>
##$EXPNO= 1
##$NAME= <P31>
##$PROCNO= 1
##$TYPE= <nmr>
##$USER= <she>
##$AMP= (0..31)
100 100 100 100 100 100 100 100 100 100 100 100 100 100 100 100 100 100 
100 100 100 100 100 100 100 100 100 100 100 100 100 100 
##$AQSEQ= 0
##$AQ_mod= 1
##$AUNM= <au_zg>
##$AUTOPOS= <>
##$BF1= 81.014009
##$BF2= 200.13
##$BF3= 200.13
##$BF4= 200.13
##$BF5= 200.13
##$BF6= 200.13
##$BF7= 200.13
##$BF8= 200.13
##$BYTORDA= 1
##$CFDGTYP= 0
##$CFRGTYP= 5
##$CHEMSTR= <none>
##$CNST= (0..31)
1 1 145 1 1 1 1 1 1 1 1 1 1 1 1 1 1 1 1 1 1 1 1 1 1 1 1 1 1 1 1 1 
##$CPDPRG= <waltz16>
##$CPDPRG1= <>
##$CPDPRG2= <waltz16>
##$CPDPRG3= <>
##$CPDPRG4= <mlev>
##$CPDPRG5= <mlev>
##$CPDPRG6= <mlev>
##$CPDPRG7= <mlev>
##$CPDPRG8= <mlev>
##$CPDPRGB= <>
##$CPDPRGT= <>
##$D= (0..31)
0 1 0 0 0 0 0 0 0 0 0 0.03 2e-05 3e-06 0 0 0 0 0 0 0 0 0 0 0 0 0 0 0 0 
0 0 
##$DATE= 1574074167
##$DBL= (0..7)
120 120 120 11 120 120 24 19 
##$DBP= (0..7)
150 150 150 150 150 150 150 150 
##$DBP07= 0
##$DBPNAM0= <>
##$DBPNAM1= <>
##$DBPNAM2= <>
$$ [...]
##$SUBNAM3= <"">
##$SUBNAM4= <"">
##$SUBNAM5= <"">
##$SUBNAM6= <"">
##$SUBNAM7= <"">
##$SUBNAM8= <"">
##$SUBNAM9= <"">
##$SW= 369.568048894756
##$SWIBOX= (0..15)
0 1 3 0 0 0 0 0 0 0 0 0 0 0 0 0 
##$SW_h= 29940.119760479
##$TD= 32768
##$TD0= 1
##$TE= 0
##$TE2= 300
##$TE3= 300
##$TEG= 300
##$TL= (0..7)
0 120 53 12 22 120 120 120 
##$TP= (0..7)
150 150 150 150 150 150 150 150 
##$TP07= 0
##$TPNAME0= <>
##$TPNAME1= <>
##$TPNAME2= <>
##$TPNAME3= <>
##$TPNAME4= <>
##$TPNAME5= <>
##$TPNAME6= <>
##$TPNAME7= <>
##$TPOAL= (0..7)
0.5 0.5 0.5 0.5 0.5 0.5 0.5 0.5 
##$TPOFFS= (0..7)
0 0 0 0 0 0 0 0 
##$TUNHIN= 0
##$TUNHOUT= 0
##$TUNXOUT= 0
##$USERA1= <user>
##$USERA2= <user>
##$USERA3= <user>
##$USERA4= <user>
##$USERA5= <user>
##$V9= 5
##$VALIST= <valist>
##$VCLIST= <CCCCCCCCCCCCCCC>
##$VD= 0
##$VDLIST= <DDDDDDDDDDDDDDD>
##$VPLIST= <PPPPPPPPPPPPPPP>
##$VTLIST= <TTTTTTTTTTTTTTT>
##$WBST= 1024
##$WBSW= 4
##$XGAIN= (0..3)
0 0 0 0 
##$XL= 0
##$YL= 0
##$YMAX_a= 9139
##$YMIN_a= -7566
##$ZGOPTNS= <>
##$ZL1= 120
##$ZL2= 120
##$ZL3= 120
##$ZL4= 120
##$ABSF1= 182.463
##$ABSF2= -187.1042
##$ABSG= 5
##$ABSL= 3
##$ALPHA= 0
##$AQORDER= 0
##$ASSFAC= 0
##$ASSFACI= 0
##$ASSFACX= 0
##$ASSWID= 0
##$AUNMP= <proc_1d>
##$AZFE= 0.1
##$AZFW= 0.5
##$BCFW= 0
##$BC_mod= 2
##$BYTORDP= 0
##$COROFFS= 0
##$CY= -3
##$DATMOD= 1
##$DC= 0
##$DFILT= <>
##$DTYPP= 0
##$F1P= 0
##$F2P= 0
##$FCOR= 1
##$FTSIZE= 65536
##$FT_mod= 6
##$GAMMA= 0
##$GB= 0
##$INTBC= 1
##$INTSCL= 5.30512e-09
##$ISEN= 30
##$LB= 1
##$LEV0= 0
##$LPBIN= 0
##$MAXI= 10000
##$MC2= 0
##$MEAN= 0
##$ME_mod= 0
##$MI= 50
##$NCOEF= 0
##$NC_proc= -8
##$NLEV= 6
##$NOISF1= 182.463
##$NOISF2= 159.3651
##$NSP= 0
##$NTH_PI= 0
##$NZP= 0
##$OFFSET= 182.463
##$PC= 4
##$PHC0= -1452.977
##$PHC1= 518.801
##$PH_mod= 1
##$PKNL= yes
##$PPARMOD= 0
##$PSCAL= 0
##$PSIGN= 0
##$REVERSE= no
##$SF= 81.0140089999434
##$SI= 65536
##$SIGF1= 159.3651
##$SIGF2= -187.1042
##$SINO= 113.3802
##$SIOLD= 16384
##$SREGLST= <1H.CDCl3>
##$SSB= 0
##$STSI= 65536
##$STSR= 0
##$SW_p= 29940.119760479
##$SYMM= 0
##$S_DEV= 0
##$TDeff= 32768
##$TDoff= 0
##$TI= <>
##$TILT= no
##$TM1= 0
##$TM2= 0
##$TOPLEV= 0
##$USERP1= <user>
##$USERP2= <user>
##$USERP3= <user>
##$USERP4= <user>
##$USERP5= <user>
##$WDW= 1
##$XDIM= 65536
##$YMAX_p= 524610351
##$YMIN_p= -68106959
$$ End of Bruker specific parameters
$$ ---------------------------------
##NTUPLES= NMR SPECTRUM
##VAR_NAME=  FREQUENCY,     SPECTRUM/REAL,   SPECTRUM/IMAG
##SYMBOL=    X,             R,               I
##VAR_TYPE=  INDEPENDENT,   DEPENDENT,       DEPENDENT
##VAR_FORM=  AFFN,          ASDF,            ASDF
##VAR_DIM=   65536,         65536,           65536
##UNITS=     HZ,            ARBITRARY UNITS, ARBITRARY UNITS
##FACTOR=    0.456856943014862, 1,           1
##FIRST=     14782.0589164792, 0,            0
##LAST=      -15158.0608439998, 0,           0
##MIN=       -15158.0608439998, -68106959,   0
##MAX=       14782.0589164792, 524610351,    0
$$ Real data points
##PAGE= N=1
##DATA TABLE= (X++(R..R)), XYDATA
$$ [...]
$$ plain form
46283 6072605 16408632 13055262 -575120 -10455073 -9464514 -3313328 80050 708109
46275 708109 3315920 8358946 10858424 7558354 1262019 -3047335 -3623247 -1859972
46267 -1859972 767009 2995180 2641583 -1317179 -5863447 -6645420 -3974020 -2474936
46259 -2474936 -3738885 -3605956 657331 4704706 3129466 -1775326 -2920075 1060098
46251 1060098 4089357 1932767 -2453480 -4796694 -5837298 -8620944 -12940685 -15974073
46243 -15974073 -16426479 -15191607 -13314913 -11385425 -9505149 -6375772 -412389 6833977
46235 6833977 11060035 10889845 10041213 11240193 11481289 7261848 1460615 -202202 2206097
46226 2206097 3350213 1199457 -650079 9020 27034 -3861445 -9793070 -13296105 -12460965
$$ packed form
46283F072605J0336027l353370j3630382r879953R90559O151186L393378O28059
46275G08109K607811N043026K499478l300070o296335m309354n75912J763275
46267a859972K626981K228171l53597l958762m546268p81973K671400J499084
46259b474936j263949J32929M263287M047375j575240m904792j144749L980173
46251A060098L029259k156590m386247k343214j040604k783646m319741l033388
46243a5974073m52406J234872J876694J929488J880276L129377N963383P246366
46235F833977M226058j70190q48632J198980K41096m219441n801233j662817K408299
46226B206097J144116k150756j849536O59099J8014l888479n931625l503035Q35140
$$ plain form
46217 -12460965 -8744687 -4809960 -2939681 -3553200 -4369651 -3184190 -1829553 -4350465
46209 -4350465 -10512037 -14755656 -13287624 -8831907 -6241751 -6665021 -8640903 -11765308
46201 -11765308 -15789180 -18435328 -17747131 -14925606 -11532732 -5913449 3353691 11915485
46193 11915485 12904541 6178128 -587453 -1666765 130174 -817970 -4550022 -7079173
46185 -7079173 -8033232 -11243727 -17144569 -19604497 -13640657 -3514173 1196112 -2885665
46177 -2885665 -9424197 -11274012 -8797462 -6592085 -5327890 -1603097 5041082 9814329
46169 9814329 8520354 2304497 -4854694 -10593857 -14406060 -15758188 -14199216 -10466454
46161 -10466454 -6265227 -3403356 -2940759 -3817361 -3008101 575419 3077029 8773
$$ packed form
46217a2460965L716278L934727J870279o13519q16451J185461J354637k520912
46209d350465o161572m243619J468032M455717K590156m23270j975882l124405
46201a1765308m023872k646148O88197K821525L392874N619283R267140Q561794
46193A1915485R89056o726413o765581j079312J796939r48144l732052k529151
46185g079173r54059l210495n900842k459928N963840J0126484M710285m081777
46177b885665o538532j849815K476550K205377J264195L724793O644179M773247
46169I814329j293975o215857p159191n739163l812203j352128J558972L732762
46161a0466454M201227K861871M62597q76602Q09260L583520K501610l068256
$$ plain form
46153 8773 -6869743 -11439721 -12104819 -13093965 -15548074 -14157041 -6400909 1474089 3487829
46144 3487829 3263389 7000364 11736867 9791957 2436334 -1061705 1769668 2779031
46136 2779031 -3238912 -10155190 -10247472 -5002511 -538980 2120426 5900476 10506300
46128 10506300 12512258 10684175 6461101 913618 -4533428 -6314773 -2376187 3525636
46120 3525636 5642370 3780751 2915048 5550891 8644406 8746616 6692691 5898491 8294266
46111 8294266 12901632 16794925 16942123 12457020 5493325 -573068 -3380138 -2044689
46103 -2044689 2340488 5682361 3606166 -2268404 -4151060 1836453 8579052 6651873
46095 6651873 -2126879 -7100816 -4339416 -1436218 -4461043 -8417591 -6144830 -435391
$$ packed form
46153H773o878516m569978o65098r89146k454109J391033P756132P874998K013740
46144C487829k24440L736975M736503j944910p355623l498039K831373J009363
46136B779031o017943o916278r2282N244961M463531K659406L780050M605824
46128A0506300K005958j828083m223074n547483n447046j781345L938586N901823
46120C525636K116734j861619q65703K635843L093515J02210k053925p94200K395775
46111H294266M607366L893293J47198m485103o963695o066393k807070J335449
46103b044689M385177L341873k076195n874570j882656N987513O742599j927179
46095F651873q778752m973937K761400K903198l024825l956548K272761N709439
$$ plain form
46087 -435391 80365 -6137230 -11921006 -11530922 -6164188 394581 5809148 8179081 6289854
46078 6289854 2595132 1800426 4655737 6659336 4610396 973760 -309452 862729
46070 862729 1963678 1457905 -1279583 -6808187 -13438263 -16850139 -15361639 -13240263
46062 -13240263 -14766029 -17166957 -14676982 -8511397 -6471260 -11508454 -16691835 -14560975
46054 -14560975 -6680536 115750 3171669 4701776 5569387 4309405 2039439 2674460
46046 2674460 6556674 8295876 3845083 -3129255 -5284107 -781367 4541549 4148127
46038 4148127 -2255254 -9323589 -12049407 -9957798 -5935013 -2458589 -103140 811111
46030 811111 -698729 -4193266 -6546510 -5568844 -4455742 -9109060 -19669438 -27842645
$$ packed form
46087d35391N15756o217595n783776L90084N366734O558769N414567K369933j889227
46078F289854l694722p94706K855311K003599k048940l636636j283212J172181
46070H62729J100949n05773k737488n528604o630076l411876J488500K121376
46062a3240263j525766k400928K489975O165585K040137n037194n183381K130860
46054a4560975P880439O796286L055919J530107Q67611j259982k269966O35021
46046B674460L882214J739202m450793o974338k154852M502740N322916l93422
46038D148127o403381p068335k725818K091609M022785L476424K355449R14251
46030H11111j509840l494537k353244R77666J113102m653318j0560378q173207
$$ plain form
46022 -27842645 -25633010 -15169271 -6581295 -6465194 -11548772 -14276302 -11575220 -6217663
46014 -6217663 -1614109 1858895 5456799 9092197 10723322 8183993 1332866 -7290588
46006 -7290588 -14034667 -16950212 -17187580 -17200948 -17600364 -16450673 -11925103 -4876410 2004004
45997 2004004 7162942 11173421 14513685 15605887 12415918 5851453 178418 -823821
45989 -823821 2334301 5550616 5271265 1206616 -4584735 -9665255 -11603263 -8083554
45981 -8083554 990815 11326942 16377122 13322467 6126552 1173763 462005 852607
45973 852607 -393159 -2128102 -2418349 -2443579 -4609686 -8110894 -9650945 -8620902 -8307208
45964 -8307208 -10658982 -12633325 -10136336 -3871624 1503263 3161514 2104560 -322528
$$ packed form
46022b7842645K209635J0463739Q587976J16101n083578k727530K701082N357557
46014f217663M603554L473004L597904L635398J631125k539329o851127q623454
46006g290588o744079k915545k37368j3368l99416J149691M525570P048693O880414
45997B004004N158938M010479L340264J092202l189969o564465n673035j002239
45989h23821L158122L216315k79351m064649n791351n080520j938008L519709
45981h083554R074369J0336127N050180l054655p195915m952789p11758L90602
45973H52607j245766j734943k90247k5230k166107l501208j540051J030043L13694
45964h307208k351774j974343K496989O264712N374887J658251j056954k427088
$$ plain form
45956 -322528 -4320290 -8775483 -9828141 -5251654 1475177 4741328 3830462 3130563 5256555
45947 5256555 7613253 7195240 5264052 4349438 3391221 252690 -2120781 2536742 14378288
45938 14378288 24272122 23525330 14291958 6507292 5642199 7578735 6005691 923775
45930 923775 -2673002 -2405644 -1472583 -3713893 -7962053 -9032433 -4081718 3369729 6601303
45921 6601303 2468986 -5756349 -11999705 -12711771 -8780507 -3986617 -2425558 -5853661
45913 -5853661 -12042602 -16602846 -17517599 -16595957 -15206555 -10826379 -901388 11191705
45905 11191705 18145435 16975579 11558921 6231049 1164751 -3871302 -5811312 -2801317
45897 -2801317 540810 -1974885 -8699933 -11296695 -6354550 -564389 -1411608 -6998430
$$ packed form
45956c22528l997762m455193j052658M576487O726831L266151r10866o99899K125992
45947E256555K356698m18013j931188r14614r58217l138531k373471M657523J1841546
45938A4378288R893834p46792r233372p784666q65093J936536j573044n081916
45930I23775l596777K67358R33061k241310m248160j070380M950715P451447L231574
45921F601303m132317q225335o243356p12066L931264M793890J561059l428103
45913e853661o188941m560244r14753R21642J389402M380176R924991J2093093
45905A1191705O953730j169856n416658n327872n066298n036053j940010L009995
45897b801317L342127k515695o725048k596762M942145N790161q47219n586822
$$ plain form
45889 -6998430 -9667652 -7233094 -5013634 -6760721 -9025300 -7009634 -2221542 -597231
45881 -597231 -4744018 -11472089 -16248563 -16928303 -13460842 -7384408 -2044181 118345
45873 118345 1442752 6565626 14441598 17111957 9868487 -1023131 -5662014 -3076684
45865 -3076684 -593416 -1959376 -3111751 -691011 2359681 2947185 3471983 6354228
45857 6354228 7491976 1400565 -9424921 -16332232 -15053090 -9268299 -3794693 630456
45849 630456 4705314 7181946 6371315 2599611 -2034175 -4466808 -1575167 6264879
45841 6264879 12351262 8971314 -2591969 -11548121 -9966812 -2060290 2430131 736078
45833 736078 -2072294 -2650311 -3485029 -6709825 -9399213 -7970958 -3773470 -882497 -303989
$$ packed form
45889f998430k669222K434558K219460j747087k264579K015666M788092J624311
45881e97231m146787o728071m776474o79740L467461O076434N340227K162526
45873A18345J324407N122874P875972K670359p243470j0891618m638883K585330
45865c076684K483268j365960j152375K420740L050692N87504N24798K882245
45857F354228J137748o091411j0825486o907311J279142N784791N473606M425149
45849F30456M074858K476632q10631l771704m633786k432633K891641P840046
45841F264879O086383l379948j1563283q956152J581309P906522M490421j694053
45833G36078k808372n78017q34718l224796k689388J428255M197488K890973N78508
$$ plain form
45824 -303989 279203 1846754 2326614 -222621 -5221885 -10962602 -16094508 -18645465 -15886807
45815 -15886807 -7555240 1858717 6638237 5748100 3282663 2982754 4574588 6056277
45807 6056277 6910026 7365651 6713187 4736071 3206151 3216316 2242120 -2836674 -10221615
45798 -10221615 -14270067 -12557561 -8476574 -5771058 -3959553 -1123289 1991689 3647333
45790 3647333 4579362 6307847 7265998 4268544 -2174379 -6971193 -5499187 2290182
45782 2290182 12726298 21198927 24034918 20251137 12711960 6068451 2467743 92154
45774 92154 -3639993 -8346018 -10534633 -6743595 2739541 12599842 16184992 12202284
45766 12202284 6584911 5418456 7478743 7382264 4922135 5593584 10773899 13596871
$$ packed form
45824c03989N83192J567551M79860k549235m999264n740717n131906k550957K758658
45815a5886807Q331567R413957M779520q90137k465437k99909J591834J481689
45807F056277Q53749M55625o52464j977116j529920J0165r74196n078794p384941
45798a0221615m048452J712506M080987K705516J811505K836264L114978J655644
45790C647333R32029J728485R58151k997454o442923m796814J472006P789369
45782B290182J0436116Q472629K835991l783781p539177o643509l600708k375589
45774I2154l732147m706025k188615L791038R483136R860301L585150l982708
45766A2202284n617373j166455K060287r6479k460129O71449N180315K822972
$$ plain form
45758 13596871 8437127 -356179 -4475761 -3045551 -1909521 -3501115 -4341264 -2813951
45750 -2813951 -2653350 -6278688 -9962151 -9115568 -4773019 -1336122 -444901 -402010 154187
45741 154187 1153194 2544035 4196655 5063124 4398775 2983213 1642820 4481 -1565984
45732 -1565984 -656764 4036230 9648453 12024391 10829019 9263241 9449878 10602069
45724 10602069 11056670 9606253 5580493 316695 -2196363 834572 6960420 11202202
45716 11202202 12074051 11500997 9749475 5367594 468876 470356 6253011 11266037 9768545
45707 9768545 4432787 2164986 5030966 8914817 9160792 4156950 -4853192 -13897348
45699 -13897348 -17517607 -13617095 -6630187 -2904931 -3554720 -4742490 -4083602 -3054928
$$ packed form
45758A3596871n159744q793306m119582J430210J136030j591594q40149J527313
45750b813951J60601l625338l683463Q46583M342549L436897Q91221M2891N56197
45741A54187R99007J390841J652620Q66469o64349j415562j340393j638339j570465
45732a565984R09220M692994N612223K375938j195372j565778J86637J152191
45724A0602069M54601j450417m025760n263798k513058L030935O125848M241782
45716A1202202Q71849n73054j751522m381881m898718J480N782655N013026j497492
45707I768545n335758k267801K865980L883851K45975n003842r010142r044156
45699a3897348l620259L900512O986908L725256o49789j187770O58888J028674
$$ plain form
45691 -3054928 -3032949 -2542203 479006 5988870 12021546 15710046 14389596 8207672 1498513
45682 1498513 -1306846 -1076408 -1903779 -3659913 -1570086 4789134 7385406 -379117
45674 -379117 -12767296 -17032646 -9370323 472762 2340282 -1996447 -3614472 460020
45666 460020 4902027 5448631 3913087 2422729 -999733 -7030198 -10299581 -6372065
45658 -6372065 -619051 -2506362 -11194796 -14702936 -6029442 6670938 10524411 3528561
45650 3528561 -5472710 -8737523 -6092550 -1974447 -1360888 -6923190 -15248317 -17547958
45642 -17547958 -9287606 2465484 6899299 3122786 -592712 -137475 122473 -2647917
45634 -2647917 -4258049 -1802315 85001 -3191893 -8080984 -8471059 -5121713 -3182122
$$ packed form
45691c054928K1979M90746L021209N509864O032676L688500j320450o181924o709159
45682A498513k805359K30438q27371j756134K089827O359220K596272p764523
45674c79117j2388179m265350P662323R843085J867520m336729j618025M074492
45666D60020M442007N46604j535544j490358l422462o030465l269383L927516
45658f372065N753014j887311q688434l508140Q673494J2700380L853473o995850
45650C528561r001271l264813K644973M118103O13559n562302q325127k299641
45642a7547958Q260352J1753090M433815l776513l715498M55237K59948k770390
45634b647917j610132K455734J887316l276894m889091l90075L349346J939591
$$ plain form
45626 -3182122 -3456493 -2779369 -1190506 -1881264 -4202678 -3039919 3457141 10346421 11998429
45617 11998429 8296643 3137982 -306941 -1002530 1043103 5014825 8896099 9922929
45609 9922929 5930936 -2646738 -11371889 -14077240 -8713775 -108317 5179976 5955615
45601 5955615 6161460 8613253 12044014 14209281 14740234 14188805 12879210 11785592 12433452
45592 12433452 14630592 15656236 12713285 5461549 -3883478 -11646185 -14005546 -9280308
45584 -9280308 85841 8803580 12695202 11218115 6753160 2459010 168488 -896146
45576 -896146 -2690008 -4695942 -3573523 1427781 5008996 1736318 -5796241 -9521183
45568 -9521183 -6613909 -2537677 -2291399 -4002257 -3861127 -2506719 -2461580 -2945096 -1921120
$$ packed form
45626c182122k74371O77124J588863o90758k321414J162759O497060O889280J652008
45617A1998429l701786n158661l444923o95589K045633L971722L881274J026830
45609I922929l991993q577674q725151k705351N363465Q605458N288293P75639
45601E955615K05845K451793L430761K165267N30953n51429j309595j093618O47860
45592A2433452K197140J025644k942951p251736r345027p762707k359361M725238
45584i280308R366149Q717739L891622j477087m464955m294150k290522j064634
45576h96146j793862k005934J122419N001304L581215l272678p532559l724942
45568i521183K907274M076232K46278j710858J41130J354408M5139m83516J023976
$$ plain form
45559 -1921120 -788374 -2187107 -4608491 -3961567 -105013 2322080 -243411 -6775904
45551 -6775904 -13714274 -17500011 -15910870 -10546640 -7245428 -9743021 -13417982 -10450659
45543 -10450659 -1329679 4874005 3191716 -979442 -1656211 -1513396 -5297081 -9269638
45535 -9269638 -5538172 5080737 12644587 10902837 3690590 -2576520 -6124551 -7144980
45527 -7144980 -4189949 2346058 7225464 5481141 -1530085 -8384682 -11746379 -11439660
45519 -11439660 -8026995 -3042534 165117 -368457 -2214728 -2035837 -940647 -2739999
45511 -2739999 -7505701 -10686332 -8940771 -3692304 1674880 5459589 7769713 9190790
45503 9190790 10139289 10282391 8646753 5466873 3013646 2814307 3197468 1876387 -286921
$$ packed form
45559a921120J132746j398733k421384O46924L856554K427093k565491o532493
45551f775904o938370l785737J589141N364230L301212k497593l674961K967323
45543a0450659R120980O203684j682289m171158o76769J42815l783685l972557
45535i269638L731466J0618909P563850j741750p212247o267110l548031j020429
45527g144980K955031O536007M879406j744323p011226o854597l361697L06719
45519a1439660L412665M984461L207651n33574j846271J78891J095190j799352
45511b739999m765702l180631J745561N248467N367184L784709K310124J421077
45503I190790R48499J43102j635638l179880k453227j99339L83161j321081k163308
$$ plain form
45494 -286921 -959848 -652802 -1899626 -4709230 -6440687 -6107986 -5362575 -5148780 -4682499
45485 -4682499 -3707695 -2534626 -331115 2941115 3758557 -1140027 -8799260 -13342551
45477 -13342551 -14732370 -17521785 -20636861 -16991764 -6173593 1203677 -2477483 -10464545
45469 -10464545 -11317376 -4702195 191128 -1472037 -5671243 -7308093 -5662303 -2556054
45461 -2556054 -370981 -1359924 -4860067 -6732951 -5294623 -4748989 -7977581 -10004071
45453 -10004071 -5710759 -726944 -5418596 -18770515 -27500687 -22641847 -9026070 3602166
45445 3602166 11012170 12996500 9018119 502587 -7259101 -10080376 -8905702 -6369050
45437 -6369050 -2843473 1855187 6517084 10375896 13309957 12950037 6365957 -3662633
$$ packed form
45494b86921o72927L07046j246824k809604j731457L32701P45411K13795M66281
45485d682499R74804J173069K203511L272230Q17442m898584p659233m543291
45477a3342551j389819k789415l115076L645097J0818171P377270l681160p987062
45469a0464545q52831O615181M893323j663165m199206j636850J645790L106249
45461b556054K185073r88943l500143j872884J438328N45634l228592k026490
45453a0004071M293312M983815m691652j3351919q730172M858840J3615777J2628236
45445C602166P410004J984330l978381q515532p761688k821275J174674K536652
45437f369050L525577M698660M661897L858812K934061l59920o584080j0028590
$$ plain form
45429 -3662633 -9731973 -9915793 -10714979 -15889120 -18689432 -11632241 780740 7078248
45421 7078248 4335930 644162 1984563 4257133 1301135 -4647790 -5465226 1633968
45413 1633968 9769903 10605935 4537926 -198013 1513489 5289651 4337049 -445218
45405 -445218 -2500149 -26289 2264505 2235746 3932057 9334877 13380695 12046664 9741916
45396 9741916 12377198 17194987 16689408 10408977 5465770 5675061 7234438 6689847 7120821
45387 7120821 12961667 22232325 27651731 24514640 15233936 6122940 810317 -2582547
45379 -2582547 -7723761 -14540666 -19000121 -18116511 -12892349 -6103878 -136512 2263906
45371 2263906 -1010942 -7433932 -10359711 -6643196 -907755 978017 -200731 520756
$$ packed form
45429c662633o069340j83820p99186n174141k800312P057191J2412981O297508
45421G078248k742318l691768J340401K272570k955998n948925q17436P099194
45413A633968Q135935Q36032o068009m735939J711502L776162r52602m782267
45405d45218k054931K473860K290794k8759J696311N402820M045818j334031k304748
45396I741916K635282M817789n05579o280431m943207K09291J559377n44591M30974
45387G120821N840846R270658N419406l137091r280704r110996n312623l392864
45379b582547n141214o816905m459455Q83610N224162O788471N967366K400418
45371B263906l274848o422990k925779L716515N735441J885772j178748P21487
$$ plain form
45363 520756 4398676 8033124 8779736 6882613 3354174 -237925 -898118 2812729 7696557
45354 7696557 9668099 9540672 10819770 12828281 11311671 5927074 1693308 1730983 3449240
45345 3449240 3936546 4710936 8130427 12331349 13217902 9925289 5534136 3084317 2965022
45336 2965022 4006703 5447252 7131845 8375793 7869608 5777611 5162088 8857590
45328 8857590 14411269 15118980 8075316 -1235522 -4920146 -1422298 4025449 5632009
45320 5632009 1202866 -7489097 -15171486 -16073965 -10207791 -4876456 -6197840 -11070232
45312 -11070232 -11755603 -6492812 -679310 1025263 -1340050 -5718425 -9316368 -8332948
45304 -8332948 -2196213 2882321 904067 -4252154 -3626276 2507929 3988484 -3637332
$$ packed form
45363E20756L877920L634448P46612j897123l528439l592099o60193L710847M883828
45354G696557J971542j27427J279098K008511j516610n384597m233766L7675J718257
45345C449240M87306P74390L419491M200922Q86553l292613m391153k449819j19295
45336B965022J041681J440549J684593J243948n06185k091997o15523L695502
45328H857590N553679P07711p043664r310838l684624L497848N447747J606560
45320E632009m429143q691963p682389r02479N866174N331335j321384m872392
45312a1070232o85371N262791N813502J704573k365313m378375l597943R83420
45304h332948O136735N078534j978254n156221O25878O134205J480555p625816
$$ plain form
45296 -3637332 -11891426 -11857001 -5826914 -1015402 1189324 2829800 2047238 -3680160 -10265646
45287 -10265646 -10843667 -5516075 -689018 422916 371529 777397 -698071 -5256265 -9628351
45278 -9628351 -9912833 -5725072 780422 7282484 11362864 10645734 4930275 -2488350
45270 -2488350 -6754792 -5064597 967230 6098687 5766892 688514 -3835640 -4248368
45262 -4248368 -2880036 -4014086 -7224532 -7457460 -1805161 6214996 10271591 7948047
45254 7948047 2736654 -349356 -15863 1184453 1262624 1413692 3453505 6540000 8308392
45245 8308392 7942153 6047931 2892430 -629667 -1748559 1064696 4916630 6319378
45237 6319378 6908565 10182012 13304797 9086476 -2406163 -11314368 -10673386 -5473974
$$ packed form
45296c637332q254094L4425O030087M811512K204726J640476p82562n727398o585486
45287a0265646n78021N327592M827057J111934n1387M05868j475468m558194m372086
45278i628351k84482M187761O505494O502062M080380p17130n715459p418625
45270b488350m266442J690195O031827N131457l31795n078378m524154m12728
45262d248368J368332j134050l210446k32928N652299Q020157M056595k323544
45254G948047n211393l086010L33493J200316P8171J51068K039813L086495J768392
45245H308392l66239j894222l155501l522097j118892K813255L851934J402748
45237F319378N89187L273447L122785m218321j1492639q908205O40982N199412
$$ plain form
45229 -5473974 -4114443 -6034011 -4269644 2995428 10332213 13314546 12808700 11068115
45221 11068115 8791810 6876250 6739110 7453570 5796227 739810 -4410294 -6007871
45213 -6007871 -4878559 -5561068 -10622890 -16332448 -15206188 -4273068 9805880 16374902
45205 16374902 11983776 3417055 -1034826 103223 3529303 7542163 12479658 16895332
45197 16895332 17713002 14426041 10375205 9029529 10111372 9751270 4459109 -4513052
45189 -4513052 -11311208 -11549530 -7623816 -5568481 -7171799 -8409740 -5429571 1682012
45181 1682012 10879889 19263637 22113050 16628616 7928328 5182374 9469828 11595639
45173 11595639 4851602 -6520200 -15241568 -20397925 -23771234 -23424192 -17649087 -10189429
$$ packed form
45229e473974J359531j919568J764367P265072P336785K982333n05846j740585
45221A1068115k276305j915560j37140P14460j657343n056417n150104j597577
45213f007871J129312o82509n061822n709558J126260J0933120J4078948O569022
45205A6374902m391126q566721m451881J138049L426080M012860M937495M415674
45197A6895332Q17670l286961m050836j345676J081843l60102n292161q972161
45189d513052o798156k38322L925714K055335j603318j237941K980169P111583
45181A682012R197877Q383748K849413n484434q700288k745954M287454K125811
45173A1595639o744037j1371802q721368n156357l373309L47042N775105P459658
$$ plain form
45165 -10189429 -4929229 -89471 5823764 7649481 1062618 -8154314 -11055105 -8144529
45157 -8144529 -6120132 -5326425 -575405 7275919 10957238 8033387 3291849 -378581
45149 -378581 -4593216 -8544284 -8586025 -5956226 -6238606 -9722464 -10945364 -9347308 -11040783
45140 -11040783 -17331236 -20920323 -17635544 -13145903 -12711072 -12060874 -4976986 5958650
45132 5958650 12888988 13099888 10222144 7721589 5946064 4180477 2541102 2562652 6264733
45123 6264733 12502907 15450183 11021291 3615972 772292 2279732 1771143 -1797744
45115 -1797744 -3293003 -2205106 -3728262 -6969743 -3579577 7287996 13890905 8557169
45107 8557169 -554582 -2257040 2138371 4925881 5280518 6131081 4517475 -3635987
$$ packed form
45165a0189429N260200M839758N913235J825717o586863r216932k900791K910576
45157h144529K024397P93707M751020P851324L681319k923851m741538l670430
45149c78581m214635l951068m1741K629799k82380l483858j222900J598056j693475
45140a1040783o290453l589087L284779M489641M34831O50198P083888J0935636
45132E958650O930338K10900k877744k500555j775525j765587j639375K1550L702081
45123F264733O238174K947276m428892p405319k843680J507440n08589l568887
45115a797744j495259J087897j523156l241481L390166J0867573O602909n333736
45107H557169r111751j702458M395411K787510L54637Q50563j613606q153462
$$ plain form
45099 -3635987 -13439894 -16380859 -12938645 -10503308 -11373600 -11839531 -10709981 -9737355 -7631599
45090 -7631599 -2508643 1555332 -668829 -5729290 -5441490 445365 4472718 3440188
45082 3440188 897042 -1772271 -6826429 -12127092 -11659351 -6110883 -3634750 -7324813
45074 -7324813 -10663050 -8682083 -5113564 -4134961 -2886809 2247471 8068180 9016430
45066 9016430 4952313 -41308 -2855011 -1836003 3657856 10486853 12630110 8661742
45058 8661742 4505802 5082244 7258953 5358633 -110771 -4230623 -5337429 -5637327
45050 -5637327 -5853615 -4437346 -1718706 -429807 -1590099 -3160187 -3474561 -3394672 -4013053
45041 -4013053 -4050502 -1078486 4904079 10044631 9761972 3833113 -2464954 -3509541 932158
$$ packed form
45099c635987r803907k940965L442214K435337q70292m65931J129550R72626K105756
45090g631599N122956M063975k224161n060461K87800N886855M027353j032530
45082C440188k543146k669313n054158n300663M67741N548468K476133l690063
45074g324813l338237J980967L568519R78603J248152N134280N820709R48250
45066I016430m064117m993621k813703J019008N493859O828997K143257l968368
45058H661742m155940N76442K176709j900320n469404m119852j106806k99898
45050e637327k16288J416269K718640J288899j160292j570088l14374P9889o18381
45041d013053l7449K972016N982565N140552k82659n928859o298067j044587M441699
$$ plain form
45032 932158 6466317 9644600 10519738 10129288 8413227 5512973 3012332 2658650 4728185
45023 4728185 7802058 9304510 7115167 2366905 -304004 2320521 7476944 9350628
45015 9350628 6161888 1636700 -346292 263599 1205111 886326 -398021 -411142 3231141
45006 3231141 9232648 12158878 8866225 3732083 3315611 6910120 7372900 1346232
44998 1346232 -6313952 -9213254 -6218490 -581726 3789442 4262277 1453354 8946
44990 8946 3662234 9222876 9933668 5268826 2168723 5146368 10471071 12497287 10921630
44981 10921630 8810319 7477190 6392309 5001358 2195332 -3021693 -8541075 -10274569
44973 -10274569 -7929826 -5761585 -5781513 -4707605 -226350 4179446 4056009 -15735
$$ packed form
45032I32158N534159L178283Q75138l90450j716061k900254k500641l53682K069535
45023D728185L073873J502452k189343m748262k670909K624525N156423J873684
45015I350628l188740m525188j982992O09891R41512l18785j284347j3121L642283
45006C231141O001507K926230l292653n134142m16472L594509M62780o026668
44998A346232p660184k899302K994764N636764M371168M72835k808923j444408
44990H946L653288N560642P10792m664842l100103K977645N324703K026216j575657
44981A0921630k111311j333129j084881j390951k806026n217025n519382j733494
44973a0274569K344743K168241j9928J073908M481255M405796j23437m071744
$$ plain form
44965 -15735 -4628533 -8676181 -13095169 -18043088 -22859081 -26401830 -25939945 -19186929 -8988322
44956 -8988322 -1763891 653935 3035933 8537771 13852532 15515714 15367925 15771678
44948 15771678 14838853 11123717 7988706 8001851 7479676 2170439 -5423787 -9531208 -8125800
44939 -8125800 -1946585 8426731 18988901 21471818 13442239 4562542 4863035 10975439
44931 10975439 12585260 8521043 6255861 7889557 7617433 2925245 -1862188 -4072128
44923 -4072128 -5525386 -5863565 -2039940 4051075 6209402 3986016 3451966 6017631
44915 6017631 5702733 366470 -3858995 -3462694 -3590567 -7820195 -10764397 -7840231 -4771990
44906 -4771990 -9066973 -17604086 -21174130 -17577625 -12172708 -7964086 -2952734 3492825
$$ packed form
44965a5735m612798m047648m418988m947919m815993l542749M61885O753016J0198607
44956h988322P224431K417826K381998N501838N314761J663182j47789M03753
44948A5771678r32825l715136l135011J3145n22175n309237p594226m107421J405408
44939h125800O179215J0373316J0562170K482917q029579q879697L00493O112404
44931A0975439J609821m064217k265182J633696k72124m692188m787433k209940
44923d072128j453258l38179L823625O091015K158327k223386n34050K565665
44915F017631l14898n336263m225465L96301j27873m229628k944202K924166L068241
44906d771990m294983q537113l570044L596505N404917M208622N011352O445559
$$ plain form
44898 3492825 8210787 8652608 5509293 1129680 -1779039 -1196562 1841744 3840333
44890 3840333 3812335 4403007 6036063 5108300 1603380 2166899 9393251 14052523 6902624
44881 6902624 -5783626 -8971188 334145 9913218 10853634 8270746 9648102 12238416
44873 12238416 9003798 782306 -4938967 -4244502 242625 4623988 6816070 5602314
44865 5602314 1198466 -3380056 -4786848 -3138280 -1193073 -518190 -577006 -544931 333004
44856 333004 3190857 7805137 11200767 10716666 8127746 8025911 11918634 16294358 17036509
44847 17036509 13815912 9541927 7067707 6986247 7404190 5565434 815751 -4114851
44839 -4114851 -6103664 -5472828 -4819324 -4343727 -1428979 4152730 7752163 5049417 -2050804
$$ packed form
44898C492825M717962M41821l143315m379613k908719N82477L038306J998589
44890C840333k7998N90672J633056r27763l504920N63519P226352M659272p149899
44881F902624j2686250l187562R305333R579073R40416k582888J377356K590314
44873A2238416l234618q221492n721273O94465M487127M381363K192082j213756
44865E602314m403848m578522j406792J648568J945207O74883n8816L2075Q77935
44856C33004K857853M614280L395630m84101k588920j01835L892723M375724P42151
44847A7036509l220597m273985k474220q1460M17943j838756m749683m930602
44839d114851j988813O30836O53504M75597K914748N581709L599433k702746p100221
$$ plain form
44830 -2050804 -7335992 -7233602 -3651740 -484987 555700 595493 1534134 3457491 3811715
44821 3811715 402610 -4344824 -4836505 126656 4448023 2908949 -823336 305030
44813 305030 5333215 6375648 880542 -4974005 -6881902 -8320068 -11937757 -12882600
44805 -12882600 -7145318 -211381 679814 -1623174 972596 8064172 11659600 9855289
44797 9855289 9354953 12974006 14598226 10307748 5719116 6683404 9734090 8467736
44789 8467736 4215912 3076395 5555213 6469317 3900357 1625052 2287988 3649074
44781 3649074 3191089 2496215 4736562 9762297 13643532 12880906 8390624 4808674 5359754
44772 5359754 8193060 9248680 7664896 5553486 3361502 -155812 -3299374 -2335981
$$ packed form
44830b050804n285188J02390L581862L166753J040687L9793R38641J923357L54224
44821C811715l409105m747434m91681M963161M321367j539074l732285J128366
44813C05030N028185J042433n495106n854547j907897j438166l617689r44843
44805a2882600N737282O933937Q91195k302988K595770P091576L595428j804311
44797I855289n00336L619053J624220m290478m588632R64288L050686j266354
44789H467736m251824j139517K478818R14104k568960k275305O62936J361086
44781C649074m57985o94874K240347N025735L881235p62626m490282l581950N51080
44772E359754K833306J055620j583784k111410k191984l517314l143562R63393
$$ plain form
44764 -2335981 1411574 1567787 -2971615 -4186892 3165041 11577397 10342232 1243081
44756 1243081 -4032984 -599830 4399470 3835463 -412393 -2921061 -2323444 -22739
44748 -22739 3477728 7424344 9779211 10144620 10455255 10753152 8083799 1976115 -2814003
44739 -2814003 -2087712 2294475 5597839 6253109 5897376 5703058 5491428 4922455 3541356
44730 3541356 1164668 -677948 55078 2554314 4194104 5608006 10176992 16846495
44722 16846495 18991555 13700828 6722019 3769972 2505843 -898403 -2743791 2222786
44714 2222786 9463475 9156160 1087661 -4647000 -2623099 1716158 3212715 4947394
44706 4947394 10295159 14889245 12831633 5511373 -1612157 -6474639 -9102148 -7448689
$$ packed form
44764b335981L747555J56213m539402j215277P351933Q412356j235165r099151
44756A243081n276065L433154M999300n64007m247856k508668N97617K300705
44748b2739L500467L946616K354867L65409L10635K97897k669353o107684m790118
44739b814003P26291M382187L303364O55270l55733j94318k11630n68973j381099
44730C541356k376688j842616P33026K499236J639790J413902M568986O669503
44722A6846495K145060n290727o978809k952047j264129l404246j845388M966577
44714B222786P240689l07315q068499n734661K023901M339257J496557J734679
44706D947394N347765M594086k057612p320260p123530m862482k627509J653459
$$ plain form
44698 -7448689 -1114309 4289354 3532981 268895 2187528 9140304 13215372 10259390
44690 10259390 4250982 -518496 -4747075 -9500001 -12176763 -10259638 -5078380 709545
44682 709545 6108976 10400375 12013158 10449338 6556210 500500 -6575354 -8989112
44674 -8989112 -1065729 12540809 17951099 8309581 -6379879 -11368000 -4905278 2473655
44666 2473655 3122292 -669117 -3520816 -3562043 -1473134 1230784 1798819 -1058107 -3305129
44657 -3305129 444981 7793245 8895285 -1155187 -14812462 -20805302 -17126590 -10987412
44649 -10987412 -7932658 -6213476 -2358797 2330359 3909795 2317737 1888093 4800128
44641 4800128 7492483 6302922 4242695 7586784 16120962 21969899 19693730 12790767
$$ packed form
44698g448689O334380N403663p56373l264086J918633O952776M075068k955982
44690A0259390o008408m769478m228579m752926k676762J917125N181258N787925
44682G09545N399431M291399J612783j563820l893128o055710p075854k413758
44674h989112P923383J3606538N410290r641518j4689460m988121O462722P378933
44666B473655O48637l791409k851699m1227K088909K703918N68035k856926k247022
44657c305129L750110P348264J102040j0050472j3657275n992840L678712O139178
44649a0987412L054754J719182L854679M689156J579436j592058m29644K912035
44641D800128K692355j189561k060227L344089Q534178N848937k276169o902963
$$ plain form
44633 12790767 7637999 5652936 4962310 5189258 5865118 4180748 -297495 -2456028
44625 -2456028 990850 5112822 4849926 5008678 12589344 22403080 22298062 12207234
44617 12207234 5242800 7756447 11151926 7943743 3194637 2793293 2069112 -4110490
44609 -4110490 -9416967 -5572013 3205014 6943311 6025714 8642117 15393121 18362649
44601 18362649 14451338 8783710 4844596 1161988 -1646997 -96093 4421467 5761203
44593 5761203 2819787 1384282 4307853 7396572 7289594 6187970 6136626 5377048 3306766
44584 3306766 2930896 5430282 7724597 7787990 6898556 4734430 -1399359 -9847643 -13588959
44575 -13588959 -9474605 -2883164 130807 -237556 -1613983 -4199455 -7180955 -6136364
$$ packed form
44633A2790767n152768j985063o90626K26948O75860j684370m478243k158533
44625b456028L446878M121972k62896J58752P580666R813736j05018j0090828
44617A2207234o964434K513647L395479l208183m749106m01344p24181o179602
44609d110490n306477L844954Q777027L738297r17597K616403O751004K969528
44601A8362649l911311n667628l939114l682608k808985J550904M517560J339736
44593E761203k941416j435505K923571L088719j06978j101624n1344p59578k070282
44584C306766l75870K499386K294315O3393q89434k164126o133789q448284l741316
44575a3588959M114354O591441L013971l68363j376427k585472k981500J044591
$$ plain form
44567 -6136364 871921 9041705 13177274 14120139 14868462 15003687 13469136 12285097 12621810
44558 12621810 11428836 6846832 2723624 2685384 3998861 2708048 514523 578275 729234
44549 729234 -2304484 -5427143 -3187444 3328433 8529656 10783322 11894042 10809777
44541 10809777 5785513 919950 1986324 6490846 6357598 490683 -3862680 -2928432
44533 -2928432 -825717 -531882 668771 3562416 3269797 -2065906 -5804563 -1687940
44525 -1687940 6901885 11992293 11412574 9090578 8106475 8411517 9530574 11205005 12067532
44516 12067532 10443435 6069914 239099 -4183486 -3213888 4125937 11828978 11890575
44508 11890575 4803326 99243 4223032 12997561 18875129 19983525 18042152 13224480
$$ packed form
44567f136364P008285Q169784M135569R42865P48323J35225j534551j184039L36713
44558A2621810j192974m582004m123208l8240J313477j290813k193525O3752J50959
44549G29234l033718l122659K239699O515877N201223K253666J110720j084265
44541A0809777n024264m865563J066374M504522j33248n866915m353363R34248
44533b928432K102715K93835J200653K893645k92619n335703l738657M116623
44525a687940Q589825N090408n79719k321996r84103L05042J119057J674431Q62527
44516A2067532j624097m373521n830815m422585R69598P339825P703041O1597
44508A1890575p087249m704083M123789Q774529N877568J108396j941373m817672
$$ plain form
44500 13224480 6983492 5270460 11823194 20929081 23570914 18992008 13729755 10603712
44492 10603712 5838630 -2514458 -9883459 -10934925 -5632372 2012285 7853597 9515283
44484 9515283 7664741 5966164 6975855 8354888 6181573 943318 -3735318 -6948487
44476 -6948487 -9798091 -9907286 -3695281 5141474 7182781 308398 -6041960 -4238086
44468 -4238086 522985 -956312 -7364559 -9640775 -5588623 -2619265 -5467479 -9453611
44460 -9453611 -8902629 -5686412 -4794396 -5821376 -4269182 689207 4851569 5284122 3813174
44451 3813174 3128914 2667039 581278 -2086252 -1993310 1951294 6873722 9415533 9152138
44442 9152138 7373829 4161654 -884780 -5499869 -5397010 493161 7434536 9718759
$$ packed form
44500A3224480o240988j713032O552734R105887K641833m578906n262253l126043
44492A0603712m765082q353088p369001j051466N302553P644657N841312J661686
44484I515283j850542j698577J009691J379033k173315n238255m678636l213169
44476f948487k849604j09195O212005Q836755K041307o874383o350358J803874
44468d238086M761071j479297o408247k276216M052152K969358k848214l986132
44460i453611N50982L216217Q92016j026980J552194M958389M162362M32553j470948
44451C813174o84260m61875k085761k667530R2942L944604M922428K541811k63395
44442I152138j778309l212175n046434m615089J02859N890171O941375K284223
$$ plain form
44434 9718759 7174472 4623453 5219516 7115529 7767265 8853583 13915794 21923492
44426 21923492 26820876 24897051 19754996 17078805 16362526 12248840 4134712 -786856
44418 -786856 3010040 10927202 13949971 10480081 6849933 6699879 6265518 2121895 -2175046
44409 -2175046 -1318213 3592918 6822400 5983530 3846634 2998758 2703143 1208545 -1897652
44400 -1897652 -5861183 -8792898 -7761074 -1711618 5646674 8934485 7704979 7019700
44392 7019700 10285450 14283370 13323846 6542102 -1096842 -4280114 -2235180 1407699
44384 1407699 2308937 -1027015 -6454264 -10353116 -10547538 -7623226 -4397933 -4172364 -7968480
44375 -7968480 -12743487 -14041218 -11558862 -9949279 -12283941 -15351557 -14556982 -10976975
$$ packed form
44434I718759k544287k551019N96063J896013O51736J086318N062211Q007698
44426B1923492M897384j923825n142055k676191p16279m113686q114128m921568
44418g86856L796896P917162L022769l469890l630148j50054m34361m143623m296941
44409b175046Q56833M911131L229482q38870k136896q47876k95615j494598l106197
44400a897652l963531k931715J031824O049456P358292L287811j229506o85279
44392G019700L265750L997920r59524o781744p638944l183272K044934L642879
44384A407699R01238l335952n427249l898852j94422K924312L225293K25569l796116
44375g968480m775007j297731K482356J609583k334662l067616P94575L580007
$$ plain form
44367 -10976975 -8972691 -8373894 -4696120 2876842 9461120 11667038 11643825 12230092 13033324
44358 13033324 13275908 13320011 11002912 2411731 -9949549 -15843000 -9712767 602153
44350 602153 4133116 1614142 2320226 8862971 14085912 13042331 9643360 9184726 10970751
44341 10970751 11682091 11315519 12251177 15108000 17981885 18357523 15149760 10508932 8976161
44332 8976161 12416434 17066807 18758742 19003385 21277074 23455608 20485220 13606200
44324 13606200 9361165 9019534 7100025 2229374 893794 6433006 12030442 10132228
44316 10132228 2756403 -3073769 -4705108 -3110937 1729287 8167120 10288668 5189202
44308 5189202 -656565 593570 6712908 9223929 6139422 3072797 3066476 3347624 2253317
$$ packed form
44367a0976975K004284N98797L677774P572962O584278K205918k3213N86267Q03232
44358A3033324K42584M4103k317099q591181j2361280n893451O130233J0314920
44350F02153L530963k518974P06084O542745N222941j043581l398971m58634J786025
44341A0970751P11340l66572R35658K856823K873885L75638l207763m640828j532771
44332H976161L440273M650373J691935K44643K273689K178534k970388o879020
44324A3606200m245035l41631j919509m870651j335580N539212N597436j898214
44316A0132228p375825n830172j631339J594171M840224O437833K121548n099466
44308E189202n845767J250135O119338K511021l084507l066625o321K81148j094307
$$ plain form
44299 2253317 2044310 3803650 5611643 6716884 8257173 9617437 9415074 9739678 13255665
44290 13255665 16395254 12677074 3430356 -2643170 -2458997 -2942082 -8949595 -14641022
44282 -14641022 -12393945 -4312655 1286859 683641 -3564059 -8291707 -11609154 -11649356
44274 -11649356 -8424488 -5137640 -3852611 -2329079 1201249 3551995 1628404 -1413177
44266 -1413177 -955724 823479 -1530883 -6412270 -6178907 734963 6198979 3609450
44258 3609450 -3263229 -6226985 -2760449 3730142 9788242 13443277 12623666 7150294
44250 7150294 1329894 35398 2257717 2587325 -502814 -2204372 1001453 5298844
44242 5298844 4779160 302590 -1555006 1970926 6109653 5879192 2929848 1774785
$$ packed form
44299B253317k09007J759340J807993J105241J540289J360264k02363L24604L515987
44290A3255665L139589l718180r246718o073526J84173m83085o007513n691427
44282a4641022K247077Q081290N599514o03218m247700m727648l317447m0202
44274a1649356L224868L286848J285029J523532L530328K350746j923591l041581
44266a413177M57453J779203k354362m881387K33363O913870N464016k589529
44258C609450o872679k963756L466536O490591O058100L655035q19611n473372
44250G150294n820400j294496K222319L29608l090139j701558L205825M297391
44242E298844n19684m476570j857596L525932M138727k30461k949344j155063
$$ plain form
44234 1774785 2105447 -487275 -6845106 -11787569 -10377516 -3497392 3958918 7696529
44226 7696529 5749303 -1083972 -8173611 -9105849 -2197576 6084723 7207472 -84268
44218 -84268 -8646263 -10896817 -5859737 1487133 5483635 3831171 -1586533 -6575335
44210 -6575335 -8123445 -6830670 -5481533 -5240399 -4453634 -1692625 1461045 2166768 257067
44201 257067 -1388450 -701767 1070511 1804614 1852906 2847866 4072617 3045566 44304
44192 44304 -1312122 283471 682159 -4159716 -11541464 -14562787 -10315391 -2152024 5331307
44183 5331307 9686090 9457753 4430704 -1823727 -3923994 -1301300 576181 -2150881
44175 -2150881 -6092531 -5532583 -441149 3904770 4000445 1566072 110611 488808 580461
$$ packed form
44234A774785L30662k592722o357831m942463J410053O880124P456310L737611
44226G696529j947226o833275p089639r32238O908273Q282299J122749p291740
44218h4268q561995k250554N037080P346870L996502j652464n417704m988802
44210f575335j548110J292775J349137K41134P86765K761009L153670P05723j909701
44201B57067j645517O86683J772278P34103M8292R94960J224751j027051l001262
44192D4304j356426J595593L98688m841875p381748l021323M247396Q163367P483331
44183E331307M354783k28337n027049o254431k100267K622694J877481k727062
44175b150881l941650N59948N091434M345919R5675k434373j455461L78197R1653
$$ plain form
44166 580461 -1442043 -4063223 -3552191 765921 3834129 632933 -5850244 -6808814 1083314
44157 1083314 10994094 14833515 12537960 9113512 6443020 2960612 -937887 -2549962
44149 -2549962 -1462079 -284504 -718160 -2046784 -3330149 -4168449 -3512834 -475137 3730518
44140 3730518 6884357 8477775 9494530 10433318 11536879 13522155 15538249 13979575
44132 13979575 6589303 -3227706 -9377921 -9724649 -7071821 -4694827 -3930323 -4859762
44124 -4859762 -5840388 -3514994 2952584 8813112 8979705 5101938 2710653 2548359 688596
44115 688596 -2945900 -3102678 1972388 6553615 5484645 1128445 -1343055 -1350084 -1596539
44106 -1596539 -2678779 -3165835 -2885298 -2438359 -929648 2696774 7033955 9135994 7054321
$$ packed form
44166E80461k022504k621180N11032M318112L068208l201196o483177r58570P892128
44157A083314R910780L839421k295555l424448k670492l482408l898499j612075
44149b549962J087883J177575m33656j328624j283365q38300O55615L037697M205655
44140C730518L153839J593418J016755R38788J103561J985276K016094j558674
44132A3979575p390272r817009o150215l46728K652828K376994P64504r29439
44124d859762r80626K325394O467578N860528J66593l877767k391285j62294j859763
44115F88596l634496j56778N075066M581227j068970m356200k471500p029k46455
44106a596539j082240m87056K80537M46939J508711L626422M337181K102039k081673
$$ plain form
44097 7054321 347422 -9576269 -18001285 -18874153 -11192211 -1237508 4443357 6133452
44089 6133452 7869929 9666359 7538064 779587 -5449354 -6205972 -2331212 1907005
44081 1907005 4742723 8191712 13843136 19513104 21529974 19663871 17481284 16894664
44073 16894664 15030098 9333410 3566481 3884206 9395064 12344435 9213099 5844680
44065 5844680 8066365 12423285 11720791 6320641 3324940 5670456 8582661 7910602
44057 7910602 6370524 8517761 13044173 13937200 8527769 1490581 -294575 4114114
44049 4114114 8475868 7232501 3060383 3609296 10821699 17554281 16830227 10742864
44041 10742864 6597401 6947766 8097603 7227671 6017749 6553055 7487707 5815733 481433
$$ packed form
44097G054321o706899r923691q425016q72868P681942R954703N680865J690095
44089F133452J736477J796430k128295o758477o228941p56618L874760M238217
44081A907005K835718L448989N651424N669968K016870j866103k182587n86620
44073A6894664j864566n696688n766929L17725N510858K949371l131336l368419
44065E844680K221685M356920p02494n400150k995701K345516K912205o72059
44057G910602j540078K147237M526412Q93027n409431p037188j785156M408689
44049D114114M361754j243367m172118N48913P212403O732582p24054o087363
44041A0742864m145463L50365J149837q69932j209922N35306R34652j671974n334300
$$ plain form
44032 481433 -6289464 -9830605 -6108873 3623852 12375775 14878871 14418569 17835960
44024 17835960 24313756 25199646 16802013 7377253 7062316 14970197 21538657 21254691
44016 21254691 17316931 14365794 12481908 10033003 7896480 7801038 9075292 9997693
44008 9997693 10769816 12267877 12885690 9967034 4569463 1573734 3622275 7475631
44000 7475631 8530679 7021534 6887565 9642660 12867224 14808075 16719681 19119763
43992 19119763 18937812 13240742 4168234 -2537103 -3179535 1727100 9802850 18457539
43984 18457539 24413666 24680341 19486066 12811329 8814927 8363580 9521469 10403863
43976 10403863 10594779 10310478 9407731 7795955 6410394 6779840 9017514 10906860 10141654
$$ packed form
44032D81433o770897l541141L721732R732725Q751923K503096m60302L417391
44024A7835960O477796Q85890q397633r424760l14937P907881O568460k83966
44016B1254691l937760k951137j883886k448905k136523r5442J274254R22401
44008I997693P72123J498061O17813k918656n397571k995729K048541L853356
44000G475631J055048j509145j33969K755095L224564J940851J911606K400082
43992A9119763j81951n697070r072508o705337o42432M906635Q075750Q654689
43984A8457539N956127K66675n194275o674737l996402m51347J157889Q82394
43976A0403863J90916k84301r02747j611776j385561L69446K237674J889346p65206
$$ plain form
43967 10141654 7239840 4872239 4342787 4487627 4467951 5604872 9191862 14021981 17536173
43958 17536173 18413183 16988552 14329945 11939951 11044075 11152002 10780808 10303227 11672469
43949 11672469 14070765 13171245 7617577 3176581 5966198 13215596 15858300 10272084
43941 10272084 2656288 562682 4100467 7514752 6476662 1516668 -3871477 -6441024
43933 -6441024 -5358933 -2394856 348828 2722213 5586370 8446990 10031007 10560412
43925 10560412 10894999 9864082 5533787 -882834 -5674802 -7385408 -7277283 -4781964
43917 -4781964 2685813 13563298 20655475 19278651 13325172 9648380 9705340 10843432
43909 10843432 12666403 16658608 21240480 22973942 22269047 22394960 22532072 17563687
$$ packed form
43967A0141654k901814k367601n29452J44840j9676J136921L586990M830119L514192
43958A7536173Q77010j424631k658607k389994q95876J07927l71194m77581J369242
43949A1672469K398296q99520n553668m440996K789617P249398K642704n586216
43941A0272084p615796k093606L537785L414285j038090m959994n388145k569547
43933f441024J082091K964077K743684K373385K864157K860620J584017N29405
43925A0560412L34587j030917m330295o416621m791968j710606J08125K495319
43917d781964P467777J0877485P092177j376824n953479l676792N6960J138092
43909A0843432J822971L992205M581872J733462p04895J25913J37112m968385
$$ plain form
43901 17563687 6454280 -4429695 -9097934 -8546962 -6354069 -2115965 5719539 13387109
43893 13387109 14315053 7954497 1222565 350380 5138550 12072891 19059782 25169146
43885 25169146 29007806 29991422 29365268 28196894 26274526 24289100 24322803 26187245 26390934
43876 26390934 23648047 22240794 25786180 30354209 29134352 22391293 16767476 15102886
43868 15102886 13527201 9765235 7676430 10698970 16462119 21483680 26263773 31808808
43860 31808808 35851841 37088125 38675307 42214366 42575533 35360523 26116898 24289513
43852 24289513 29848229 34354832 34930448 37818570 45766853 51011668 46622909 38454005
43844 38454005 38164833 46932020 53366024 48312216 36222443 28751331 29817687 31451848
$$ packed form
43901A7563687j1109407j0883975m668239N50972K192893M238104P835504P667570
43893A3387109R27944o360556o731932q72185M788170O934341O986891O109364
43885B5169146L838660R83616o26154j168374j922368j985426L3703J864442K03689
43876B6390934k742887j407253L545386M568029j219857o743059n623817j664590
43868A5102886j575685l761966k088805L022540N763149N021561M780093N545035
43860C1808808M043033J236284J587182L539059L61167p215010r243625j827385
43852B4289513N558716M506603N75616K888122P948283N244815m388759q168904
43844C8454005k89172Q767187O434004n053808j2089773p471112J066356J634161
$$ plain form
43836 31451848 25472180 15511254 12786861 20678969 29756417 30897731 27386698 28250966
43828 28250966 34221266 38387401 38422264 38724687 40151272 37449225 30049744 26477759
43820 26477759 32479044 41694584 44678113 41891528 40563074 42469046 42926586 40649513
43812 40649513 40897040 47373776 56403284 61529691 60882788 58144068 57942865 61612123
43804 61612123 66898640 71359841 75663278 82563134 92982797 105200046 117936649 131387362
43796 131387362 144739976 156462524 168678457 187482850 216395050 252649635 292257872
43789 292257872 334926777 380738587 425711568 464852939 496470173 518713420 524610351
43782 524610351 506719517 466667740 415650851 365142312 319969317 279581170 242300650
$$ packed form
43836C1451848n979668r960926k724393P892108R077448J141314l511033Q64268
43828B8250966N970300M166135L4863L02423J426585k702047p399481l571985
43820B6477759O001285R215540K983529k786585j328454J905972M57540k277073
43812D0649513K47527O476736R029508N126407o46903k738720k01203L669258
43804F1612123N286517M461201M303437O899856J0419663J2217249J2736603J3450713
43796A31387362J3352614J1722548J2215933J8804393K8912200L6254585L9608237
43789B92257872M2668905M5811810M4972981L9141371L1617234K2243247N896931
43782E24610351j7890834m0051777n1016889n0508539m5172995m0388147l7280520
$$ plain form
43775 242300650 208064460 179449853 159751005 148450472 140261909 130793106 120909434
43768 120909434 112891419 105278999 95518766 85222113 78021416 73783996 69625176 65383371
43760 65383371 63260526 62789205 60837835 56307445 50783330 45228161 40046349 37290135
43752 37290135 38263518 39955145 38588283 35591225 34856737 35299341 32395016 26864598
43744 26864598 25257090 30938817 40207243 48134268 52536081 51546201 43906704 33581213
43736 33581213 28016060 29408027 32734639 33717829 32630952 28811278 19118980 5459057
43728 5459057 -3357585 -2402004 2391994 3175999 945191 1720914 6340231 10121185 9849402
43719 9849402 5951711 263314 -3922837 -2457672 4529578 10865126 11861255 10443365
$$ packed form
43775B42300650l4236190k8614607j9698848j1300533q188563r468803r883672
43768A20909434q018015p612420r760233j0296653p200697m237420m158820m241805
43760F5383371k122845m71321j951370m530390n524115n555169n181812k756214
43752C7290135R73383J691627j366862k997058p34488M42604k904325n530418
43744B6864598j607508N681727R268426P927025M401813r89880p639497j0325491
43736C3581213n565153J391967L326612R83190j086877l819674r692298j3659923
43728E459057q816642R55581M793998P84005k230808P75723M619317L780954k71783
43719I849402l897691n688397m186151J465165O987250O335548R96129j417890
$$ plain form
43711 10443365 11533468 14211277 14745913 13697272 13790091 13878259 11864334 10987468 15424029
43702 15424029 21056549 19014884 8878718 562674 1272629 7360182 11550777 12140470
43694 12140470 11714104 11684201 12013049 13280300 15854093 18828282 21344558 22962953 22351826
43685 22351826 18855520 15879724 18479993 25952107 30957722 28499647 22173511 18608176
43677 18608176 18938968 19445051 18391409 18126546 20932484 26022257 31085406 34884771
43669 34884771 37691710 39863549 40418585 37759290 32840836 30579440 35346748 44857871
43661 44857871 51645262 51878351 49946215 52500793 60474535 69316478 75120501 77914576
43653 77914576 80310361 85570436 96223620 112133097 130021420 146369844 160386228
$$ packed form
43711A0443365J090103K677809N34636j048641R2819Q8168k013925q76866M436561
43702A5424029N632520k041665j0136166q316044P09955O087553M190595N89693
43694A2140470m26366k9903L28848J267251K573793K974189K516276J618395o11127
43685B2351826l496306k975796K600269P472114N005615k458075o326136l565335
43677A8608176L30792N06083j053642k64863K805938N089773N063149L799365
43669C4884771K806939K171839N55036k659295m918454k261396M767308R511123
43661D4857871O787391K33089j932136K554578P973742Q841943N804023K794075
43653G7914576K395785N260075J0653184J5909477J7888323J6348424J4016384
$$ plain form
43646 160386228 173434193 187331947 204637412 227851473 254810702 276429846 283424824
43639 283424824 275461044 260033015 242254168 220364000 192768420 164484740 142562276
43632 142562276 127936204 115966672 103337970 90421979 78198984 67437359 60351991
43625 60351991 58051757 56082162 48130512 35671155 27790982 28155337 28475370 20654498
43617 20654498 9904054 7345220 12718760 14633254 8121075 1453843 2114358 5632371
43609 5632371 4739801 1984384 4628054 11581701 14606588 10839608 5777249 3821757
43601 3821757 3469974 3207731 5255125 10558154 15317318 15956676 14041832 13355554 14808390
43592 14808390 16678771 17553104 16884670 14713912 12746385 13832342 18673793 24711264
$$ packed form
43646A60386228J3047965J3897754J7305465K3214061K6959229K1619144O994978
43639B83424824p963780j5428029j7778847k1890168k7595580k8283680k1922464
43632A42562276j4626072j1969532j2628702j2915991j2222995j0761625p085368
43625F0351991k300234j969595p951650j2459357p880173L64355L20033p820872
43617B0654498j0750444k558834N373540J914494o512179o667232O60515L518013
43609E632371q92570k755417K643670O953647L024887l766980n062359j955492
43601C821757l51783k62243K047394N303029M759164O39358j914844o86278J452836
43592A4808390J870381Q74333o68434k170758j967527J085957M841451O037471
$$ plain form
43584 24711264 29483618 32990036 35405392 35059202 31086998 26420297 25633466 30420204
43576 30420204 38762646 47871640 56596826 65272322 73741512 79139824 76420312 63313438
43568 63313438 44759400 29565450 21822150 18297949 14968448 12234327 11561256 10983609
43560 10983609 8031652 4756830 5363829 9707224 13158295 12961956 11335804 11687741
43552 11687741 14431432 17388287 18524992 17695883 16786843 17990775 20937167 22435593
43544 22435593 20461776 16974237 14703090 12861017 9152159 4598646 2253320 1791304
43536 1791304 254940 -1498910 1248512 8554670 12823861 8578912 1038617 -479765
43528 -479765 4851369 9296218 7921390 3711997 731657 -1512935 -4149875 -4646720
$$ packed form
43584B4711264M772354L506418K415356l46190l972204m666701p86831M786738
43576C0420204Q342442R108994Q725186Q675496Q469190N398312k719512j3106874
43568F3313438j8554038j5193950p743300l524201l329501k734121o73071n77647
43560A0983609k951957l274822O06999M343395L451071j96339j626152L51937
43552A1687741K743691K956855J136705q29109r09040J203932K946392J498426
43544B2435593j973817l487539k271147j842073l708858m553513k345326m62016
43536A791304j536364j753850K747422P306158M269191m244949p540295j518382
43528d79765N331134M444849j374828m209393k980340k244592k636940m96845
$$ plain form
43520 -4646720 -867519 3883574 4807024 2999124 4100732 9927882 16099744 18869293
43512 18869293 19997099 22621808 25739192 26137481 23842407 21887789 21135115 18909474
43504 18909474 13801615 9064898 9062402 13478808 17164302 15753182 9965576 3887583
43496 3887583 174499 -1951073 -4367145 -7030995 -7915665 -5595416 -1450288 853036
43488 853036 -1487487 -7186186 -11201572 -9507453 -3564558 1379663 2512035 1755885
43480 1755885 1197998 -470541 -4259535 -6565379 -3202145 3379934 6073498 2769885
43472 2769885 -962938 -366440 2274857 2587719 714419 -1042294 -3513417 -8528921
43464 -8528921 -13556814 -13674806 -8367121 -2043813 2042502 4471591 6310410 7228343
$$ packed form
43520d646720L779201M751093R23450j807900J101608N827150O171862K769549
43512A8869293J127806K624709L117384L98289k295074j954618p52674k225641
43504A8909474n107859m736717k496M416406L685494j411120n787606o077993
43496C887583l713084k125572k416072k663850q84670K320249M145128K303324
43488H53036k340523n698699m015386J694119N942895M944221J132372p56150
43480A755885n57887j668539l788994k305844L363234O582079K693564l303613
43472B769885l732823N96498K641297L12862j873300j756713k471123n015504
43464h528921n027893j17992N307685O323308M086315K429089J838819R17933
$$ plain form
43456 7228343 7763747 9780406 13129078 14638322 12145600 7643071 4905550 5123431
43448 5123431 5886643 3891658 -1628704 -7772400 -10666043 -9509357 -6527352 -2667124
43440 -2667124 3504191 10837035 13574002 8501922 1163021 -448662 3435876 5798955
43432 5798955 3651558 569503 -1518593 -5357898 -11016567 -12671640 -6772011 2011578
43424 2011578 7292891 9048236 10978096 13828326 16169747 18843736 23572211 28680623
43416 28680623 30503823 28429021 25515071 24654341 26042807 27523785 26506078 23305326
43408 23305326 22550012 27598710 33331301 30197076 17396653 5511308 2263573 2520186
43400 2520186 -1746220 -8210499 -9254241 -5403560 -3797664 -5588417 -5041048 -1115665
$$ packed form
43456G228343N35404K016659L348672J509244k492722m502529k737521K17881
43448E123431P63212j994985n520362o143696k893643J156686K982005L860228
43440b667124O171315P332844K736967n072080p338901j611683L884538K363079
43432E798955k147397l082055k088096l839305n658669j655073N899629Q783589
43424B011578N281313J755345J929860K850230K341421K673989M728475N108412
43416B8680623J823200k074802k913950q60730J388466J480978j017707l200752
43408B3305326p55314N048698N732591l134225j2800423j1885345l247735K56613
43400B520186m266406o464279j043742L850681J605896j790753N47369L925383
$$ plain form
43392 -1115665 -370659 -6619328 -15794918 -23023354 -27126780 -26141208 -16953617 -3318059
43384 -3318059 3822385 -164454 -6085643 -3371438 5086574 8030831 2540005 -2505145
43376 -2505145 675789 9315405 15177196 14193920 8783515 3741753 2245680 4414260
43368 4414260 7905416 10040454 9857277 8075462 5576125 2742920 24084 -1921422
43360 -1921422 -3005326 -4071375 -5780731 -7007597 -5298990 -272824 4034655 2966450
43352 2966450 -1808527 -2603837 4370353 12630986 13343012 7322382 3375527 5482259
43344 5482259 8297996 6592656 2431567 -296049 -2602945 -6668014 -9676333 -7504671
43336 -7504671 -2531444 -1756404 -7095651 -12474034 -11874981 -6688331 -3044013 -4018994 -6873652
$$ packed form
43392a115665P45006o248669r175590p228436m103426R85572R187591J3635558
43384c318059P140444l986839n921189K714205Q458012K944257n490826n045150
43376b505145L180934Q639616N861791r83276n410405n041762j496073K168580
43368D414260L491156K135038j83177j781815k499337k833205k718836j945506
43360a921422j083904j066049j709356j226866J708607N026166M307479j068205
43352B966450m774977p95310O974190Q260633P12026o020630l946855K106732
43344E482259K815737j705340m161089k727616k306896m065069l008319K171662
43336g504671M973227P75040n339247n378383N99053N186650L644318r74981k854658
$$ plain form
43327 -6873652 -7556012 -5811324 -4374105 -3904816 -1616545 3533562 7247240 5376572
43319 5376572 1304287 2403699 9028045 13121987 9778104 4052880 2479434 3443606
43311 3443606 1684875 -1945868 -2345552 394848 750293 -3145704 -6791169 -6914630 -6061218
43302 -6061218 -7371985 -9322106 -8414733 -4064768 1403049 5195705 5018477 411038
43294 411038 -5088442 -5765284 87641 7767755 11804985 12018514 11926421 13079013 13718981
43285 13718981 12240226 9549037 7901237 8628372 10782732 11439430 8391570 3403318
43277 3403318 1334685 4668320 10388400 14068229 15427165 17129047 19239275 18618642
43269 18618642 14099621 8528238 4251440 137792 -4342778 -5361075 647347 10302245
$$ packed form
43327f873652o82360J744688J437219M69289K288271N150107L713678j870668
43319E376572m072285J099412O624346M093942l343883n725224j573446R64172
43311C443606j758731l630743l99684K740400L55445l895997l645465j23461Q53412
43302f061218j310767j950121R07373M349965N467817L792656j77228m607439
43294D11038n499480o76842N852925P680114M037230K13529r2093J152592O39968
43285A3718981j478755k691189j647800P27135K154360O56698l047860m988252
43277C403318k068633L333635N720080L679829J358936J701882K110228o20633
43269A8618642m519021n571383m276798m113648m480570j018297O008422R654898
$$ plain form
43261 10302245 16273469 16906646 17597537 21142830 22406028 16621603 8568936 7362164
43253 7362164 13919343 19926418 19455881 15671391 14106011 14444246 12562056 7689498
43245 7689498 3989177 6194762 15494673 28153890 37108970 37593895 32928527 31780458
43237 31780458 37314074 42227155 38033741 26538673 17453041 15961923 17590955 15631865
43229 15631865 9331252 3252455 1437248 3887550 7324730 8472766 7353898 7153015
43221 7153015 9882035 13223970 13441720 10363023 7181079 6146040 7047928 9299497
43213 9299497 12454185 14618340 13287633 8502471 3236381 412771 1028015 4361760
43205 4361760 7771880 7532533 3223065 345732 4336632 12176865 14874048 9263329
$$ packed form
43261A0302245N971224O33177O90891L545293J263198n784425q052667j206772
43253G362164O557179O007075m70537l784490j565380L38235j882190m872558
43245G689498l700321K205585R299911J2659217Q955080M84925m665368j148069
43237C1780458N533616M913081m193414j1495068r085632j491118J629032j959090
43229A5631865o300613o078797j815207K450302L437180J148036j118868k00883
43221G153015K729020L341935K17750l078697l181944j035039R01888K251569
43213I299497L154688K164155j330707m785162n266090k823610O15244L333745
43205D361760L410120k39347m309468k877333L990900P840233K697183n610719
$$ plain form
43197 9263329 2336119 1641169 5957704 8728318 7032553 3276177 533359 38940
43189 38940 1645327 3480819 2625077 -877520 -2360885 1721865 7854861 9177598 4490876
43180 4490876 -455880 -870590 1641200 2483754 -342025 -5605640 -11198135 -15038137
43172 -15038137 -15165332 -11094291 -5011883 -731181 -1242801 -6754983 -14099367 -18336827
43164 -18336827 -16527436 -10406998 -4461357 -1478731 -1156176 -2391267 -4424939 -5448294
43156 -5448294 -3121341 1868426 5279408 4720935 3556404 6330002 11678766 13634628
43148 13634628 9768513 3979747 277217 -2098144 -5111291 -7208934 -5819744 -2229319
43140 -2229319 97619 818284 2414825 5410462 7966346 9746155 11558307 11169286
$$ packed form
43197I263329o927210o94950M316535K770614j695765l756376k742818m94419
43189C8940J606387J835492q55742l502597j483365M082750O132996J322737m686722
43180D490876m946756m14710K511790Q42554k825779n263615n592495l840002
43172a5038137j27195M071041O082408M280702n11620n512182p344384m237460
43164a8336827J809391O120438N945641K982626L22555j235091k033672j023355
43156e448294K326953M989767L410982n58473j164531K773598N348764J955862
43148A3634628l866115n788766l702530k375361l013147k097643J389190L590425
43140b229319K326938P20665J596541K995637K555884J779809J812152l89021
$$ plain form
43132 11169286 5150294 -3546706 -5875753 1744313 11038542 11841581 4771140 -1364522
43124 -1364522 -1921215 35482 1183309 2427012 5158515 8144612 9704949 9630916 8221639
43115 8221639 6303628 5946678 7757248 8172061 3790631 -2040601 -2136499 4638231 11724934
43106 11724934 14118797 13780014 14195590 15184657 15628955 16100227 15857342 12303323 6517787
43097 6517787 3953714 5927437 6138367 520475 -5119710 -3703606 1631821 2206929
43089 2206929 -3287500 -8449821 -9692322 -8993411 -6981376 -1541443 5863617 9930894
43081 9930894 9342386 8517728 9793399 9964650 6740904 2648976 -340885 -4588528 -11692572
43072 -11692572 -18156820 -19678919 -16130307 -9497778 -934777 7118401 10249884 7557728
$$ packed form
43132A1169286o018992q697000k329047P620066R294229Q03039p070441o135662
43124a364522n56693J956697J147827J243703K731503K986097J560337p4033j409277
43115H221639j918011l56950J810570M14813m381430n831232r5898O774730P086703
43106A1724934K393863l38783M15576R89067M44298M71272k42885l554019n785536
43097F517787k564073J973723K10930n617892n640185J416104N335427N75108
43089B206929n494429n162321j242501O98911K012035N439933P405060M067277
43081I930894n88508q24658J275671J71251l223746m091928k989861m247643p104044
43072a1692572o464248j522099L548612O632529Q563001Q053178L131483k692156
$$ plain form
43064 7557728 4437877 6098486 11458308 16992110 22606823 28825823 31777528 27322862
43056 27322862 18328778 11748122 9551570 8584864 8514896 12518355 18863490 19365573 10348569
43047 10348569 -263878 -2075366 4715251 10637515 9792329 6030285 5759872 9088942
43039 9088942 10763638 7823403 3282120 1846752 3790311 4670519 1016001 -5267277
43031 -5267277 -9206527 -8441359 -4897339 -1235659 2136121 5930387 9867921 13001380
43023 13001380 14819131 14790096 12094239 7343381 3475759 2998946 4871189 5967672
43015 5967672 5246400 4378515 4316689 3638170 1001028 -2848136 -6535124 -9585053 -11261557
43006 -11261557 -10007076 -6087856 -3122823 -4375339 -8481619 -11495497 -12417479 -13539283
$$ packed form
43064G557728l119851J660609N359822N533802N614713O219000K951705m454666
43056B7322862q994084o580656k196552r66706o9968M003459O345135N02083r017004
43047A0348569j0612447j811488O790617N922264q45186l762044k70413L329070
43039I088942J674696k940235m541283j435368J943559Q80208l654518o283278
43031e267277l939250P65168L544020L661680L371780L794266L937534L133459
43023A3001380J817751k9035k695857m750858l867622m76813J872243J096483
43015E967672p21272q67885o1826o78519k637142l849164l686988l049929j676504
43006a1261557J254481L919220K965033j252516m106280l013878r21982j121804
$$ plain form
42998 -13539283 -15437005 -15343952 -11786076 -7676607 -6623494 -8316626 -9822310 -9836616 -9317612
42989 -9317612 -8932070 -8107651 -6233230 -3286130 217938 2856817 3010735 1219412 450441
42980 450441 2416248 5060020 5488088 3725519 1391873 -1345112 -4452705 -5619895
42972 -5619895 -3337059 -1242872 -4403011 -11123913 -13710762 -8900981 -2681138 -2047288
42964 -2047288 -6097123 -8877269 -8005790 -6324056 -6583286 -8357651 -9955547 -10712332 -11289562
42955 -11289562 -12976661 -15934070 -17420329 -13943554 -6712189 -2179975 -4445800 -9594271
42947 -9594271 -10994402 -7848100 -4081543 -811225 3991359 8600811 7326529 -143993
42939 -143993 -5016507 338930 11970259 19145676 17444922 11969446 8447688 6747310
$$ packed form
42998a3539283j897722R3053L557876M109469J053113j693132j505684j4306N19004
42989i317612L85542Q24419J874421K947100L504068K638879J53918j791323p68971
42980D50441J965807K643772M28068j762569k333646k736985l107593j167190
42972e619895K282836K094187l160139o720902k586849M809781O219843O33850
42964b047288m049835k780146Q71479J681734k59230j774365j597896p56785n77230
42955a1289562j687099k957409j486259L476775P231365M532214k265825n148471
42947i594271j400131L146302L766557L270318M802584M609452j274282p470522
42939a43993m872514N355437J1631329P175417j700754n475476l521758j700378
$$ plain form
42931 6747310 4449084 1987370 1090096 1024328 -78935 -1603619 -1492254 -297128 -823531
42922 -823531 -3469141 -5258622 -4706985 -4439707 -6749330 -9360600 -8956795 -6945306 -7428792
42913 -7428792 -10083073 -9749653 -4031387 2988944 6562012 7138195 7862618 9378148 10234988
42904 10234988 9856999 7654680 1563481 -8304439 -16164228 -15564972 -7625661 149824
42896 149824 3414696 4766353 7272647 9329458 8521064 6448800 5982068 6195092 3838676
42887 3838676 -1255637 -5504969 -6161140 -4206451 -2368717 -1693207 -636789 2515160
42879 2515160 6224063 5891468 -351691 -6849162 -5454527 3543363 9927407 5895813
42871 5895813 -3876354 -8582895 -4645844 2308539 6658584 7843534 6686109 3074806
$$ packed form
42931F747310k298226k461714q97274o5768j103263j524684J11365J195126n26403
42922h23531k645610j789481N51637K67278k309623k611270M03805K011489m83486
42913g428792k654281L33420N718266P020331L573068N76183P24423J515530Q56840
42904A0234988l77989k202319o091199r867920p859789N99256P939311P775485
42896A49824L264872J351657K506294K056811q08394k072264m66732K13024k356416
42887C838676n094313m249332o56171J954689J837734O75510J056418L151949
42879B515160L708903l32595o243159o497471J394635Q997890O384044m031594
42871E895813r772167m706541L937051O954383M350045J184950j157425l611303
$$ plain form
42863 3074806 -1122902 -2127380 414131 2346098 1381069 240424 873146 240002 -4047140
42854 -4047140 -7740877 -4885199 3403929 10232228 11981710 11341226 11764339 13561679
42846 13561679 15812572 17843242 17886191 14147046 8625482 6598317 10545662 16931217
42838 16931217 20279944 18388960 12852746 7039990 4482914 6563112 10406775 11154822
42830 11154822 7193852 1089168 -4647898 -9449667 -12141387 -10901326 -7183649 -5304417
42822 -5304417 -6219921 -6358607 -4854449 -6134803 -11381740 -13575857 -7316907 1517403
42814 1517403 3789421 981595 1777707 6805665 7455140 938909 -3876469 351019
42806 351019 8870866 12625859 9914000 4771684 -493854 -4821348 -4860756 1181974 8583458
$$ packed form
42863C074806m197708j004478K541511J931967r65029j140645O32722o33144m287142
42854d047140l693737K855678Q289128O828299J749482o40484M23113J797340
42846A3561679K250893K030670M2949l739145n521564k027165L947345O385555
42838A6931217L348727j890984n536214n812756k557076K080198L843663P48047
42830A1154822l960970o104684n737066m801769k691720J240061L717677J879232
42822e304417r15504j38686J504158j280354n246937k194117O258950Q834310
42814A517403K272018k807826P96112N027958O49475o516231m815378M227488
42806C51019Q519847L754993k711859n142316n265538m327494l9408O042730P401484
$$ plain form
42797 8583458 11094800 9405280 9192832 11847577 12616295 8081949 862305 -4045953
42789 -4045953 -4345515 -1094993 3284815 6855349 9087081 9968470 8453687 3967857
42781 3967857 -438060 -459716 2427859 1352167 -5337457 -9436269 -4332937 4028225
42773 4028225 5283992 88525 -1901014 2052634 4161097 -345659 -6113102 -7835739
42765 -7835739 -8606916 -12307213 -14875943 -10663207 -2920479 -114280 -3704738 -6536786
42757 -6536786 -3315347 2849819 5324929 1495427 -5691761 -11145641 -11734725 -8601351
42749 -8601351 -5711227 -5170517 -4681199 -947793 5395379 10163193 10570061 8231878 7178017
42740 7178017 9622656 13474938 13892435 8214124 -566309 -6572863 -7232608 -4802493
$$ packed form
42797H583458K511342j689520k12448K654745P68718m534346p219644m908258
42789d045953k99562L250522M379808L570534K231732Q81389j514783m485830
42781C967857m405917k1656K887575j075692o689624m098812N103332Q361162
42773D028225J255767n195467j989539L953648K108463m506756n767443j722637
42765g835739p71177l700297k568730M212736P742728K806199l590458k832048
42757f536786L221439O165166K475110l829502p187188n453880n89084L133374
42749h601351K890124N40710M89318L733406O343172M767814M06868k338183j053861
42740G178017K444639L852282M17497n678311q780433o006554o59745K430115
$$ plain form
42732 -4802493 -1912237 1354916 5119423 7808432 8524240 8616056 8954533 8354575 6798621
42723 6798621 7081697 10190446 11892989 7948614 932976 -2330877 569607 5254132
42715 5254132 6578491 3761185 -615695 -3849530 -4745880 -3760285 -1809390 1531513
42707 1531513 7083123 12380389 12087655 5025023 -2093279 -2256193 2393955 3518185
42699 3518185 -2174351 -9844032 -14194817 -14482253 -11225157 -3982823 5123684 10614345
42691 10614345 9655962 5382192 1569707 -2237183 -6969590 -9079898 -4263300 5447357
42683 5447357 12966277 14577208 13574740 14876407 18714724 21058929 19077452 14884004
42675 14884004 13396396 16297654 19034893 15652046 6450381 -1887276 -4662880 -4413492
$$ packed form
42732d802493K890256L267153L764507K689009P15808R1816L38477n99958j555954
42723F798621K83076L108749J702543l944375p015638l263853K900484M684525
42715E254132J324359k817306m376880l233835q96350R85595J950895L340903
42707A531513N551610N297266k92734p062632p118302j62914M650148J124230
42699C518185n692536p669681m350785k87436L257096P242334R106507N490661
42691A0614345r58383m273770l812485l806890m732407k110308M816598R710657
42683E447357P518920J610931j002468J301667L838317K344205j981477m193448
42675A4884004j487608K901258K737239l382847r201665q337657k775604K49388
$$ plain form
42667 -4413492 -5574678 -7135677 -4773759 1435333 6666519 9138186 13119744 21401248
42659 21401248 28529028 26105394 13795537 742896 -4884311 -4375025 -4542328 -8073642
42651 -8073642 -11323792 -10771588 -7646493 -5066952 -3899494 -3667225 -4981316 -7902552
42643 -7902552 -9436347 -6465543 -1052241 870971 -2786043 -6935351 -5780750 -665687
42635 -665687 1158221 -4676391 -13916159 -17448209 -10457185 2522579 12008693 12932466
42627 12932466 8711688 5811507 6226924 7094607 6010835 3665599 1705072 1131761
42619 1131761 3016855 7621164 11951726 11283668 4880818 -1930653 -3111907 2074369
42611 2074369 9376868 14125360 14403003 11399568 7942524 5701309 3546146 71288
$$ packed form
42667d413492j161186j560999K361918O209092N231186K471667L981558Q281504
42659B1401248P127780k423634j2309857j3052641n627207N09286j67303l531314
42651h073642l250150N52204L125095K579541J167458K32269j314091k921236
42643g902552j533795K970804N413302J923212l657014m149308J154601N115063
42635f65687J823908n834612r239768l532050O991024J2979764R486114R23773
42627A2932466m220778k900181M15417Q67683j083772k345236j960527n73311
42619A131761J885094M604309M330562o68058o402850o811471j181254N186276
42611B074369P302499M748492K77643l003435l457044k241215k155163l474858
$$ plain form
42603 71288 -2848745 -1959426 1909327 4039328 2385902 -82561 -1071538 -2318700 -4545887
42594 -4545887 -3917399 1926167 8094028 8282613 4012900 2195285 4703782 6385157
42586 6385157 3585252 -979509 -3226604 -2915317 -1821146 -254077 2283117 5067409
42578 5067409 6338662 4233451 -2468209 -12358794 -20369490 -21643724 -16803833 -10681982
42570 -10681982 -5871186 -995309 4332515 7244168 6230209 4333610 4979616 7153146
42562 7153146 7392411 4697884 1015732 -1630649 -2147226 285395 5443958 10892099
42554 10892099 13110049 9900274 1678119 -8262790 -14445966 -12424983 -3099440 7105858
42546 7105858 11664558 9341185 4394900 2630557 6604577 12451423 12082950 2087237
$$ packed form
42603G1288k920033Q89319L868753K130001j653426k468463r88977j247162k227187
42594d545887O28488N843566O167861J88585m269713j817615K508497J681375
42586F385157k799905m564761k247095L11287J094171J567069K537194K784292
42578E067409J271253k105211o701660r890585q010696j274234M839891O121851
42570a0681982M810796M875877N327824K911653j013959j896599O46006K173530
42562G153146K39265k694527l682152k646381n16577K432621N158563N448141
42554A0892099K217950l209775q222155r940909o183176K020983R325543J0205298
42546G105858M558700k323373m946285j764343L974020N846846l68473r995713
$$ plain form
42538 2087237 -9576867 -10666976 -111628 8974913 5427777 -5773541 -11239828 -7456043
42530 -7456043 -3406341 -5512776 -8420769 -4155840 5756829 12807466 12997456 10091545
42522 10091545 8049957 5725639 1177913 -2743687 -1488777 3508268 4946363 -637669
42514 -637669 -6906063 -5336659 3106376 8817944 5887607 -1775136 -8056419 -12514724
42506 -12514724 -16802812 -18340509 -13845744 -6592150 -3494343 -5694719 -8322780 -9536969
42498 -9536969 -12660996 -17508018 -17142808 -8283327 785087 -183279 -8613062 -11611863
42490 -11611863 -3426651 6922578 8634086 4013262 4411788 13557481 21792198 18759544
42482 18759544 6638204 -3630936 -6435615 -5919952 -6417304 -5067382 2157600 11523930
$$ packed form
42538B087237j1664104j090109J0555348R086541l547136j1201318n466287L783785
42530g456043M049702k106435k907993M264929R912669P050637J89990k905911
42522A0091545k041588k324318m547726l921600J254910M997045J438095n584032
42514f37669o268394J569404Q443035N711568k930337p662743o281283m458305
42506a2514724m288088j537697M494765P253594L097807k200376k628061j214189
42498i536969l124027m847022L65210Q859481R068414r68366q429783k998801
42490a1611863Q185212J0349229J711508m620824L98526R145693Q234717l032654
42482A8759544j2121340j0269140k804679N15663m97352J349922P224982R366330
$$ plain form
42474 11523930 14670872 9525043 2606166 -10769 893014 1734099 1812862 1943337 1003122
42465 1003122 -2313489 -6419368 -9056542 -10864217 -12962826 -12537495 -5868541 4117694
42457 4117694 8755634 4503397 -1374167 257493 8662578 15017067 14462347 11037854
42449 11037854 9982575 10374700 8362155 3998962 800459 350977 1183630 2004523 2435848
42440 2435848 1321721 -1921746 -4841373 -5057168 -5368922 -10386772 -17644546 -18674759
42432 -18674759 -11305176 -4026662 -3858087 -6640156 -5797522 -4511489 -9981678 -19420922
42424 -19420922 -22420627 -16408571 -9388964 -6357835 -3300611 2481528 6125843 4268056
42416 4268056 1638834 2418664 2508346 -2536310 -8406372 -8839790 -6114857 -6020088 -6549806
$$ packed form
42474A1523930L146942n145829o918877k616935R03783Q41085P8763J30475r40215
42465A003122l316611m105879k637174j807675k098609M25331O668954R986235
42457D117694M637940m252237n877564J631660Q405085O354489n54720l424493
42449A1037854j055279L92125k012545m363193l198503m49482Q32653Q20893M31325
42440B435848j114127l243467k919627k15795l11754n017850p257774j030213
42432a8674759P369583P278514J68575k782069Q42634J286033n470189r439244
42424a9420922k999705O012056P019607L031129L057224N782139L644315j857787
42416D268056k629222P79830Q9682n044656n870062m33418K724933R4769n29718
$$ plain form
42407 -6549806 -1250174 8486237 14237683 13202576 10942939 10820606 9395639 4440520
42399 4440520 -217728 -1119810 -415545 -1559045 -4589674 -8009286 -10680231 -10178683 -4659058
42390 -4659058 1642501 814634 -7686826 -14243932 -11438891 -3875822 -606016 -2344088
42382 -2344088 -2484880 1879350 6417647 6550808 2965592 -502064 -1353782 -175858 576368
42373 576368 -305679 -620838 2456875 7156901 7936803 2706635 -4405600 -8975373 -10561004
42364 -10561004 -9108144 -2836820 6281856 10548713 5847942 -1456527 -3228364 -1080695
42356 -1080695 -1862669 -5223485 -4696924 535337 4626255 5981821 9466923 15563039
42348 15563039 16590001 8049474 -3660188 -9788088 -9663187 -8012925 -7318576 -7779756
$$ packed form
42407f549806N299632R736411N751446j035107k259637j22333j424967m955119
42399D440520m658248r02082P04265j143500l030629l419612k670945N01548N519625
42390d659058O301559q27867q501460o557106K805041P563069L269806j738072
42382b344088j40792M364230M538297J33161l585216l467656q51718J177924P52226
42373E76368q82047l15159L077713M700026P79902n230168p112235m569773j585631
42364a0561004J452860O271324R118676M266857m700771p304469j771837K147669
42356a080695p81974l360816N26561N232261M090918J355566L485102O096116
42348A5563039J026962q540527j1709662o127900J24901J650262O94349m61180
$$ plain form
42340 -7779756 -10028917 -12636655 -11193083 -5249702 -1995237 -6732554 -13148496 -10422919
42332 -10422919 1716703 12518081 14608003 11660131 10219928 10491347 8749759 4314923
42324 4314923 -324532 -4286678 -9267189 -15694202 -20321268 -18973745 -11591132 -3620563
42316 -3620563 -908787 -2981568 -3538142 1101992 6577857 6121578 -552557 -7676609
42308 -7676609 -11292762 -12158595 -11286103 -7985275 -3774260 -3114465 -7026437 -9786160 -6087920
42299 -6087920 939683 3326297 -1307813 -7428461 -9667245 -8594556 -6855664 -3762921
42291 -3762921 2631025 10230512 13916324 11989363 8371038 7419392 9039662 10225810
42283 10225810 9202373 6181035 1879183 -2299303 -3886951 -1881659 953122 921318
$$ packed form
42340g779756k249161k607738J443572N943381L254465m737317o415942K725577
42332a0422919J2139622J0801378K089922k947872j440203K71419j741588m434836
42324D314923m639455l962146m980511o427013m627066J347523P382613P970569
42316c620563K711776k072781n56574M640134N475865m56279o674135p124052
42308g676609l616153q65833Q72492L300828M211015O59795l911972k759723L698240
42299f087920P027603K386614m634110o120648k238784J072689J738892L092743
42291c762921O393946P599487L685812j926961l618325r51646J620270J186148
42283A0225810j023437l021338m301852m178486j587648K005292K834781l1804
$$ plain form
42275 921318 -1845431 -4031146 -4025561 -3045022 -1710598 488731 1810961 -1018677 -6728745
42266 -6728745 -8471773 -2012927 8418852 15697953 17932269 17271979 13984198 7045457
42258 7045457 -1142402 -6104286 -6980029 -6404788 -5363642 -2914989 -562545 -1468959 -4788470
42249 -4788470 -6152627 -4929372 -5444969 -8987635 -10397059 -6204766 -1057848 -1026437 -4242546
42240 -4242546 -4130508 -40680 1583141 -3060908 -9601297 -11659420 -8765708 -5403795
42232 -5403795 -4474789 -4914835 -5213061 -6106061 -8352036 -9908800 -8230913 -5115581 -5767467
42223 -5767467 -11257365 -15114091 -11209961 -3194551 -997642 -7718189 -15140309 -14418765
42215 -14418765 -6947807 -1188947 -1617493 -4883312 -5728146 -2980194 553696 1625799
$$ packed form
42275I21318k766749k185715N585R80539J334424K199329J322230k829638n710068
42266f728745j743028O458846J0431779P279101K234316o60290l287781o938741
42258G045457q187859m961884q75743N75241J041146K448653K352444r06414l319511
42249d788470j364157J223255n15597l542666j409424M192293N146918L1411l216109
42240d242546J12038M089828J623821m644049o540389k058123K893712L361913
42232e403795R29006m40046k98226q93000k245975j556764J677887L115332o51886
42223e767467n489898l856726L904130Q015410K196909o720547p422120P21544
42215a4418765P470958N758860m28546l265819q44834K747952L533890J072103
$$ plain form
42207 1625799 -748602 -4812797 -7702764 -7848784 -5774489 -2984873 -1124248 -1830371
42199 -1830371 -5526066 -10084173 -12408959 -11497338 -8263408 -3041853 3706369 8592320
42191 8592320 7521839 1793805 -2216400 -1260104 962006 371215 -1438672 -930541 1495976
42182 1495976 3222059 3886141 4378806 4272102 3886226 5757721 10157639 12648632 10614496
42173 10614496 8466317 10819273 14108434 11771726 5001287 788827 1079468 1817384
42165 1817384 1712873 3443365 6184025 5791423 3372397 4567072 8437114 6812398
42157 6812398 -1797830 -7663504 -4829427 -1127929 -5277518 -12177506 -11251514 -3789637
42149 -3789637 -579125 -4902047 -9242246 -8905473 -8129901 -10091310 -10419005 -5819797 -2046107
$$ packed form
42207A625799k374401m064195k889967j46020K074295K789616J860625p06123
42199a830371l695695m558107k324786R11621L233930N221555O748222M885951
42191H592320j070481n728034m010205R56296K222110n90791j809887N08131K426517
42182A495976J726083O64082M92665j06704l85876J871495M399918K490993k034136
42173A0614496k148179K352956L289161k336708o770439m212460K90641P37916
42165A817384j04511J730492K740660l92602k419026J194675L870042j624716
42157F812398q610228n865674K834077L701498m149589o899988R25992P461877
42149c789637L210512m322922m340199L36773P75572j961409l27695M599208L773690
$$ plain form
42140 -2046107 -6436977 -16231691 -21096321 -16633963 -9875072 -9796488 -16123903 -20715789
42132 -20715789 -18712895 -14368259 -14195509 -17497658 -17855581 -13018390 -7985192 -6730609
42124 -6730609 -6066417 -1609655 3948380 3847189 -3050812 -10572042 -13043641 -10663850
42116 -10663850 -6834515 -3871486 -2241837 -1203001 738822 4058018 6734673 6518745
42108 6518745 4294683 2707370 1850911 -478471 -3902226 -4206071 1458167 10229312
42100 10229312 15878684 14433895 7128915 -750872 -3777374 -880192 3720785 5476825
42092 5476825 4905949 5712168 8104199 7981840 4147287 2278377 7951801 17668260 21315096
42083 21315096 14020876 1953292 -5391127 -5721422 -3761251 -2692015 -884622 2244068
$$ packed form
42140b046107m390870r794714m864630M462358O758891P8584o327415m591886
42132b0715789K002894M344636J72750l302149l57923M837191N033198J254583
42124f730609O64192M456762N558035j01191o898001p521230k471599K379791
42116a0663850L829335K963029J629649J038836J941823L319196K676655k15928
42108F518745k224062j587313q56459k329382l423755l03845N664238Q771145
42100A0229312N649372j444789p304980p879787l026502K897182M600977J756040
42092E476825n70876Q06219K392031j22359l834553j868910N673424R716459L646836
42083B1315096p294220j2067584p344419l30295J960171J069236J807393L128690
$$ plain form
42075 2244068 2697218 -2006001 -7173056 -6661690 -1793866 1415459 2096858 4103089 6299886
42066 6299886 2638491 -5728048 -8174596 71267 8940287 7416037 -723431 -3970934
42058 -3970934 -16737 4618708 7489486 11288658 14218991 11072939 3845263 278863
42050 278863 1135372 -210619 -4318880 -3614120 3336908 7341398 3161148 -2465388 -3101490
42041 -3101490 -2095390 -2973411 -1333631 4821100 6998743 -530931 -8280976 -5099526
42033 -5099526 2880744 1236712 -9328376 -14061019 -7423628 9143 -163642 -2997424
42025 -2997424 -1744811 1474940 2691551 4046713 7775943 9634914 5310435 -1954669
42017 -1954669 -6228165 -7006350 -7141899 -6795628 -4925300 -3492029 -4718752 -6308131 -4171244
$$ packed form
42075B244068M53150m703219n167055N11366M867824L209325O81399K006231K196797
42066F299886l661395q366539k446548Q245863Q869020j524250q139468l247503
42058c970934L954197M635445K870778L799172K930333l146052p227676l566400
42050B78863Q56509j345991m108261P04760O951028M004490m180250n626536o36102
42041c101490J006100q78021J639780O154731K177643p529674p750045L181450
42033e099526P980270j644032j0565088m732643O637391P432771j72785k833782
42025b997424J252613L219751J216611J355162L729230J858971m324479p265104
42017a954669m273496p78185j35549L46271J870328J433271j226723j589379K136887
$$ plain form
42008 -4171244 1499938 6710921 8826473 7971547 4808859 264019 -3511545 -4736611
42000 -4736611 -3966541 -2680970 -1181881 396234 660516 -1380580 -4518591 -6913702
41992 -6913702 -8178354 -8629819 -8160390 -7076708 -6116127 -4560059 -890519 3347410 3612660
41983 3612660 -1278589 -5838745 -4126284 2859523 9007414 10263773 6807571 238637
41975 238637 -7207475 -11690564 -10489227 -6223375 -4936108 -8857796 -13428791 -12614047
41967 -12614047 -5590774 2806914 7371430 7470038 6809403 8422497 10620560 9292196
41959 9292196 3969571 -708403 -453986 3700890 6864292 4896925 -2941287 -13213609
41951 -13213609 -19080534 -15019524 -2782795 9851204 17583803 21435995 22908312 19991455
$$ packed form
42008d171244N671182N210983K115552q54926l162688m544840l775564j225066
42000d736611P70070J285571J499089J578115K64282k041096l138011k395111
41992f913702j264652m51465M69429J083682R60581J556068L669540M237929K65250
41983C612660m891249m560156J712461O985807O147891J256359l456202o568934
41975B38637p446112m483089J201337M265852J287267l921688m570995Q14744
41967a2614047P023273Q397688M564516R8608o60635J613094K198063j328364
41959I292196n322625m677974K54417M154876L163402j967367p838212j0272322
41951a3213609n866925M061010J2236729J2633999P732599L852192J472317k916857
$$ plain form
41943 19991455 12916274 8347144 11427304 17294831 17516469 12316542 8740640 8474715
41935 8474715 6389418 1305345 -1068510 1788009 4739223 4247016 4208429 7595637 9377445
41926 9377445 4292386 -3672600 -6564433 -3463036 434693 2511538 3561240 2434469
41918 2434469 -2526095 -7641364 -6814947 -525589 4657546 5929315 6819958 8863866
41910 8863866 8055410 2508981 -2951936 -4051206 -3525759 -5616934 -8633299 -8399152 -5722541
41901 -5722541 -4705828 -5816338 -6171276 -5187946 -4440443 -2992346 1150085 5159812 3473987
41892 3473987 -2887551 -5427854 299278 7578769 7322318 119623 -5541362 -4864284
41884 -4864284 -1368728 -444655 -2812444 -5304170 -5155061 -2393633 417662 462390 -2201153
$$ packed form
41943A9991455p075181m569130L080160N867527K21638n199927l575902k65925
41935H474715k085297n084073k373855K856519K951214m92207l8587L387208J781808
41926I377445n085059p964986k891833L101397L897729K076845J049702j126771
41918B434469m960564n115269Q26417O289358N183135J271769Q90643K043908
41910H863866q08456n546429n460917j099270N25447k091175l016365K34147K676611
41901e722541J016713j110510l54938R83330P47503J448097M142431M009727j685825
41892C473987o361538k540303N727132P279491k56451p202695n660985O77078
41884d864284L495556R24073k367789k491726J49109K761428K811295M4728k663543
$$ plain form
41875 -2201153 -4369882 -3853134 -2496018 -2902318 -3903112 -2754939 -549897 -713687 -2178621
41866 -2178621 432260 8021548 13748348 12085845 6821378 5319937 7989032 9054793
41858 9054793 6026111 2147127 -498090 -3964400 -8683372 -10438748 -6771179 -2257010
41850 -2257010 -2793713 -7047092 -8331993 -3918699 2246898 6269719 9197077 13441933
41842 13441933 17794701 18828976 15624456 10666223 6747740 4653895 3281223 662758
41834 662758 -4376062 -10087423 -12066907 -7503871 1027282 7630403 8879433 6231946
41826 6231946 3159312 1755383 1939593 1733515 -1898943 -10022429 -18787036 -21934547
41818 -21934547 -17475558 -9798733 -4078197 -1119807 794235 2120619 2897510 4625466
$$ packed form
41875b201153k168729N16748J357116m06300j000794J148173K205042j63790j464934
41866b178621K610881P589288N726800j662503n264467j501441K669095J065761
41858I054793l028682l878984k645217l466310m718972j755376L667569M514169
41850b257010n36703m253379j284901M413294O165597M022821K927358M244856
41842A3441933M352768J034275l204520m958233l918483k093845j372672k618465
41834F62758n038820n711361j979484M563036Q531153O603121J249030k647487
41826F231946l072634j403929J84210k06078l632458q123486q764607l147511
41818b1934547M458989P676825N720536K958390J914042J326384P76891J727956
$$ plain form
41810 4625466 7575807 8133751 3055259 -4678947 -8659138 -7377067 -5406811 -6147837
41802 -6147837 -8006205 -8640311 -8161405 -6142233 1123 10427455 19967006 23213693
41794 23213693 20368207 15315231 10202419 4905942 -114250 -3687733 -5523598 -5470840
41786 -5470840 -2678862 2037715 4770918 2489977 -2804162 -6719629 -7923179 -7907735
41778 -7907735 -6732851 -2854425 3166467 8402301 11350926 13173233 14993900 16598643
41770 16598643 17861215 18793896 18031876 13932218 7579739 2329395 -95604 -1142746
41762 -1142746 -3100971 -7125226 -12991642 -18373439 -19055847 -13025261 -4207837 1018067
41754 1018067 1048998 -366009 -483073 -382295 -967247 -816218 116969 -1202334 -6116330
$$ packed form
41810D625466K950341N57944n078492p734206l980191J282071J970256p41026
41802f147837j858368o34106M78906K019172O143356J0426332R539551L246687
41794B3213693k845486n052976n112812n296477n020192l573483j835865N2758
41786e470840K791978M716577K733203k280941n294139l915467j203550J5444
41778g907735J174884L878426O020892N235834K948625J822307J820667J604743
41770A6598643J262572R32681p62020m099658o352479n250344k424999j047142
41762a142746j958225m024255n866416n381797o82408O030586Q817424N225904
41754A018067L0931j415007j17064J00778n84952J51029R33187j319303m913996
$$ plain form
41745 -6116330 -10863483 -10805673 -5942171 -24089 3670485 3805008 849786 -2218498 -1627535
41736 -1627535 2203957 3868480 41812 -5137818 -5309182 -425103 4079014 5214288
41728 5214288 4846920 4563831 3117529 210458 -1452405 -286855 986290 -956287
41720 -956287 -4997709 -6965219 -5109920 -1668454 801497 2222790 3511912 4335649
41712 4335649 3972277 3429169 4676133 7425466 8207208 3875381 -4303522 -10898673 -10915992
41703 -10915992 -4381564 3258909 5839144 2780491 257561 4000102 11147052 12739530
41695 12739530 5505162 -3136031 -5119872 -2730166 -4007763 -9781549 -12532909 -8163097
41687 -8163097 -1537955 1822044 2881685 4203202 3801432 -629068 -5271741 -4162065
$$ packed form
41745f116330m747153N7810M863502N918082L694574J34523k955222l068284N90963
41736a627535L831492J664523l826668n179630j71364M884079M504117J135274
41728E214288l67368k83089j446302k907071j662863J165550J273145j942577
41720i56287m041422j967510J855299L441466K469951J421293J289122Q23737
41712D335649l63372n43108J246964K749333P81742m331827q178903o595151j7319
41703a0915992O534428P640473K580235l058653k522930L742541P146950J592478
41695A2739530p234368q641193j983841K389706j277597n773786k751360M369812
41687h163097O625142L359999J059641J321517m01770m430500m642673J109676
$$ plain form
41679 -4162065 1971567 6123742 3864716 -2378612 -7648207 -9288729 -7365141 -3756777
41671 -3756777 -1594515 -2944930 -6204878 -7750928 -6703226 -6025093 -7804019 -8986524
41663 -8986524 -3948877 8000393 19026898 19366311 8660833 -2131314 -3393758 970412
41655 970412 -583240 -10221345 -17114403 -12920498 -3253392 1427560 259318 267958 4169389
41646 4169389 7772531 8172795 7329673 7150738 6712745 5032090 2000584 -3639839 -12778769
41637 -12778769 -22239881 -26984593 -26236047 -23347464 -19951679 -15076169 -9948796 -8008909
41629 -8008909 -9032951 -8608995 -5198503 -2651434 -3408023 -4039278 -704289 4906036 8529610
41620 8529610 9146385 8405125 6728945 3659086 740047 751469 4201138 8578395 11033859
$$ packed form
41679d162065O133632M152175k259026o243328n269595j640522J923588L608364
41671c756777K162262j350415l259948j546050J047702O78133j778926j182505
41663h986524N037647J1949270J1026505L39413j0705478j0792147j262444M364170
41655I70412j553652r638105o893058M193905R667106M680952j168242Q640L901431
41646D169389L603142M00264q43122j78935m37993j680655l031506n640423r138930
41637a2778769r461112m744712P48546K888583L395785M875510N127373J939887
41629h008909j024042M23956L410492K547069p56589o31255L334989N610325L623574
41620H529610O16775p41260j676180l069859k919039J1422L449669M377257K455464
$$ plain form
41611 11033859 10664637 8458637 5928530 3922514 2519004 1506128 -77048 -4318506
41603 -4318506 -11639681 -17316374 -15084982 -6336773 -646525 -3025165 -6071253 -1340107
41595 -1340107 6605030 7002007 555867 -1440724 4395084 8382573 4325063 -725714
41587 -725714 635779 3865947 1319258 -4667958 -6814557 -5248868 -5441566 -7637927
41579 -7637927 -7387213 -4462329 -3177447 -4862901 -6669425 -6772623 -4997853 3414
41571 3414 8306101 15372387 17328863 17588667 21480282 26132005 23615276 13752573 5654324
41562 5654324 5160298 7973188 7621422 4051306 1163399 488579 582689 -196053 -2514960
41553 -2514960 -5691566 -7726527 -7633702 -7215576 -8054348 -8301935 -6110076 -4323874 -6688916
$$ packed form
41611A1033859l69222k206000k530107k006016j403510j012876j583176m241458
41603d318506p321175n676693K231392Q748209N690248k378640l046088M731146
41595a340107P945137L96977o446140j996591N835808L987489m057510n050777
41587g25714J361493L230168k546689n987216k146599J565689j92698k196361
41579g637927K50714K924884J284882j685454j806524j03198J774770N001267
41571C414Q302687P066286J956476K59804L891615M651723k516729r862703q098249
41562E654324m94026K812890l51766l570116k887907o74820R4110p78742k318907
41553b514960l176606k034961R2825M18126q38772k47587K191859J786202k365042
$$ plain form
41544 -6688916 -10779261 -10690081 -6182441 -2695400 -2201142 -1100843 1687232 1959690 -1909824
41535 -1909824 -5268284 -4964408 -4711381 -8378390 -13155156 -14023421 -10659299 -5414947 1304941
41526 1304941 8686040 12424346 9849872 5571757 6141262 10486806 11268584 5407057
41518 5407057 -1852904 -4062144 -611217 4573371 8188666 9653660 9794435 9037140
41510 9037140 6775252 2412005 -2921647 -6519515 -6550577 -3623003 394687 4016757
41502 4016757 6420996 7586492 8375264 8804174 6463678 -589060 -9120312 -12550639
41494 -12550639 -9004286 -4085758 -3422434 -5777310 -6670020 -5916051 -7273596 -11838643
41486 -11838643 -15945297 -15935943 -12139914 -7505237 -4311226 -3041129 -3321875 -4884558 -7087204
$$ packed form
41544f688916m090345Q9180M507640L487041M94258J100299K788075K72458l869514
41535a909824l358460L03876K53027l667009m776766q68265L364122N244352O719888
41526A304941P381099L738306k574474m278115N69505M345544P81778n861527
41518E407057p259961k209240L450927N184588L615295J464994J40775p57295
41510I037140k261888m363247n333652l597868l1062K927574M017690L622070
41502D016757K404239J165496P88772M28910k340496p052738q531252l430327
41494a2550639L546353M918528O63324k354876q92710P53969j357545m565047
41486a1838643m106654R354L796029M634677L194011J270097k80746j562683k202646
$$ plain form
41477 -7087204 -7508713 -2707669 7377274 16654860 17945290 11327691 4117263 1631954
41469 1631954 1716029 108639 -2779250 -3503374 -993733 2903815 6066085 6623854 3471832
41460 3471832 -846084 -666300 5700743 11982903 11230260 4844995 -387842 -2369043
41452 -2369043 -4904420 -9256615 -10823510 -6288880 712603 4168292 2948775 547138
41444 547138 -418907 -253483 555479 2823085 6068272 6558078 992682 -7714332 -11811391
41435 -11811391 -8292548 -4080536 -7153607 -14514741 -15509079 -7092058 2091440 5487260
41427 5487260 8062484 15868594 23262871 19760306 6130391 -5852092 -8957655 -7271358
41419 -7271358 -6930567 -8267923 -9359600 -10349820 -10824686 -8164565 -2011716 3517272 4974709
$$ packed form
41477g087204m21509M801044J0084943R277586J290430o617599p210428k485309
41469A631954Q4075j607390k887889p24124K509641L897548L162270N57769l152022
41460C471832m317916J79784O367043O282160p52643o385265n232837j981201
41452b369043k535377m352195j566895M534630P001483L455689j219517k401637
41444E47138r66045J65424Q08962K267606L245187M89806n565396q707014m097059
41435a1811391L518843M212012l073071p361134r94338Q417021R183498L395820
41427E487260K575224P806110P394277l502565j3629915j1982483l105563J686297
41419g271358L40791j337356j091677r90220m74866K660121O152849N528988J457437
$$ plain form
41410 4974709 3669964 2363652 1187545 -833946 -3131883 -4590126 -4693217 -2357736
41402 -2357736 3240958 9270811 10407430 5683933 905734 1768758 7607490 14436051
41394 14436051 20687551 26222414 28393898 24005133 14770140 6942045 4661507 5884034
41386 5884034 5617581 1809585 -2680147 -3467703 393385 5161996 6432149 3712342
41378 3712342 7874 -2323887 -3602127 -5221579 -7870362 -10957946 -12181985 -8765160
41370 -8765160 -1465793 4069343 3373689 -507368 -987248 2360472 3267645 -1391477 -6634461
41361 -6634461 -6391323 -1020970 4735803 7539802 6627896 2620115 -2115398 -4526728
41353 -4526728 -4355667 -4113664 -4653794 -4356541 -3648910 -5518604 -9629635 -11095627 -7812070
$$ packed form
41410D974709j304745j306312j176107k021491k297937j458243j03091K335481
41402b357736N598694O029853J136619m723497m778199Q63024N838732O828561
41394A4436051O251500N534863K171484m388765r234993p828095k280538J222527
41386E884034k66453l807996m489732p87556L861088M768611J270153k719807
41378C712342l704468k331761j278240j619452k648783l087584j224039L416825
41370h765160P299367N535136o95654l881057m79880L347720R07173m659122n242984
41361f634461K43138N370353N756773K803999r11906m007781m735513k411330
41353d526728J71061K42003n40130K97253P07631j869694m111031j465992L283557
$$ plain form
41344 -7812070 -3720563 -1529834 1989613 8940831 14284301 12784350 7151056 2871657
41336 2871657 -566077 -6016966 -10345815 -8438194 -2989091 -1083942 -2168407 969377
41328 969377 8750935 12110632 5970909 -3058025 -6423876 -4098771 -1010117 733930
41320 733930 938962 -2268968 -9292745 -15444368 -15726349 -11366810 -7449716 -5873309 -4687780
41311 -4687780 -2896631 -1616047 -909546 674388 2949921 3558967 1704481 267561
41303 267561 2521677 7548611 10587416 8457146 3529908 845247 1717399 2567417 618040
41294 618040 -2347278 -3793563 -4695226 -6585847 -7255777 -4202238 -468772 -1337858 -5902059
41285 -5902059 -8073313 -6402607 -6324574 -10584795 -13721861 -9920266 -1652375 3877655
$$ packed form
41344g812070M091507K190729L519447O951218N343470j499951n633294m279399
41336B871657l437734n450889m328849J907621N449103J905149j084465L137784
41328I69377P781558L359697o139723r028934l365851K325105L088654J744047
41320G33930K05032l207930p023777o151623k81981M359539L917094J576407J185529
41311d687780J791149J280584P06501J583934K275533O09046j854486j436920
41303B67561K254116N026934L038805k130270m927238k684661Q72152Q50018j949377
41294F18040k965318j446285r01663j890621o69930L053539L733466q69086m564201
41285e902059k171254J670706P8033m260221l137066L801595Q267891N530030
$$ [...]
##END NTUPLES=NMR SPECTRUM
##END=
