##TITLE=31Pdec_LR-689-A-CK-1
 CDcl3, 24 sc
 23.10.2019
##JCAMPDX= 6.0         $$ Bruker NMR JCAMP-DX V2.0
##DATA TYPE= NMR SPECTRUM
##DATA CLASS= NTUPLES
##ORIGIN= UXNMR, Bruker Analytische Messtechnik GmbH
##OWNER= root
$$ XWIN-NMR		Version 3.5
$$ Wed Oct 23 15:45:27 2019 Russian Standard Time (UT+4h)  she@DPX200
##.OBSERVE FREQUENCY= 81.013821
##.OBSERVE NUCLEUS= ^31P
##.ACQUISITION MODE= SIMULTANEOUS
##.ACQUISITION SCHEME= undefined
##.AVERAGES= 24
##.DIGITISER RES= 17
##SPECTROMETER/DATA SYSTEM= spect
##.PULSE SEQUENCE= zgpg30
##.SOLVENT NAME= CDCl3
##.SHIFT REFERENCE= (INTERNAL, CDCl3, 0, 182.463)
##AUDIT TRAIL= $$ (NUMBER, WHEN, WHO, WHERE, WHAT)
$$ ##TITLE= Audit trail, XWIN-NMR		Version 3.5
$$ ##JCAMPDX= 5.01
$$ ##ORIGIN= Bruker BioSpin GmbH
$$ ##OWNER= she
$$ F:/spectra/data/she/nmr/P31/1/pdata/1/auditp.txt
$$ ##AUDIT TRAIL=  $$ (NUMBER, WHEN, WHO, WHERE, WHAT)
(   1,<2019-10-23 15:44:07.14 +0400>,<she>,<DPX200>,
      <created by zg, POWCHK disabled, PULCHK disabled
       configuration hash MD5:
       00 E9 B6 7A A2 85 ED C7 34 08 36 98 17 FE 4E 26
       data hash MD5: 32K
       6B 47 6C E6 F0 89 65 81 75 25 BA C0 1C 89 79 2F>)
(   2,<2019-10-23 15:44:10.21 +0400>,<she>,<DPX200>,
      <Start of raw data processing
       efp BC_mod = 2 LB = 1 FT_mod = 6 PKNL = 1 PHC0 = -946.1938 PHC1 = 579.2007 SI = 64K 
       data hash MD5: 64K
       F8 AA 61 1C 66 74 FE 94 5F 94 5F F7 6F EB 28 01>)
(   3,<2019-10-23 15:44:20.28 +0400>,<she>,<DPX200>,
      <pk PHC0 = 39.16602 PHC1 = 0 
       data hash MD5: 64K
       8C 89 FC 42 C8 44 60 98 5E D7 63 AD 3A A9 86 0D>)
(   4,<2019-10-23 15:44:48.98 +0400>,<she>,<DPX200>,
      <pk PHC0 = 30.18983 PHC1 = -86.8 
       data hash MD5: 64K
       52 2D 32 01 D7 57 83 AB BD 6E 9E CD C3 D0 AE 97>)
(   5,<2019-10-23 15:44:52.34 +0400>,<she>,<DPX200>,
      <abs ABSG = 5 
       data hash MD5: 64K
       BF 2A 49 FA 96 F2 B4 91 03 E7 84 8B 84 91 32 E6>)
$$ ##END=
$$ 
$$ hash MD5
$$ 35 A1 20 4E D6 67 E0 12 60 D7 AC B8 0F B4 6A 2E
##$RELAX= 
##$RELAX= 
##$RELAX= 
##$RELAX= 
##$RELAX= 
##$RELAX= 
##$RELAX= 
##$RELAX= 
$$ Bruker specific parameters
$$ --------------------------
##$DU= <F:/spectra>
##$EXPNO= 1
##$NAME= <P31>
##$PROCNO= 1
##$TYPE= <nmr>
##$USER= <she>
##$AMP= (0..31)
100 100 100 100 100 100 100 100 100 100 100 100 100 100 100 100 100 100 
100 100 100 100 100 100 100 100 100 100 100 100 100 100 
##$AQSEQ= 0
##$AQ_mod= 1
##$AUNM= <au_zg>
##$AUTOPOS= <>
##$BF1= 81.014009
##$BF2= 200.13
##$BF3= 200.13
##$BF4= 200.13
##$BF5= 200.13
##$BF6= 200.13
##$BF7= 200.13
##$BF8= 200.13
##$BYTORDA= 1
##$CFDGTYP= 0
##$CFRGTYP= 5
##$CHEMSTR= <none>
##$CNST= (0..31)
1 1 145 1 1 1 1 1 1 1 1 1 1 1 1 1 1 1 1 1 1 1 1 1 1 1 1 1 1 1 1 1 
##$CPDPRG= <waltz16>
##$CPDPRG1= <>
##$CPDPRG2= <waltz16>
##$CPDPRG3= <>
##$CPDPRG4= <mlev>
##$CPDPRG5= <mlev>
##$CPDPRG6= <mlev>
##$CPDPRG7= <mlev>
##$CPDPRG8= <mlev>
##$CPDPRGB= <>
##$CPDPRGT= <>
##$D= (0..31)
0 1 0 0 0 0 0 0 0 0 0 0.03 2e-05 3e-06 0 0 0 0 0 0 0 0 0 0 0 0 0 0 0 0 
$$ [...]
##$SUBNAM3= <"">
##$SUBNAM4= <"">
##$SUBNAM5= <"">
##$SUBNAM6= <"">
##$SUBNAM7= <"">
##$SUBNAM8= <"">
##$SUBNAM9= <"">
##$SW= 369.568048894756
##$SWIBOX= (0..15)
0 1 3 0 0 0 0 0 0 0 0 0 0 0 0 0 
##$SW_h= 29940.119760479
##$TD= 32768
##$TD0= 1
##$TE= 0
##$TE2= 300
##$TE3= 300
##$TEG= 300
##$TL= (0..7)
0 120 53 12 22 120 120 120 
##$TP= (0..7)
150 150 150 150 150 150 150 150 
##$TP07= 0
##$TPNAME0= <>
##$TPNAME1= <>
##$TPNAME2= <>
##$TPNAME3= <>
##$TPNAME4= <>
##$TPNAME5= <>
##$TPNAME6= <>
##$TPNAME7= <>
##$TPOAL= (0..7)
0.5 0.5 0.5 0.5 0.5 0.5 0.5 0.5 
##$TPOFFS= (0..7)
0 0 0 0 0 0 0 0 
##$TUNHIN= 0
##$TUNHOUT= 0
##$TUNXOUT= 0
##$USERA1= <user>
##$USERA2= <user>
##$USERA3= <user>
##$USERA4= <user>
##$USERA5= <user>
##$V9= 5
##$VALIST= <valist>
##$VCLIST= <CCCCCCCCCCCCCCC>
##$VD= 0
##$VDLIST= <DDDDDDDDDDDDDDD>
##$VPLIST= <PPPPPPPPPPPPPPP>
##$VTLIST= <TTTTTTTTTTTTTTT>
##$WBST= 1024
##$WBSW= 4
##$XGAIN= (0..3)
0 0 0 0 
##$XL= 0
##$YL= 0
##$YMAX_a= 14345
##$YMIN_a= -17866
##$ZGOPTNS= <>
##$ZL1= 120
##$ZL2= 120
##$ZL3= 120
##$ZL4= 120
##$ABSF1= 182.463
##$ABSF2= -187.1042
##$ABSG= 5
##$ABSL= 3
##$ALPHA= 0
##$AQORDER= 0
##$ASSFAC= 0
##$ASSFACI= 0
##$ASSFACX= 0
##$ASSWID= 0
##$AUNMP= <proc_1d>
##$AZFE= 0.1
##$AZFW= 0.5
##$BCFW= 0
##$BC_mod= 2
##$BYTORDP= 0
##$COROFFS= 0
##$CY= -3
##$DATMOD= 1
##$DC= 0
##$DFILT= <>
##$DTYPP= 0
##$F1P= 0
##$F2P= 0
##$FCOR= 1
##$FTSIZE= 65536
##$FT_mod= 6
##$GAMMA= 0
##$GB= 0
##$INTBC= 1
##$INTSCL= 5.30512e-09
##$ISEN= 30
##$LB= 1
##$LEV0= 0
##$LPBIN= 0
##$MAXI= 10000
##$MC2= 0
##$MEAN= 0
##$ME_mod= 0
##$MI= 50
##$NCOEF= 0
##$NC_proc= -7
##$NLEV= 6
##$NOISF1= 182.463
##$NOISF2= 159.3651
##$NSP= 0
##$NTH_PI= 0
##$NZP= 0
##$OFFSET= 182.463
##$PC= 4
##$PHC0= -876.838
##$PHC1= 492.4007
##$PH_mod= 1
##$PKNL= yes
##$PPARMOD= 0
##$PSCAL= 0
##$PSIGN= 0
##$REVERSE= no
##$SF= 81.0140089999434
##$SI= 65536
##$SIGF1= 159.3651
##$SIGF2= -187.1042
##$SINO= 113.3802
##$SIOLD= 16384
##$SREGLST= <1H.CDCl3>
##$SSB= 0
##$STSI= 65536
##$STSR= 0
##$SW_p= 29940.119760479
##$SYMM= 0
##$S_DEV= 0
##$TDeff= 32768
##$TDoff= 0
##$TI= <>
##$TILT= no
##$TM1= 0
##$TM2= 0
##$TOPLEV= 0
##$USERP1= <user>
##$USERP2= <user>
##$USERP3= <user>
##$USERP4= <user>
##$USERP5= <user>
##$WDW= 1
##$XDIM= 65536
##$YMAX_p= 341476552
##$YMIN_p= -17288956
$$ End of Bruker specific parameters
$$ ---------------------------------
##NTUPLES= NMR SPECTRUM
##VAR_NAME=  FREQUENCY,     SPECTRUM/REAL,   SPECTRUM/IMAG
##SYMBOL=    X,             R,               I
##VAR_TYPE=  INDEPENDENT,   DEPENDENT,       DEPENDENT
##VAR_FORM=  AFFN,          ASDF,            ASDF
##VAR_DIM=   65536,         65536,           65536
##UNITS=     HZ,            ARBITRARY UNITS, ARBITRARY UNITS
##FACTOR=    0.456856943014862, 1,           1
##FIRST=     14782.0589164792, 0,            0
##LAST=      -15158.0608439998, 0,           0
##MIN=       -15158.0608439998, -17288956,   0
##MAX=       14782.0589164792, 341476552,    0
$$ Real data points
##PAGE= N=1
##DATA TABLE= (X++(R..R)), XYDATA
$$ [...]
46237a854817K07618O97224m81066j605853r74786J78893L35426K90936R23759
46228b282666J161565M13506K42736J226790J073688j310502k842205q31379K174312
46219i74155K213276K59693J8820J161335K60557k278207k213710R82980K413738
46210A844327n24188l923049l610038j030186N01020J407304L518169N188342
46202C371701L510392l22619k408516j975713j566867j866235p80496J896616
46194a41737L179491J643128j65063k086N22242q39517k761488k412125j04810
46185a081965J342022J067744P67425J026655M33156r99211r24995J090280J539910
46176D261021j881269n425097l594142K622180O263473L693536r88250k613203
$$ y = [-1854817, -1647199, -949975, -1431041, -3036894, -4011680, -3832787, -3497361, -3206425, -2282666, -1121101, -707595, -464859, 761931, 1835619, 525117, -2317088, -3148467, -974155, 1239121, 1498814, 1517634, 2678969, 2939526, 661319, -1552391, -569411, 1844327, 1320139, -2602910, -6212948, -7243134, -6742114, -5334810, -1816641, 3371701, 6882093, 6559474, 4150958, 2175245, 608378, -1257857, -2038353, -141737, 3037754, 4680882, 4515819, 4513733, 5035975, 4196458, 1434970, -977155, -1081965, 260057, 1327801, 2095226, 3121881, 3555037, 2555826, 1630831, 2721111, 4261021, 2379752, -3045345, -6639487, -4017307, 2246166, 5939702, 4951452, 2338249]
46168B338249j805432j902503k514600r24609J925819K119036p55432k704806
46160d224278j702529l81777q70324j331132o648J271683O98299J99372J939510
46151d407824M025061L715245K446465L047908L872850J104797l904853n438275
46143D461374k134324P53372l68508k187929o06818K373884K191643p91244k070698
46134A620752k0686K173176J603588p39523k095045j278523P91513K237122J465735
46125E758109j347006l794698l540896j210725L15021l03655j136086L01248L512898
46116a445790N168140K837320j830491m337712k312889J385624K008968q66316
46108F06854k768155o96120K657295L093893R86621J8962J173898J656764k27689
$$ y = [2338249, 532817, -1369686, -3884286, -4808895, -2883076, -764040, -1519472, -4224278, -5926807, -6308584, -7178908, -8510040, -8516688, -7245005, -6546706, -6347334, -4407824, -382763, 3332482, 5778947, 8826855, 12699705, 13804502, 9899649, 4461374, 2327050, 3080422, 2711914, 523985, -82833, 2291051, 4482694, 3691450, 1620752, 1600066, 3773242, 5376830, 4637307, 2542262, 1263739, 2055252, 4292374, 5758109, 4411103, 616405, -2924491, -4135216, -3820195, -4123850, -5259936, -4958688, -1445790, 3722350, 6559670, 4729179, 391467, -1921422, -535798, 1473170, 606854, -2161301, -2857421, -200126, 2893767, 3880388, 3899350, 5073248, 6730012, 6502323]
46099F502323k515870k758330j107103Q22777K024488J997954M88183j590917
46091C863505k549006k096450j621670j722384j314645P4821J193631J270372
46083b901826J291793J869292J914155Q73085J59441O27759P36897p00727j981658
46074A888211j175567N12599Q04035J34192L01295P65842j46504j335164j92517
46065A556422K491386K973270L61853j915192j405739K80111R67644R16888O48303
46056F874946p21077k819327l029926p11973Q24770m06952j158439J590798M218160
46047D660980J140071n445786o940126m34441O459665N735731o28345m513701
46039C4048k876449j46979l09745j589442n51854K105052K841079P80699j235677
$$ y = [6502323, 3986453, 1228123, 121020, 943797, 2968285, 4966239, 5454422, 3863505, 1314499, -781951, -2403621, -4126005, -5440650, -5365829, -4172198, -2901826, -1610033, 259259, 2173414, 3046499, 3205940, 3833699, 4570596, 3869869, 1888211, 712644, 1225243, 2029278, 2163470, 2464765, 3230607, 3084103, 1748939, 1556422, 4047808, 7021078, 7382931, 5467739, 4062000, 4342111, 5309755, 6226643, 6874946, 6153869, 3334542, 304616, -407357, 417413, 10461, -1147978, 442820, 4660980, 5801051, 355265, -6584861, -7019302, -559637, 5176094, 4547749, 34048, -2842401, -2989380, -3299125, -4888567, -5440421, -3335369, -494290, 286409, -949268]
46030i49268j177713o08938j606305l026849k235305M68478J969913R39425m66137
46021f692699l11335M34925M84191R05233K760664M104904K486461p25957j879926
46012A566461m55736M72599o08084j521757m93678Q36402M24399o11790R9983
46003b91201K126183K532186q6670l621133m697671k173481J592394K862284M43303
45994a313806k704021k854066j77154J817800J402966N26825Q39377R40774l79697
45985a901002r88053J335893M387816M059912N38510j922305j483023r80858k565708
45976D81182l874959k050756J234916K105326L78138l91098J378932K846979J147194
45967C255854k247493l516919j520784J237859K229196J533192N97670R586n97048
$$ y = [-949268, -2126981, -2735919, -4342224, -7369073, -9604378, -9135900, -7165987, -6226562, -6692699, -7004034, -6569109, -6084918, -5179685, -2419021, 1685883, 4172344, 3446387, 1566461, 1110725, 1583324, 975240, -546517, -1040195, -203793, 220606, -391184, -291201, 1834982, 4367168, 4280498, 659365, -4038306, -6211787, -4619393, -1757109, -1313806, -4017827, -6871893, -7049047, -5231247, -3828281, -3301456, -2462079, -1521305, -1901002, -2889055, -1553162, 2834654, 6894566, 7433076, 5510771, 4027748, 3046890, 481182, -3393777, -5444533, -4209617, -2104291, -1726153, -2117251, -738319, 2108660, 3255854, 1008361, -2508558, -4029342, -2791483, -562287, 970905, 1568575, 1578161, 981113]
45958I81113j342790j729447j122693P09320K955171L639762J435880j965928
45950C560388k993427p56616J416082P66899o69860L69751K314654P41641l794649
45941I54863n140743n87415M279339L324807j247532k519607Q32858L306577J336393
45932D539540j956836k250443p7647J135344L30581p12235p01052q1026M77863
45923G04089Q33024O75524m26890k078774l092342k679418j081059R02297K411767
45914c831782K684027J530787o2270n15703N50851J527827O68074j404099k184081
45905a036369o47819J209832J235434K52846N48674K053448K416288Q03431q96704
45896E939061j189657q78090r58242r57591n36436m68081p44833j43850R00726
$$ y = [981113, -361677, -2091124, -3213817, -2504497, 450674, 4090436, 5526316, 3560388, 566961, -189655, 1226427, 1993326, 1323466, 1693217, 4007871, 4749512, 954863, -4185880, -4773295, -493956, 2830851, 1583319, -936288, -103430, 3203147, 4539540, 2582704, 332261, 254614, 1389958, 1720539, 1008304, 307252, 226226, 704089, 1537113, 2212637, 1785747, -293027, -3385369, -6064787, -7145846, -6243549, -3831782, -1147755, 383032, 320762, -194941, 355910, 1883737, 2551811, 1147712, -1036369, -1684188, -474356, 761078, 1013924, 1562598, 3616046, 6032334, 6835765, 5939061, 4749404, 3871314, 2913072, 1955481, 1419045, 950964, 206131, 62281, 963007]
45887I63007q2139l077371l960866m60562L379707K724590p11952j673552L49475
45878b549663J436973O05123N70771J294858m67543l922019l420608K276688O291394
45869B115974L383161k015366k731277N57152J749332o16185k299909j142288
45861i99406L37257L29833L22628J251205J598949Q17818Q15443K255978K628367
45852I358072J06320l187292l988843k188896k62217L39717K75091M52853P57861
45843A662666N92904k45571j255237j458304k81344J540451K436483J706589L21805
45834E020442k82942J51705N97430R4371j033097j492361p14038R3266o34990
45825A799786k376882k774905r08956J074803Q81068n34011l74911J687023K839974
$$ y = [963007, 880868, -2196503, -6157369, -6617931, -3238224, -513634, -1225586, -2899138, -2549663, -1112690, -507567, 63204, 1358062, 890519, -3031500, -6452108, -4175420, 2115974, 5499135, 3483769, 752492, 1309644, 3058976, 2442791, 142882, -999406, -662149, -332316, -9688, 1241517, 2840466, 3658284, 4473727, 6729705, 9358072, 9464392, 6277100, 2288257, 99361, -162856, 176861, 451952, 904805, 1662666, 2255570, 2009999, 754762, -703542, -984886, 555565, 2992048, 4698637, 5020442, 4737500, 4889205, 5486635, 5581006, 4547909, 3055548, 2341510, 2434776, 1799786, -577096, -3352001, -4260957, -3186154, -2305086, -2839097, -3214008, -1526985, 1312989]
45816A312989J192012j475462k269859j191020p48484j893036k370309j54958
45808g598127K973649L426977J002407o12244O09931J922442N65442j092229Q28704
45799B026952M579118M470877k26786l655349k289332J8545q93718k466679k78629
45790A284999L888353M626020J313632j841874k924663l650786m070754k005090
45782c380163J505185K036696j083106k745469J47974L478281K046317k630381
45774f24666m708753k021912K154579M204228L689642K103494P52061J91113K64020
45765F003806M59745O43742Q22004J54623k126914m386084l526879M04872K965580
45756A414495Q44583l278539m147546r55349K073821J732539n11851j425013j56232
$$ y = [1312989, 2505001, 1029539, -1240320, -2431340, -3179824, -5072860, -7443169, -7598127, -4624478, -1197501, -195094, -807338, -197407, 1725035, 2290477, 1198248, 2026952, 6606070, 11076947, 10850161, 7194812, 4905480, 4924025, 4030307, 1563628, 1284999, 5173352, 9799372, 11113004, 9271130, 6346467, 2695681, -1375073, -3380163, -1874978, 161718, -921388, -3666857, -3518883, -40602, 2005715, -624666, -5333419, -7355331, -5200752, -996524, 2693118, 4796612, 5548673, 5739786, 6003806, 6463551, 7107293, 7929297, 8083920, 5957006, 1570922, -1955957, -1551085, 1414495, 2259078, -1019461, -5167007, -6122356, -4048535, -2315996, -2827847, -4252860, -4409092]
45747d409092J641819K272806J367237l31114j537539j242217K52463J328347
45739f57290P46614p11835j009478M67413J737916O08228k199758l647081k199529
45730f864800N35441K538791L825444M846259M430724J649869j610350k705723
45722F645655k155970k637630m367950m586654j973437J352864L025093L037586
45714a660443K300283J014005m79844j316571j431030j389702o52883J541556
45706b074629L415535K045986j740822l490352j515042N76380k39626j790868
45698d813438q43478J600318K716960K763918L536630L993303J741829k164849
45690H531193l968950k483798k92547K76418m55364j173810j256068p36249k69719
$$ y = [-4409092, -2767273, -494467, 872770, 541656, -995883, -2238100, -1985637, -657290, 89324, -622511, -1631989, -1164576, 573340, 1181568, -1018190, -4665271, -6864800, -6329359, -3790568, 34876, 4881135, 9311859, 10961728, 9351378, 6645655, 4489685, 1852055, -2515895, -7102549, -9075986, -7723122, -4698029, -1660443, 639840, 1653845, 1174001, -142570, -1573600, -2963302, -3616185, -2074629, 1340906, 3386892, 1646070, -1844282, -3359324, -2782944, -3022570, -4813438, -5656916, -4056598, -1339638, 1424280, 4960910, 8954213, 10696042, 8531193, 4562243, 2078445, 1785898, 2062316, 1606952, 433142, -822926, -1559175, -1828894]
45681a828894o83125j268145R6679L419337N141612K716676j252183k515927j127994
45672B698036l45121r89376j006269L9402K71729n93628n44476R89002K081538
45663B600837J617192O66515J48975n9221L80517J614310J607637j518137n080195
45654A978430m089800J156763M246342J389554l136008l200462Q36478L609560
45646B790857K518753K30941r1534J039106R15531j181387k584062n52933L431918
45637F517190M541914Q75483l349109l443842j038549j225725m225154n117337
45629f465129k069335P93115M41719m43413J121344L024064K014154m33804n91591
45620b608876J462905K465484J303853N784R8982J029627J741527J486563k54015
$$ y = [-1828894, -2512019, -3780164, -3683485, -264148, 4877464, 7594140, 6341957, 3826030, 2698036, 2352915, 1363539, 357270, 396672, 668401, 74773, -469703, 519299, 2600837, 4218029, 4884544, 5033519, 4974298, 5354815, 6969125, 8576762, 7058625, 1978430, -2111370, -954607, 3291735, 4681289, 1545281, -1655181, -818703, 2790857, 5309610, 5540551, 5449017, 6488123, 7403654, 6222267, 3638205, 3085272, 6517190, 11059104, 11934587, 8585478, 5141636, 4103087, 2877362, -1347792, -6465129, -8534464, -7741349, -7299630, -7743043, -6621699, -3597635, -1583481, -2017285, -2608876, -1145971, 1319513, 2623366, 2629150, 2728132, 3757759, 5499286, 6985849, 6731834]
45611F731834k690769l594040k093793k70152o8738l75667N44299J594838P58863
45602E36675j060733j353020j41794M13048j30675k72820J73235j62338j151150
45593c149572r59544O62441J654878Q86319l11966o13722m69249m48206K17945
45584b530676K131607M067366M087821J775138j354383l347319l449430k488476
45576a108352j681671j167155k73211R12390J492692J424985J520888J338729
45568B459295o52534l743120m484847j512859J695397J623636n1406M40726K501520
45559a724192K242363o62942j953558N85265L543299K730411j290037m456109
45551i85500m144667j301734J153963J087668q23852j629127L17895K830874K673395
$$ y = [6731834, 4041065, 447025, -1646768, -1916920, -1985658, -2361325, -1817026, -222188, 536675, -524058, -1877078, -2018872, -1605824, -1736499, -2009319, -1836084, -1998422, -3149572, -4109116, -3446675, -1791797, -905478, -1217444, -1831166, -2300415, -2748621, -2530676, -399069, 3668297, 7756118, 9531256, 8176873, 4829554, 1380124, -1108352, -2790023, -3957178, -4230389, -3317999, -1825307, -400322, 1120566, 2459295, 1806761, -1936359, -6421206, -7934065, -6238668, -4615032, -4666438, -4225712, -1724192, 518171, -144771, -2098329, -1513064, 2030235, 4760646, 3470609, -985500, -5130167, -6431901, -5277938, -4190270, -5014122, -6643249, -6325354, -3494480, -821085]
45542h21085K24501j128335j5680J440470J548975J337817J790246J636180k86218
45533E726871k565357l069632j898596q27436p90020j245578j292717m29479J133623
45524e258321K310311K058330Q39782K52345R62657K031962K402614J855176M53555
45515G908411j547326l113927l178504k066056q36820M72486K155004K860174
45507B653442Q88430k449350l590268j526703Q25592J020851J57907K24137R35649
45498h60313J025401N93481L15064J0945l29993K37617J748189K306914O53396
45489E700701j736938k754896k377525j649643n59034J097931K088263J141674
45481I50533q80848k054931j843547q94738N96637K515151L668269K942187J146067
$$ y = [-821085, -596584, -1724919, -1740599, -300129, 1248846, 2586663, 4376909, 6013089, 5726871, 3161514, 91882, -1806714, -2634150, -3424170, -4669748, -5962465, -6391944, -5258321, -2948010, -889680, -49898, 202447, 1165104, 3197066, 5599680, 7454856, 7908411, 6361085, 3247158, 68654, -1997402, -2834222, -2361736, -206732, 2653442, 3541872, 1092522, -2497746, -4024449, -3198857, -2178006, -2020099, -1795962, -860313, 165088, 758569, 1073633, 1084578, 754585, 992202, 2740391, 5047305, 5700701, 3963763, 1208867, -1168658, -2818301, -3377335, -2279404, -191141, 950533, 69685, -1985246, -3828793, -4723531, -4126894, -1611743, 2056526, 4998713, 6144780]
45472F144780P224l18769j159211k904994m080044l081447j81774K365830K340472
45463h67933J30747j239755J48682K175339J693913k69073J50301K993425L628150
45454H543796J49548l011172j882196R38667J143427o7691R93140K973864J337876
45445A1119259l317514n307850k705701o5733p20174j972292p28403R42753k01555
45436b957210k487192j716358K084307M520579L052024j34522j898416j894597
45428a431385j343866k91966J734359L280211J848656k035614m005929j231713
45420c477247K997446L289685L9083j021145K088470L972846K04821n309841n993617
45411c209499k258084J89350m16249p25454L95686R8538j985458j889114J816250
$$ y = [6144780, 6152004, 5833235, 4674024, 1769030, -2311014, -5392461, -5574235, -3208405, -867933, -737186, -1976941, -1828259, 347080, 2040993, 1771920, 1922221, 4915646, 8543796, 8693344, 5682172, 3799976, 4738643, 5882070, 5814379, 6807519, 9781383, 11119259, 7801745, 2493895, -211806, -277539, -997713, -2970005, -3698408, -2755655, -2957210, -5444402, -7160760, -5076453, -555874, 2496150, 2361628, 463212, -1431385, -2775251, -3067217, -1332858, 1947353, 3796009, 1760395, -2245534, -3477247, -479801, 2809884, 2848967, 1827822, 3916292, 7889138, 8093959, 2784118, -3209499, -5467583, -5278233, -5694482, -6419936, -6024250, -5925712, -7911170, -9800284, -7984034]
45402g984034M782395L555085Q67748P95624K458266K377565K05944j706707k389380
45393B962506k440732j709644J36956J884425K144713J425452Q82867L65541n37436
45384E114648j126938j013237j132154j744136j548421m03934k93571j636611
45376c784354j728227O02862K132613L91800j598461O3105L649043M686780L013303
45367G428464J733713J059936j008969l139288k133679M61717j18185l231462
45359A052247k765798K489289N505116J578917m087262m355815o83287L81331
45351h85262k046479k623237R38769M138655K515623k050393m126315j686191
45343e824830J820678K022241r89567k841147p22587K592448K737591M97057O28912
$$ y = [-7984034, -3201639, 353446, 1221194, 2016818, 4475084, 6852649, 7058593, 5351886, 2962506, 521774, -1187870, -1050914, 833511, 2978224, 4403676, 5286543, 5652084, 5114648, 3987710, 2974473, 1842319, 98183, -1450238, -1854172, -2147743, -3784354, -5512581, -4909719, -2777106, -2385306, -3983767, -3920662, -271619, 4415161, 7428464, 9162177, 10222113, 9213144, 6073856, 3940177, 4401894, 4283709, 1052247, -1713551, 775738, 6280854, 7859771, 3772509, -583306, -1266593, -885262, -2931741, -5554978, -4616209, -477554, 2038069, -12324, -4138639, -5824830, -4004152, -1981911, -2971478, -5812625, -6535212, -3942764, -1205173, -708116, -79204]
45334g9204L825527M830288P61481l509577k333784K091823L225376k5861k652188
45325F133881j784486J0590R7583o50770j023928j856697l232282k905602M1170
45316e170541K714659K138145m79044j602871j68905J671944J812597L37587j314371
45307f0800k055368j978468j946676k242616j940086l94238J265914J656593J567352
45298f128393K635049L894457K665069o34605j998018L01688K702835J737553
45290E175635n55305j40107K207560J949660j999759n399241m710375j424084
45282d896016J057204J936275K387769K513612J454512l13082j073728l93512
45274B673034P6229j061533k815026k982383j151393O22173O28484l9062P88165
$$ y = [-79204, 3746323, 8576611, 9338092, 5828515, 3494731, 5586554, 8811930, 8786069, 6133881, 4349395, 4359985, 4457568, 3806798, 2782870, 926173, -2306109, -5211711, -5170541, -2455882, -317737, -796781, -2399652, -2568557, -896613, 915984, 1253571, -60800, -2116168, -4094636, -6041312, -8283928, -10224014, -10618252, -9352338, -7695745, -6128393, -3493344, 401113, 3066182, 2431577, 433559, 735247, 3438082, 5175635, 4620330, 4480223, 6687783, 8637443, 6637684, 1238443, -3471932, -4896016, -3838812, -1902537, 485232, 2998844, 4453356, 4140274, 3066546, 2673034, 2749263, 1687730, -1127296, -4109679, -5261072, -4638899, -4010415, -4049477, -3261312]
45265c261312K645176K534545o40900l794729l412293j77538K136052J570055
45257b400944k74456r92942J15518K194754L652325K873840q1151k574342k158276
45248C54326j76202j76123k498439l415057p53881K727412L708103L208767L900451
45239F879357M598371J839850l432721n494068j824386K375664Q97928m572317
45231A267678o421935j598605M099298L912683r76299l670813j056073K868380
45223a575686L392566J104353l96023o8597J59536p16302j378918o12308R71699
45214H80320J877520J121075j076523k910621k200940N88643J930677r212j893104
45205a692165J64224L882415L425436j451658m298172j424911K903565L483982
$$ y = [-3261312, -616136, 1918409, 1277509, -2517220, -5929513, -6107051, -3970999, -2400944, -2675400, -3668342, -3552824, -1358070, 2294255, 5168095, 5086944, 2512602, 354326, 178124, 2001, -2496438, -5911495, -6665376, -3937964, -229861, 2978906, 6879357, 11477728, 13317578, 9884857, 4390789, 2566403, 4942067, 5839995, 1267678, -5154257, -6752862, -2653564, 1259119, 282820, -3387993, -4444066, -1575686, 1816880, 2921233, 2525210, 2456613, 2616149, 1899847, 520929, -91379, 880320, 2757840, 3878915, 2802392, -108229, -2309169, -1720526, 210151, 200939, -1692165, -1527941, 2354474, 5779910, 4328252, 30080, -1394831, 1508734, 4992716]
45197D992716J394598K86905j37080j867807l143673j068276K341759K568310
45189E367452p9575j327316m71798q80290k792520k272285J109020K134018j496333
45180g09627m466729k069692J907372J058891l382356m383942L50202N574428
45172f121453O225080K975460p30566k963362l137105r49543K426511M210336
45164A935358K954523M12367q07154m31259k34272j254804k397327j818700P23023
45155i18245L176530L229573J029970r79019j259485r40717j535857k411111k156394
45146b764755j242054j144960j560732q72265Q67762J856362J545613J284769
45138b030260J535693J002252m87596p19409J573557M010779L338180j30102k843013
$$ y = [4992716, 6387314, 6674219, 6537139, 4669332, 1525659, 457383, 2799142, 5367452, 5287877, 3960561, 3488763, 2608473, -184047, -2456332, -1347312, 786706, -709627, -5176356, -7246048, -5338676, -4279785, -7662141, -12046083, -11695881, -6121453, 103627, 3079087, 2348521, -614841, -3751946, -4701489, -2274978, 1935358, 4889881, 5302248, 4495094, 4063835, 3829563, 2574759, 177432, -1641268, -918245, 2258285, 5487858, 6517828, 5538809, 4279324, 3338607, 1802750, -608361, -2764755, -4006809, -5151769, -6712501, -7584766, -6717004, -4860642, -3315029, -2030260, -494567, 507685, 20089, -699320, 874237, 4885016, 8223196, 8093094, 5250081]
45129E250081k390382N1541J599013Q09091j212307k243612j390970n0648L9188
45120D60995p09177o41602j29314j432274m262850m369399P46106O792282P212431
45111C667198K021175k092108j077676J369616J99073l237792l661370j15177
45103b927061K668359J184720k285204l336575j071496J724680K519499J345237
45095a77841k25772r96302r25076n92827j50016Q37105K130365K241174M11469
45086B552279j461703r25258J141998J317569j160506k969764j923460m38259
45078c867104j167588k084821J43998L797692L902277q9332l263909k549567m52746
45069e631100j892l50398J55806M44153n58373r11753R56100K526455R78792j392796
$$ y = [5250081, 2859699, 2911240, 4510253, 5319344, 4107037, 1863425, 472455, 421807, 460995, -248182, -889784, -1019098, -2451372, -6714222, -11083621, -10337515, -3545233, 3667198, 5688373, 3596265, 2518589, 3888205, 4087278, 849486, -2811884, -2927061, -258702, 926018, -1359186, -4695761, -5767257, -4042577, -1523078, -177841, -403613, -1399915, -2324991, -2917818, -3067834, -2230729, -100364, 2140810, 2552279, 1090576, 165318, 1307316, 2624885, 1464379, -1505385, -3428845, -3867104, -5034692, -7119513, -6975515, -3177823, 724454, 635122, -2628787, -5178354, -5631100, -5632992, -5983390, -5827584, -5383431, -5941804, -6853557, -5897457, -3371002, -2392210, -3785006]
45059c785006k73633L360163M187024Q10704k107886j295052L76459q34537l405861
45050b967625l294060l30322J978422J903919J151690J185833J112801Q0513o91677
45041A29494J61280J621446J410772p82054k639676k052330L35865K017689J524636
45032A727122l14167j766406j921921r13710N90766J605178J339490J60769o14148
45023a07027m75556m47287j293807j972300j054803J041204K543609K506098J300505
45014B040636l96444j770229j786703n15724K34150o40091j393006M2913K343050
45005a841448K533706Q82821N17350K048583K497412N60517j007661q0365J475753
44996G586668J488787J025529J332814O38647k262939m212033j998261J733750
$$ y = [-3785006, -4058639, -698476, 3488548, 4299252, 2191366, 896314, 1272773, 438236, -2967625, -6261685, -6592007, -4613585, -2709666, -1557976, -372143, 740658, 821171, 129494, 290774, 1912220, 3322992, 2540938, -98738, -2151068, -1815203, 202486, 1727122, 1412955, -353451, -2275372, -3189082, -2598316, -993138, 346352, 507121, -107027, -582583, -1029870, -2323677, -4295977, -5350780, -4309576, -1765967, 740131, 2040636, 1644192, -126037, -1912740, -2428464, -2194314, -2834405, -4227411, -4184498, -1841448, 692258, 1575079, 2092429, 4141012, 6638424, 7198941, 6191280, 6110915, 7586668, 9075455, 10100984, 11433798, 12072445, 9809506, 5597473, 3599212, 5332962]
44988E332962J910574j105722k537441j385891j521670l914867m083350K27283
44980g078122M383915L718949O60750L48785K292636J787052j857505l978244
44972B78216j782562J687305K345745M61518q23540k37035N78794j11878j943925
44963D52638k984985j691378J546070M450097M692662J988779j654496l716718
44955C082669l178649j191508J486p32007k061533j705568N35509K416246K390604
44946d42751J524866J202274P67896o11721j448009r7630J693813Q08347k092605
44937A304480l194029j610138p08855k095491k634699p9372K330477P99958k501969
44928h389638k551017P48527K894749K080345R93736J161299P11627q97102q53530
$$ y = [5332962, 7243536, 6137814, 3600373, 2214482, 692812, -3222055, -7305405, -7078122, -2694207, 1024742, 1685492, 2034277, 4326913, 6113965, 4256460, 278216, -1504346, 182959, 2528704, 2990222, 2166682, 1929647, 2508441, 2396563, 452638, -2532347, -4223725, -2677655, 1772442, 6465104, 8453883, 6799387, 3082669, -95980, -1287488, -1286002, -2018009, -4079542, -5785110, -5249601, -2833355, -442751, 1082115, 2284389, 3052285, 2440564, 992555, 894925, 2588738, 3397085, 1304480, -1889549, -3499687, -4208542, -6304033, -8938732, -9018104, -6687627, -5887669, -8389638, -10940655, -10192128, -7297379, -5217034, -4223298, -3061999, -2350372, -3247474, -4101004]
44919d101004J907507L840628K140738n83567n88585J000943O58485j210216j145308
44910A919621J041783J604584j013705l538291k754174J19842J742520J134781
44902B56961M0154R1679J059242J402509K5505k147202k792239j294084j31270
44893c488745j283932k526126m46069L474323L991000K5305l006494r96709K756176
44884a501271K724861o68965k437059q62496P03056l43800k383380k750678j222541
44875h742273Q34506K444196L042552K342422J082787M73505M48401L5707l94039
44866A567764N95762K473558K475608l41910l049068k723168n94952l773j378804
44857i78983j905466m22K327601K317882K2231k022417j895790j87127R97813
$$ y = [-4101004, -2193497, 1647131, 3787869, 3204302, 2615717, 3616660, 4275145, 3064929, 1919621, 2961404, 4565988, 3552283, 13992, -2740182, -2620340, -877820, 256961, 297115, 388794, 1448036, 2850545, 2876050, 728848, -2063391, -3357475, -3488745, -4772677, -7298803, -7744872, -4270549, -279549, -254244, -3260738, -4257447, -1501271, 1223590, 554625, -1882434, -2744930, -2041874, -2385674, -4769054, -7519732, -8742273, -7907767, -5463571, -2421019, -78597, 1004190, 1477695, 1926096, 1961803, 1567764, 2163526, 4637084, 7112692, 6770782, 3721714, 998546, 403594, 399821, -978983, -2884449, -2884871, -557270, 1760612, 1782843, -239574, -2135364, -2322491, -1324678]
44848a324678M27685r36457j020495R40260L337598L841310J905185p16445j817313
44839D636650q16725Q70610J285467j71956k208644l143559k701728j726741m41487
44830d418113J634483L733895L591970N23467k603209k497061J49956J680500
44822A795888O86589m85922p7846J23392j933239m558270m404898j453582J043878
44813i264010J389886J303372K373469L357743K468872L50121j036043j158765
44805b15355p86986j18337J084952K105201J877862P33022j55798q38967k261560
44796A424034l851257l513702p05875K242234K861290J267168p16867j790094
44788b783069j500784K02941K242272K373875k83081l352588l688581j371153
$$ y = [-1324678, -896993, -1833450, -2853945, -1913685, 1423913, 5265223, 7170408, 6453963, 4636650, 3819925, 4690535, 5976002, 5804046, 3595402, 451843, -2249885, -3976626, -4418113, -2783630, 950265, 4542235, 5065702, 2462493, -34568, 115388, 1795888, 2482477, 1996555, 1918709, 2042101, 108862, -4449408, -8854306, -10307888, -9264010, -7874124, -6570752, -4197283, -839540, 1629332, 1979453, 943410, -215355, -1002341, -1120678, -35726, 2069475, 3947337, 4680359, 4524561, 3685594, 1424034, -2427223, -5940925, -6646800, -4404566, -1543276, -276108, -992975, -2783069, -4283853, -4080912, -1838640, 535235, 252154, -3100434, -6789015, -8160168]
44780h160168P23954J180752J532337K925427L705749J986461j043797k561065
44772B89650k041047j465904j749086j396515M91959K115293J582636J18340M04228
44763a650446K415288L385393K010544J77574l11089l10822j084352j672885q56782
44754B102423p0258j343165l249458k422602Q22100K115617m74615l061861j412747
44745f994566K940763N201859M099130K517748K057643Q89940k152442m663930
44737C896145l825222m89171J991787J966839O16897n44034j349040j979749j946259
44728a661807r53655J19872J25316p96796j384985q66084L75799J687676K741404
44719f13260L020776J864192k63773j598513j284926q46604j915514l180722j720137
$$ y = [-8160168, -7436214, -6255462, -4723125, -1797698, 1908051, 3894512, 2850715, 289650, -1751397, -3217301, -4966387, -6362902, -5870943, -3755650, -2173014, -2054674, -1650446, 764842, 4150235, 6160779, 6338353, 6027264, 5716442, 4632090, 2959205, 2102423, 2032165, 689000, -2560458, -4983060, -4160960, -2045343, -2519958, -5581819, -6994566, -4053803, 1148056, 5247186, 7764934, 9822577, 10712517, 8560075, 3896145, 70923, -418248, 1573539, 3540378, 4157275, 3613241, 2264201, 284452, -1661807, -2615462, -2495590, -2370274, -3167070, -4552055, -5418139, -5042340, -3354664, -613260, 2407516, 4271708, 4007935, 2409422, 1124496, 277892, -1637622, -4818344, -6538481]
44710f538481K534436N849098N117481J573322j144813j424670p62611j049077
44702D154685k142551k313340n39159J949553K776641J322373k88653k7427J189456
44693F081578J160340J7466k93580K49894l91568k349837k986490j101262J041829
44684A428370J334366N37045j67324j144736j951818n53306K535847L040343p08372
44675D350415l819735j628308K853996L598489J002905L49848K367680K348756
44667A1424046j212791l943875l005017j079273p75135n41938J054888J845741
44659C766646J21173j791154j283137N31576J547231K180350L141881K823626
44651A1038192K41365k087214j595592K21778L42483j187985k274279k411004
$$ y = [-6538481, -4004045, 1845053, 6962534, 8535856, 7391043, 5966373, 5203762, 4154685, 2012134, -301206, -840365, 1109188, 3885829, 5208202, 4919549, 4892122, 6081578, 7241918, 7259384, 6965804, 7215698, 6824130, 4474293, 1487803, 386541, 1428370, 2762736, 3299781, 3132457, 1987721, 35903, -517403, 2018444, 5058787, 4350415, 530680, -1097628, 1756368, 5354857, 6357762, 6707610, 9075290, 11424046, 10211255, 6267380, 3262363, 2183090, 1407955, 866017, 1920905, 3766646, 3887819, 2096665, 813528, 1345104, 2892335, 5072685, 8214566, 11038192, 11279557, 9192343, 7596751, 7818529, 8161012, 6973027, 4698748, 2287744]
44643B287744k215811j227199O45640J267921p48500k767981j398047K089228
44635b067005L241659P91648j882203j683850O60157K330205J656370n43888j650368
44626H52725J77458L225907L584451M41306k338804j808219k29157q16631k059169
44617A029867n19274K679075L083490o4727k750085k315856n38834M5085o64447
44608a5706j570001j859861p61031J557645K815493J135251j528855j619862O58564
44599a188363J798510P60447K69571J723210K780006J339667j410102l250792
44591B822154l408012j898281P20282K386314J462387o2195J051944L518471K756381
44582I349445j286192k976297K40927L436946J932604j620449k321737q90670
$$ y = [2287744, 71933, -1155266, -509626, 758295, 9795, -2758186, -4156233, -2067005, 1174654, 1966302, 84099, -1599751, -939594, 1390611, 3046981, 2503093, 852725, 1030183, 4256090, 7840541, 8281847, 5943043, 4134824, 3905667, 3089036, 1029867, 510593, 3189668, 6273158, 6208431, 3458346, 1142490, 603656, 648741, -15706, -1585707, -3445568, -4206599, -2648954, 166539, 1301790, -227065, -1846927, -1188363, 610147, 1370594, 1640165, 3363375, 6143381, 7483048, 6072946, 2822154, -585858, -2484139, -1763857, 622457, 2084844, 2022649, 3074593, 6593064, 9349445, 8063253, 5086956, 5327883, 8764829, 10697433, 9076984, 6755247, 5864577]
44574E864577j144371k743825k196972O34222K423008J960032J095083N86698
44566F478452n70070j882894j607599k90925j63232r22903p5828K258281L015016
44557F238298J402243K75552R52946P71589j994091m476387l513648p97854j96937
44548a338289j680815j628730J335673M219479L960051J332015n86771k90102
44540E322511J020397J344929q0961k297495l429421k189098P68850L022106K537087
44531F018905j46181k371243k237188m27148J228002K158534K945107L357133
44523A0525921K200322n32647k877781l211680k357380k315536l495049m285086
44515f348916l207871o44967J726953K794822L019343L424260L729239K432038
$$ y = [5864577, 4720206, 1976381, -220591, 413631, 2836639, 4796671, 5891754, 6478452, 5908382, 4025488, 2417889, 2126964, 1963732, 1040829, 965001, 3223282, 6238298, 7640541, 7916093, 8869039, 9640628, 7646537, 3170150, -343498, -1141352, -1338289, -3019104, -4647834, -3312161, 907318, 4867369, 6199384, 5612613, 5322511, 6342908, 7687837, 7606876, 5309381, 1879960, -309138, 459712, 3481818, 6018905, 5872724, 3501481, 1264293, 837145, 2065147, 4223681, 7168788, 10525921, 12726243, 12193596, 9315815, 6104135, 3746755, 1431219, -2063830, -6348916, -9556787, -10201754, -8474801, -5679979, -2660636, 763624, 4492863, 6924901]
44507F924901n67350k613606j324143J707555K605361N54599j291349q44955Q3464
44498E234477m07642p53412R88358K789262J096439l337870n771985l757378Q0565
44489c839186K228964K396382K144608J810430Q00719l90619n51922K25286N87095
44480E411757J53592K55288J584002K178281m79231n265952p375759l959776J661066
44471e836732L756456J419281q23200L30614K923488L466942J702244k44083j084397
44462E610613p29979N57188J514837M83674j596905j454254J170021J862787j559935
44453E858047m268938j431489L256703K628299k266485l364320J399597M635225
44445F446639J528610k586488j383211K375015K341381o01828n79480K710782
$$ y = [6924901, 6357551, 3743945, 2419802, 4127357, 6732718, 7287317, 5995968, 5151013, 5234477, 4826835, 4073423, 5061781, 7851043, 8947482, 5609612, -162373, -3919751, -3839186, -1610222, 786160, 2930768, 4741198, 5541917, 5151298, 4599376, 4824662, 5411757, 5565349, 5820637, 7404639, 9582920, 9103689, 3837737, -3538022, -7497798, -5836732, -2080276, -660995, -1484195, -1153581, 1769907, 5236849, 6939093, 6695010, 5610613, 4880634, 5437822, 6952659, 7436333, 5839428, 4385174, 5555195, 7417982, 5858047, 1589109, 157620, 3414323, 6042622, 3776137, 411817, 1811414, 6446639, 7975249, 5388761, 4005550, 6380565, 8721946, 8120118, 7540638, 10251420]
44437A0251420L436409m88312l925944k574630J082769K449427J132557l96953
44429A0966743j208960j711224j277398O00895K084452J022444j419307k060118
44421F997527l98820R51838Q09365J142150K883088L211524j66398m285008m327079
44412F818187q74123N63118k227092m807778k980232R78815K376708J344241J567999
44403B759843L503102L759906J057369j732863k191057j117705J72111J542342
44395G753048J936265m08861l931216l961083N72022M464972L356282j34622j226339
44386H420468m72284j386907l177369k033148J286529J715169j488249k693750
44378A70459J051522M517300J912252m045575n722103j150014L960129M355479
$$ y = [10251420, 13687829, 13199517, 9273573, 6698943, 7781712, 10231139, 11363696, 10966743, 9757783, 8046559, 6769161, 7370056, 9454508, 10476952, 9057645, 6997527, 6598707, 7550545, 8359910, 9502060, 12385148, 15596672, 15430274, 11145266, 6818187, 5944064, 6507182, 4280090, -527688, -3507920, -2529105, -152397, 1191844, 2759843, 6262945, 10022851, 11080220, 9347357, 7156300, 6038595, 6210706, 7753048, 9689313, 9280452, 5349236, 1388153, 1960175, 6425147, 9781429, 9646807, 8420468, 7948184, 6561277, 3383908, 1350760, 2637289, 4352458, 2864209, 170459, 1221981, 5739281, 7651533, 3605958, -2116145, -3266159, 693970, 5049449]
44370E049449J034932j854213k443691j803503j324014j248744r81951J34954
44362c436781J853031K614602J106056j568239k547388n99866K349530L717497
44354C488442L027078J396851k38420j116828l58896J400451J334707k046394
44346F886991n417765l941235J667947M903737J844869l407335m265862j76592
44338a905245L777321M298369K992740K189805J391061q03305l718830n186771
44330C035145l911629m71356L023227M070723J933755j187697k489727j891936
44322B110505j332526j214654j47904J735857K304754J052606J17968M43984J09773
44313E180363j731702k572585q01123Q88459k37227j931391m60559K718380K678717
$$ y = [5049449, 6084381, 4230168, 1786477, -17026, -1341040, -2589784, -3571735, -3436781, -1583750, 1030852, 2136908, 568669, -1978719, -2578585, -229055, 3488442, 6515520, 7912371, 7673951, 6557123, 6198227, 7598678, 8933385, 6886991, 1469226, -2472009, -804062, 4099675, 5944544, 2537209, -1728653, -1905245, 1872076, 6170445, 9163185, 11352990, 12744051, 11940746, 8221916, 3035145, -876484, -1347840, 1675387, 5746110, 7679865, 6492168, 4002441, 2110505, 777979, -436675, -584579, 1151278, 3456032, 4508638, 4626606, 5070590, 5180363, 3448661, 876076, 74953, 963412, 726185, -1205206, -1665765, 1052615, 3731332]
44304C731332j142128l776828k067439J300282K627195K147204J859849J567972
44296F247439o111k085224k646285j436947J7912Q32817J373852J847194J837946
44287E982593J182305K74623l56160k16959P89006J568706M10064k601671m703338
44278B329169l462017l0970K253668K160793J493108J590967J181205j037235
44270F478688l456608l362043r66725O72253n011j026180k39923J284118J172661
44261E51230k47576m82473R44979J691197O01420k30240R95262K441659J206695
44252G472153k141197m145011k968072J9359K826104M563182M473660J850668
44244A1950846k057473m106322k727080r9187N60722r38247j830588k46391K274791
$$ y = [3731332, 2589204, -1187624, -3255063, -1954781, 672414, 2819618, 4679467, 6247439, 6241328, 4156104, 1509819, 72872, 90784, 923601, 2297453, 4144647, 5982593, 7164898, 7439521, 7083361, 6866402, 7655408, 9224114, 9634178, 7032507, 2329169, -1132848, -1163818, 1089850, 3250643, 4743751, 6334718, 7515923, 6478688, 3022080, -339963, -1306688, -634435, -639446, -1665626, -1905549, -621431, 551230, 303654, -178819, 766160, 2457357, 3058777, 2828537, 3823799, 6265458, 7472153, 5330956, 1185945, -1782127, -1762768, 1063336, 5626518, 10100178, 11950846, 9893373, 5787051, 3059971, 2960784, 3521506, 2583259, 752671, 506280, 2781071]
44235B781071K561796l56960l754433l946704m87615L181000L773181J824060
44227E575396J18380m87895j429749k875323k704538j98383J791891O05895j942038
44218a546364j846984J145092K923433R15508k159537k161949P61414K778182
44210H08795J852482o3604o05143j95198l19290o22142J16270J289845J240844
44201C502859K63335K24773J115326Q07667j001368j641137P4775J171135r58712
44192C558653l688891k553447J712550L730785J249997j667027o66681K948855
44184D624794M584357K511590q24700k522170j988871m32850N50001j50325k253401
44175D098425l729168k405729J416839M484776L587140p07128l972578k517263
$$ y = [2781071, 5342867, 4985907, 1231474, -2715230, -3202845, -21845, 3751336, 5575396, 5693776, 5205881, 3776132, 900809, -1803729, -2002112, -210221, 395674, -1546364, -3393348, -2248256, 675177, 1590685, -568852, -2730801, -1969387, 808795, 2661277, 2597673, 1992530, 1797332, 1478042, 855900, 972170, 2262015, 3502859, 3766194, 3990967, 5106293, 5913960, 4912592, 3271455, 3346230, 4517365, 3558653, -130238, -2683685, -971135, 2759650, 4009647, 2342620, 1675939, 4624794, 9209151, 11720741, 10896041, 8373871, 6385000, 5952150, 6502151, 6351826, 4098425, 369257, -2036472, -619633, 3865143, 7452283, 6745155, 2772577, 255314]
44167B55314K133555M708318K522772j357558k439632n14878J052396M40313j024287
44158E776313j883198k187292j876661l75971J428839J423244m52889j552828
44150B99557l90691J214160J419218J424878L038857M959882M120959K5189m315984
44141A1796025n492569k565235K356468N295628L426691j579795m456602k323783
44133F456828J445590J485038k437348n242795l337865J095584L412938K115811
44125D993781k07605n99608R13242J807261L87506k007383k686909j114498N65063
44116B050850P28419M01325J239223K767138L026479J142591j927152m493410
44108D935463n098544l362775p96417L28611k33050m47598O56862J513142J247212
$$ y = [255314, 2388869, 7097187, 9619959, 8262401, 5822769, 5307891, 6360287, 6800600, 5776313, 3893115, 1705823, -170838, -546809, 882030, 2305274, 1852385, 299557, -91134, 1123026, 2542244, 3967122, 7005979, 11965861, 16086820, 16112009, 11796025, 6303456, 3738221, 6094689, 11390317, 14817008, 13237213, 8780611, 6456828, 7902418, 9387456, 6950108, 1707313, -1630552, -534968, 2877970, 4993781, 4786176, 4186568, 5099810, 6907071, 7294577, 5287194, 2600285, 1485787, 2050850, 2779269, 3180594, 4419817, 7186955, 10213434, 11356025, 9428873, 4935463, -163081, -3525856, -4322273, -3993662, -4226712, -4674310, -4017448, -2504306, -1257094]
44099a257094J726228L922311M851843J801414k302273k249894J567182L499176
44091A1558893J115485j633784j206518K87098n61307k598711k350685J39096
44083D749567J574366O16726n71897j06731R54057N36564j433805k880796j945537
44074A492514Q50077K786359J623153j783454m179309l493422r43356Q32955Q46235
44065a968248K28485K83747R64352J245983N73320l14247k93126M38721M85148
44056A644135m08820m68213J360744L119597K384561P0878r87320o41765j363360
44047D710437l471381l988588j344873J960021K967486J842899L25202p42588
44039B258615p61741R04830K730702J537563k585904n009895k876452O04151J467502
$$ y = [-1257094, 469134, 4391445, 9243288, 11044702, 8742429, 6492535, 8059717, 11558893, 12674378, 11040594, 9834076, 10121174, 9559867, 6961156, 4610471, 4749567, 6323933, 6940659, 6368762, 6262031, 7216088, 7752652, 6318847, 3438051, 1492514, 2342591, 5128950, 6752103, 4968649, 789340, -2704082, -3647438, -2814483, -1968248, -1739763, -1456016, -491664, 754319, 1327639, 1013392, 720266, 1158987, 1644135, 1235315, 767102, 2127846, 5247443, 7632004, 7702882, 6715562, 6073797, 4710437, 1239056, -2749532, -4094405, -2134384, 833102, 2676001, 3001203, 2258615, 1496874, 2401704, 5132406, 6669969, 4084065, -925830, -3802282, -3198131, -1730629]
44030a730629J098373K570066M095832J979439j907285k196058J025992K108667
44022G044397o80534k391823j04702K147702O10923j747516o30625K196129K101785
44013H545736r09301l060649l033223k339884j007131K047136N040821M650811
44005I934316J366545r23095j014895j646641l872333m713007k262998P85006
43997b347102J247427K3992j41171R77572J810191K169684K722033K597311N89257
43988I649194j912360k142955r4017J255338K96088j058476n94497Q84174J115252
43979G397741j9271m63488O81610J677082P13817j355263k201130j328581m96562
43970D605955p43936r86284n29651q53780k753992l423488K82123O217385Q405719
$$ y = [-1730629, -632256, 1937810, 6033642, 8013081, 6105796, 3909738, 4935730, 7044397, 6363863, 3972040, 3867338, 6015040, 6625963, 4878447, 4247822, 6443951, 8545736, 7636435, 4575786, 1542563, -797321, -1804452, 242684, 5283505, 9934316, 11300861, 10377766, 9362871, 7716230, 3843897, -869110, -3132108, -2347102, -1099675, -1075683, -1216854, -239282, 1570909, 3740593, 6462626, 9059937, 9649194, 7736834, 5593879, 5499862, 6755200, 7051288, 5992812, 5398315, 6282489, 7397741, 7378470, 6914982, 7596592, 9273674, 9987491, 8632228, 6431098, 5102517, 4605955, 3862019, 2875735, 2346084, 1492304, -1261688, -4685176, -4403053, 1814332, 10220051]
43961A0220051M833775R3787j290990m72120o89243j648746j325567p13175k077113
43952F930659l952133k882172L29569J254183q28786j481190J439374L951454
43944D760958K367332q60085j417878K34258Q22659L14260J253705L361444L500771
43935A4337424R16201j537595j837908j049189n40960p5659M47521R8472j133283
43926I625024j731922r59038J87031R60303J709858K115654R65642j298400k117416
43917I456736k56152K223025K759056J341534l82070j229040o37484J206818K189889
43908A6672312k95258m985182o490072j986360M156626N628091K244414q34426
43900A4110145o61152Q21310J263250Q58359J82473j163951k540539k112158j14453
$$ y = [10220051, 15053826, 15147613, 13856623, 13384503, 12695260, 11046514, 9720947, 9007772, 6930659, 2978526, 96354, 425923, 1680106, 851320, -629870, 809504, 4760958, 7128290, 6268205, 4850327, 5084585, 5907244, 6221504, 7475209, 10836653, 14337424, 15253625, 13716030, 11878122, 10828933, 10287973, 10212314, 10659835, 10758307, 9625024, 7893102, 6934064, 7121095, 8081398, 9791256, 11906910, 12872552, 11574152, 9456736, 9200584, 11423609, 14182665, 15524199, 15142129, 13913089, 13275605, 14482423, 16672312, 16377054, 11391872, 4901800, 2915440, 7072066, 12700157, 14944571, 14110145, 13448993, 14270303, 15533553, 16391912, 16574385, 15410434, 12869895, 10757737, 10643284]
43891A0643284O77556o90261j467823K90690K155384J021138j815766k516706
43883H297496l13421J999216K559969K250804J962701J042782p06950j843741
43875A5248856j347186l11906l79740j438099j842995m47360K075000L591050
43867A5147620K291199j200355l771098k947220Q2203J836269Q71029q26070j038515
43858A0445062j59596J00328n41331q39811m7994J093321J343018M62588k92618
43849A1562967N59211K528917K938523J79908l401464l918660j191757R07756
43841A0165401M2643j351210p5933K842885L607798Q73508k710497l671877r77187
43832H745531L201796M998192K339039k148925l516562q46761J365897n1191k150758
$$ y = [10643284, 11320840, 10630579, 9162756, 9453446, 11608830, 12629968, 10814202, 8297496, 7984075, 9983291, 12543260, 14794064, 16756765, 17799547, 17092597, 15248856, 13901670, 13589764, 13210024, 11771925, 9928930, 9481570, 11556570, 15147620, 17438819, 16238464, 12467366, 9520146, 9602349, 11438618, 12309647, 11483577, 10445062, 10285466, 10385794, 9844463, 9004652, 8956658, 10049979, 11392997, 11855585, 11562967, 12122178, 14651095, 17589618, 17769526, 14368062, 10449402, 9257645, 10165401, 10208044, 8856834, 8780901, 11623786, 15231584, 16105092, 13394595, 9722718, 8745531, 11947327, 16945519, 19284558, 17135633, 13619071, 12772310, 14138207, 14087016, 11936258]
43823A1936258r57042J906676K295683P70787J098063K924904K275316p77172
43815B1473473j491208J387688L240016J413524o38777J17197J493912J334619
43807B8330444J874130M459752N302519J854168j354940N79540M434550L933498
43799D9413661J30085q35777J674907K431569q6962j589830n2359J394527J027730
43790E3507551J212842K630541K243018n47318j777118J05584Q65950k407072
43782E5833978o009130n462649k203566k46906p520L12602M48321o43175j930663
43773D0091292k395279l196818m458262l343035Q14245L285551P20794k503852
43765B9014636o82551L498155K836540k402913m406199j85974L800539J995697
$$ y = [11936258, 10979216, 12885892, 15181575, 15952362, 17050425, 19975329, 22250645, 21473473, 19982265, 21369953, 24609969, 26023493, 25384716, 25501913, 26995825, 28330444, 30204574, 34664326, 39966845, 41821013, 40466073, 41045613, 45480163, 49413661, 49543746, 48707969, 50382876, 52814445, 52727483, 51137653, 51085294, 52479821, 53507551, 54720393, 57350934, 59593952, 59046634, 57269516, 57375100, 58241050, 55833978, 49824848, 44362199, 42158633, 41911727, 41904207, 42216809, 42665130, 42021955, 40091292, 37696013, 34499195, 30040933, 26697898, 27512143, 30797694, 31518488, 29014636, 28332085, 31830240, 34666780, 32263867, 27857668, 27671694, 31472233, 33467930]
43757C3467930k023841j924497J642779K866750j95589l367035k700989O04920
43749B8370428K469464J060261j491016j983672N6476K119617K236982J437056
43741C4275596J602089K216163J346799q13331j887409r01082L82938K83130o13364
43732C5891529q76009k60909N62238J175978J551025J704192J583951R07686n92361
43723D1647320k242493k598047j458496n45166q42625p70957R68579K325218O44384
43714C7127717k586584l304107q84909J131749O61770m14376l31166j59059o49716
43705C0591319M3744K870388N052283L924247J436989J315256L057957K593457
43697E0885640j185297m136805k351786K606639N803351M903873K082290M24252
$$ y = [33467930, 31444089, 29519592, 31162371, 34029121, 33833532, 30466497, 27765508, 28370428, 30839892, 31900153, 30409137, 28425465, 28481941, 30601558, 32838540, 34275596, 35877685, 38093848, 39440647, 38627316, 36739907, 35838825, 36221763, 36504893, 35891529, 35015520, 34754611, 35316849, 36492827, 38043852, 39748044, 41331995, 42239681, 41647320, 39404827, 36806780, 35348284, 34803118, 33960493, 33189536, 34158115, 36483333, 37127717, 34541133, 31237026, 30352117, 31483866, 32145636, 31731260, 31400094, 31241035, 30591319, 30635063, 33505451, 38557734, 42481981, 43918970, 45234226, 48292183, 50885640, 49700343, 45563538, 43211752, 45818391, 51621742, 56525615, 58607905, 59032157]
43689E9032157M86567J114038J945644L274124M152563L015889N58408k93339
43681G3286051J660375M073863M633996M235089M556170M782314L651803K756712
43673A03636373M055963N519089L701121J19344J49358M945133R319947R357094
43665A40803422P637918Q263213J0507449J0930149R215893Q263804R765818J2679004
43657B18066670J5360286J6863949J6639890J4902145J3083457J2537782J2820096
43650C20274275J1892579P955170J354528m714649o538252m621925m658118j0769141
43642C10174467j9015885k1866515j8556837j5682536j6976887j8678044j7153356
43635A82244407j4722541j4071020j2770606q604562n360084p014788r968357
$$ y = [59032157, 59518724, 60632762, 62578406, 65852530, 70005093, 73020982, 73579390, 73286051, 74946426, 79020289, 83654285, 87889374, 92445544, 97227858, 100879661, 103636373, 107692336, 113211425, 116912546, 117031890, 117181248, 122126381, 131446328, 140803422, 148441340, 156704553, 167212002, 178142151, 187358044, 195621848, 205387666, 218066670, 233426956, 250290905, 266930795, 281832940, 294916397, 307454179, 320274275, 332166854, 340122024, 341476552, 336761903, 330223651, 325601726, 320943608, 310174467, 291158582, 269292067, 250735230, 235052694, 218075807, 199397763, 182244407, 167521866, 153450846, 140680240, 132075678, 126715594, 119700806, 109732449]
43628A09732449q010979k464088j72219k803073n348821m906538l895938l957127
43620G8173666l395222k105590k697162m646608l374759J993408N515540K776174
43612G2239447k389078l777975j563843l94294j571238k264548j138724J41473
43604E9281220R35181K933254O525202R092989Q473728O039351M717826N236794
43596A03235545O003610O158440O924685R383612J2295159J3471825J2575691
43589A70048567J0826905Q368426M383362J06658j425027j55792m36438n101761
43581A86614900j0863340j2897416j1581116j0633858j0654200r471768p650615
43574A12862587p987507r650805q616421m837738l271855n952202q494866p156678
$$ y = [109732449, 101721470, 99257382, 99085163, 96282090, 90933269, 86026731, 82130793, 78173666, 74778444, 72672854, 69975692, 65329084, 61954325, 63947733, 69463273, 72239447, 69850369, 66072394, 64508551, 64114257, 62543019, 60278471, 59139747, 59281220, 60216401, 63149655, 69674857, 78767846, 87241574, 93280925, 97998751, 103235545, 109239155, 115397595, 122322280, 131705892, 144001051, 157472876, 170048567, 180875472, 189243898, 193627260, 193733918, 192308891, 192153099, 191716661, 186614900, 175751560, 162854144, 151273028, 140639170, 129984970, 120513202, 112862587, 104875080, 95224275, 86607854, 81770116, 78498261, 72546059, 64051193, 56894515]
43566E6894515m360758l826214m612108l933832k273205j568584j274649k69211
43558C4775954q2338k130156m017803k817367j19808M58825q13368q47344M71134
43549B4877729K42401k069923l652330k967778j509948n76790J74984N82697j94036
43540A4907006j253471p29416N00928n78636l938052n539891l065837P29049K374434
43531C406114K387885L041560L851251K561725m86826k174321r90799P50233Q1005
43522A2427827k564971l861214k019969O37800O91359j493134k065897N73173
43514B324974K948031J461179k010966k724115n0624K034177J357105L26638J151707
43505F818106K036518M28843k634194m018858k654311m0731K016176K327814M54257
$$ y = [56894515, 52533757, 48707543, 44095435, 40161603, 37888398, 36319814, 35045165, 34775954, 34693616, 32563460, 28545657, 25728290, 25608482, 26067307, 25253939, 24406595, 24877729, 25120130, 23050207, 19397877, 16430099, 14920151, 14343361, 14518345, 15101042, 14907006, 13653535, 12924119, 13425047, 12846411, 8908359, 3368468, 302631, 1031680, 3406114, 5793999, 8835559, 12686810, 15248535, 14761709, 12587388, 11596589, 12346822, 12427827, 9862856, 6001642, 3981673, 4619473, 5310832, 3817698, 1751801, 2324974, 5273005, 6734184, 4723218, 1999103, 1948479, 3982656, 5339761, 5666399, 6818106, 8854624, 9283467, 6649273, 2630415, -23896, -64627, 1951549, 4279363, 4733620]
43496D733620k146736k554690p7156J936070M10533k701717l073378m91435J091475
43487b873414J03658k47163K207794M217735J885399k629046l471968M41639L691262
43478C325896K178305j201279j405328J086767J504481j398229l361956j431775
43470g03118J397804J031775j231260q57658K705788N102232L439618j05008k092196
43461H687977k047370j221177R3994J633754J628458r48021l770120l653238j103811
43452f99554M34786k10916n17569J194898K748238J529450j203276k014033k69536
43443I92488J230543N23747j092287j625149j226572r95437n35770J135259K901654
43434A308476K251213q19265k798999j086873K072578K301958p79846k781315
$$ y = [4733620, 2586884, 32194, -44962, 1891108, 2301641, -400076, -3473454, -3964889, -2873414, -2769756, -3016919, -809125, 3408610, 5294009, 2664963, -807005, -365366, 3325896, 5504201, 4302922, 2897594, 3984361, 5488842, 4090613, 728657, -703118, 694686, 1726461, 495201, -362457, 2343331, 7445563, 10885181, 10780173, 8687977, 6640607, 5419430, 5513424, 7147178, 8775636, 7827615, 4057495, 404257, -699554, -264768, -475684, -993253, 201645, 2949883, 4479333, 3276057, 1262024, 992488, 2223031, 2746778, 1654491, 29342, -1197230, -2192667, -2728437, -1593178, 1308476, 3559689, 2740424, -58575, -1145448, 927130, 3229088, 2449242, -332073]
43426c32073p19413K433355J667336k826478n437586k619821K356076M104730
43418a373874K386616J442845K921736L469122M69345l451504m300909k458021
43410h94644j056527l83778J803656M860062M899499R68165k759230l055262k001049
43401B380892k396247k580754p6033K511277P26326l800062m509403M57462N242432
43392b044110M727199J219964k01505R13750J416776K63010q96994j366815j860877
43383B170398k018087q62656N44050Q9173j735541k227261q40430o5118j126590
43374f072062j881223n41473J212790J040042j98324K5440J752060K602214J538021
43365e22515R8757k40369J65090M76153P06241R79758Q62651K39266k57191m01402
$$ y = [-332073, -1051486, 1381869, 3049205, 222727, -5214859, -7834680, -5478604, -1373874, 1012742, 2455587, 5377323, 8846445, 9315790, 5864286, 1563377, -894644, -1951171, -2334949, -531293, 4328769, 9228268, 10196433, 7437203, 4381941, 2380892, -15355, -2596109, -2672142, -160865, 565461, -3234601, -7744004, -7286542, -2044110, 2683089, 3903053, 3701548, 4615298, 6032074, 6295084, 5398090, 4031275, 2170398, 152311, -710345, -166295, -77122, -1812663, -4039924, -4880354, -4945472, -6072062, -7953285, -8494758, -7281968, -6241926, -6440250, -6414810, -4662750, -2060536, -522515, -423758, -664127, -499037, -22884, 683357, 1663115, 2525766, 2765032, 2507841, 2106439]
43355B106439q53329j712200j806566n23302P77139O10316l01286l45614Q017
43346b040386j095978l195888l166986K53126L808196L555605p602k763863k146757
43337f800533N92796K844824L166343J413638j343201k639066o66347K658636
43329g72910L030215n02988l529366k128516J471425K197122l80015j793308K59381
43320b148960K740405K376595L14883n30785N463J53909m35741q26054p89443
43311H60272k28360J756309M504768M441276k35638n093730m391261K85246J815917
43302C714799j609866l672360j46262M302957L806452N08542K51385K737106K764163
43293A2656916n51006k665302j529053k49341r20244j551806q66169r85465k955046
$$ y = [2106439, 1253110, -459090, -2265656, -2788958, -2011819, -1401503, -1702789, -2048403, -2040386, -3136364, -6332252, -9499238, -9246112, -5437916, -1882311, -1889913, -4653776, -6800533, -6207737, -3362913, -196570, 1217068, -126133, -2765199, -3431546, -772910, 2257305, 1754317, -1775049, -3903565, -2432140, -235018, -615033, -2408341, -2148960, 591445, 2968040, 3282923, 2752138, 2757601, 2911510, 2475769, 1649715, 860272, 631912, 2388221, 6892989, 11334265, 11098627, 6004897, 1613636, 1898882, 3714799, 2104933, -1567427, -1713689, 2589268, 6395720, 6904262, 7155647, 9892753, 12656916, 12105910, 9440608, 7911555, 7662214, 6741970, 5190164, 4323995, 3338530, 383484]
43284C83484m017524k111128N71193J253903O16482N20713O99543M32929P53451
43275h96954K181013K808326J442184J55262P68537J278713q51085l962374m403705
43266a480083j970910L09683P36957J66396k89807N9225K005111M924297N971535
43257A0432404L428636n45880k982619l872213m069443k238923K057961M854754
43249G064677K492663k006408k827793k08443P71428o45934r0792L051784L493048
43240A1094230q65606m552453k909138Q91448J540259m19618j062909P8737N37296
43231D332246j41740l94303k5438k1933l30950o64517j831710l664097l734870
43222f477312j002195J552788J182079J1429J600568M716936M954071J683192
$$ y = [383484, -3634040, -5745168, -5173975, -3920072, -3303590, -2782877, -2083334, -1650405, -896954, 1284059, 4092385, 5534569, 5689831, 6458368, 7737081, 6885996, 2923622, -1480083, -3450993, -3141310, -2404353, -2237957, -2527764, -2468539, -463428, 4460869, 10432404, 13861040, 13315160, 10332541, 6460328, 2390885, 151962, 2209923, 7064677, 9557340, 7550932, 4723139, 4514696, 5286124, 4640190, 4549398, 7601182, 11094230, 10228624, 5676171, 2767033, 3658481, 5198740, 4779122, 3716213, 3794950, 4332246, 4190506, 3796203, 3770765, 3748832, 3417882, 2753365, 921655, -2742442, -6477312, -7479507, -5926719, -4744640, -4733211, -3132643, 1584293, 6538364, 8221556]
43214H221556j024842n32678J196840J327111j68524j742097k779102l440309
43206A057955l404698k042087M69174K609490K373465n44212l401706k786050
43198e668669J086263M182681L623706Q69447j178682j937352k230850j827072
43190c080528k40373J529644K190202J833207Q72037r10833k673058k215617N24621
43181b170698K161647N87353j479131o60173J778490K283398N81788q74079j285015
43172I23580j454148q97050R98620K279926J005082p54038J66554K277908J480594
43163F027028j817131k876429j67096K330499J399734j239443k401743j441492
43155a86073M27614J739528R72180j949783m127755k719787O90863K146739J197477
$$ y = [8221556, 7196714, 6664036, 7860876, 9187987, 9019463, 7277366, 4498264, 1057955, -2346743, -4388830, -3919656, -1310166, 1063299, 519087, -2882619, -5668669, -4582406, -399725, 3223981, 4093428, 2914746, 977394, -1253456, -3080528, -3320901, -1791257, 398945, 2232152, 3104189, 2193356, -479702, -2695319, -2170698, -9051, 578302, -900829, -1561002, 217488, 2500886, 3082674, 2208595, 923580, -530568, -1427618, -428998, 1850928, 2856010, 2101972, 2268526, 4546434, 6027028, 4209897, 1333468, 1166372, 3496871, 4896605, 3657162, 1255419, -186073, 241541, 1981069, 2953249, 1003466, -3124289, -5844076, -5153213, -3006474, -1808997]
43146a808997O84150J171974M14705j569991j984040m19622M18941j24036J50635
43137c066281J214966M27929j734584j448264J461000K414075q9314j920929r72906
43128c714308n37726j978509j284572K875445M975947J811474j274235L27029
43120A200545K011485j390397m974376j464599N247358N127183j994522o373454
43112b610777l628114N03353J509629K028953L917736L644847l30188l095815
43104A939624q33990L011572L460951R98714j219103k767069m345024m359131
43096d113456j393792K262611L127678R93196j491561k053877q2950L183197M608888
43087E039934J954364k273620k999826K75342K425361M80266j979242j025176
$$ y = [-1808997, -1124847, 47127, 461832, -1108159, -3092199, -3511821, -3092880, -3216916, -3066281, -1851315, -1423386, -3157970, -4606234, -3145234, -731159, -820473, -2741402, -3714308, -4252034, -6230543, -7515115, -4639670, 336277, 2147751, 873516, 1200545, 3212030, 1821633, -3152743, -4617342, 630016, 5757199, 3762677, -2610777, -6238891, -5735538, -4225909, -2196956, 1720780, 5365627, 5035439, 1939624, 1105634, 4117206, 7578157, 8576871, 7357768, 4590699, 245675, -4113456, -5507248, -3244637, -116959, 876237, -615324, -2669201, -2752151, 431046, 5039934, 6994298, 4720678, 1720852, 1996194, 4421555, 4901821, 2922579, 1897403]
43079A897403J304204R29183j324922j403993J225490L014871J869092m67020
43071G044308j597467j330442j047964j837113l284874l556644j548132R35961
43063f222367J163535j39853M93546L256658L764335R573l471098k011582K004362
43054a152891K861136m4617k378247k032228j149615j388944j686941j110338
43046h082685k86726M41361J323245J652092P09976j73305M73019J068061o47583
43037c522545k748281j166751L271884M802406J008335l457613l588700m23187
43029e824452J938106K212247J642801N61874j224571k278760j030946J380486
43021b623215K330846J172315n39996j549436j719257j041332L12681J385771
$$ y = [1897403, 3201607, 4130790, 2805868, 1401875, 2627365, 5642236, 7511328, 7044308, 5446841, 4116399, 3068435, 1231322, -2053552, -5610196, -7158328, -6222367, -5058832, -5198685, -4705139, -1448481, 2315854, 2325427, -1145671, -3157253, -1152891, 1708245, 1663628, -714619, -2746847, -3896462, -5285406, -6972347, -8082685, -8369411, -7928050, -6604805, -4952713, -4242737, -4416042, -3943023, -2874962, -3522545, -6270826, -7437577, -4165693, 636713, 1645048, -1812565, -5401265, -5824452, -3886346, -1674099, -31298, 530576, -693995, -2972755, -4003701, -2623215, -292369, 879946, 339950, -1209486, -2928743, -3970075, -3657394, -2271623]
43013b271623J427207J073511J288204J730840J405743K75808r41202j866732
43005B121756k249168j544114P7984J219794J048356O60274J263251J981280J144434
42996E723847r75656k457879k310721j224633j40825N47418P46470P59101J039625
42987A706747R47895r76144m136348m996307j394978L579675M909539K123886
42979A763965n51949k56246J407033J608785k25389k752597m081950k507283J554648
42970d040983M274337K191484k399118l540892L7306K863420Q42085k899382l322009
42961e993752p80476R87013J156375J492292J779206M67526j183073m29365J779078
42952g25176J614892j250850k595058j66313K762950K293216p84581k719314j641254
$$ y = [-2271623, -844416, 229095, 1517299, 3248139, 4653882, 4929690, 3988488, 2121756, -127412, -1671526, -1593542, -373748, 674608, 1334882, 2598133, 4579413, 5723847, 4748191, 2290312, -20409, -1245042, -1385867, -838449, -91979, 667122, 1706747, 2654642, 1678498, -2457850, -7454157, -8849135, -5269460, -359921, 1763965, 1212016, 955770, 2362803, 3971588, 3746199, 993602, -3088348, -5595631, -4040983, 233354, 2424838, 25720, -3515172, -3477866, -614446, 227639, -2671743, -5993752, -6774228, -5787215, -4630840, -3138548, -1359342, -891816, -2074889, -2504254, -725176, 889716, -361134, -2956192, -3122505, -359555, 1933661, 1149080, -1570234, -3211488]
42943c211488J206099L495797L673543J965934K39904k76050q79715l061082m933418
42934a780476l221939J191763L647789K492992J227354K102504K085987j606224
42926F139750n831493n628577j416883K185126K883402J893194J96033j874700
42918a454148k278275P45846M449706L948778o26295l734691k241267O69703J138534
42909F17891O0780J74542J155097J063695L13816N27308R19635m49412k544465
42900A838887k340468j57305o9560l441162n592554j993597M510647O753231K913952
42891B422071j303676j222938N94929k23814k085212l43868L888399M322273m70893
42882E577271l945737j278069L330708L366237l59615k256161j112327m55962
$$ y = [-3211488, -2005389, 1490408, 5163951, 7129885, 7369789, 7093739, 6214024, 3152942, -1780476, -5002415, -3810652, -162863, 2330129, 3557483, 5659987, 7745974, 6139750, 308257, -5320320, -6737203, -4552077, -1668675, 224519, 420552, -1454148, -3732423, -2986577, 1463129, 5411907, 4785612, 1050921, -1190346, -520643, 617891, 678671, 853213, 2008310, 3072005, 3385821, 3913129, 4832764, 4383352, 1838887, -501581, -658886, -728446, -4169608, -9762162, -11755759, -7245112, -491881, 2422071, 1118395, -104543, 490386, 266572, -1818640, -2162508, 1725891, 6048164, 5577271, 1631534, 353465, 3684173, 7050410, 6690795, 4434634, 3322307, 2866345]
42874B866345j203181m63478K081276K693092K0460k202585j182486O37866N2218
42865C299527j856657k240968j123185k62060L97413J874645L226473K550476
42857E865664K05945j432003j054303N24556J824335J710812k71709l029516m108397
42848B35384k319901L58079R45674q60054k460944j622871J070027L060645K591740
42839I97779N88575l70608O96577J684950L48619k048785k143546O71766L284506
42830C709833L159625J137573q08422k129951k853467k409753p42731J073308
42822A36015K273544K797007J933821r43735l861693l632228p41135O61516q71047
42813b247935j630217J022903L971193L263776L37441o86540O57659J670588J348276
$$ y = [2866345, 1663164, 1199686, 3280962, 5974054, 5994514, 3791929, 2609443, 3247309, 3299527, 1442870, -798098, -1921283, -2183343, -1785930, 88715, 3315188, 5865664, 6071609, 4639606, 3585303, 4109859, 5934194, 7645006, 7373297, 4343781, 235384, -2084517, -1726438, -780764, -1640818, -4101762, -5724633, -4654606, -1593961, 997779, 1586354, 1215746, 1912323, 3597273, 3945892, 1897107, -246439, 425327, 3709833, 6869458, 8007031, 7198609, 5068658, 2215191, -194562, -937293, 136015, 2409559, 5206566, 7140387, 6196652, 2334959, -1297269, -2038404, -1376888, -2247935, -3878152, -2855249, 1115944, 4379720, 4717161, 4030621, 4688280, 6358868, 7707144]
42804G707144O89178l69108k451383m296073m233290k995424k065548q49566J428902
42795g435168L116799K906851K823232M403074M586836M23741m598907m886251
42787A340207j565186m23918k228210k314263M20129J800071N56123N33856K751012
42778H69821K755490j063862l578171j199055K327108K730794J840548K531119
42770G213792K703009n017k372886p41173J941387P37808k704148k923870J61394
42761D010296J555692m78888k694138k988344k455365j419078J086034L624196
42753B40405L282859P62099k31255R26551J166659k42939l08113J732675K275086
42744I604027n44025l220876k298261M16473J307409N26418N57557J418390R90007
$$ y = [7707144, 8396322, 8027214, 5575831, 1279758, -2953532, -5948956, -8014504, -8864070, -7435168, -4318369, -1411518, 1411714, 5814788, 10401624, 10825365, 6226458, 1340207, -224979, -648897, -2877107, -5191370, -4771241, -2971170, -2415047, -1881191, 869821, 3625311, 2561449, -1016722, -2215777, 111331, 2842125, 4682673, 7213792, 9916801, 9911784, 7538898, 6797725, 8739112, 9476920, 6772772, 3848902, 4010296, 5565988, 5087100, 2392962, -595382, -3050747, -4469825, -3383791, 240405, 3523264, 4285363, 4054108, 4980659, 6147318, 5904379, 5596266, 7328941, 9604027, 9060002, 5839126, 3540865, 3957338, 5264747, 5791165, 6348722, 7767112, 8757119]
42735H757119r08013k031515j218823l388k81757j724131k055986L03565L878541
42726D715612M951961J788292k479626l059964M41110L460458K486509q60471
42718A1443881k908497k638195j407053N666J530704K108361N33479k126971l149747
42709C391628j604557M13992O12731o58922j286369m35448L94960m11688k071611
42700a655284k025302P86807M160884M919017K516055n28342j591703m12229J370751
42691G540654K120723J282608p04857k890821m192531l651247r84481K471374
42683I91422L914629J685624k160551l696400k095409n75503j256553j819975
42675e012716L02825K968117K287481r29878k040009M38970L030450L062592J982577
$$ y = [8757119, 7849106, 5817591, 4598768, 4595380, 4313623, 2589492, 533506, 837071, 4715612, 9667573, 11455865, 8976239, 5916275, 6357385, 9817843, 12304352, 11443881, 8535384, 5897189, 4490136, 4495802, 6026506, 8134867, 8668346, 6541375, 3391628, 1787071, 2201063, 2813794, 2154872, 868503, 433055, 828015, 416327, -1655284, -3680586, -2893779, 1267105, 6186122, 8702177, 8173835, 6582132, 6169903, 7540654, 9661377, 10943985, 10239128, 7348307, 3155776, -495471, -1479952, 991422, 4906051, 6591675, 4431124, 734724, -1360685, -1936188, -3192741, -5012716, -4709891, -1741774, 545707, -384171, -2424180, -1985210, 1045240, 4107832, 6090409]
42666F090409J502466M43333k186248m170023l071072j20455J564027J098660
42658A151097j43675j185304j784023j279865N87357K436482K772788K115108
42650D669965J899385J986301J018222j226749l390271m138132l139240j026402
42642c346921P27513P94465k58780l85655Q57648J288003m83664k454754k063183
42633e325328j5342J152478J115280J635781L084468L818785K912056J169548
42625I547726n34018j833421j949364l88921J406057J243522p92980k385031k092719
42616B220851n65916J175944K460188K043719q54453m103077l937537J36035L939925
42607B515679L569787N854k665221k232356q8335J058886q8365k447957l566201
$$ y = [6090409, 7592875, 8036208, 5849960, 1679937, -1391135, -1511590, 52437, 1151097, 1007422, -177882, -1961905, -3241770, -2654413, -217931, 2554857, 4669965, 6569350, 8555651, 9573873, 8347124, 4956853, 818721, -2320519, -3346921, -2619408, -1824943, -2083723, -2469378, -1611730, -323727, -807391, -3262145, -5325328, -5340670, -4188192, -3072912, -1437131, 1647337, 5466122, 8378178, 9547726, 9013708, 7180287, 5230923, 4842002, 6248059, 7491581, 6698601, 4313570, 2220851, 1654935, 2830879, 5291067, 7334786, 6480333, 2377256, -1560281, -1424246, 2515679, 6085466, 6091320, 3426099, 1193743, 1105408, 2164294, 2075929, -372028, -3938229]
42598c938229k104241M88366J677261J132536P93659J550800J958665J064351
42590B623168L81459J470182L116837K801123J51879k630184l321695j555297
42582C037472J207006K587356J001902k354213l950438j687470K219355L436988
42574E497958M67532l691910m914100k166991J779573L367927J735788p94168
42566A281609j626919p46532p1946n83817j326700j056992M39168K536961L886340
42557B731172K729931r16806l740327k505583R26961J371903j991496l730958
42549e125203k54252M203732L574458j086206l556416j698333O03353M92894k06176
42540c052149L99882P24128q27928k347289j340927J077125J833728N36111j70312
$$ y = [-3938229, -6042470, -5554104, -3876843, -2744307, -1950648, -399848, 1558817, 2623168, 3004627, 4474809, 7591646, 10392769, 10544648, 7914464, 4592769, 3037472, 4244478, 6831834, 7833736, 5479523, 1529085, -158385, 2060970, 5497958, 5965490, 2273580, -2640520, -4807511, -3027938, 339989, 2075777, 1281609, -345310, -1091842, -1163788, -1747605, -3074305, -4131297, -3692129, -1155168, 2731172, 5461103, 4544297, 803970, -1701613, -774652, 597251, -1394245, -5125203, -5379455, -1175723, 2398735, 1312529, -2243887, -3942220, -3338867, -2845973, -3052149, -2652267, -1928139, -2756067, -5103356, -6444283, -5367158, -3533430, -2997319, -3167631]
42531c167631J353386L343393K874518l43966l205233k680837K27541J427701
42523a71128p41306k955725j778678J004858J263934o77286o26441K186567L437222
42514I42017P73025k209401j728104N40062J076398M07061J171206K692084K066199
42505E730547n20707j926350j133264k48443l17726Q7662J321201J108228j808769
42496B292379m823043m227564J44004M391976M591484J042197j746002r5068L894270
42487E464633M400038l35271n017404m283204L324J914378o2520k083748j580919
42478a580693j28645N27089Q48202R61378k33603k088656k025063J86791J489421
42469b043779M82973k96191R94740K240963J299024j67959J55735J122585M79791
$$ y = [-3167631, -1814245, 1529148, 4403666, 4059700, 854467, -1826370, -1598829, -171128, -912434, -3868159, -5646837, -4641979, -3378045, -4055331, -4681772, -2495205, 942017, 1715042, -494359, -2222463, -1682401, -606003, -198942, 972264, 3664348, 5730547, 5209840, 3283490, 2150226, 1901783, 1584057, 1671719, 2992920, 4101148, 2292379, -2530664, -6758228, -6614224, -2222248, 2369236, 3411433, 1665431, 1570363, 5464633, 9864671, 9529400, 4511996, 228792, 232116, 2146494, 2083974, 226, -1580693, -1709338, -1182249, -334047, 627331, 393728, -1694928, -3719991, -3533200, -2043779, -1560806, -1856997, -862257, 1378706, 2677730, 2509771, 2665506, 3788091, 4267882]
42460D267882j057666j492012j223221j561814j437189O44702K837862K164267
42452C142811m28666j275702J29967N71068j267786k538199p88132K341834L563685
42443C450880J964068p13477k293688j828745k07578N62558l08680j196946o01255
42434a172863Q2672j349753l780556l752090n81865K603584L448440K902552K272194
42425F72315R11586j431753k680536j166107J470779K347458J139479j68758n04405
42416E90058p42940j716331k685567k202407J9206K368666K761812J081809m21285
42407i46979O9716J571069J962845J014972j03344j325373l073443l788842j390298
42398f009677K657261M263344K538485J104950K075594K424329r47017n499626
$$ y = [4267882, 3210216, 1718204, 494983, -1066831, -2504020, -1859318, 978544, 3142811, 2714145, 1438443, 1568410, 2139478, 871692, -1666507, -2454639, -112805, 3450880, 5414948, 4701471, 2407783, 579038, 371460, 934018, 625338, -571608, -1172863, -1090191, -2439944, -6220500, -9972590, -10554455, -7950871, -4502431, -1599879, 672315, 1583901, 152148, -2528388, -3694495, -2223716, 123742, 1263221, 1094463, 590058, -152882, -1869213, -4554780, -6757187, -6737981, -4369315, -1607503, -525694, -946979, -877263, 693806, 2656651, 3671623, 3568279, 2242906, -830537, -4619379, -6009677, -3352416, 910928, 3449413, 4554363, 6629957, 9054286, 8107269, 2607643]
42390B607643n975419j525284L330345M362460J777787j148041j735817p6902
42382A616772J505311J204361j07591m28817J23080k06167j171245m87482J833801
42373C882023K612185N32715j471490j048364r1874p98942j617067o56482J92916
42364A535620j180150k351820q1927L476690L602558M56096j741806j812119k122660
42355b19518k655792q41309K383917K709324j06057j106809J497314K905195k38702
42346D327563l949414l271346r7143L03027k351335l360543j27080M651199O498220
42337B623148L570803j797173m761268k661558J271962J435426k314780m186862
42329f820302j248920K104510J461923o90542O7892K317164J740522r33415j132584
$$ y = [2607643, -3367776, -4893060, -1562715, 2799745, 4577532, 3429491, 1693674, 1616772, 3122083, 4326444, 4218853, 3790036, 3913116, 3706949, 2535704, 2048222, 3882023, 6494208, 7026923, 5555433, 4507069, 4415195, 3616253, 1999186, 1342704, 1535620, 355470, -1996350, -2078277, 1398413, 5000971, 5457067, 3715261, 1903142, -219518, -2875310, -3716619, -1332702, 1376622, 1270565, 163756, 1661070, 4566265, 4327563, 378149, -2893197, -2990340, -2687313, -5038648, -8399191, -8526271, -3875072, 2623148, 6193951, 4396778, -364490, -3026048, -1754086, -318660, -2633440, -6820302, -8069222, -5964712, -4502789, -5193331, -5125439, -2808275, -1067753, -2001168, -3133752]
42320c133752J814224M009832L448066J706214m10360l398855n248034k876979
42312d089644J801036K911313p30823l420919j270134K082953J719455j028822
42304b025585j423702J296305L508300K553938p71209l949042m547200j598896
42296f957091K718498M227326J536513j913876k491896j053026n51540r66671
42288e451763Q9580K686250L846768J702521j958280l734896j966126J782745
42280c003201L783754J625967k558689l967804j287716J442476R85321j47886
42272c127778J650357M221099K547771k639576m931981j588937K521953K293466
42264I46374q94667k622138j848832m83066O82111J933792K352862J073737l20405
$$ y = [-3133752, -1319528, 2690304, 6138370, 7844584, 7434224, 4035369, -1212665, -4089644, -2288608, 622705, -108118, -3529037, -4799171, -2716218, -996763, -2025585, -3449287, -2152982, 1355318, 3909256, 3138047, -810995, -5358195, -6957091, -4238593, -11267, 1525246, -388630, -2880526, -3933552, -4485092, -5451763, -5362183, -2675933, 1170835, 2873356, 915076, -2819820, -4785946, -3003201, 780553, 2406520, -152169, -4119973, -5407689, -3965213, -2979892, -3127778, -1477421, 2743678, 5291449, 2651873, -2280108, -3869045, -1347092, 946374, 51707, -2570431, -4419263, -4902329, -4220218, -2286426, 66436, 1140173, 819768]
42255H19768J07736J038631l28561l344047m205703j533135J543298J886013K73222
42246c742778o02280J08866J383449K437149K927486K039467o12435l391979l680153
42237c133208r48024K220103K707892L7404l287261m271266k096139J377134L420003
42228c973362K739786K61551j975476k486411j204778P51459J972651J714883
42220b199697L13609j210796j911156j411805m7311J290083J786474J509998J267662
42211f12939J362276J062384l0469p17359M14020K443867K519832m73068l842121
42202B126423l960129p27018K142889J435726j976113m405660l583033p92759
42194i739674J164167J305809J117288K124200L664571L551766P05472l249511
$$ y = [819768, 927504, 1966135, 1637574, -1706473, -5912176, -7445311, -5902013, -4016000, -3742778, -4345058, -4236192, -2852743, -415594, 2511892, 4551359, 3938924, 546945, -3133208, -4081232, -1861129, 846763, 884167, -2403094, -6674360, -8770499, -7393365, -3973362, -1233576, -972025, -2947501, -5433912, -6638690, -5887231, -3914580, -2199697, -1886088, -3096884, -5008040, -6419845, -6467156, -5177073, -3390599, -1880601, -612939, 749337, 1811721, 1781252, 1063893, 1477913, 3921780, 6441612, 5968544, 2126423, -1833706, -2560724, -417835, 1017891, -958222, -5363882, -8946915, -9739674, -8575507, -7269698, -6152410, -4028210, -363639, 3188127, 3893599, 644088]
42186F44088n116184l077820J192325L787756K722965L95129M42595K375820J827705
42177E194379k879007p219621o006691l72158M063272M650395L487445K397075
42169C315089P08815j285340j275337P60060J243595j414068l512003j490496
42161b949685K468268L893715K448212R18766p379j533909k852616k068894k25908
42152I0570j5841j053086p96323M21523J23885q99351N39990L303832K170650
42143C885849l422563o836818l463130K677711N178029L494219R54510j197730
42135A270077l030333k735601N49178L263804J850753j378193j778794J66879
42127a822230L91802j185966o82035K438614M025264K031262o69075j512080j414711
$$ y = [644088, -4472096, -7549916, -6357591, -2569835, 153130, 548259, 990854, 3366674, 5194379, 2315372, -4904249, -10910940, -11283098, -7219826, -2569431, 918014, 3315089, 4023904, 2738564, 1463227, 2223287, 3466882, 2052814, -1459189, -2949685, -481417, 3412298, 5860510, 6779276, 6771897, 5237988, 2385372, 316478, 90570, 74729, -978357, -1774680, -1353157, -1229272, -2128623, -1588633, 1715199, 3885849, 463286, -6373532, -9836662, -7158951, -1980922, 1513297, 2467807, 1270077, -1760256, -4495857, -3946679, -682875, 1167878, -210315, -1989109, -1822230, -1430428, -2616394, -3298429, -859815, 3165449, 5196711, 4527636, 3015556, 1600845]
42118A600845j172557N46555L407471L909655M94036l292035l603806j452653
42110D37511k66639p37697r97978j50279J051531J837033J683412J38792j985212
42101A010474k653394j325795K4764J24395N76298K752331M486947K717640j643210
42092F070450m317317k960590L57494K134146J267764m32013o46464Q23164J786132
42083D082766M55407j859840k268691l83413J199611Q69369m3307k08598m62867
42074A380437j389832j385983N31041K176389J141214j367208k295273j026256
42066b235471O65425J701323K122080J529587j86201j410607o62714R23439J410731
42057C857592J245314J858383K271685N02440k363728l234311k021682j787794
$$ y = [1600845, 428288, 974843, 4382314, 8291969, 8786005, 5493970, 1890164, 437511, 170872, -566825, -1564803, -1715082, -663551, 1173482, 2856894, 2995686, 1010474, -1642920, -2968715, -2943951, -2819556, -2243258, 509073, 4996020, 7713660, 6070450, 1753133, -1207457, -849963, 1284183, 2551947, 2119934, 1473470, 2296634, 4082766, 4538173, 2678333, 409642, 26229, 1225840, 2095209, 2051902, 1843304, 1380437, -9395, -1395378, -864337, 1312052, 2453266, 1086058, -1209215, -2235471, -1570046, 131277, 2253357, 3782944, 3596743, 2186136, 1523422, 2446861, 3857592, 5102906, 6961289, 9232974, 9735414, 7371686, 4137375, 2115693, 327899]
42049C27899l399192l801598q99018L051097M616237L329452J084649n89879j214165
42040B505482r69431q07823j541553k138664o48471K499148M114701K241628j188366
42031D066651k831397j646975Q23071K529684K316436L89977j771607k754076
42023A121764k684221k505732k182459j129567N5079L15242K27997J062415K129563
42014c589919J799256P89223J086889J750781k8733l128946k656338K236500N629688
42005C888401L129555j501424k276222J9674L2517l098336m605783j783729K168412
41996d026935L072788R35197j298596j755622r61798m08995p65642j259476r26545
41987g395624l53993q96374j988833j425317R11035K326786J714430J484446K966293
$$ y = [327899, -3071293, -6872891, -7771909, -4720812, -104575, 3224877, 4309526, 3719647, 2505482, 1536051, 728228, -813325, -2951989, -3600460, -1101312, 3013389, 5255017, 4066651, 1235254, -411721, 411350, 2941034, 5257470, 5647447, 3875840, 1121764, -1562457, -4068189, -6250648, -7380215, -7325136, -7009894, -6781897, -5719482, -3589919, -1790663, -1001440, 85449, 1836230, 1807497, -1321449, -3977787, -1741287, 3888401, 7017956, 5516532, 3240310, 3259984, 3292501, 194165, -4411618, -6195347, -4026935, -954147, -18950, -1317546, -3073168, -4034966, -4443961, -5209603, -6469079, -7395624, -7749617, -8645991, -10634824, -12060141, -11149106, -8822320, -7107890, -5623444, -2657151]
41978b657151L450236J026348j195450m1260J728916k64238m197991m741041j958681
41969h850312o51890j402827J68152M345618N355435J131999k235095K163L628287
41960A491530K669906r30233j167663J991330L124199K54495k913959l326221
41952A193384j886108j24155J879097L390195K693987J37822j421430m22017J380914
41943F821689J582638p6377k180898l159687j985213Q54767K835117J746561j133020
41934E305577k221400l82920J676112J445628k74939j507029k053202k419331
41926d31504j706311P34598K628506R67580k992703m127706k26991M305257L970496
41917C121222m76269l428266k291420o9900L44651K91417J641055K639653R90633
$$ y = [-2657151, 793085, 1819433, 623983, 582723, 2311639, 2047401, -2150590, -6891631, -8850312, -9502202, -10905029, -10736877, -6391259, -1035824, 96175, -2138920, -2136757, 1491530, 4161436, 3231203, 2063540, 4054870, 7179069, 7433564, 4519605, 1193384, -692724, -816879, 1062218, 4452413, 7146400, 7284222, 5862792, 5440775, 6821689, 8404327, 8327950, 6147052, 2987365, 1002152, 1856919, 4692036, 6438597, 5305577, 3084177, 2701257, 4377369, 5822997, 5548058, 4041029, 1987827, -431504, -2137815, -1403217, 1225289, 2192869, -799834, -4927540, -5154531, -849274, 3121222, 2644953, -783313, -3074733, -3144633, -2799982, -2508565, -867510, 1772143, 2762776]
41908B762776j359323p10908K325469L492974J281216j428176k351820k429083
41900A583125k647298k112284o79646m5723n71929j74678J907796L291009K228964
41891B779336K93958o20565j034377j636368j389026j46041n9813j810042k515970
41882f138908k70565K331954K412467J467904K087228K875635R94892k387055
41874C373552l583026j798712Q39206L022158M254418L086398n05311k909153
41866E779530j397541J142398N78903j678918j617920o1442p98481k905686k040127
41857b999284J281692K083976k15909q00311J804125L390242J973383O24646M11839
41848G554399j863003o056678o498721j292727L365339K639505M3411J16833R29105
$$ y = [2762776, 1403453, 692545, 3018014, 6510988, 7792204, 6364028, 4012208, 1583125, -1064173, -3176457, -3856103, -3901826, -4473755, -4648433, -2740637, 550372, 2779336, 3073294, 2452729, 1418352, -218016, -1607042, -1753083, -1812896, -3622938, -6138908, -6409473, -4077519, -1665052, -197148, 1890080, 4765715, 5760607, 3373552, -209474, -2008186, -1168980, 1853178, 6107596, 9193994, 8688683, 5779530, 4381989, 5524387, 6103290, 4424372, 2806452, 2745010, 1946529, -959157, -2999284, -1717592, 366384, 150475, -649836, 1154289, 4544531, 6517914, 7142560, 7554399, 5691396, -365282, -6864003, -8156730, -4791391, -2151886, -2108475, -1991642, -1062537]
41839a062537l07193o53690K569917M813257J052351m847316n507341j440070
41831e382622R33621J19732J82333J997284K038891k11262r96909Q85834K258097
41822A824999J353244M998n06152q14049n20862J171340K005456r35940n399390
41813a816356n941861k009983J393248J582725J156324K150895K712189J186812
41805D13993j125227k710778l276093j919795J648586L995505J399406l343387
41797d917790l600705R03431L355766Q43713j317459Q38374L414338K126917l88194
41788A258391k53440M49835j437519k774517J082044P071470P494450J273172
41780A4163886m475311m402129r60181N89865j149272l649948m125640j719241
$$ y = [-1062537, -1369730, -2023420, 546497, 5359754, 6412105, 1564789, -3942552, -5382622, -4449001, -4329269, -4146936, -2149652, -110761, -322023, -1318932, -433098, 1824999, 3178243, 3183241, 2677089, 1863040, 1342178, 2513518, 4518974, 3583034, -1816356, -7758217, -9768200, -8374952, -6792227, -5635903, -3485008, -772819, 413993, -711234, -3422012, -6698105, -8617900, -6969314, -2973809, -1574403, -4917790, -8518495, -7615064, -4259298, -3415585, -4733044, -3894670, -480332, 1646585, 1258391, 1004951, 1454786, 17267, -2757250, -1675206, 5396264, 12890714, 14163886, 9688575, 5286446, 4326265, 4916130, 3766858, 116910, -4008730, -5727971]
41772e727971K221787M953413M324250O32635l505201m985867k470215K026402
41764b530767M345209K682449L6881j76497N29299j314621m122496k996367J457965
41755b088945K871999n68842k658053N90424M132979K254872k358457l845259
41747a669282k326172j386398p87054J423156L121557J508464p08472L92181K321601
41738A889581M16683k908984j674829K586511K571826k165289l873070O18336
41730b539235M871208L573517J29753n73571J2636j530021l841266l621842j500507
41721e019328m64400r36649j009484K68673K286170L822539L346864O13295j552305
41712A355375j92643K795188K630642r78520l265210k125190r33359j864664k152559
$$ y = [-5727971, -3506184, 1447229, 5771479, 6404114, 2898913, -2086954, -4557169, -2530767, 1814442, 4496891, 4533772, 4357275, 4886574, 3571953, -550543, -3546910, -2088945, 783054, 214212, -2443841, -1853417, 2279562, 4534434, 2175977, -1669282, -3995454, -5381852, -6168906, -4745750, -1624193, -115729, -824201, -432020, 1889581, 2306264, -602720, -2277549, 308962, 2880788, 715499, -3157571, -2539235, 2331973, 5905490, 6035243, 5461672, 5474308, 3944287, 103021, -3518821, -5019328, -5483728, -6420377, -7429861, -7161188, -4875018, -1052479, 2294385, 2907680, 1355375, 1162732, 3957920, 6588562, 5610042, 2344832, 219642, -713717, -2578381, -4730940]
41703d730940J58413K166787J380923J54071R87364J875260M38273j421757j240029
41694b31635n01708j104997j117263J222094K843622M48419l162004k832970J005938
41685c430504L424414K430777M06272o71771r21952m56178N09979N69966n99474
41676A261529q04019O49356M96783k927528n272514k515286J840185K245159M30373
41667d595962J561414L810143J150722m413660l884412L909744Q742281M092864
41659A0373134l276747m327672n99270O94282j563956l045236k471245k051980
41651f268690j581248J192886N114958O135233L128335j101248m120202n295309
41643b795285l900505j11019K753814J503801j544729j062812L036648M695487
$$ y = [-4730940, -4572527, -2405740, -1024817, -870746, 116618, 1991878, 2430151, 1008394, -231635, -733343, -1838340, -2955603, -1733509, 1110113, 1558532, -1603472, -4436442, -3430504, -6090, 2424687, 2830959, 2159188, 1237236, 781058, 1291037, 1861003, 1261529, 457510, 1106866, 1603649, -1323879, -6596393, -9111679, -7271494, -5026335, -4595962, -3034548, 775595, 1926317, -2487343, -6371755, -2462011, 6280270, 10373134, 7096387, 2768715, 2169445, 2863727, 1299771, -1745465, -4216710, -6268690, -7849938, -6657052, -1542094, 4593139, 7721474, 6620226, 2500024, -2795285, -6695790, -6806809, -4052995, -2549194, -4093923, -5156735, -2120087, 2575400]
41635B575400N61117m796928n229644j084422K393777K404528P41787k60344m13602
41626c108331j89999O08732J766780K116435J139694j39136p61282j181200j921953
41617a670260j988222k84882J950500K167347J43842j422576p80812L84410j85539
41608a686192j709804j821665m57559M04496L95878J115170K530792K251877k14530
41599H08463j428367J245062M898107M293690r30264n453669n002675j100347
41591b670000J965549K455696J517352L2674j990461l330600j939714J569139
41583b390365L330716J071819k264194k323000L90257J344872j043353l042383
41575d925631j528494J224214J333750p06489j293946M57850J832083J126725
$$ y = [2575400, 3136517, -1660411, -6890055, -7974477, -5580700, -3176172, -2434385, -2694729, -3108331, -3298330, -2689598, -922818, 1193617, 2333311, 2194175, 1432893, 251693, -1670260, -3658482, -3943364, -1992864, 174483, 318325, -1104251, -1885063, -1500653, -1686192, -3395996, -5217661, -5675220, -5270724, -4874846, -3759676, -1228884, 1022993, 808463, -619904, 625158, 5523265, 9816955, 8886691, 3433022, -1569653, -2670000, -704451, 1751245, 3268597, 3301271, 1310810, -2019790, -3959504, -2390365, 940351, 2012170, -252024, -2575024, -2184767, -839895, -1883248, -4925631, -6454125, -5229911, -3896161, -4602650, -5896596, -5438746, -3606663, -2479938]
41567b479938k47679p67890r42920j415491j304212J22955J741940J972057R62650
41558b358528K84472Q99874K105020K368842J150616j60427J40166J311739N91378
41549F333152k612068m893508l240715M88363K186561J180560O4765l6240k46207
41540g75337n88569l9560K16719j825957m034339j831652L805387N750729R65170
41531A642591m099384k581910K898904M793344J649131j502477j849713j544788
41523e94302k032457j499322Q65283K692597K186961O22190l37422q98675j469645
41514d64792j383814n58343j33832l87343j93747N20845J73568j456195j994098
41505e877751Q6534K744751K974978P51378j377439j614467k52931J516006K604584
$$ y = [-2479938, -2727617, -3495507, -4438427, -5853918, -7158130, -7035175, -5293235, -3321178, -2358528, -2074056, -1174182, 930838, 3299680, 4450296, 4289869, 4430035, 5741774, 6333152, 3721084, -1172424, -4413139, -3924776, -1738215, -557655, -492890, -529130, -775337, -1363906, -1403466, -1186747, -3012704, -7047043, -8878695, -5073308, 677421, 1642591, -2456793, -5038703, -2139799, 2653545, 4302676, 2800199, 950486, -594302, -2626759, -4126081, -3260798, -568201, 1618760, 2240950, 1903528, 1004853, -464792, -1848606, -2406949, -2540781, -2928124, -3121871, -2601026, -2427458, -3883653, -5877751, -5791217, -3046466, -71488, 679890, -697549, -2312016, -2564947, -1048941, 1555643]
41496A555643K236097M18406j782988l038582k706266r74006J209189K260693
41488h21814J160778j052052k103339j294097k42709k18128l17890N00202J105758
41479c283291j42154k282173k522899r0896K653784L351453K185782O26741p14538
41470b18191j755540j753150j80683J699812J824227k5201j882071k081961q33878
41461e206636Q71498K386674K885441J434280j213629k382277o79900J702398
41453b02151J786244n6328j039860m16642k16820j369692j932707l05281K048428
41444a704809K656764J337134n2933k42941K73703K33872q43194j844128j053603
41435a240135J391958K971186K108181P33392J155977J815810k22545l505412
$$ y = [1555643, 3791740, 4210146, 2427158, -611424, -3317690, -4291696, -3082507, -821814, 338964, -713088, -2816427, -4110524, -4353233, -4571361, -4889251, -4389049, -3283291, -3425445, -5707618, -8230517, -8321413, -5667629, -2316176, -130394, 496347, -218191, -1973731, -3726881, -3907564, -2207752, -383525, -408726, -2290797, -4372758, -5206636, -4335138, -1948464, 936977, 2371257, 1157628, -1224649, -1904549, -202151, 1584093, 1527765, 487905, 71263, -145557, -1515249, -3447956, -3753237, -1704809, 951955, 2289089, 2236156, 1993215, 2266918, 2500790, 1657596, -186532, -1240135, 151823, 3123009, 5231190, 5964582, 7120559, 8936369, 8713824, 5208412]
41427E208412l673768o97988Q05246n85261j005457R29268J031897k134549k877721
41418b999921K020111N923123K223869l960283l442256J708820J655953m080188
41410i50772n258589J829697P681076M594583j986171l501470j116141q99456
41402C92757k708827k245862J06492O09454k90665R01072L637500L956678J227942
41393E586541j531486l137661m480551m305654p23127L472226L121832j198473
41385c196353l284260n77653K426233J914455L18542J069739K502768J142680
41377B316151j978853k629672K89262L236924K705040q55005l913560l506078
41369d335791o6662K954728K739052K13495j490276j210890n50045p35576j104829
$$ y = [5208412, 1534644, 836656, 1641902, 1056641, 51184, 980452, 2012349, -122200, -2999921, -979810, 4943313, 7167182, 3206899, -235357, 1473463, 3129416, -950772, -6209361, -4379664, 3301412, 7895995, 5909824, 2408354, 1292213, 392757, -2316070, -4561932, -4455440, -3845986, -4136651, -3235579, 401921, 4358599, 5586541, 4055055, 917394, -3563157, -7868811, -8591938, -5119712, -1997880, -3196353, -6480613, -7058266, -4632033, -2717578, -2399036, -1329297, 1173471, 2316151, 337298, -2292374, -2003112, 1233812, 3938852, 3083847, -829713, -4335791, -4402453, -1447725, 1291327, 1504822, 14546, -1196344, -1746389, -2481965, -3586794]
41360c586794j003510o79846K34763K386409M087425K303563k231561m334600
41352b824151j320039K556165K060650j262378j769610J408508L350361J269965
41344C469471j621445j821147p69303j521410l326737l098495o03961J388172
41336g904855J624540J771325K903970L420819J782267o11040j103650M70415
41328B353791J437496j81891k919135l397737m41486L110104L393509J42909k836992
41319F60568k363928K52850J426767L23434n84181K51562J343679J095669L48086
41310B754506M01266M81885p46111k492389k761097j066396J521276L932280M898376
41301F923596K785574j752267m390129j867884K661130K956719j675732n353008
$$ y = [-3586794, -4590304, -5270150, -5035387, -2648978, 1438447, 3742010, 1510449, -2824151, -4144190, -1588025, 472625, -789753, -2559363, -1150855, 2199506, 3469471, 1848026, 26879, -742424, -2263834, -5590571, -8689066, -9293027, -7904855, -6280315, -4508990, -1605020, 1815799, 3598066, 2987026, 1883376, 2353791, 3791287, 3609396, 690261, -2707476, -3148962, -38858, 3354651, 3497560, 660568, -1703360, -1450510, -23743, 299691, -284490, -32928, 1310751, 2406420, 2754506, 3155772, 3637657, 2891546, 399157, -2361940, -3428336, -1907060, 2025220, 6923596, 9709170, 7956903, 3566774, 1698890, 4360020, 7316739, 5641007, 287999]
41293B87999m023723m42019J154035J012662J396567J704467J57146j875214j513481
41284b141561O84415J347578l65357j569721k64975J786122J836412j33167j594116
41275d14370m85590K448051M092508K214588j485334k950200j068170P08076m30592
41266B628967k309782j411394J256539J791698j76333j033222P14605K122590
41258C583668Q12251j411416j951028j462245j939965k777790j623421J580652
41250e189294L922978L178922N22031j134427o52248M56832N70465J32759L19126
41241B127144N84166l73506j580816o13423K053106K933973J190262M68826K454630
41232I244362K830694j942462p532033p338964k631583k01504j314887p72200
$$ y = [287999, -3735724, -4177743, -3023708, -2011046, -614479, 1089988, 1247134, -628080, -2141561, -1457146, -109568, -474925, -2044646, -2309621, -523499, 1312913, 1179746, -414370, -899960, 1548091, 5640599, 7855187, 6369853, 3419653, 2351483, 3059559, 2628967, 319185, -1092209, 164330, 1956028, 1779695, 746473, 1461078, 3583668, 4395919, 2984503, 1033475, -428770, -2368735, -5146525, -6769946, -5189294, -1266316, 1912606, 2434637, 1300210, 647962, 1104794, 1675259, 1808018, 2127144, 2711310, 2337804, 756988, 143565, 2196671, 5130644, 6320906, 6789732, 9244362, 12075056, 10132594, 2600561, -4738403, -7369986, -7571490, -8886377, -9658577]
41224i658577K897882M628225K202614L99157K135421K930821p84518m462480
41216B88545k808108J052351R06246k112699k130954J017443J894498r20624k837788
41207e651090j314681P57518R72420Q84280J793899K078395Q38898M0589Q73735
41198A273963J452001J17194j898467k775960k447172j342883N77297K405246
41190b638781K467852R48388j10698k9687j8418j78827O98168J856971R18988
41181C913956j604726k242778k69532R31082j16392n12257R97595Q94757k418621
41172d26916m064540j53801M636840L495716j712634l383325q0652K324568J143665
41163A778921M49980K606112L763322J087408j902409j497467j15752j539369
$$ y = [-9658577, -6760695, -2132470, 70144, 469301, 2604722, 5535543, 4751025, 288545, -2519563, -1467212, -560966, -2673665, -4804619, -3787176, -1892678, -2813302, -5651090, -6965771, -6208253, -5235833, -4351553, -2557654, -479259, 359639, 400228, 1273963, 2725964, 2843158, 944691, -1831269, -4278441, -5621324, -5044027, -2638781, -170929, 777459, 666761, 637074, 618656, 439829, 1137997, 2994968, 3913956, 2309230, 66452, -203080, 728002, 611610, 99353, 1096948, 1991705, -426916, -4491456, -4645257, -8417, 3487299, 1774665, -1608660, -1689312, 635256, 1778921, 2228901, 4835013, 8598335, 9685743, 7783334, 6285867, 6170115, 4630746]
41155D630746l924545l058949J48759J103567r48543k213716q51269P49658P32225
41146c632067M07386Q42691N59752j430466l095756k060038R63840L222879L149831
41137a071948J200507j288825k762322k036949M08910K396023K273266N71180
41129c10158j180167k249807k469965j365883J104307L560072M247769K906241
41121D242409Q28239n42729m78257Q20035J994852J270406j487323m025933m153939
41112a532240k425169j188789j435247j970731j509736j97708R85195J174682
41104h099743K1414j708779k098646m0272K781000L407384J316899j001757j551078
41095f973578j056304q53341m72353J014732K588803K347621N02714o82811r3228
$$ y = [4630746, 706201, -2352748, -2203989, -1100422, -2048965, -4262681, -5113950, -4364292, -3632067, -3224681, -2381990, -1822238, -3252704, -6348460, -8408498, -7444658, -4221779, -1071948, 128559, -1160266, -3922588, -5959537, -5550627, -3154604, -881338, -310158, -1490325, -3740132, -6210097, -7575980, -6471673, -2911601, 1336168, 4242409, 5070648, 4527919, 4049662, 4869697, 6864549, 8134955, 6647632, 2621699, -1532240, -3957409, -5146198, -6581445, -8552176, -10061912, -10259620, -9274425, -8099743, -8078329, -9787108, -11885754, -11926026, -9145026, -5737642, -4420743, -5422500, -6973578, -8029882, -8883223, -9355576, -8340844, -5752041, -3404420, -2901706, -3584517, -3677745]
41086c677745Q50602O40095N7287Q33146K636362K970015M32050l028684m093787
41077b380659j919219J047122K111088J101707k65421o17108L04254K030789L339577
41068D752130K697024J79147j751429j082128P00286M60840j949901l374843j990004
41059a358878L07441J091792N37122p8863p12350j467747j184783M78750J147651
$$ y = [-3677745, -2827143, -2187048, -2129761, -1296615, 1339747, 4309762, 4741812, 1713128, -2380659, -4299878, -3252756, -1141668, -39961, -305382, -922490, -618236, 1412553, 4752130, 7449154, 7628301, 5876872, 4794744, 5495030, 5955870, 4005969, 631126, -1358878, -1051437, 40355, 577477, 498614, -213736, -1681483, -2866266, -2387516, -1239865]
$$ [...]
##END NTUPLES=NMR SPECTRUM
##END=
