##TITLE=31Pdec_LR-688B-MC2
 DMSO-d6, 124 sc
 2.8.2019
##JCAMPDX= 6.0         $$ Bruker NMR JCAMP-DX V2.0
##DATA TYPE= NMR SPECTRUM
##DATA CLASS= NTUPLES
##ORIGIN= UXNMR, Bruker Analytische Messtechnik GmbH
##OWNER= root
$$ XWIN-NMR		Version 3.5
$$ Fri Aug  2 14:02:51 2019 Russian Standard Time (UT+4h)  she@DPX200
##.OBSERVE FREQUENCY= 81.013821
##.OBSERVE NUCLEUS= ^31P
##.ACQUISITION MODE= SIMULTANEOUS
##.ACQUISITION SCHEME= undefined
##.AVERAGES= 24
##.DIGITISER RES= 17
##SPECTROMETER/DATA SYSTEM= spect
##.PULSE SEQUENCE= zgpg30
##.SOLVENT NAME= DMSO
##.SHIFT REFERENCE= (INTERNAL, DMSO, 0, 182.463)
##AUDIT TRAIL= $$ (NUMBER, WHEN, WHO, WHERE, WHAT)
$$ ##TITLE= Audit trail, XWIN-NMR		Version 3.5
$$ ##JCAMPDX= 5.01
$$ ##ORIGIN= Bruker BioSpin GmbH
$$ ##OWNER= she
$$ F:/spectra/data/she/nmr/P31/1/pdata/1/auditp.txt
$$ ##AUDIT TRAIL=  $$ (NUMBER, WHEN, WHO, WHERE, WHAT)
(   1,<2019-08-02 14:02:03.62 +0400>,<she>,<DPX200>,
      <created by zg, POWCHK disabled, PULCHK disabled
       configuration hash MD5:
       00 E9 B6 7A A2 85 ED C7 34 08 36 98 17 FE 4E 26
       data hash MD5: 32K
       B0 7A 1C 9A 4E 8B 3E 99 78 D7 D0 5D 1D 8D 04 ED>)
(   2,<2019-08-02 14:02:06.79 +0400>,<she>,<DPX200>,
      <Start of raw data processing
       efp BC_mod = 2 LB = 1 FT_mod = 6 PKNL = 1 PHC0 = -586.5504 PHC1 = 565.0003 SI = 64K 
       data hash MD5: 64K
       3A 24 BA 9E FD 6E 96 93 C6 66 AC 55 00 07 A5 4E>)
(   3,<2019-08-02 14:02:19.45 +0400>,<she>,<DPX200>,
      <pk PHC0 = 3.490464 PHC1 = 0 
       data hash MD5: 64K
       76 D9 A6 B1 40 41 24 9F 38 F7 A0 25 38 5D 56 B3>)
$$ ##END=
$$ 
$$ hash MD5
$$ 1C 57 CE 60 B3 25 35 05 F2 07 64 C5 02 39 C1 B0
##$RELAX= 
##$RELAX= 
##$RELAX= 
##$RELAX= 
##$RELAX= 
##$RELAX= 
##$RELAX= 
##$RELAX= 
$$ Bruker specific parameters
$$ --------------------------
##$DU= <F:/spectra>
##$EXPNO= 1
##$NAME= <P31>
##$PROCNO= 1
##$TYPE= <nmr>
##$USER= <she>
##$AMP= (0..31)
100 100 100 100 100 100 100 100 100 100 100 100 100 100 100 100 100 100 
100 100 100 100 100 100 100 100 100 100 100 100 100 100 
##$AQSEQ= 0
##$AQ_mod= 1
##$AUNM= <au_zg>
##$AUTOPOS= <>
##$BF1= 81.014009
##$BF2= 200.13
##$BF3= 200.13
##$BF4= 200.13
##$BF5= 200.13
##$BF6= 200.13
##$BF7= 200.13
##$BF8= 200.13
##$BYTORDA= 1
##$CFDGTYP= 0
##$CFRGTYP= 5
##$CHEMSTR= <none>
##$CNST= (0..31)
1 1 145 1 1 1 1 1 1 1 1 1 1 1 1 1 1 1 1 1 1 1 1 1 1 1 1 1 1 1 1 1 
##$CPDPRG= <waltz16>
##$CPDPRG1= <>
##$CPDPRG2= <waltz16>
##$CPDPRG3= <>
##$CPDPRG4= <mlev>
##$CPDPRG5= <mlev>
##$CPDPRG6= <mlev>
##$CPDPRG7= <mlev>
##$CPDPRG8= <mlev>
##$CPDPRGB= <>
##$CPDPRGT= <>
##$D= (0..31)
0 1 0 0 0 0 0 0 0 0 0 0.03 2e-05 3e-06 0 0 0 0 0 0 0 0 0 0 0 0 0 0 0 0 
0 0 
##$DATE= 1564740123
##$DBL= (0..7)
120 120 120 11 120 120 24 19 
##$DBP= (0..7)
150 150 150 150 150 150 150 150 
##$DBP07= 0
##$DBPNAM0= <>
##$DBPNAM1= <>
##$DBPNAM2= <>
##$DBPNAM3= <>
##$DBPNAM4= <>
##$DBPNAM5= <>
##$DBPNAM6= <>
##$DBPNAM7= <>
##$DBPOAL= (0..7)
0.5 0.5 0.5 0.5 0.5 0.5 0.5 0.5 
##$DBPOFFS= (0..7)
0 0 0 0 0 0 0 0 
$$ [...]
##$SUBNAM2= <"">
##$SUBNAM3= <"">
##$SUBNAM4= <"">
##$SUBNAM5= <"">
##$SUBNAM6= <"">
##$SUBNAM7= <"">
##$SUBNAM8= <"">
##$SUBNAM9= <"">
##$SW= 369.568048894756
##$SWIBOX= (0..15)
0 1 3 0 0 0 0 0 0 0 0 0 0 0 0 0 
##$SW_h= 29940.119760479
##$TD= 32768
##$TD0= 1
##$TE= 0
##$TE2= 300
##$TE3= 300
##$TEG= 300
##$TL= (0..7)
0 120 53 12 22 120 120 120 
##$TP= (0..7)
150 150 150 150 150 150 150 150 
##$TP07= 0
##$TPNAME0= <>
##$TPNAME1= <>
##$TPNAME2= <>
##$TPNAME3= <>
##$TPNAME4= <>
##$TPNAME5= <>
##$TPNAME6= <>
##$TPNAME7= <>
##$TPOAL= (0..7)
0.5 0.5 0.5 0.5 0.5 0.5 0.5 0.5 
##$TPOFFS= (0..7)
0 0 0 0 0 0 0 0 
##$TUNHIN= 0
##$TUNHOUT= 0
##$TUNXOUT= 0
##$USERA1= <user>
##$USERA2= <user>
##$USERA3= <user>
##$USERA4= <user>
##$USERA5= <user>
##$V9= 5
##$VALIST= <valist>
##$VCLIST= <CCCCCCCCCCCCCCC>
##$VD= 0
##$VDLIST= <DDDDDDDDDDDDDDD>
##$VPLIST= <PPPPPPPPPPPPPPP>
##$VTLIST= <TTTTTTTTTTTTTTT>
##$WBST= 1024
##$WBSW= 4
##$XGAIN= (0..3)
0 0 0 0 
##$XL= 0
##$YL= 0
##$YMAX_a= 10671
##$YMIN_a= -12003
##$ZGOPTNS= <>
##$ZL1= 120
##$ZL2= 120
##$ZL3= 120
##$ZL4= 120
##$ABSF1= 0
##$ABSF2= 0
##$ABSG= 0
##$ABSL= 0
##$ALPHA= 0
##$AQORDER= 0
##$ASSFAC= 0
##$ASSFACI= 0
##$ASSFACX= 0
##$ASSWID= 0
##$AUNMP= <proc_1d>
##$AZFE= 0.1
##$AZFW= 0.5
##$BCFW= 0
##$BC_mod= 2
##$BYTORDP= 0
##$COROFFS= 0
##$CY= -3
##$DATMOD= 1
##$DC= 0
##$DFILT= <>
##$DTYPP= 0
##$F1P= 0
##$F2P= 0
##$FCOR= 1
##$FTSIZE= 65536
##$FT_mod= 6
##$GAMMA= 0
##$GB= 0
##$INTBC= 1
##$INTSCL= 5.30512e-09
##$ISEN= 30
##$LB= 1
##$LEV0= 0
##$LPBIN= 0
##$MAXI= 10000
##$MC2= 0
##$MEAN= 0
##$ME_mod= 0
##$MI= 50
##$NCOEF= 0
##$NC_proc= -7
##$NLEV= 6
##$NOISF1= 182.463
##$NOISF2= 159.3651
##$NSP= 0
##$NTH_PI= 0
##$NZP= 0
##$OFFSET= 182.463
##$PC= 4
##$PHC0= -583.0599
##$PHC1= 565.0003
##$PH_mod= 1
##$PKNL= yes
##$PPARMOD= 0
##$PSCAL= 0
##$PSIGN= 0
##$REVERSE= no
##$SF= 81.0140089999434
##$SI= 65536
##$SIGF1= 159.3651
##$SIGF2= -187.1042
##$SINO= 113.3802
##$SIOLD= 16384
##$SREGLST= <1H.CDCl3>
##$SSB= 0
##$STSI= 65536
##$STSR= 0
##$SW_p= 29940.119760479
##$SYMM= 0
##$S_DEV= 0
##$TDeff= 32768
##$TDoff= 0
##$TI= <>
##$TILT= no
##$TM1= 0
##$TM2= 0
##$TOPLEV= 0
##$USERP1= <user>
##$USERP2= <user>
##$USERP3= <user>
##$USERP4= <user>
##$USERP5= <user>
##$WDW= 1
##$XDIM= 65536
##$YMAX_p= 327409657
##$YMIN_p= -30368675
$$ End of Bruker specific parameters
$$ ---------------------------------
##NTUPLES= NMR SPECTRUM
##VAR_NAME=  FREQUENCY,     SPECTRUM/REAL,   SPECTRUM/IMAG
##SYMBOL=    X,             R,               I
##VAR_TYPE=  INDEPENDENT,   DEPENDENT,       DEPENDENT
##VAR_FORM=  AFFN,          ASDF,            ASDF
##VAR_DIM=   65536,         65536,           65536
##UNITS=     HZ,            ARBITRARY UNITS, ARBITRARY UNITS
##FACTOR=    0.456856943014862, 1,           1
##FIRST=     14782.0589164792, 0,            0
##LAST=      -15158.0608439998, 0,           0
##MIN=       -15158.0608439998, -30368675,   0
##MAX=       14782.0589164792, 327409657,    0
$$ Real data points
##PAGE= N=1
##DATA TABLE= (X++(R..R)), XYDATA
$$ [...]
45334B119521K732025Q41639M18311J997478K190561o8852j912649j219327M90885
$$ 2119521 4851546 5693185 6111496 8108974 10299535 10230683 8318034 7098707 7589592
45325G589592P21208n79943j485774j020076l79335r83824k066977j456284J015933
$$ 7589592 8310800 7730857 6245083 5225007 4845672 3861848 1794871 338587 1354520
45316A354520K581032J355282n24519N2424K115909J818843j480778l910940k785434
$$ 1354520 3935552 5290834 4766315 4818739 6934648 8753491 7272713 3361773 576339
45307E76339k66878M46497k89942k65541M60658P8488j424045k003400o59146
$$ 576339 309461 755958 466016 200475 661133 739621 -684424 -2687824 -3346970
45298c346970J280967K076711J355545l9202r40593o87601K64858Q94713J067278
$$ -3346970 -2066003 10708 1366253 1327051 386458 -301143 -36285 858428 1925706
45289A925706J489209J875920Q40390j433188k388181p25494J022232J8840k261779
$$ 1925706 3414915 5290835 6131225 4698037 2309856 1584362 2606594 2625434 363655
45280C63655k088909O73098K381917J405258L22381J166647K052535Q60333o31962
$$ 363655 -1725254 -1052156 1329761 2735019 3057400 4224047 6276582 7136915 6504953
45271F504953M10857K670000K126021j566932l860231j599766K370211K988528
$$ 6504953 6915810 9585810 11711831 10144899 6284668 4684902 7055113 10043641
45263A0043641m28178l867910m182235k391151j083479q10990m54813K65959N10192
$$ 10043641 9615463 5747553 1565318 -825833 -1909312 -2720302 -3175115 -2909156 -2398964
45254b398964P4504k12041Q2136M75174O61423R00615J050533M44152q32713j713215
$$ -2398964 -2324460 -2536501 -2454365 -1979191 -1317768 -417153 633380 1077532 244819 -1468396
45244a468396j654125j126845k25357J485388K992964J989771j299759k770661
$$ -1468396 -3122521 -4249366 -4474723 -2989335 3629 1993400 693641 -2077020
45236b077020K30157M030343L023050j815465l534409P70173N344008L890290
$$ -2077020 -1846863 2183480 5206530 3391065 -143344 626829 5970837 9861127
45228I861127j668636m632933l112059j217289j593768j947583j6455K415558
$$ 9861127 8192491 3559558 447499 -769790 -2363558 -4311141 -4327596 -1912038
45220a912038K780185J806645J500575J249928q09377l647855l931353r28511
$$ -1912038 868147 2674792 4175367 5425295 4615918 968063 -2963290 -3891801
45212c891801J993212J809052k91518j014613L16473J057511q19824l671826m020533
$$ -3891801 -1898589 -89537 -381055 -1395668 -1079195 -21684 -841508 -4513334 -8533867
45203h533867q98680K835944L919685K388582P10446m3131j013964k311611j734885
$$ -8533867 -9432547 -6596603 -2676918 -288336 422110 378979 -634985 -2946596 -4681481
45194d681481J394344L513580J186544l149830l847641k70050K239156P43592
$$ -4681481 -3287137 226443 1412987 -1736843 -5584484 -5854534 -3615378 -2871786
45186b871786r24152Q30245K730549J27598m210940l537410J817496M184495M60601
$$ -2871786 -3795938 -2965693 -235144 -107546 -4318486 -7855896 -6038400 -1853905 -1393304
45177a393304k979645o06240L515878K733845j294753j643882K566358N298024
$$ -1393304 -4372949 -4979189 -1463311 1270534 -24219 -1668101 898257 6196281
45169F196281L547138J062678R13100Q54158j222387k843225j746047o07171k481359
$$ 6196281 9743419 10806097 11719197 12573355 11350968 8507743 6761696 6154525 3673166
45160C673166m962457l926683p35623k15340k507557k587017J590656N589323
$$ 3673166 -1289291 -5215974 -5951597 -6166937 -8674494 -11261511 -9670855 -4081532
45152d081532M950315J144869j332615r00588O01838J293147P49199n34031j258084
$$ -4081532 868783 2013652 681037 -219551 382287 1675434 2424633 1890602 632518
45143F32518m1852K403380L123304O37602k480530k699712j68261J885467J685694
$$ 632518 590666 2994046 6117350 6754952 4274422 1574710 1406449 3291916 4977610
45134D977610N35030Q2831K08674P4653m51509j107871j786180k211972j953389
$$ 4977610 5512640 5595471 5804145 5878798 5427289 4319418 2533238 321266 -1632123
45125a632123j132635m36214k24484k37465j96145j02909o4255l35553j143387
$$ -1632123 -2764758 -3200972 -3425456 -3662921 -3859066 -3961975 -4026230 -4361783 -5505170
45116e505170j877474j224198R41548K695667K433181J186429Q78448J224320
$$ -5505170 -7382644 -8606842 -7665294 -4969627 -2536446 -1350017 -471569 752751
45108G52751O74662l00402J42786J423354Q32965j623652k277152N41058L137357
$$ 752751 1427413 1127011 1269797 2693151 3526116 1902464 -374688 166370 3303727
45099C303727J441483l074869n470782l669686J61156L212386M082048K315605
$$ 3303727 4745210 1670341 -3800441 -7470127 -7308971 -4096585 -14537 2301068
45091B301068r98331k809469j267442J198522R90418j028749p07195K511193M069569
$$ 2301068 1302737 -1506732 -2774174 -1575652 -585234 -1613983 -2321178 190015 4259584
45082D259584J066296l197424l825716p37826K202389K558177J138898l66175
$$ 4259584 5325880 2128456 -1697260 -2435086 -232697 2325480 3464378 3098203
45074C098203j038221m67414J124972K457371K125046N8798k364042l279570j551808
$$ 3098203 2059982 1592568 2717540 5174911 7299957 7358755 4994713 1715143 163335
45065A63335J723468L092033K47809m040667m295225L62441M466236L687469O32813
$$ 163335 1886803 4978836 5226645 1185978 -3109247 -2746806 1719430 5406899 6039712
45056F039712M2954J389207P47394k093783l678547l153386l011044l427706j504527
$$ 6039712 6082666 7471873 8219267 6125484 2446937 -706449 -3717493 -7145199 -8649726
45047h649726K550587M102813J511362l45659K244034N146769K471751l840640
$$ -8649726 -6099139 -1996326 -484964 -830623 1413411 6560180 9031931 5191291
45039E191291o413934k990135J277091K093368J022510Q59962R58970j36786j038094
$$ 5191291 -1222643 -4212778 -2935687 -842319 180191 1040153 1999123 1862337 824243
45030H24243K06900K369242K690426J015032m37116o08802l60925r6629Q40391
$$ 824243 1031143 3400385 6090811 7105843 6668727 6059925 5699000 5602371 6442762
45021F442762K135418K045402k18160l110186m513728l798144j622726J031239
$$ 6442762 8578180 10623582 10405422 7295236 2781508 -1016636 -2639362 -1608123
45013a608123K853452K517072K75940j593470j325433k7674J7865j111473j255734
$$ -1608123 1245329 3762401 4038341 2444871 1119438 1091764 1109629 -1844 -1257578
45004a257578p6879j22356k719947n086619l810348K49120L232635L608867L149402
$$ -1257578 -1334457 -1456813 -4176760 -9263379 -13073727 -12824607 -9591972 -5983105 -2833703
44995b833703K791846J191674j537172k253382O28177L796864L436312R15499
$$ -2833703 -41857 1149817 -387355 -2640737 -2012560 1784304 5220616 6136115
44987F136115L85988J947784J593691j915134m590827l279059l99821J49959q98023
$$ 6136115 6522103 8469887 10063578 8148444 3557617 278558 -121263 28696 -869327
44978h69327K22535L847167N777248L137105j499322l312451j052346J918136
$$ -869327 -646792 3200375 8977623 12114728 10615406 7302955 6250609 8168745
44970H168745J892247j163229m085937m185490j720544J058061K392727K080907
$$ 8168745 10060992 8897763 4811826 626336 -1094208 -36147 2356580 4437487
44962D437487Q23651n14677j245713j283201j055452m52566J309765L668334L771443
$$ 4437487 5261138 4746461 3500748 2217547 1162095 709529 2019294 5687628 9459071
44953I459071j31386m968347n601449j707690J399026J69830k306305j338021
$$ 9459071 9327685 4359338 -1242111 -2949801 -1550775 -1380945 -3687250 -5025271
44945e025271K317619M031884K267551K8364k37302M58647L80501k09194j38981
$$ -5025271 -2707652 1324232 3591783 3620147 3382845 3841492 4221993 4012799 3873818
44936C873818P44664J544583J032805j531862m922146n878103k559611K426295
$$ 3873818 4618482 6163065 7195870 5664008 741862 -5136241 -7695852 -5269557
44928e269557M800644L933374K594739J873852J34086k524141l070230o46873
$$ -5269557 -468913 3464461 6059200 7933052 8067138 5542997 2472767 1825894
44920A825894J063016n70102k457705m61062L623060M221161L15553k857019j270812
$$ 1825894 2888910 2318808 -138897 -599959 3023101 7244262 7559815 4702796 3431984
44911C431984K363852K657461j027912l938749k445410J217268K215084j00009
$$ 3431984 5795836 8453297 7425385 3486636 1041226 2258494 4473578 4373569
44903D373569j430432P47851K833642M18121m252866m786775j86601L393110J777629
$$ 4373569 2943137 3690988 6524630 6942751 2689885 -2096890 -2283491 1109619 2887248
44894B887248j522075j605267M78562Q99777r1626L99298J927516J522958o01811
$$ 2887248 1365173 -240094 238468 1138245 1046619 1445917 3373433 4896391 4294580
44885D294580j267847K2610M11901j050059j886039o94870Q11007J278836J583701
$$ 4294580 3026733 3049343 3461244 2411185 525146 -169724 641283 1920119 3503820
44876C503820K055902J254106j037895k547397j757816K6034J037213J159197
$$ 3503820 5559722 6813828 5775933 3228536 1470720 1496754 2533967 3693164
44868C693164P86639k9056n25799K04858J003031k56356k744971k995581p1916
$$ 3693164 4479803 4450747 3924948 4129806 5132837 4876481 2131510 -864071 -935987
44859i35987K784463K871413J211297k46172j255122j624437m42927J259364O57781
$$ -935987 1848476 4719889 5931186 5685014 4429892 2805455 2362528 3621892 4279673
44850D279673k033516k711763J23634K138903j37948l293185k166626K045459
$$ 4279673 2246157 -465606 -341972 1796931 1658983 -1634202 -3800828 -1755369
44842a755369L883285J869003m23709n80237J32256K81891J62070j63641j340085
$$ -1755369 2127916 3996919 3573210 2992973 3125229 3407120 3569190 3405549 2065464
44833B065464k806970l000240j639840J55568J588345K252863J616249L25937
$$ 2065464 -741506 -3741746 -5381586 -5226018 -3637673 -1384810 231439 557376
44825E57376L58954J740247J467868j542686l407338j056819J975208P67559k515327
$$ 557376 916330 2656577 4124445 2581759 -825579 -1882398 92810 860369 -1654958
44816a654958j830993K479747L958477O75841j908138m05944J374109j22737k040802
$$ -1654958 -3485951 -1006204 2952273 3628114 1719976 1314032 2688141 2565404 524602
44807E24602p40586J532202O25150k388503k979791J9311L477814M504719K787242
$$ 524602 -215984 1316218 1941368 -447135 -3426926 -3407615 70199 4574918 7362160
44798G362160l54345k740106k465969k51486Q67570l02827j391330m41341J005356
$$ 7362160 7007815 4267709 1801740 1550254 2417824 2114997 723667 282326 1287682
44789A287682P77842n96509j593974k128803k123397m38671K434665L565667J944468
$$ 1287682 2065524 1469015 -124959 -2253762 -4377159 -4815830 -2381165 1184502 3128970
44780C128970M41764P79997M50528j893386k409256J550496N096781K382235l421275
$$ 3128970 3570734 4350731 4801259 2907873 498617 2049113 7145894 9528129 6106854
44771F106854m298673j1238J802117j566561l649693j9160M140400K491302k452064
$$ 6106854 1808181 1796943 3599060 2032499 -1617194 -1636354 2504046 4995348 2543284
44762B543284l798359q87917R55459m63701j437712R50633M229899M460778J676785
$$ 2543284 -1255075 -2142992 -1187533 -1651234 -3088946 -2138313 2091586 6552364 8229149
44753H229149q82586j473115j484768k410670l057766j230964K393127M152608
$$ 8229149 7346563 5873448 4388680 1978010 -1079756 -2310720 82407 4235015
44745D235015K025720j416383k417228r98022j12949p37331q09456Q67871K641486
$$ 4235015 6260735 4844352 2427124 1429102 1316153 578822 -230634 637237 3278723
44736C278723K750478J583843J78810j328965k610164k537796j008865L41594
$$ 3278723 6029201 7613044 7791854 6462889 3852725 1314929 306064 647658
44728F47658M75354L61579Q85411J113717J02983j142195j130817n7323R08662
$$ 647658 1123012 1484591 2370002 3483719 3586702 2444507 1313690 1256367 2165029
44719B165029J261955Q28676o31642j975052p35603L061250M903672R23478n761198
$$ 2165029 3426984 4255660 3624018 1648966 913363 3974613 8878285 9801763 4040565
44710D040565p676601k582055L219729L095918j348153l083153N47122M746258
$$ 4040565 -3636036 -6218091 -2998362 97556 -1250597 -4333750 -3786628 959630
44702I59630M334479L27688k578295k608425j881600j832238j209138P70218K305775
$$ 959630 5294109 5621797 3043502 435077 -1446523 -3278761 -4487899 -3717681 -1411906
44693a411906J641657l46531j863518k579612k507568n98797K991132N040991
$$ -1411906 229751 -116780 -1980298 -4559910 -7067478 -7666275 -4675143 365848
44685C65848K921078j015901k224192m57747M77450o48179o93064J832534L486599
$$ 365848 3286926 2271025 46833 -410914 66536 -581643 -1274707 557827 4044426
44676D044426J288446k173073k445698L44128K292222J540828j13148q55263j010221
$$ 4044426 5332872 3159799 714101 1058229 3350451 4891279 4778131 3922868 2912647
44667B912647j325966j428269o71501P07871J650541J025605j180873k993468
$$ 2912647 1586681 158412 -513089 194782 1845323 2870928 1690055 -1303413
44659a303413j973667J476821L792044K595123r1936q03772N62497J265132K14695
$$ -1303413 -3277080 -1800259 1991785 4586908 4494972 3691200 4253697 5518829 5733524
44650E733524p30710n6768J091995O09668j883552m580792n077251k579384R01167
$$ 5733524 5002814 4946046 6038041 6647709 4764157 183365 -4893886 -7473270 -6572103
44641f572103K291659J151950L45671J747452L018360J085116k485352l002229
$$ -6572103 -4280444 -3128494 -2782823 -1035371 1982989 3068105 582753 -2419476
44633b419476N47307L716504K731718n26830j601427N30161K842810K689135O27179
$$ -2419476 -1872169 1844335 4576053 4049223 2447796 2977957 5820767 8509902 9137081
44624I137081j181891j758831j774475j941485j835102o39366J307171K497113
$$ 9137081 7955190 6196359 4421884 2480399 645297 5931 1313102 3810215
44616C810215K037024P33746p0738m8179K95240N23612K61354p93199j918318
$$ 3810215 5847239 6580985 6510247 6462068 6757308 7280920 7542274 6749075 4830757
44607D830757j516188N14176J687805L032k763337k991143q8026K785944K963288
$$ 4830757 3314569 3828745 5516550 5519582 2756245 -234898 -322924 2463020 5426308
44598E426308J192201j25616J03041J083377J294239j50322k384727l172736j468375
$$ 5426308 6618509 6492893 6595934 7679311 8973550 8823228 6438501 3265765 1797390
44589A797390Q82536J365324J9400j325765k154194l106262l291935r26070L028062
$$ 1797390 2679926 4045250 4064650 2738885 584691 -2521571 -5813506 -6739576 -3711514
44580c711514M930026L149153J12967j283488q44563K90015J534063K099189Q63283
$$ -3711514 1218512 4367665 4480632 3197144 2352581 2642596 4176659 6275848 7139131
44571G139131j498466k478855j215422K24638K41584k04929k57271q96377k117870
$$ 7139131 5640665 3161810 1946388 2171026 2412610 2207681 1950410 1054033 -1063837
44562a063837j528747J665618M186199L156078L78915j027152j523914k904858
$$ -1063837 -2592584 -926966 3259233 6415311 6794226 5767074 4243160 1338302
44554A338302l727399j589531J779230K517495O83316l62295J82614J64471n16528
$$ 1338302 -2389097 -3978628 -2199398 318097 1001413 639118 821732 986203 469675
44545D69675L82465K570768L107198J670487R20172R73992r51281m192168l984822
$$ 469675 852140 3422908 6530106 8200593 9120765 10094757 9143476 4951308 966486
44536I66486M95591L409297R72912k661354k467861k49509p3511o79400J218690
$$ 966486 1462077 4871374 5844286 3182932 715071 465562 392051 -287349 931341
44527I31341L547652J836251k474813l759237j359781o4782j358902j142660K442030
$$ 931341 4478993 6315244 3840431 81194 -1278587 -1343369 -2702271 -3844931 -1402901
44518a402901N319466M107385J090438l37511o75400j672529k601857k404502
$$ -1402901 3916565 8023950 9114388 8776877 8101477 6428948 3827091 1422589
44510A422589k223213k640998j515866K089026M732473L128118m99017j563228
$$ 1422589 -800624 -3441622 -4957488 -2868462 1864011 4992129 4493112 2929884
44502B929884J59397J061205k18513j398932q44283N36643J722477K548962K099809
$$ 2929884 3089281 4150486 3931973 2533041 1688758 2225401 3947878 6496840 8596649
44493H596649n93092l804996m201120j408892J307588J677372Q45441K53642p10541
$$ 8596649 8003557 4198561 -2559 -1411451 -103863 1573509 2418950 2672592 1962051
44484A962051k210594k037774J177039M782986M971382J789388j230226j848261
$$ 1962051 -248543 -2286317 -1109278 3673708 8645090 10434478 9204252 7355991
44476G355991j120872p72378q77559p08967j99193K34275L16266j00007q04154
$$ 7355991 6235119 5462741 4585182 3876215 3677022 3911297 4227563 4127556 3323402
44467C323402p97755P23975K554224K086411j187656m031934l054789O58173K587162
$$ 3323402 2525647 3249622 5803846 7890257 6702601 2670667 -384122 274051 2861213
44458B861213O04391k430208k809484n89788J631602K621765K605002R00778k940721
$$ 2861213 3465604 1035396 -1774088 -2363876 -732274 1889491 4494493 5395271 2454550
44449B454550o016906m275329J118778L742616N05392l545051k451172J893745
$$ 2454550 -3562356 -7837685 -6718907 -2976291 -2470899 -6015950 -8467122 -6573377
44441f573377K983241l16539k674544r80760J534766J418487L52912J496528L914646
$$ -6573377 -3590136 -3906675 -6581219 -7561979 -6027213 -4608726 -4255814 -2759286 1155360
44432A155360M110707J281534j920219l002319j888586j75869L74469p83635k166997
$$ 1155360 5266067 6547601 4627382 1625063 -263523 -439392 -64923 -848558 -3015555
44423c015555j719603L34088J523036O90658l24713L54198J886904K301742J164223
$$ -3015555 -4735158 -4401070 -2878034 -2187376 -2512089 -2157891 -270987 2030755 3194978
44414C194978o87002k365591k614138k68727L364694M679578K173024j350232
$$ 3194978 2507976 142385 -2471753 -2740480 624214 5303792 7476816 6126584
44406F126584k836097k790025k697145j532353J591738L679454J287382l488820
$$ 6126584 3290487 500462 -2196683 -3729036 -2137298 1542156 2829538 -659282
44398f59282n040846j926282J780469K861084K338080J853223R45737n71515j126160
$$ -659282 -5700128 -7626410 -5845941 -2984857 -646777 1206446 2152183 1580668 454508
44389D54508p5218R93203J163439J637739K825085K835809O62785j736169k439998
$$ 454508 379290 1372493 2535932 4173671 6998756 9834565 10497350 8761181 6321183
44380F321183k235895k322962j787393J99267J740452O19617j953739k734136
$$ 6321183 4085288 1762326 -25067 174200 1914652 2534269 580530 -2153606
44372b153606q95913J274611J812278J118424N22439M43241M00009k0021n69686
$$ -2153606 -3049519 -1774908 37370 1155794 1678233 2121474 2521483 2501462 1931776
44363A931776o18279j41261o1178q26746j179084K41398K474830L344667K710413
$$ 1931776 1313497 1172236 1111058 284312 -894772 -653374 1821456 5166123 7876536
44354G876536K203912J776536l67435l704193m734395k114388P18730M72781j121606
$$ 7876536 10080448 11856984 11489549 7785356 3050961 936573 1655303 2128084 1006478
44345A006478l18891K694413M122933K019271j323219k432776n27656J688372
$$ 1006478 687587 3382000 7504933 9524204 8200985 5768209 5240553 6928925
44337F928925P35404l370595o080498l752773N65938P63497k873735l409541J718309
$$ 6928925 7664329 4293734 -1786764 -5539537 -4973599 -4210102 -7083837 -10493378 -8775069
44328h775069N864747L462914j048177p37888K609151K628112j33103l0005K362221
$$ -8775069 -2910322 552592 -495585 -1233473 1375678 4003790 3870687 3840682 6202903
44319F202903P52386m788045o238878n74073M833955L747539n8826n33504J114375
$$ 6202903 6955289 2167244 -4071634 -4645707 188248 3935787 3876961 3343457 4457832
44310D457832P56102n38045L92131J738553k16889l722911l918753q99127P94345
$$ 4457832 5213934 4675889 5068020 6806573 6589684 2866773 -1051980 -1951107 -1156762
44301a156762j64658n30383J365068L235020K958105Q86618k042135m681610m526928
$$ -1156762 -1321420 -1851803 -486735 2748285 5706390 6593008 4550873 -130737 -4657665
44292d657665l48365M260559M378371Q44879p94799J185018K407477L4400k589367
$$ -4657665 -5006030 -745471 3632900 4477779 3682980 4867998 7275475 7309875 4720508
44283D720508j742653P06297R27758n95538p01256O09542L68627k009412l507613
$$ 4720508 2977855 3684152 4611910 4016372 3315116 3924658 4293285 2283873 -1223740
44274a223740k026728R08594K766105K926461J940156k9618k305535k643595N02637
$$ -1223740 -3250468 -2341874 424231 3350692 5290848 5261230 2955695 312100 814737
44265H14737M708899N008639K6586n033591m069678J843599N262515K025604l336635
$$ 814737 5523636 10532275 10558861 5525270 1455592 3299191 8561706 10587310 7250675
44256G250675m180549p12879J500246J65232j460101q08300M01341K52072R714
$$ 7250675 3070126 2357247 3857493 4022725 2562624 1754324 2155665 2407737 2417451
44247B417451R42655J272865n76758k409738j491246N87849J93789k277384k768477
$$ 2417451 3360106 4632971 4056213 1646475 155229 743078 936867 -1340517 -4108994
44238d108994k3820K367478J560138m30277l52150J188144J163454p81591j878184
$$ -4108994 -4132814 -1765336 -205198 -635475 -987625 200519 1363973 582382 -1295802
44229a295802p60497N47763K34300k16781J259377L100264J821827k128585l750139
$$ -1295802 -2056299 -1508536 -1274236 -1491017 -231640 2868624 4690451 2561866 -1188273
44220a188273m04244L696904L081993r70919k370929M49903K244389o14989m296713
$$ -1188273 -1592517 2104387 5186380 4215461 1844532 2294435 4538824 3923835 -372878
44211c72878l416879Q96745L266234K151084Q24871J160813J310049k3627j315062
$$ -372878 -3789757 -2893012 373222 2524306 3349177 4509990 5820039 5796412 4481350
44202D481350j351820r73628m53258J250147L122282J865961k594137n134700
$$ 4481350 3129530 2155902 1702644 2952791 6075073 7941034 5346897 212197
44194B12197k286931K185241K688264J12236l29424K088577K913860O72433m44936
$$ 212197 -2074734 110507 2798771 2911007 2581583 4670160 7584020 8256453 7811517
44185G811517J944911L667127L63546n216655o692919k737267J846844K782089
$$ 7811517 9756428 13423555 13787101 8570446 1877527 -859740 987104 3769193
44177C769193M45601k360883l592626k652575m37246Q58399j29152j860245j669644
$$ 3769193 4214794 1853911 -1738715 -4391290 -4828536 -3970137 -4099289 -5959534 -7629178
44168g629178N82650K586723L039593K718197K152907Q64144o23334o52629P26272
$$ -7629178 -7046528 -4459805 -1420212 1297985 3450892 4315036 3691702 3039073 3765345
44159C765345J171886n14024k516683k819288j811750p74180J29968Q52420O19832
$$ 3765345 4937231 4423207 1906524 -912764 -2724514 -3498694 -3368726 -2516306 -1896474
44150a896474j85979M32020K617060L147834Q7454l370434l140255m26104M48320
$$ -1896474 -2082453 -1650433 966627 4114461 4201915 831481 -2308774 -2734878 -2286558
44141b286558r16071r63529J044582J503764j033441k786715p75250K138884J718546
$$ -2286558 -3202629 -4166158 -3121576 -1617812 -2651253 -5437968 -6213218 -4074334 -2355788
44132b355788j043847j723566P53086K969438K225014l46571k141978k104680
$$ -2355788 -3399635 -5123201 -4370115 -1400677 824337 477766 -1664212 -3768892
44124c768892q02347P27725J546122J324235P16544O01079R92309J268769J147607
$$ -3768892 -4571239 -3843514 -2297392 -973157 -256613 344466 1336775 2605544 3753151
44115C753151Q10417M84463M47845Q59175J122305L47372r81814j052667O55851
$$ 3753151 4563568 5048031 5495876 6355051 7477356 7824728 6842914 5790247 6446098
44106F446098K151636J559141l48350j673902k084829k262643k046688j214137
$$ 6446098 8597734 10156875 9808525 8134623 6049794 3787151 1740463 526326
44098E26326q60753j597430j519602J151733M255955L896300K44291k413385j814253
$$ 526326 -334427 -1931857 -3451459 -2299726 1956229 5852529 6096820 3683435 1869182
44089A869182k47624P8322M13272K118107L214852J324205k018746l139354j314862
$$ 1869182 1621558 1699880 2113152 4231259 7446111 8770316 6751570 3612216 2297354
44080B297354O14280L35177j408500k372951j421758M37995R11472j119901l554813
$$ 2297354 2911634 3246811 1838311 -534640 -1956398 -1518403 -606931 -1726832 -5281645
44071e281645k889302J072738M184535L168737m6101j426108n39945j37027j051878
$$ -5281645 -8170947 -7098209 -2913674 255063 208962 -1217146 -1757091 -1894118 -2945996
44062b945996j129138N69997J846448Q59182r86647j249395J66151J441967J596715
$$ -2945996 -4075134 -3505137 -1658689 -799507 -1786154 -3035549 -2869398 -1427431 169284
44053A69284J347314J650956K350397K240515L55309k472535l716927j867705
$$ 169284 1516598 3167554 5517951 7758466 8113775 5641240 1924313 56608
44045E6608J190822K007644o1702k027212j475759J84151J21853j613740k259845
$$ 56608 1247430 3255074 3193372 1166160 -309599 -125448 -3595 -1617335 -3877180
44036c877180m45566J954382K662620K014274J755992J832879M24462k630534
$$ -3877180 -4322746 -2368364 294256 2308530 4064522 5897401 6321863 3691329
44028C691329m545735l106976J3790J502477J022178J020317K268825K713738
$$ 3691329 -854406 -3961382 -3947592 -2445115 -1422937 -402620 1866205 4579943
44020D579943J355327L9782j5941l19587j687093j916611K48634J800913j56910
$$ 4579943 5935270 5975052 5959111 5639524 3952431 2035820 2284454 4085367 3928457
44011C928457l169422k929176j24712J123281L47100P08651K348616J771584j390002
$$ 3928457 759035 -2170141 -2294853 -1171572 -824472 -115821 2232795 4004379 2614377
44002B614377k930521j091488N84172k23444o73152J505668L426210K115967k26469
$$ 2614377 -316144 -1407632 -823460 -1046904 -1720056 -214388 3211822 5327789 5101320
43993E101320l71316L75899o46831k051129j064622J112198J514245O83424R12742
$$ 5101320 4730004 5105903 4459072 2407943 1343321 2455519 3969764 4653188 5565930
43984E565930J367202p0716k011726j730911l43710n05474p83100J671059M352654
$$ 5565930 6933132 6862416 4850690 3119779 2776069 2270595 1487495 3158554 7511208
43975G511208K263334k934555m028800O10128M252148K158080k082516l461569
$$ 7511208 9774542 6839987 2811187 3421315 7673463 9831543 7749027 4287458
43967D287458k590459k122481j521428L19730J537020O39563j02609J409847K941926
$$ 4287458 1696999 -425482 -1946910 -1627180 -90160 549403 446794 1856641 4798567
43958D798567J623290r88626j508521q3020O79450K90503K98673J013912J433650
$$ 4798567 6421857 5433231 3924710 3841690 4521140 4811643 5110316 6124228 7557878
43949G557878J345089J129273P64269P24839J854119K825388O93419m004174o227144
$$ 7557878 8902967 10032240 10796509 11521348 13375467 16200855 16894274 12890100 6662956
43940F662956l319973P06118J235847k78450k430J301754J57395l187934n429976
$$ 6662956 3342983 4049101 5284948 5006498 5004068 6305822 6463217 3275283 -2154693
43931b154693n506720m330988j239060L929680P082531M293612j152311k417666
$$ -2154693 -7661413 -11992401 -13231461 -9301781 -2219250 2074362 922051 -1495615
43923a495615Q27612K633839R68965L54257K979881M517437J797501j644286j624497
$$ -1495615 -668003 1965836 2934801 3289058 6268939 10786376 12583877 10939591 9315094
43914I315094J79549O3225j388457j250960L59379J018482K30917m87026l84825
$$ 9315094 9494643 9557868 8169411 6918451 7277830 8296312 8527229 8040203 7655378
43905G655378K42862J186176J807802J073850l83549m19057R64236R15778j438856
$$ 7655378 7898240 9084416 10892218 11966068 11582519 11163462 12127698 13043476 11604620
43896A1604620k709844m92404K151720R74992l023697n252180m026958j667310
$$ 11604620 8894776 8402372 10554092 11529084 8505387 3253207 -773751 -2441061
43888b441061j18893Q05481J164351K76202j294839j748244m96489J246101K367149
$$ -2441061 -2559954 -1754473 -590122 -313920 -1608759 -3357003 -3853492 -2607391 -240242
43879b40242K661651J931586R2102j777615k042035m07625J696878K499021J099529
$$ -240242 2421409 4352995 4445097 2667482 625447 217822 1914700 4413721 5513250
43870E513250j865176m014004k894718R02803L477457J977197j740456l417818
$$ 5513250 3648074 -365930 -3260648 -2357845 1119612 3096809 1356353 -2061465
43862b061465j580764J262252K131117P29562q45627n69012J326109K435609J057750
$$ -2061465 -3642229 -2379977 -248860 480702 -364925 -933937 392172 2827781 3885531
43853C885531j293884j780311m37338k0000j276912j513862Q04986L252552L333485
$$ 3885531 2591647 811336 373998 353998 -922914 -2436776 -1631790 1620762 4954247
43844D954247K110854J344400J25906k255529l061628j17524L133409J676179
$$ 4954247 7065101 8409501 8535407 6279878 3218250 3100726 6234135 7910314
43836G910314l128306m974062j863468J418187J052119o69366j50819J712924
$$ 7910314 4782008 -192054 -2055522 -637335 414784 -254582 -405401 1307523
43828A307523J654165o67217k476135j706361J063485L618975L810044J322432
$$ 1307523 2961688 2294471 -181664 -1888025 -824540 2794435 6604479 7926911
43820G926911j339629r95279K159707M165927K191738j590805k665685O5721K915460
$$ 7926911 6587282 5592003 7751710 11917637 14109375 12518570 9852885 9918606 12834066
43811A2834066J970191k115113m756666k858824J356805L102339J119485j201566
$$ 12834066 14804257 12689144 7932478 5073654 6430459 9532798 10652283 9450717
43803I450717j306700j072436k751350m184190j947951K301643L349042K42342
$$ 9450717 8144017 7071581 4320231 136041 -1811910 489733 3838775 4081117
43795D081117k088262k77382K675409K398396m73678j996987p40857J301021K366342
$$ 4081117 1992855 1715473 4390882 6789278 6315600 4318613 3577756 4878777 7245119
43786G245119K430472J465649j007640m077393n177897k861051J043191L100077
$$ 7245119 9675591 11141240 10133600 6056207 878310 -1982741 -939550 2160527
43778B160527J979849k88324j074001l95189l38870j548301k051011k77478K392734
$$ 2160527 4140376 3852052 2778051 2382862 2043992 495691 -1555320 -1832798 559936
43769E59936L392029K030679m79200k740328l481978j694627J684316L651112
$$ 559936 3951965 5982644 5503444 2763116 -718862 -2413489 -729173 2921939
43761B921939K698668R44629N73194K81892j684835l171252j045307K900638L820435
$$ 2921939 5620607 6565236 7138430 7420322 5735487 2564235 1518928 4419566 8240001
43752H240001J071818j325200j484210j693755k970413k971451r75593J74522
$$ 8240001 9311819 7986619 6502409 4808654 1838241 -1133210 -2108803 -1934281
43744a934281o24484k87006K826550N264638L733471Q5571k321594l546132m630574
$$ -1934281 -2558765 -2845771 -19221 5245417 8978888 9064459 6742865 3196733 -1433841
43735a433841l790486M78797N022123N324054J722981j513685k055742j001635
$$ -1433841 -5224327 -4745530 276593 5600647 7323628 5809943 3754201 2752566
43727B752566K55804J265371J428854N10942m55675p65407j180038j807229j158586
$$ 2752566 3008370 4273741 5702595 6213537 5757862 4992455 3812417 2005188 846602
43718H46602O13041N38703k272958l867794j325963J823551Q15844k429504k192642
$$ 846602 1459643 1998346 -274612 -4142406 -5468369 -3644818 -2828974 -5258478 -7451120
43709g451120J956816M887642M111730K508832K547067K991972K310329J008979
$$ -7451120 -5494304 -606662 3505068 6013900 8560967 11552939 13863268 14872247
43701A4872247l24663j642264j753955K96704K247320J057082j823559k132876
$$ 14872247 14547584 12905320 11151365 11448069 13695389 14752471 12928912 10796036
43693A0796036K80285J269841m52385j512142m55518m50124l153845n117948l244725
$$ 10796036 11076321 12346162 11893777 10381635 9926117 9475993 6322148 1204200 -2040525
43684b040525O35159L508010N156440N471154K503266k922466n067388o57976
$$ -2040525 -1405366 2102644 7259084 12730238 15233504 12311038 7243650 6585674
43676F585674N002381M614221r07406m369658k887866o31054j077775k174305
$$ 6585674 11588055 16202276 15294870 10925212 8037346 7406292 6328517 4154212
43668D154212q60580J836986K786654J355649l80719r32353r97192j794908k900366
$$ 4154212 3293632 5130618 7917272 9272921 8892202 7959849 6962657 5167749 2267383
43659B267383k569499l65558J562970J156832l23318j609J890874K122156m0883
$$ 2267383 -302116 -667674 895296 2052128 1728810 1727201 3618075 5740231 5699348
43650E699348j182960M46898J316361j707183n201899l520566K360253N544637
$$ 5699348 4516388 4963286 6279647 4572464 -629435 -4150001 -1789748 3754889
43642C754889K750490j698819k585344l15406J433138J381922J068786J324212
$$ 3754889 6505379 4806560 2221216 1905810 3338948 4720870 5789656 7113868
43634G113868J221017L00859j79263J120442L458463M144182J277994l552473
$$ 7113868 8334885 8635744 8456481 9576923 13035386 17179568 18457562 14905089
43626A4905089o180038m372856p40500L13358j825058l338700j280863K415073
$$ 14905089 8725051 4352195 3611695 3925053 2099995 -1238705 -2519568 -104495
43618a04495L534439J003441k032863k413825p02225Q0918j311364k685272j344565
$$ -104495 3429944 4433385 2400522 -13303 -715528 -634610 -1945974 -4631246 -5975811
43609e975811K218068M614062L415945j82159k744370k010642J139362L560399
$$ -5975811 -3757743 856319 4272264 4090105 1345735 -664907 474455 4034854
43601D034854K808731n5264j067766J976220N897663N255285o04303o036645n925198
$$ 4034854 6843585 6788321 5720555 7696775 13594438 18849723 18245420 12208775 6283577
43592F283577j853495O59740m49683j986166p74156K036327L034356J234851r63392
$$ 6283577 4430082 5089822 4640139 2653973 1879817 3916144 6950500 8185351 7221959
43583G221959j166032J09601O37612k26522r79282q02255r78472k200077k448803
$$ 7221959 6055927 6165528 6803140 6576618 5597336 4795081 3816609 1616532 -832271
43574h32271p7323K437508J320079k440103l870180j266387J655033K118377K089299
$$ -832271 -909594 1527914 2847993 407890 -3462290 -4728677 -3073644 -955267 1134032
43565A134032L205632K714519j299322m581245k196036L081268M014991l85899
$$ 1134032 4339664 7054183 5754861 1173616 -1022420 2058848 6073839 5687940
43557E687940l663319j870199J364765J691507N28716J332914L408985L505771
$$ 5687940 2024621 154422 1519187 3210694 3739410 5072324 8481309 11987080
43549A1987080J194422j162025k421594l193194l137249j101675J948604L058375
$$ 11987080 13181502 12019477 9597883 6404689 3267440 2165765 4114369 7172744
43541G172744J171164j253884j550097r7489R42113P64613J54911o15585k114233
$$ 7172744 8343908 7090024 5539927 5442438 6384551 7149164 7304075 6688490 4574257
43532D574257l852321l928077j485539J721671L310947K906929J788771R35037
$$ 4574257 721936 -3206141 -4691680 -2970009 340938 3247867 5036638 5971675
43524E971675P02773J386230K442739K157721J2527j700069j039861j743j644275
$$ 5971675 6674448 8060678 10503417 12661138 12673665 10973596 9933735 9931992 8287717
43515H287717m522659m240141n34456J982318J077802j91782L82647N28080j016359
$$ 8287717 3765058 -475083 -1009539 972779 2050581 1858799 2241446 2769526 1753167
43506A753167p92588L135917N968598K771388l292771n337167k669390j59082
$$ 1753167 960579 4096496 10065094 12836482 9543711 4206544 1537154 1378072
43498A378072K28072O83296J509336N02112j762032k162247p49956m64787j097477
$$ 1378072 1606144 2289440 3798776 4300888 2538856 376609 -373347 -838134 -1935611
43489a935611L54613L040457K641232n83243j094155K600264M843818K070227
$$ -1935611 -1580998 1459459 4100691 3517448 2423293 5023557 9867375 11937602
43481A1937602j393168p12609K053308K517793J030620L41499K16090q67960j945496
$$ 11937602 10544434 9831825 11885133 14402926 15433546 15775045 15991135 15123175 13177679
43472A3177679j772474j700842k479550j673048J649139L460497P98909k467500
$$ 13177679 11405205 9704363 7224813 5551765 7200904 10661401 11460310 8992810
43464H992810j483872J265726j465m284222m993702n97059L027538J850783q69847
$$ 8992810 7508938 8774664 8773199 4488977 -504725 -1101784 1925754 3776537 2906690
43455B906690m85231K584949M833290M590309K558413j10024k248716k834738
$$ 2906690 2421459 5006408 9839698 14430007 16988420 16878396 14629680 11794942
43447A1794942k100904j388621j351647j452699j254089q22102q831J199009J885073
$$ 11794942 9694038 8305417 6953770 5501071 4246982 3424880 3416049 4615058 6500131
43438F500131J214254j52855j019285j356624j631357j375813j21721J178458
$$ 6500131 7714385 7561530 6542245 5185621 3554264 2178451 2056730 3235188
43430C235188J464981J422650K247209L449378L604123K442834P82780n73829
$$ 3235188 4700169 6122819 8370028 11819406 15423529 17866363 18649143 18075314
43422A8075314q44054J57198N87669j678945m794009m117299L62836K361624j477331
$$ 18075314 17231260 17388458 17976127 16297182 11503173 7385874 7748710 10110334 8633003
43413H633003n470163l176867K433626L756041M03385j376206M40752J470620
$$ 8633003 3162840 -14027 2419599 6175640 6579025 5202819 5643571 7114191
43405G114191l19920j451603L7443J302632N32077J4560J085256J520499L28726
$$ 7114191 6794271 5342668 5380111 6682743 7214820 7229380 8314636 9835135 10163861
43396A0163861k9885J408846J919543K54208r17969k84240o18214l285716m885377
$$ 10163861 10133976 11542822 13462365 13716573 12798604 12514364 11896150 8610434 3725057
43387C725057k843852N4936M67720j55242J073397L218996L552944K002980Q2326
$$ 3725057 881205 936141 1403861 1248619 2322016 5541012 9093956 11096936 11179262
43378A1179262j905019l400039k272595J604016M154357J960262k889376n760254
$$ 11179262 9274243 5874204 3601609 5205625 9359982 11320244 8430868 2670614
43370B670614m979466j842006K048567M700118M002729J001719j25091J838132
$$ 2670614 -2308852 -4150858 -2102291 2597827 6600556 7602275 7477184 9315316
43362I315316K617331p83796m724252m394201r92093J135653J284444J501820
$$ 9315316 11932647 11148851 6424599 2030398 1038305 2173958 3458402 4960222
43354D960222J812725J275310J187045K371140K005817j728498m785532k841151
$$ 4960222 6772947 8048257 9235302 11606442 13612259 11883761 7098229 4257078
43346D257078J017636P71369k560438k704989J292235L813046J971798r50321
$$ 4257078 5274714 6046083 3485645 780656 2072891 5885937 7857735 6907414
43338F907414k068257k276401k054448j83426K047651J306654j727190k535340
$$ 6907414 4839157 2562756 508308 324882 2372533 3679187 1951997 -583343
43330e83343k75576Q82335n78832r83139J202242K128715q3193j088779K269669
$$ -583343 -858919 23416 -555416 -1538555 -336313 1792402 1709209 620430 2890099
43321B890099N772045M064281j157180m232796l503759j453124L48092J800923
$$ 2890099 8662144 12726425 11569245 7336449 3832690 2379566 2727658 4528581
43313D528581J866631r3333j963141j377667P35234J958418J986744J668133N09655
$$ 4528581 6395212 6301879 4338738 2961071 3696305 5654723 7641467 9309600 9819255
43304I819255j780509l159203j861973M41264J130909O99016J277787K623117
$$ 9819255 8038746 4879543 3017570 3458834 4589743 5288759 6566546 9189663
43296I189663K789267J692514R37504R07576P04027J30052o64416k380096m908833
$$ 9189663 11978930 13671444 14608948 15516524 16220551 16350603 15686187 13306091 8397258
43287H397258n736042k843051J687170L767475K456845N15897K84803J294656
$$ 8397258 2661216 -181835 1505335 5272810 7729655 8245552 8530355 9825011
43279I825011J691939K52717k554643m277426k480986J640423L596601J414911
$$ 9825011 11516950 11769667 9215024 4937598 2456612 4097035 7693636 9108547
43271I108547j201284j90973K710876K778027l52608k309659n26771K646933L645700
$$ 9108547 7907263 7716290 10427166 13205193 12852585 10542926 10016155 12663088 16308788
43262A6308788J488785k349798n310037m991566j486972J662895J233710j295685
$$ 16308788 17797573 15447775 10137738 5146172 3659200 5322095 6555805 5260120
43254E260120j675173J168147L966903L866461J504092r57495k284386k206055
$$ 5260120 3584947 4753094 8719997 12586458 14090550 13133055 10848669 8642614
43246H642614j236062q45108j915294l020152k167415P5663J397917J237281R39937
$$ 8642614 7406552 6561444 4646150 1625998 -541417 -465754 932163 2169444 3109381
43237C109381Q43120R8404p04357J38116K134027K636761R07623o03625J22090
$$ 3109381 3952501 4050905 3346548 3484664 5618691 8255452 9163075 8559450 8681540
43228H681540K232864L895025M175475K419164j504306n288884n234751q52759
$$ 8681540 10914404 14809429 18984904 21404068 19899762 14610878 9376127 8523368
43220H523368L586483L756502J16871l242379l419751j229491L61150l82631j925184
$$ 8523368 12109851 15866353 15983224 12740845 9321094 8091603 8452753 8070122 6144938
43211F144938j200632K115254M441339K838588q82169k801910k045337n40733
$$ 6144938 4944306 7059560 11500899 14339487 13457318 10655408 8610071 8069338
43203H069338O79425J500140P47979j550208j529878L552940Q829841O855931
$$ 8069338 8748763 10248903 10996882 9446674 7916796 11469736 20299577 27155508
43195B7155508p70222m243887K43227M832349K162839m016201n812580k788201
$$ 27155508 26385286 22141399 22384626 27216975 29379814 25363613 19551033 16762832
43187A6762832m662J097580K670884M008235K221476j687976l580074k663333
$$ 16762832 16758170 17855750 20526634 24534869 26756345 25068369 21488295 18824962
43179A8824962k008107k845033l230660k358825j648837j370262l40587Q73415
$$ 18824962 16816855 13971822 10741162 8382337 6733500 5363238 5022651 5896066
43171E896066M26312j016242q45873R99175J966629J420109J241185J691645R30306
$$ 5896066 6322378 5306136 4460263 5459438 7426067 8846176 10087361 11779006 12709312
43162A2709312p52211o26311J418210J850408p62546l095199k395817p65054j272060
$$ 12709312 11957101 11330790 12749000 14599408 13836862 10741663 8345846 7580792 6308732
43153F308732k816912k152016Q68133L147048K599086K85232j295480p26043J048821
$$ 6308732 3491820 1339804 2207937 5354985 7954071 8239303 6943823 6217780 7266601
43144G266601J442142q39966l556715l288551m8584K718856K941819J909600R20349
$$ 7266601 8708743 7868777 4312062 1023511 974927 3693783 6635602 8545202 9465551
43135I465551n88794k135007j178647K276879L398720j268793p471226p628217
$$ 9465551 8876757 6741750 5563103 7839982 11238702 9969909 2498683 -5129534
43127e129534r22346N314137M986989L44278k056034J97060L543860L959351J584158
$$ -5129534 -6051880 -737743 4249246 4593524 2537490 2734550 6278410 10237761 11821919
43118A1821919o71514j247271j004678q08485o0953J663412L117205K864488J227995
$$ 11821919 11150405 9903134 8898456 8089971 8029018 9692430 12809635 15674123 16902118
43109A6902118n84203k173363l205135k437580J31766J496911p69097m037153
$$ 16902118 16317915 14144552 10939417 8501837 8633603 10130514 9361417 5324264
43101E324264l601767J43240J995158l8568j983670q16413J037281J056372J439660
$$ 5324264 1722497 1865737 3860895 3822327 1838657 1022244 2059525 3115897 4555557
43092D555557M171314N597207J709818m016419m517799L88312L831706K181562
$$ 4555557 8726871 14324078 16033896 12017477 7499678 7887990 11719696 13901258
43084A3901258p61937j125973n69773j776370l178273j983837O92211J534695
$$ 13901258 13139321 12013348 11443575 9667205 6488932 4505095 5197306 6732001
43076F732001K2034j530531j712394j003729J00311J346209J574873k75017k980245
$$ 6732001 6754035 5223504 3511110 2507381 2607692 3953901 5528774 5253757 2273512
43067B273512l804471j798250J065639K352805J656920L36972l23360k43188k44802
$$ 2273512 -1530959 -3329209 -2263570 89235 1746155 2083127 1759767 1516579 1271777
43058A271777q57336j382130n24077J720768L395429K614855K0404j732125j078508
$$ 1271777 414441 -967689 -1491766 229002 3624431 6239286 6259690 4527565 3449057
43049C449057O77775J159375r8147j246576o39617J096891K003843J216850m17935
$$ 3449057 4126832 5286207 5188060 3941484 3301867 4398758 6402601 7619451 7201516
43040G201516j904974l043520l483685k212231Q48934L584741L596074J205947
$$ 7201516 5296542 2253022 -1230663 -3442894 -2593960 990781 4586855 5792802
43032E792802q81739j049647l83730k92132j61041J120361K321708Q16640l275948
$$ 5792802 4911063 3861416 3477686 3185554 3024513 4144874 6466582 7283222 4007274
43023D007274n925292l731039J426239M297769K656382l95275j082545L95760
$$ 4007274 -1918018 -5649057 -4222818 74951 2731333 2336058 1253513 1649273
43015A649273J447340J210333N47311n93704k540284l357754p89349L086117L340374
$$ 1649273 3096613 4306946 4854257 4260553 1720269 -1637485 -2426834 659283 3999657
43006C999657m24081k523165N40045M427391L384626j091938k923688o66364J388008
$$ 3999657 3575576 1052411 1592456 6019847 9404473 8312535 5388847 4722483 6110491
42997F110491O04635r20018j219130j439390k456994k661747j098090N15032Q27287
$$ 6110491 6715126 5795108 4575978 3136588 679594 -1982153 -3080243 -2565211 -1737924
42988a737924R72985J810082J926410M32444r51408p73422k70878o34979m65603
$$ -1737924 -764939 1045143 2971553 3403997 2452589 1679167 1408289 773310 307707
42979C07707J315256K484568Q19443j542327q60711K201200L284518P90206k158146
$$ 307707 1622963 4107531 4926974 3384647 2523936 4725136 8009654 8799860 6641714
42970F641714k686730j630269q64966k36363R57344J652289N49972j173825r79187
$$ 6641714 3954984 2324715 1459749 1223386 2180730 3833019 4382991 3209166 2229979
42961B229979J379983L191584K365983L43934J78045K218413L381509J371242
$$ 2229979 3609962 6801546 9167529 9511463 9689508 11907921 15289430 16660672
42953A6660672j827220k325854M68493L074695K470040n11357k834846k640559
$$ 16660672 14833452 12507598 12976091 16050786 18520826 18009469 15174623 12534064
42945A2534064l98762J691833J070937k497089n332444l573011R30786K008971
$$ 12534064 12135302 13827135 14898072 12400983 7068539 3495528 4426314 6435285
42937F435285j977001m881340j596883L897065M338037J34674j876162M70941
$$ 6435285 4458284 -423056 -2019939 1877126 6215163 6349837 4473675 4944616
42929D944616J876520r60573l756667j823630K298397K902362l65873k713693
$$ 4944616 6821136 5860563 2103896 280266 2578663 5481025 5115152 2401459
42921B401459j473760R55160J302927m97583j985874j189858J416366L204606
$$ 2401459 927699 1882859 3185786 2688203 702329 -487529 928837 4133443
42913D133443J966143j301749l088488j448995J819708L754223L441675J766574
$$ 4133443 6099586 4797837 1709349 260354 2080062 5834285 9275960 11042534
42905A1042534k47348j503383r91887N13479N73695j404569k587546p18678K143253
$$ 11042534 10795186 9291803 8299916 8813395 9387090 7982521 5394975 4676297 6819550
42896F819550K523259N96234p15208n17466l62045n57348J59987J200831J72342
$$ 6819550 9342809 9939043 9223835 8706369 8344324 7786976 7946963 9147794 9320136
42887I320136k825002m436816k885733l91680P97599J660466L526054M793810
$$ 9320136 6495134 2058318 -827415 -1219095 -421496 1238970 4765024 9558834
42879I558834L429871P63640k81647M40290O01524o16724j607450j245706l23205
$$ 9558834 12988705 13752345 13470698 13910988 14512512 13895788 12288338 11042632 10719427
42870A0719427P6940k62634j249373k528055l007675j922063k07246P24887J136046
$$ 10719427 10796367 10533733 9284360 6756305 3748630 1826567 1619321 2344208 3480254
42861C480254K014635K587782J315307q73486j358051j62514j37879j779833j603429
$$ 3480254 5494889 8082671 9397978 8524492 7166441 7003927 6866048 5086215 3482786
42852C482786K031969M964074K716594k452042m323029j436930J440887O66444
$$ 3482786 5514755 10478829 13195423 10743381 6420352 4983422 6424309 7090753
42844G090753j770780k346678r80582K02881M88218N76364N94966J91888l70238
$$ 7090753 5319973 2973295 1992713 2195594 2683812 3260176 3855142 4047030 3676792
42835C676792p03825q96125n49874J275749L786351L883335L2602m563539n172343
$$ 3676792 2972967 2076842 1526968 2802717 6589068 10472403 10505005 5941466 769123
42826G69123j321478K970059M401229L358245J635125j24244j719642k265949
$$ 769123 -552355 2417704 6818933 10177178 11812303 11688059 9968417 7702468
42818G702468j362524k63131m76212j706599k212701j022939Q77074J634451O08031
$$ 7702468 6339944 6076813 5600601 3894002 1681301 658362 1535436 3169887 3777918
42809C777918p87552o75561Q44702J810366J418069J440137L140431M209564J419392
$$ 3777918 2990366 2314805 3159507 4969873 6387942 7828079 10968510 15178074 16597466
42800A6597466m127484p416719n723467j607072J286593K515061L120462K421776
$$ 16597466 12469982 5053263 -670204 -2277276 -990683 1524378 4644840 7066616
42792G066616l86891l025493k043536K175283N208847L926201j48224l333893
$$ 7066616 6679725 3654232 1610696 3785979 8994826 12921027 12772803 9438910
42784I438910l631443j327315K174322M699017M019546J67852l525982l455921
$$ 9438910 5807467 4480152 6654474 11353491 15373037 15540889 12014907 8558986
42776H558986R6687L141992K655796r3880j596451n18139J159515J102446o62071
$$ 8558986 8655673 11797665 14453461 14359581 12763130 12244991 13404506 14506952 13844881
42767A3844881k360581k642196j388218O88288K217771J733841n84200k218707
$$ 13844881 11484300 8842104 7453886 8142174 10359945 12093786 11509586 9290879
42759I290879r39841K042485L255060J416314j112831j803594r51752k30797n6975
$$ 9290879 8351038 10393523 13648583 15064897 13952066 12148472 11196720 10965923 10908948
42750A0908948J85315P02170J564589L151616M747475M067951L10174l322013
$$ 10908948 11094263 11796433 13361022 16512638 21260113 25328064 25638238 22316225
42742B2316225k716398J712116N114322M128402O24344j242035j5894K182811
$$ 22316225 19599827 21311943 26426265 30554667 31179011 29936976 29921082 32103893
42734C2103893K846362K013776J977694M322295P705503R591793J0144837J2270712
$$ 32103893 34950255 36964031 38941725 43264020 50969523 60561316 70706153 82976865
42726H2976865J6856409K1097077K4269604L1252706M3827976N0131400L2469414
$$ 82976865 99833274 120930351 145199955 176452661 220280637 270412037 302881451
42719C02881451r829196n2440994o8411534n5394030l3938544k1559005j7533895
$$ 302881451 293052255 240611261 172199727 116805697 82867153 61308148 43774253
42712D3774253j3449633p983529n076149m420170k263664Q33432O34677k698913
$$ 43774253 30324620 22341091 17264942 12844772 10581108 11414540 12049217 9350304
42704I350304l896257j111012R04900j218590l550512j018066M246708N706769
$$ 9350304 5454047 4343035 5247935 4029345 478833 -539233 3707475 9414244
42696I414244J716717k835757l694584j660990N17333J697005J595998j34632
$$ 9414244 11130961 8295204 4600620 2939630 3456963 5153968 6749966 6615334
42688F615334k368409k608551l74981J645208J425154M32256Q36429J999442K010504
$$ 6615334 4246925 1638374 1263393 2908601 4333755 4766011 5602440 7601882 9612386
42679I612386R91148L44027r681j042700k193426k148437j470336j837056k908298
$$ 9612386 10603534 10947561 10937880 9895180 7701754 5553317 4082981 2245925 -662373
42670f62373k505001p1554K282804K566226R79545q86259j369769L79866L035431
$$ -662373 -3167374 -3238928 -956124 1610102 2589647 1703388 333619 713485 3748916
42661C748916L284785k60424m052925l520949L98631K299452J54990k020402p10581
$$ 3748916 7033701 6773277 2720352 -800597 -401966 1897486 2052476 32074 -678507
42652f78507K007871K391040O28017n95198n29393n7609J063091L237053M636845
$$ -678507 1329364 3720404 4348421 3753223 3223830 3166221 4229312 7466365 12103210
42643A2103210L102750k76424k355690k119038j065563j18923J052524K061555
$$ 12103210 15205960 14929536 12573846 10454808 9389245 9270322 10322846 12384401
42635A2384401J974757J435746K143754M204017O175804P416067P924404O301631
$$ 12384401 14359158 15794904 17938658 22142675 28318479 35734546 43658950 49960581
42627D9960581R71243o253188j0796301j0397091p244153m480730l016045k422532
$$ 49960581 50931824 44678636 33882335 23485244 16241091 11760361 8744316 6321784
42619F321784k343424j944926l33736J428409J071494j115618j943719j79176
$$ 6321784 3978360 2033434 1699698 3128107 4199601 3083983 1140264 961088
42611I61088J120668o55568l145510k224703J851073M677144L471698r2626k749688
$$ 961088 2081756 1426188 -1719322 -3944025 -2092952 2584192 6055890 5963264 3213576
42602C213576l105353j969343q67822o86453r94591o90277L91933J251452J435881
$$ 3213576 108223 -1861120 -2728942 -3415395 -4409986 -5100263 -4708330 -3456878 -2020997
42593b020997J621981J809725P74216j424524k433270j021810N19789l4208p88988
$$ -2020997 -399016 1410709 2184925 760401 -1672869 -2694679 -2174890 -2209098 -2998086
42584b998086J262127M479350M133983k96047l726340k525216Q53505K207385
$$ -2998086 -1735959 2743391 6877374 6581327 2854987 329771 1183276 3390661
42576C390661J261397M09693K90919k96977j436362j923289j500499r20445q2720
$$ 3390661 4652058 5061751 5352670 5055693 3619331 1696042 195543 -724902 -807622
42567h07622J763464L903068M149001J571563j911274l324739j616138J330444
$$ -807622 955842 4858910 9007911 10579474 8668200 5343461 3727323 5057767
42559E057767K490187O96794k104421l097092j938818p32865o20130k76908J261493
$$ 5057767 7547954 8244748 6140327 3043235 1104417 371552 -248578 -525486 736007
42550G36007K264508P51732j981025k584352K3870L512378N086657L866643O56400
$$ 736007 3000515 3752247 1771222 -813130 -789260 2723118 7809775 11676418 12332818
42541A2332818k724609l983319k225812N10317J367330L68847L3864J225006J874842
$$ 12332818 9608209 5624890 3399078 3909395 5276725 5645572 5679436 6904442 8779284
42532H779284N50782j235520j572231p67381J10390J157536K208310J581733j229874
$$ 8779284 9330066 8094546 6522315 5754934 5865324 7022860 9231170 10812903 9583029
42523I583029l303840j749085J580832K102115j052476l865217l110548j32983
$$ 9583029 6279189 4530104 6110936 8213051 7160575 3295358 184810 51827
42515E1827J983639K190436J004616j149582l147247k772549M91630L613680L309914
$$ 51827 2035466 4225902 5230518 4080936 933689 -1838860 -1347230 2266450 5576364
42506E576364L62311j549270o92562J289856K394849K264203J132052p46797k073791
$$ 5576364 5938675 4389405 3696843 4986699 7381548 9645751 10777803 10031006 7957215
42497G957215j292150O86987Q97412j222329k307045j88395J902445k10968m472220
$$ 7957215 6665065 7352052 8249464 7027135 4720090 4531695 6434140 6223172 1750952
42488A750952m542568P17756M608685J788224m033951n530248j974506J034981
$$ 1750952 -2791616 -2073860 2534825 4323049 289098 -5241150 -7215656 -6180675
42480f180675P21855K07931J830286L110477J912836P30437K003083L100376P91959
$$ -6180675 -5458820 -5250889 -3420603 -310126 1602710 2333147 4336230 7436606 8228565
42471H228565k257935j268012K110090J672745k907252m598271p5373M356775
$$ 8228565 5970630 4702618 6812708 8485453 5578201 979930 904557 5261332
42463E261332K076394l879146n659004j919872J739592J833150M44289l7869j10085
$$ 5261332 7337726 3458580 -2200424 -4120296 -2380704 -547554 -103265 -141134 -251219
42454b51219k79539L38371J257434M31259j772610k119412L24727K117083O19234
$$ -251219 -530758 -192387 1065047 1496306 -276304 -2395716 -2070989 46094 665328
42445F65328j921389j918798N58712K846328L509237K752298J110674k7996J129549
$$ 665328 -1256061 -3174859 -2616147 230181 3739418 6491716 7602390 7574394 8703943
42436H703943L478415K858146j837751n341454k875956K266228L235635o2362
$$ 8703943 12182358 15040504 13202753 7861299 4985343 7251571 10487206 10424844
42428A0424844j493159Q17361J630565j947340n007132k805571J362073J630422
$$ 10424844 8931685 9749046 11379611 9432271 4425139 1619568 2981641 4612063
42420D612063j044580j187254J674836K392639j015184m019258k608125J150412
$$ 4612063 3567483 2380229 4055065 6447704 5432520 1413262 -1194863 -44451
42412d4451K972508K140525P01750l80721j323094j538420m24911P75318L18574
$$ -44451 2928057 5068582 5770332 5389611 4066517 2528097 2103186 2878504 3197078
42403C197078j319669k035429j032888N80484J783330K452218K339790J046944
$$ 3197078 1877409 -158020 -1190908 -610424 1172906 3625124 5964914 7011858
42395G011858p17458j346661k91050J237651J827330J260004K43456l39327J14053
$$ 7011858 6294400 4947739 4656689 5894340 7721670 8981674 9225130 8885803 8999856
42386H999856J276781J772102P33702p37008r85419l83162o88141j895464k074324
$$ 8999856 10276637 12048739 12782441 12045433 11060014 10676852 9988711 8093247 6018923
42377F018923q98759p00369k586190m005933k377017R12641K775337L008066L438411
$$ 6018923 5120164 4419795 1833605 -2172328 -4549345 -3636704 -861367 2146699 5585110
42368E585110L735324J943136j079147j921507j65666L71967k198674m133021
$$ 5585110 9320434 11263570 10184423 8262916 8097250 8469217 6270543 2137522
42360B137522j484896L527384N278846K328008j467793k821234k369946j851671
$$ 2137522 652626 4180010 9458856 11786864 10319071 7497837 5127891 3276220
42352C276220j246805n0397R58556Q44974O0788l74304k45810K06275J022192
$$ 3276220 2029415 1979018 2937574 3782548 3843336 3469032 3223222 3429497 4451689
42343D451689J956243J980375L83559j987906l309086k491640j53678J762820
$$ 4451689 6407932 8388307 8771866 6783960 3474874 983234 829556 2592376
42335B592376J420770j099172l343787k763973L03990K823583K500015J20358
$$ 2592376 4013146 2913974 -429813 -3193786 -2889796 -66213 2433802 2554160
42327B554160j803472j669986K68240K380721K587256J61063k702214k645697
$$ 2554160 750688 -919298 -651058 1729663 4316919 4477982 1775768 -869929
42319h69929M71018K642755Q58118k385399k234338J632525M261558J990085k867144
$$ -869929 -398911 2243844 3101962 716563 -1517775 114750 4376308 6366393 3499249
42310C499249n175369l021028R21453K976294J974244l39548j328637k7139J886301
$$ 3499249 -1676120 -4697148 -3775695 -799401 1174843 835295 -493342 -520481 1365820
42301A365820K041147L42836j002111o54150J85926J25995q5721P17822J447581
$$ 1365820 3406967 3749803 2747692 2093542 2279468 2405463 2319742 3037564 4485145
42292D485145L16113j516084q63525K375719M066527J576327j827090j229145
$$ 4485145 4801258 3285174 2421649 4797368 8863895 10440222 8613132 7383987
42284G383987K684765M300361J134676k535488j959310J244395J898931o86394
$$ 7383987 10068752 14369113 15503789 12968301 11008991 12253386 14152317 13465923
42276A3465923j768794J333011M995388M906096K747336L450817P283525R109024
$$ 13465923 11697129 13030140 18025528 22931624 25678960 29129777 36413302 45522326
42268D5522326N884629P15163k354466l957444o696172r447703q686616m702097
$$ 45522326 51406955 52122118 49767652 45810208 39114036 29666333 20979717 16277620
42260A6277620k080815l091005m344970k128263J786057K606690o59619l983383
$$ 16277620 14196805 11105800 6760830 4632567 6418624 9025314 8365695 4382312
42252D382312l809751j187054M61066l9124o58903O21319K855701L060501K3905
$$ 4382312 572561 -614493 -153427 -192551 -851454 -230135 2625566 5686067 5709972
42243E709972l595479l930114n33499K896172K876433L0687k233055j901734m5394
$$ 5709972 2114493 -1815621 -2349120 547052 3423485 3454172 1221117 -680617 -726011
42234g26011J020844J21975j856526k632984o71403K688931M207349K658833M14677
$$ -726011 294833 416808 -1439718 -4072702 -4744105 -2055174 2152175 4811008 5225685
42225E225685r6757K87987k39419o81367R79939L265768K508361j140751l095752
$$ 5225685 5128928 5416915 5177496 4496129 5476068 8741836 11250197 10109446 7013694
42216G013694r63129J986727J977867k2229r04954m16102k20331m0520J522911
$$ 7013694 6050565 8037292 10015159 9992930 9087976 8671874 8451543 8411023 9933934
42207I933934L349805K677039m04606k471653j389588R69198J432702p04893l307749
$$ 9933934 13283739 15960778 15556172 13084519 11694931 12664129 14096831 13391938 10084189
42198A0084189l741320j338445J747092K439559J88536k302050k662779j777893
$$ 10084189 6342869 5004424 6751516 9191075 9379611 7077561 4414782 2636889
42190B636889j627286j839230p36346J380793K683556K742334K288506Q86440
$$ 2636889 1009603 -829627 -1565973 -185180 2498376 5240710 7529216 8415656
42182H415656j981726m101204k560204J249159K561024K5820k221528p67239K360326
$$ 8415656 6433930 2332726 -227478 1021681 3582705 3608525 1386997 619758 2980084
42173B980084L283034J588617l76527j201197j046748m17317k46281j472139l002293
$$ 2980084 6263118 7851735 7475208 6274011 5227263 4809946 4563665 3091526 89233
42164H9233k271797O21312K073648L47275j283296K61002K462267J093238k608119
$$ 89233 -2182564 -1561252 512396 859671 -423625 -162623 2299644 3392882 784763
42155G84763l447006j60794K915319K385121k02262j928712k485691k881896k841856
$$ 784763 -2662243 -2823037 92282 2477403 2275141 346429 -2139262 -5021158 -7863014
42146g863014j448442J076573L535777M745694L872439J004162k199184l587198
$$ -7863014 -9311456 -8234883 -4699106 46588 3919027 4923189 2724005 -863193
42138h63193k597777m86350J203323J444648j00637k149822k064688Q01548L006791
$$ -863193 -3460970 -3947320 -2743997 -1299349 -1399986 -3549808 -5614496 -4812948 -1806157
42129a806157J081956k946048l562022N11408M280565L382755k97169j923434
$$ -1806157 -724201 -3670249 -7232271 -6720863 -2440298 942457 645288 -1278146
42121a278146j00510K394979K748609R00053j028795q29019J566141L415271J952941
$$ -1278146 -1378656 1016323 3764932 4664985 3636190 2807171 4373312 7788583 9741524
42112I741524j847926m109371l137539j368270j205029j503921j74744J839841
$$ 9741524 7893598 3784227 646688 -721582 -1926611 -3430532 -3605276 -1765435
42104a765435J837146m52547k403509j959125K27668K050965K101164O38961p73515
$$ -1765435 71711 -380836 -2784345 -4743470 -4515802 -2464837 -363673 275288 -498227
42095d98227q11063J11997M98408M6186M7020J079231J759056O97761j395778
$$ -498227 -1309290 -1197293 -698885 -652699 -605679 473552 2232608 2930369 1534591
42086A534591k426130r98749K434701N521542N352901J557005k194405k006148
$$ 1534591 -891539 -1890288 544413 6065955 11418856 12975861 10781456 8775308
42078H775308J096823K676600J439979M89610J397712J630162j67988r94794J161987
$$ 8775308 9872131 12548731 13988710 14478320 15876032 17506194 17338206 16343412 17505399
42069A7505399K949411P41000l279637m622532l233729k009378j175190N91489
$$ 17505399 20454810 21195810 17916173 13293641 10059912 8050534 6875344 7466833
42061G466833J593473m74654k978110j422318K578169K896600j332059m171372
$$ 7466833 9060306 8585652 5607542 4185224 6763393 9659993 8327934 4156562
42053D156562k352314K38046j36946j320962k08127J643638J325600l04867o49129
$$ 4156562 1804248 2042294 1905348 584386 376259 2019897 3345497 3040630 2391501
42044B391501L66055J263052J691701J496393j36702k178178j554904J874681
$$ 2391501 2757556 4020608 5712309 7208702 7072000 4893822 3338918 5213599
42036E213599L521301M53158l634008l524019K18158K917978K396614N1584k534516
$$ 5213599 8734900 9188058 5554050 2030031 2248189 5166167 7562781 7614365 5079849
42027E079849m203106l359333k89216J507607p6481k017800r24277J097810J70451
$$ 5079849 876743 -2482590 -2771806 -1264199 -1340680 -3358480 -4282757 -3184947 -3014496
42018c014496k233902j748390J011253J509862n53223j011042P12604N12775k095613
$$ -3014496 -5248398 -6996788 -5985535 -4475673 -5028896 -6039938 -5327334 -4814559 -6910172
42009f910172j881932L046301O793749M405926n60171k003778k07498N43575k89864
$$ -6910172 -8792104 -5745803 1047946 5453872 4893701 2889923 2682425 3226000 2936136
42000B936136N3847J531158J259498j077803k465685j194869J342256L374633
$$ 2936136 2989983 4521141 5780639 4702836 2237151 1042282 2384538 5759171
41992E759171M154299K973582j04213k699374k286330M0175O96714j366570l356624
$$ 5759171 9913470 12887052 12782839 10083465 7797135 7837310 8534024 7167454 3810830
41983C810830k646300K12481K847454L475480J765356q82454j907413k33439J846259
$$ 3810830 1164530 1377011 4224465 7699945 9465301 8582847 6675434 6441995 8288254
41974H288254J336024j274167k732726j655333J51506J003360J162557R00276
$$ 8288254 9624278 8350111 5617385 3962052 4113558 5116918 6279475 7179751
41966G179751m03175k239900k649199j183776P5445k00656m96871P84459K457448
$$ 7179751 6776576 4536676 1887477 703701 779146 578490 81619 866078 3323526
41957C323526K285363J16809k291918l309636k131196Q77344L349432K552016
$$ 3323526 5608889 5725698 3433780 124144 -2007052 -1129708 2219724 4771740
41949D771740o10421j702955J010860L289867J080161k782000k647809J001347
$$ 4771740 4161319 2458364 3469224 6759091 7839252 5057252 2409443 3410790
41941C410790K428354P3930j295717O53146J404490k401410o063824l446137L096952
$$ 3410790 5839144 5913074 4617357 5270503 6674993 4273583 -1790241 -5236378 -2139426
41932b139426N705812K259587j615565j629441M6701O957j269171j877153j965996
$$ -2139426 3566386 5825973 4210408 2580967 2627668 2634625 1365454 -511699 -2477695
41923b477695k035850r18206J876086M322955M722907L951028K876809N25962
$$ -2477695 -4513545 -5431751 -3555665 767290 5490197 9441225 12318034 12843996
41915A2843996k743579l665792j110226O17463k037173n326730l398665K040645
$$ 12843996 10100417 6434625 5324399 5941862 3904689 -1422041 -4820706 -2780061
41907b780061L815071L37778k421600q05816J722060J828479J583809K858332
$$ -2780061 1035010 1372788 -1048812 -1854628 -132568 1695911 3279720 6138052
41899F138052K576046j469452n011598l252760J302318K909679J584155J694584
$$ 6138052 8714098 7244646 2233048 -1019712 282606 3192285 4776440 6471024
41891F471024L580155L389136O13471r23425l7049K14749r19084j3084L588726
$$ 6471024 10051179 13440315 14053786 13130361 13093312 13308061 12388977 12375893 15964619
41882A5964619M931951J168102k878281j462315L397725N103854K191270l26366
$$ 15964619 20896570 22064672 19186391 17724076 21121801 26225655 28416925 28090559
41874B8090559J270624M966835P115502P341815P671034R129670J1375195J4745978
$$ 28090559 29361183 34328018 41443520 48785335 56456369 65586039 76961234 91707212
41866I1707212K0273241K6503969K7520270J6972739m105449k5095043l4407561
$$ 91707212 111980453 138484422 166004692 182977431 178871982 153776939 119369378
41859A19369378l0445818k1641800j5777993j2741626q838590m125207j896954
$$ 119369378 88923560 67281760 51503767 38762141 29923551 25798344 23901390
41852B3901390k915388m021315k533847M95206J997197N30463k257674l457012
$$ 23901390 20986002 16964687 14430840 14926046 16923243 17453706 15196032 11739020
41844A1739020k206203p23000j033953j561585N66493M172083M675335J001946
$$ 11739020 9532817 8809817 7775864 6214279 6780772 10952855 15628190 16630136
41836A6630136k263684j831038o86884k571685n159852l764115N12493K070438
$$ 16630136 14366452 12535414 11848530 9276845 4116993 352878 865371 2935809
41828B935809m80061k537372j042848J295298J037603q15808j042180J165183
$$ 2935809 2455748 -81624 -1124472 170826 1208429 392621 -649559 515624
41820E15624L833987M617935K304521k193140n453845m286104J60233L091580
$$ 515624 4349611 8967546 11272067 9078927 3625082 -661022 -500789 2590791
41812B590791J845462j131467k081782m93337J491149K239932J617166K51161
$$ 2590791 4436253 3304786 1223004 729667 2220816 4460748 6077914 6329075
41804F329075p80570n75218L97956P48300J82810l03871l69527n73513n40656
$$ 6329075 5548505 4973287 5371243 6119543 6302353 5998482 5628955 5055442 4514786
41795D514786P70612K561749K652483J183238Q46732K194452K022682j448647
$$ 4514786 5285398 7847147 10499630 11682868 12529600 14724052 16746734 15298087
41787A5298087m906062m434610j280517L04847o18595j163888K31812J645550
$$ 15298087 10392025 5957415 4676898 4981745 4363150 3199262 3431074 5076624
41779E076624J075290o58533j365741k75080J381110J760133J30168k305994l427130
$$ 5076624 6151914 5493381 4127640 3852560 5233670 6993803 7123971 4817977 1390847
41770A390847k315715O9462K320970L627924L368174J349719r90987j422393J65912
$$ 1390847 -924868 -855406 1465564 5093488 8461662 9811381 8820394 7398001 7563913
41761G563913J362185O22752p74151j139436p06117l35520L4734K62898o00403
$$ 7563913 8926098 9548850 8774699 7635263 6929146 6593626 6628360 6891258 6290855
41752F290855k330754l058801k167860j254204p89158J128575M644471O082816
$$ 6290855 3960101 901300 -1266560 -2520764 -3309922 -2181347 2463124 8545940
41744H545940K919802k042265m538356m105250k421319L01805L392482L557357
$$ 8545940 11465742 9423477 4885121 779871 -1641448 -1339643 2052839 5610196
41736E610196n05484m177325k880989O61706R83721r09995L5506L069820K486232
$$ 5610196 5104712 927387 -1953602 -1291896 -308175 -1218170 -1182664 1887156 4373388
41727D373388j770517k972797J200136M527304K464119q76386k53372K460172
$$ 4373388 2602871 -369926 830210 5357514 7821633 6945247 6691875 9152047
41719I152047K613518M18959r80051j363749k349495l202820k287138p00679o04130
$$ 9152047 11765565 12184524 11204473 9840724 7491229 4288409 2001271 1300592 696462
41710F96462j493194j219391P17724L067106M201187K291488k956278p478373
$$ 696462 -796732 -2016123 -1298399 1768707 5969894 8261382 5305104 -2173269
41702b173269n859065Q13768M725452J763762k801138k739899K59852J121105
$$ -2173269 -8032334 -7218566 -2493114 -729352 -3530490 -6270389 -6010537 -4889432
41694d889432o570K10901J371883J037565N35684K378265M054297J303129l805995
$$ -4889432 -4896002 -4685101 -3313218 -2275653 -1739969 638296 4692593 5995722 2189727
41685B189727m967898j183602K382386K820906K217656J809026K1770k615046
$$ 2189727 -2778171 -3961773 -1579387 1241519 3459175 5268201 5289971 2674925
41677B674925k709344K41432K545361K124676Q18470j4978j136875j833038p2458
$$ 2674925 -34419 207013 2752374 4877050 5695520 5680542 4543667 2710629 2638171
41668B638171K686839K449083l32982p15708K166856L030046m90295l389377j698403
$$ 2638171 5325010 7774093 7441111 6725403 8892259 11922305 11432010 8042633 6344230
41659F344230R47515l476k244852j203012J881222K420457m298k168241k915466
$$ 6344230 7291745 7288269 5043417 3840405 5721627 8142084 8137786 5969545 3054079
41650C054079l225628k586448k09912J812446J179923l97266p4829Q63108n07788
$$ 3054079 -171549 -2757997 -2967909 -1155463 24460 -372806 -447635 415473 -92315
41641i2315k636087j410707K515306L984128J270370j471693q05275J568224K606883
$$ -92315 -2728402 -4139109 -1623803 2360325 3630695 2159002 1353727 2921951 5528834
41632E528834K173414J471666M46534j044156j783061r53451K39715K89265m76295
$$ 5528834 7702248 9173914 9620448 8576292 6793231 5839780 6079495 6368760 5892465
41623E892465o91137J0654O52119J21330j529816k651095j469465J194246J847186
$$ 5892465 5201328 5211982 5864101 5985431 4455615 1804520 335055 1529301 3376487
41614C376487j365638n299721n076993k42723M765040O170051M365734J656512
$$ 3376487 2010849 -3288872 -8365865 -8608588 -3843548 2326503 6692237 8348749
41606H348749p81482k580888k983478j650413L02235J281622Q13428l29823j045118
$$ 8348749 7567267 4986379 2002901 352488 654723 1936345 2749773 2419950 1374832
41597A374832o52193O78465J959786K216895J396173L06203j45747L69960J160785
$$ 1374832 722639 1401104 3360890 5577785 6973958 7280161 7134414 7504374 8665159
41588H665159P97724j225985l170744k754124k62019J796515K339557K717070
$$ 8665159 9462883 8236898 5066154 2312030 2050011 3846526 6186083 8903153
41580H903153L516991L223600J379226J63654R07467J815181J351080R82525J937610
$$ 8903153 12420144 15643744 17022970 17186624 18094091 19909272 21260352 22242877 24180487
41571B4180487K302099O26181n35873J445400M535070N523375N645870P840748
$$ 24180487 26482586 27108767 26572894 28018294 32553364 38076739 43722609 51563357
41563E1563357J0808794J1419314J1144329J4048812J9970159K6266485L4476003
$$ 51563357 62372151 73791465 84935794 98984606 118954765 145221250 179697253
41556A79697253M6395993N3519060M1010615O786736l1186227n2249316n2372519
$$ 179697253 226093246 279612306 320622921 327409657 296223430 243974114 191601595
41549A91601595m1932750l0739394k1927026j6126538j3559077j2443306j0492902
$$ 191601595 149668845 118929451 97002425 80875887 67316810 54873504 44380602
41542D4380602p966525o322516n294494m081867l406878l530897k617042p4104
$$ 44380602 36414077 30091561 24797067 20715200 17308322 13777425 11160383 11086279
41534A1086279J204462o68655k737784j723529N17993M64683r30055o67983J20771
$$ 11086279 12290741 11622086 8884302 7160773 7678766 8143449 7213394 6545411 6666182
41525F666182j712045m604594l951606m942K165742J030103P53569L592436N927748
$$ 6666182 4954137 349543 -3602063 -3607005 -1441263 -411160 342409 3934845 9862593
41516I862593M339544P17878j683552l157478n057936n716197k844719J815948
$$ 9862593 14202137 14920015 13236463 10078985 5021049 -695148 -3539867 -1723919
41508a723919L960522K214592o51118j824742j441061j093100j126614n06651
$$ -1723919 2236603 4451195 3800077 1975335 534274 -558826 -1685440 -2192091
41500b192091J199876K805931K916230J679379J27699j690320m050308n116464
$$ -2192091 -992215 1813716 4729946 6409325 6537024 4846704 796396 -4320068
41492d320068k096042L891935P173615M343067p47350k077588M53498J913319
$$ -4320068 -6416110 -2524175 4649440 8992507 8245157 6167569 6621067 8534386
41484H534386L990k504649k806689j477446l00844N6469l84274j040166m23335
$$ 8534386 8538376 6033727 3227038 1749592 1448748 1505217 1120943 80777 -342558
41475c42558J767931K838796N34071k567848k081810J336926K859657J193247
$$ -342558 1425373 4264169 4798240 2230392 148582 1485508 4345165 5538412
41467E538412J67026J728025K824201J216135p61020q88074p73749j781658j707530
$$ 5538412 5705438 7433463 10257664 11473799 10712779 9824705 9050956 7269298 5561768
41458E561768Q01301K509960M99844k457829j877344J617137L846513L525695
$$ 5561768 6363069 8873029 9372873 6915044 5037700 6654837 10501350 14027045
41450A4027045K868783L091634L296389L021859K549065J414968o11818k149136
$$ 14027045 16895828 19987462 23283851 26305710 28854775 30269743 29657925 27508789
41442B7508789k241042k188285k956670l086059k048338k699166o373434q521761
$$ 27508789 25267747 23079462 20122792 17036733 14988395 12289229 5915795 -2605966
41434b605966m541052K249790M577123J886698L44434K329630L177734m189l201513
$$ -2605966 -7147018 -4897228 -320105 1566593 1911027 4240657 7418391 7414202 4212689
41425D212689k405231R4352M01679o19833k30066N53192q02318k805608j702367
$$ 4212689 1807458 1901810 2303489 1683656 1453590 2006782 1204464 -1601144 -3303511
41416c303511K189506M408110K657937m55354j535505l29607J262120J834561
$$ -3303511 -1114005 3294105 5952042 5496688 3961183 3631576 4893696 6728257
41408F728257J095695o00906k254690k537603r41500J493186K785796J535806
$$ 6728257 7823952 7223046 4968356 2430753 1489253 2982439 5768235 7304041
41400G304041j605270l900860k873447Q99522M206757M753676L078207N33409
$$ 7304041 5698771 1797911 -1075536 -176014 4030743 8784419 11862626 12396035
41392A2396035k621832n634944n793489j490678L912038M617935l29471n047577
$$ 12396035 9774203 4139259 -1654230 -3144908 767130 5385065 5055594 8017
41384H017l961629J031767L268737L12647l161249k400490P09813Q97902k231296
$$ 8017 -3953612 -2921845 346892 659539 -2501710 -4902200 -4192387 -3294485 -5525781
41375e525781l300033Q92200O318307P009360K820449j258265k099891j167257
$$ -5525781 -8825814 -7933614 -1615307 5394053 8214502 6956237 4856346 3689089
41367C689089n67533j02097O86408N69062j274191l076768k473825K17194K314068
$$ 3689089 3121556 3019459 3705867 4274929 3000738 -76030 -2549855 -2332661 -18593
41358a8593J931202l04103k374445k852943j887437o53082J70989J075226K376397
$$ -18593 1912609 1608506 -765939 -3618882 -5506319 -6159401 -5988412 -4913186 -2536789
41349b536789K933027J579979n93187j267144j71870P53189P30446J180560K502598
$$ -2536789 396238 1976217 1383030 115886 -55984 697205 1427651 2608211 5110809
41340E110809K492702j80974l083602k974124k58840J867554J736747L38963j108821
$$ 5110809 7603511 7422537 4338935 1364811 1105971 2973525 4710272 5049235 3940414
41331C940414k229699k360610q30477J256505J590267k57479j901794j150449
$$ 3940414 1710715 -649895 -1480372 -223867 1366400 1108921 -792873 -1943322
41323a943322J226636K606181J634288n27017j679630p73337J229144K376167
$$ -1943322 -716686 1889495 3523783 2996766 1317136 543799 1772943 4149110
41315D149110J619851k77800j627687j344283K89567J843086J751398j63217k153166
$$ 4149110 5768961 5491161 3863474 2519191 2808758 4651844 6403242 6240025 4086859
41306D086859k367698j098437k155O33685J764072K565778N58831l768083n547749
$$ 4086859 1719161 620724 618569 1252254 3016326 5582104 6140935 2372852 -3174897
41297c174897j639227M180441N758085K721044o9904k82081l01069j274063n14776
$$ -3174897 -4814124 -633683 5124402 7845446 7775542 7493461 7192392 5918329 5403553
41288E403553K716907L800580o02515n887020m823148J902232N989989K751611
$$ 5403553 8120460 11921040 11318525 5431505 608357 2510589 8500578 11252189
41280A1252189l129622n031237l087634j803871k076659o48298L156924N232391
$$ 11252189 8122567 3091330 3696 -1800175 -3876834 -4525132 -1368208 3864183
41272C864183K839070r21895j640944J3055K6453k210841k998927m26383K402566
$$ 3864183 6703253 5781358 4140414 4153469 4179922 1969081 -1029846 -1456229 946337
41263I46337J836331j373453l620531l035159n11786K378297M425762M699853
$$ 946337 2782668 1409215 -2211316 -5246475 -5758261 -3379964 1045798 5745651
41255E745651L271349J405406j51584j923012l594720l101767J30468K945669
$$ 5745651 9017000 10422406 10270822 8347810 4753090 1651323 1781791 4727460
41247D727460K289618j98099p03173Q00232R85884q88746j808403l53941R47581
$$ 4727460 7017078 6818979 6115806 6916038 7901922 7013176 5204773 4850832 5798413
41238E798413R3425j258814j106929l92886o93279j259536p46497K59602O53951
$$ 5798413 5891838 4633024 3526095 3133209 2439930 1180394 433897 693499 1347450
41229A347450P78416R50367J51715j655567k158468j59477J770065R97347q52036
$$ 1347450 2125866 3076233 3227948 1572381 -586087 -745564 1024501 2021848 1169812
41220A169812o28489J019700R02149j241115k587433k121116j608716j521461
$$ 1169812 541323 1561023 2463172 1222057 -1365376 -3486492 -5095208 -6616669
41212f616669k7674L006061M649375L079286K36684j197856j001789k26255P00886
$$ -6616669 -6644343 -3638282 1011093 4090379 4327063 3129207 2127418 1901163 2602049
41203B602049J139694j24486k580966l412586j215445J474432J484204o51191
$$ 2602049 3741743 3617257 1036291 -2376295 -3591740 -2117308 -633104 -1284295
41195a284295j860611q69924R61885K314458K951078K375217p7982l287266m448668
$$ -1284295 -3144906 -4014830 -3052945 -738487 2212591 4587808 4509826 1222560 -3226108
41186c226108k199244J474122L440843K899199J676787J333595J199286L7654
$$ -3226108 -5425352 -3951230 -510387 2388812 4065599 5399194 6598480 6636134
41178F636134j190466p2942L233941M729410J315973m304024o215844k709132
$$ 6636134 5445668 5372726 8606667 13336077 14652050 10348026 4132182 1423050
41170A423050J739337K634477P34515n22579l00127l56131j226581j449334l96385
$$ 1423050 3162387 5796864 6531379 6008800 5708673 5352542 4125961 2676627 2280242
41161B280242O13924N14033K4493K77322J015637R25531o07195k451840k602586
$$ 2280242 2894166 3408199 3432692 3710014 4725651 5651182 5043987 2592147 -10439
41152a0439m12018K279467L178188K568732K735169M106214M198238J555606j543987
$$ -10439 -422457 1857010 5035198 7603930 10339099 14445313 18643551 20199157 18655170
41143A8655170k330949j530002j510098k041070j119333Q48024J242192l72317
$$ 18655170 16324221 14794219 13284121 11243051 10123718 10971742 12213934 11841617
41135A1841617j459023p68033k39811j466808k967473k519514r6444K855107N040927
$$ 11841617 10382594 9614561 9374750 7907942 4940469 2420955 2324511 5179618 10220545
41126A0220545N014355J637351l347826n426597k387881K312156L743977J750852
$$ 10220545 15234900 16872251 13524425 8097828 5709947 8022103 11766080 13516932
41118A3516932K19844R95950J843842P62953q33666q15937l9007j035399l721687
$$ 13516932 13736776 14732726 16576568 17339521 16505855 15689918 15650911 14615512 10893825
41109A0893825m687098j539074L362577N078198J950245k269096l097222q36454
$$ 10893825 6206727 4667653 8030230 13108428 15058673 12789577 9692355 8855901
41101H855901M47392j167275l128623k538097j28671J459596J561401J527629
$$ 8855901 9303293 8136018 5007395 2469298 2340627 3800223 5361624 6889253
41093F889253J853974J458929k21728k036767k416194j126887M25878N12142q96415
$$ 6889253 8743227 10202156 9980428 7943661 5527467 4400580 4826458 5338600 4442185
41084D442185j561089L71578L182060L098805l17004k865656j482738J234935
$$ 4442185 2881096 3252674 6434734 9533539 9216535 6350879 4868141 6103076
41076F103076J023132j584915k393137l9290K567496L159173K612376J918333
$$ 6103076 7126208 5541293 3148156 3108866 5676362 8835535 11447911 13366244
41068A3366244K77538k384482l998258l191081j280501N3436R61468J915719K252212
$$ 13366244 13643782 11259300 7261042 4069961 2789460 2842896 3804364 5720083 7972295
41059G972295J853558K137885L491823L716049J180197k191555l381245k250062
$$ 7972295 9825853 11963738 15455561 19171610 20351807 18160252 14779007 12528945
41051A2528945o74928Q73714L036311M718680L706694K36115k732433l350912
$$ 12528945 11854017 12727731 15764042 20482722 24189416 24425531 21693098 18342186
41043A8342186k783237k577110k226373o75515J109286P90674k154713m973966
$$ 18342186 15558949 12981839 10755466 10079951 11189237 11979911 9825198 4851232
41035D851232m220254L9774L510971K405483j640063l521375j621651K59721p41751
$$ 4851232 630978 670752 4181723 6587206 4947143 1425768 -195883 63838 -677913
41026f77913j865800M26906L936563L838749O89472l32350J884111K505381p64482
$$ -677913 -2543713 -2116807 1819756 5658505 6347977 6015627 7899738 10405119 9640637
41017I640637l285951j118540K080255R98641k196544j166167L862202N776513
$$ 9640637 6354686 5236146 7316401 8315042 6118498 4952331 8814533 14591046
41009A4591046J709498k256046m96977L518913K820864k305765m958447k059063
$$ 14591046 16300544 14044498 13547521 17066434 19887298 17581533 12623086 10564023
41001A0564023J440551J11082m476540o482820l487090J412523M013167L038232
$$ 10564023 12004574 12115656 7639116 1156296 -2330794 -918271 3094896 6133128
40993F133128J54800k006594j767738K56915J715419J369838P68510J667125K700413
$$ 6133128 6287928 4281334 2513596 2770511 4485930 5855768 6624278 8291403 10991816
40984A0991816J062805k687583m430294j954146K002337L620507K584065R71469
$$ 10991816 12054621 9367038 4936744 2982598 4984935 8605442 11189507 12160976
40976A2160976k92418j508483k301195k141139j695000j482579m77646J642086
$$ 12160976 11868558 10360075 8058880 5917741 4222741 2740162 2262516 3904602
40968C904602K520978M72563j774182o15689K210307J710051k222454m077740
$$ 3904602 6425580 6898143 5123961 4508272 6718579 8428630 6206176 2128436
40960B128436j246382K118406K049982M72296N81674J154456j35254j548914n62556
$$ 2128436 882054 3000460 5050442 5522738 6104412 7258868 7123614 5574700 5012144
40951E012144O82354j104051l564673j747148L070874M365268O15532k102932
$$ 5012144 5694498 4590447 1025774 -721374 2349500 6714768 7330300 5227368
40943E227368L24330L995204L593897q6068l009219m029325l932025j927948K103102
$$ 5227368 5551698 9546902 13140799 13054731 10045512 6016187 2084162 156214 2259316
40934B259316M496346K042043k270108k802864L78436J936715r4478j617142L51699
$$ 2259316 6755662 8797705 6527597 3724733 4103169 6039884 5945406 4328264 4679963
40925D679963K971282K635090O39435N21105K712657N263892P570561R632473
$$ 4679963 7651245 10286335 10925770 11446875 14159532 19423424 26993985 36626458
40917C6626458R140040L505060n271740j1333093j1323181p438403l604765j273132
$$ 36626458 45766498 49271558 43999818 32666725 21343544 13905141 10300376 9027244
40909I027244J5399M42516L8180n96097j129863j799660j936435r6163K922421
$$ 9027244 9042643 9485159 9523339 8927242 7797379 5997719 4061284 3965121 6887542
40900F887542L400814n16355n065288n028730p57076K425523J680511k09293j0854
$$ 6887542 10288356 9772001 4706713 -322017 -1079093 1346430 3026941 2817648 2806794
40891B806794J348005J399671M26920L27768J061217J073065J83139n22089r36153
$$ 2806794 4154799 5554470 5981390 6309158 7370375 8443440 8626579 8104490 7168337
40882G168337j674436k137339j214679L96157Q90315K31929Q4614R03267J356663
$$ 7168337 5493901 3356562 2141883 2538040 3428355 3660284 3744898 4648165 6004828
40873F004828P67496r8219q28955j658411j835882l27079J538704J142590r26080
$$ 6004828 6772324 6674105 5845150 4186739 2350857 2023778 3562482 4705072 3778992
40864C778992q16429K579719M998317K719534j838621l704732k282315r82894
$$ 3778992 2962563 5542282 10540599 13260133 11421512 7716780 5434465 4451571
40856D451571j396725j823074j182275o48398r67245j165489n65635L03458J173007
$$ 4451571 3054846 1231772 49497 -598901 -1566146 -2731635 -3297270 -2993812 -1820805
40847a820805K147290K217204J61978k775244l699240k031658j26686N23779Q47614
$$ -1820805 326485 2543689 2705667 -69577 -3768817 -5800475 -5927161 -5403382 -4555768
40838d555768J269494M87172j400258j693712Q70538L550739L410836J381777
$$ -4555768 -3286274 -2799102 -4199360 -5893072 -5022534 -1471795 1939041 3320818
40830C320818O5627l06402r56385j559567j215430q35894j432884j443348Q79546
$$ 3320818 3386445 3080043 2123658 564091 -651339 -1487233 -2920117 -4363465 -3483919
40821c483919L662935L716441J665598P14163J026118J66829r07822J928088Q104159
$$ -3483919 179016 3895457 5561055 6275218 7301336 7468165 6560343 8488431 16592590
40812A6592590J0461624M796195l318766n887367l225406j874572l929287m814264
$$ 16592590 27054214 31850409 28531643 22644276 19418870 17544298 13615011 8800747
40804H800747j847454J073817k16298l588339l952861o44590K289293K243061
$$ 8800747 6953293 8027110 7810812 4222473 269612 -374978 1914315 4157376
40796D157376R47055P24363Q27254o20927k757824k762844m21582Q07387j275076
$$ 4157376 5104431 5828794 6656048 6035121 3277297 514453 92871 900258 -374818
40787c74818l735978k228710K458551M939244K597303j014258j585801K78368
$$ -374818 -4110796 -6339506 -3880955 1058289 3655592 2641334 1055533 1333901
40779A333901J213813L49992p29752j491573k397034k371004R026L079358L417029
$$ 1333901 2547714 2897706 2167954 676381 -1720653 -4091657 -4082631 -1003273 2413756
40770B413756Q77856j060238o03678O0043j098011k679464k439820n85967J268978
$$ 2413756 3291612 2231374 1627696 1687739 589728 -2089736 -4529556 -5115523 -3846545
40761c846545K337125K340275J074102l32634k1291J364458P92818k087239l278376
$$ -3846545 -1509420 830855 1904957 1572323 1551032 2915490 3708308 1621069 -1657307
40752a657307n52786K095179J18430m070186m274372J21764L382432K094071o29531
$$ -1657307 -2210093 -114914 3516 -4066670 -8341042 -8219278 -4836846 -2742775 -3372306
40743c372306r66189K21034K03990r62970j486803j105455n73883M50205K504794
$$ -3372306 -4338495 -4117461 -3913471 -4876441 -6363244 -7468699 -8042582 -7592377 -5087583
40734e087583M395239M312519K230587l53089k302653l153782k530577p92166
$$ -5087583 -692344 3620175 5850762 5497673 3195020 41238 -2489339 -3281505
40726c281505M79466J31231r17727r29571K62425J283190J181836L18407l05017
$$ -3281505 -2802039 -2670808 -3588535 -4518106 -4255681 -2972491 -1790655 -1472248 -1777265
40717a777265K19597K017309L699437L260599P64998r56735J53973K101994J242675
$$ -1777265 -1557668 459641 4159078 7419677 8184675 7227940 7381913 9483907 10726582
40708A0726582k354755m438426k210205J699415K564206l17410k918379j849965
$$ 10726582 8371827 3933401 1723196 3422611 5986817 5669407 2751028 901063
40700I01063J523529L343412K223253J12337j245719k259667l240616k732266
$$ 901063 2424592 5768004 7991257 8103594 6857875 4598208 1357592 -1374674
40692a374674l9076K469676K247943N00960J43924P64015m82383l058982k793907
$$ -1374674 -1413750 1055926 3303869 3804829 3948753 4712768 4230385 1171403 -1622504
40683a622504J195171L894009J445139l049810m281920k100468q3098O55826J577977
$$ -1622504 -427333 3466676 4911815 1862005 -2419915 -4520383 -4603481 -3947655 -2369678
40674b369678K354628J294727o14038p32166M88116K76937j142963q29940J089437
$$ -2369678 -15050 1279677 665639 -66527 421589 698526 -444437 -1274377 -184940
40665a84940J118482j173176j813700O49224K278685N25908j337665k34462J154531
$$ -184940 933542 -239634 -2053334 -1404110 874575 1400483 62818 -171644 982887
40656I82887m43330k369008m03205L406643L611139K96581j260331P31846K522704
$$ 982887 539557 -1829451 -2232656 1173987 4785126 5081707 3821376 4553222 7075926
40647G075926J799519O97737O21526k22348k101727j915862J146531K931720O81834
$$ 7075926 8875445 9573182 10194708 9972360 7870633 5954771 7101302 10033022 10714856
40638A0714856k289179k224417j151292k524272m036939j071047M342294M912501
$$ 10714856 8425677 6201260 5049968 2525696 -1511243 -2582290 1760004 6672505
40630F672505r56633n899644l706284K300079M565196J456485k096058k224400
$$ 6672505 5715872 -183772 -3890056 -1589977 2975219 4431704 2335646 111246
40622A11246j22138J329324J316913N22342o84464j966687k303700r81084J236886
$$ 111246 -10892 1318432 2635345 3157687 2473223 506536 -1797164 -2778248 -1541362
40613a541362K851513L158599K305513L41817k605894n206460n330802k428833
$$ -1541362 1310151 4468750 6774263 7116080 4510186 -696274 -6027076 -8455909
40605h455909J355477L535580M094425M490188M427224K087962j885699l568347
$$ -8455909 -7100432 -3564852 529573 5019761 9446985 11534947 9649248 6080901
40597F080901j046259J833310L98158l528094l626301J406380N163735K552173
$$ 6080901 5034642 6867952 7266110 3738016 111715 1518095 6681830 9234003
40589I234003k676553l338436R25109L697551J336716k429641k579271M46319
$$ 9234003 6557450 3219014 4144123 7841674 9178390 6748749 4169478 4615797
40581D615797K363864J047654j538462k351615m32693K460220L419392J204941
$$ 4615797 6979661 8027315 6488853 4137238 3704545 6164765 9584157 10789098
40573A0789098j995289k659843k70750J896089J127380j257557k186984j085396
$$ 10789098 8793809 6133966 5863216 7759305 8886685 7629128 5442144 4356748
40565D356748J09702K60424J67954N10612N38184o17522k415318l294591k284679
$$ 4356748 4466450 4726874 4894828 5405440 5943624 5326102 2910784 -383807 -2668486
40556b668486q2311J527720J629595J194106J251423P75000j482750l413602j354949
$$ -2668486 -2750797 -1223077 406518 1600624 2852047 3627047 2144297 -1269305 -2624254
40547b624254L470678M541430r41869o525023m762910J865283M482767Q94078
$$ -2624254 846424 5387854 4445985 -2079038 -6841948 -4976665 -493898 400180
40539D00180k096814j99605K093591P8379k916618j336344L072829L966939L26932
$$ 400180 -1696634 -1896239 197352 275731 -2640887 -3977231 -904402 3062537 3389469
40530C389469k632413j896222k30809n38898j583090j315459p81014k014063m117787
$$ 3389469 757056 -1139166 -1369975 -1908873 -3491963 -4807422 -5588436 -7602499 -11720286
40521a1720286m027648o05261L722245N621224M463936K737551K598287K844581
$$ -11720286 -15747934 -16353195 -12630950 -7009726 -2545790 191761 2790048 5634629
40513E634629R84783k026110k193464J209791L297538M19744l798603l597040
$$ 5634629 6619412 4593302 2399838 3609629 6907167 7326911 3528308 -68732
40505f8732l0778P01458k818852m931504j667621L523778N234173L068228L13132
$$ -68732 -99510 601948 -2216904 -7148408 -8816029 -5292251 -58078 3010150 3323282
40496C323282j075826j215834m75725M34509M00295k16986K36090J252558l8048
$$ 3323282 2247456 1031622 555897 990406 1390701 1173715 1409805 2662363 2624315
40487B624315l669924n038540j330026L589990M499884K088458N17821L38351
$$ 2624315 -1045609 -6084149 -7414175 -3824185 675699 2764157 3281978 3620329
40479C620329q66852k476063j441234J428595J704288j328890l091440j105852
$$ 3620329 2753477 277414 -1163820 264775 1969063 640173 -2451267 -3557119
40471c557119J194456N49434q99516J40280K420466K724020J434725J279309K111948
$$ -3557119 -2362663 -1813229 -2712745 -2572465 -151999 2572021 4006746 5286055 7398003
40462G398003J201098j728715l536623k256677K68637J276041M88781m26631l78154
$$ 7398003 8599101 6870386 3333763 1077086 1345723 2621764 3110545 2683914 2305760
40453B305760K61088N81946K05181l72618k64260Q40179K245583K902815K275784
$$ 2305760 2566848 3148794 3353975 2981357 2717097 3557276 5802859 8705674 10981458
40444A0981458N92230j254185k096212j606940j057024j853313l162031k518156
$$ 10981458 11573688 10319503 8223291 6616351 5559327 3706014 543983 -1974173
40436a974173N26055L011438K147185j014859l096274k643232j061640R0938O83126
$$ -1974173 -1448118 1563320 3710505 2695646 -400628 -3043860 -4105500 -4014562 -3331436
40427c331436Q21816Q4090j211253j360360P44605L452534L535447O5798l719104
$$ -3331436 -2509620 -2425530 -3636783 -4997143 -4252538 -800004 2735443 2801241 -917863
40418i17863l664731J98398L392551K726703M94709P80753K989937K635086j426290
$$ -917863 -4582594 -4384196 -991645 1735058 2229767 3010520 6000457 8635543 7209253
40409G209253m632199l217760N62327K369931J864712J375639R21786j122635
$$ 7209253 2577054 -640706 -78379 2291552 4156264 5531903 6453689 5331054
40401E331054l628212l504642q43340Q34028J4428q94224l9232J114760J009883
$$ 5331054 1702842 -1801800 -2645140 -1811112 -1796684 -2690908 -2730140 -1615380 -605497
40392f05497P03275J371438J871849R79063k93101q32208j667438l527938m174500
$$ -605497 97778 1469216 3341065 4320128 4027027 3194819 1527381 -2000557 -6175057
40383f175057j310889L075938M600304K311547m32165j036893n82079p82796q43612
$$ -6175057 -7485946 -4410008 190296 2501843 2069678 1032785 450706 -332090 -1175702
40374a175702P08692K783967K722485J07222k486674k928236j968869j169217
$$ -1175702 -467010 2316957 5039442 5146664 2659990 -268246 -2237115 -3406332
40366c406332R2602L259682O638549N902874R8675n432109n076945l96854K143399
$$ -3406332 -3313730 -54048 6584501 12487375 12586050 7153941 2076996 1680142 3823541
40357C823541L85844j045951J373899M290728K782916j825687l894727j771271
$$ 3823541 4209385 3163434 4537333 8828061 11610977 9785290 5890563 4119292
40349D119292M05522n69714k511216j798687J078794K494706J005977p86013m9229
$$ 4119292 4524814 3955100 1443884 -354803 723991 3218697 4224674 3438661 3389432
40340C389432K219204K327439j116609m855952m740235r18337K515759K760736
$$ 3389432 5608636 7936075 6819466 1963514 -2776721 -3695058 -1179299 1581437
40332A581437R70078n88906j405663j631774p33916Q68820J096890o04421j514917
$$ 1581437 2551515 1962609 556946 -1074828 -1808744 -939924 156966 -447455 -1962372
40323a962372K71260K155127Q36521j993520j957999J028826K750536J540167
$$ -1962372 -1691112 464015 1300536 -692984 -2650983 -1622157 1128379 2668546
40315B668546K66036O23163L51153j865074l209432j438832Q76121L87123j496212
$$ 2668546 2934582 3557745 3908898 2043824 -1165608 -2604440 -1728319 -1341196 -2837408
40306b837408r86375J942966L666824K335822j99341j597646j341709m0572J108590
$$ -2837408 -3823783 -1880817 1786007 4121829 3922488 2324842 983133 942561 2051151
40297B051151M65447k021906l374209r57976K921800L123205j032125m005615
$$ 2051151 2516598 494692 -2879517 -3837493 -915693 2207512 1175387 -2830228
40289b830228j359915M032380N816018K439791j501125j713228J001880L079909
$$ -2830228 -4190143 -157763 5658255 8098046 6596921 4883693 5885573 8965482
40281H965482K893125J492354Q9304j132601k014718k129091j888682k378679
$$ 8965482 11858607 13350961 13440265 12307664 10292946 8163855 6275173 3896494
40273C896494l336249k848446l56018J511240K11704k488945k310310J480322
$$ 3896494 560245 -2288201 -2644219 -1132979 -921275 -3410220 -5720530 -4240208
40265d240208M681947L841933O96606q34242O3519J156751J026089K42406n72646
$$ -4240208 441739 4283672 4980278 4146036 4209555 5366306 6392395 6634801 6062155
40256F062155j341116j455740m48286L35612q96466l125772l155957k64112K279655
$$ 6062155 4721039 3265299 2817013 3152625 2256159 -869613 -4025570 -4289682 -2010027
40247b010027J754817j90793l41089J219656J751116M63321n82117k98293k61685
$$ -2010027 -255210 -446003 -787092 432564 2183680 2647001 2064884 1766591 1504906
40238A504906j426245j852552J47255K578377K302574o7964j014281L25377Q78193
$$ 1504906 78661 -1773891 -1626636 951741 3254315 3186351 2172070 2497447 3375640
40229C375640j157479l132164j999084J047598K584032J748235L20875m85732
$$ 3375640 2218161 -914003 -2913087 -1865489 718543 2466778 2787653 2301921
40221B301921m87635Q71811L203782L616138J81995l801924l312551P81149K448151
$$ 2301921 1814286 2686097 5889879 9506017 9688012 5886088 2573537 3354686 5802837
40212E802837l50579k548603k88609K791311J535458k435614l416373l61366K116125
$$ 5802837 5452258 2903655 2615046 5406357 6941815 4506201 1089828 728462 2844587
40203B844587Q04710k361770l847202k492542M99721L045398L263743R98359j584767
$$ 2844587 3649297 1287527 -2559675 -5052217 -4552496 -1507098 1756645 2755004 1170237
40194A170237k275016j258419o0557Q34036J637746J809786J007316L77242Q28511
$$ 1170237 -1104779 -2363198 -2423755 -1589719 48027 1857813 2865129 3242371 4070882
40185D070882J188693K21144q55231k47652J324445J916323J361568M53524j173818
$$ 4070882 5259575 5480719 4625488 4377836 5702281 7618604 8980172 9433696 8259878
40176H259878l394139l695498n14953L203115L696254K015971J644416K167167
$$ 8259878 4865739 1170241 655288 3858403 7554657 9570628 11215044 13382211
40168A3382211N35302k538292l333768j866244j698827k843825j446549K451442
$$ 13382211 13917513 11379221 8045453 6179209 4480382 1636557 190008 2641450
40160B641450L724737P59874j544519k27485R50575j096435l055410j614976L05008
$$ 2641450 6366187 7126061 5581542 5354057 6304632 5208197 2152787 537811 842819
40151H42819p44575k043052Q5544K843567J584843j657927j500591J437603J898590
$$ 842819 98244 -1944808 -1859264 984303 2569146 911219 -589372 848231 2746821
40142B746821p72297k115122q27473m22107k100855k595558m45189J448697J248180
$$ 2746821 1974524 -140598 -968071 -1390178 -3491033 -6086591 -6531780 -5083083 -3834903
40133c834903R17242J665623J515583m29731j692195p23057M64641L23931O19732
$$ -3834903 -2917661 -1252038 263545 -166186 -1858381 -2581438 -2116797 -1792866 -1173134
$$ [...]
##END NTUPLES=NMR SPECTRUM
##END=
