##TITLE=31Pdec_LR-688B-MC1C3
 CDCl3, 88 sc
 19.9.2019
##JCAMPDX= 6.0         $$ Bruker NMR JCAMP-DX V2.0
##DATA TYPE= NMR SPECTRUM
##DATA CLASS= NTUPLES
##ORIGIN= UXNMR, Bruker Analytische Messtechnik GmbH
##OWNER= root
$$ XWIN-NMR		Version 3.5
$$ Thu Sep 19 14:34:21 2019 Russian Standard Time (UT+4h)  she@DPX200
##.OBSERVE FREQUENCY= 81.013821
##.OBSERVE NUCLEUS= ^31P
##.ACQUISITION MODE= SIMULTANEOUS
##.ACQUISITION SCHEME= undefined
##.AVERAGES= 88
##.DIGITISER RES= 17
##SPECTROMETER/DATA SYSTEM= spect
##.PULSE SEQUENCE= zgpg30
##.SOLVENT NAME= CDCl3
##.SHIFT REFERENCE= (INTERNAL, CDCl3, 0, 182.463)
##AUDIT TRAIL= $$ (NUMBER, WHEN, WHO, WHERE, WHAT)
$$ ##TITLE= Audit trail, XWIN-NMR		Version 3.5
$$ ##JCAMPDX= 5.01
$$ ##ORIGIN= Bruker BioSpin GmbH
$$ ##OWNER= she
$$ F:/spectra/data/she/nmr/P31/1/pdata/1/auditp.txt
$$ ##AUDIT TRAIL=  $$ (NUMBER, WHEN, WHO, WHERE, WHAT)
(   1,<2019-09-19 14:33:33.31 +0400>,<she>,<DPX200>,
      <continue with go, POWCHK disabled, PULCHK disabled
       configuration hash MD5:
       00 E9 B6 7A A2 85 ED C7 34 08 36 98 17 FE 4E 26
       data hash MD5: 32K
       8A 34 A4 5E 05 DC 70 C1 55 21 32 AF 2D D1 B0 1F>)
(   2,<2019-09-19 14:33:35.17 +0400>,<she>,<DPX200>,
      <Start of raw data processing
       efp BC_mod = 2 LB = 1 FT_mod = 6 PKNL = 1 PHC0 = -401.824 PHC1 = 103.8003 SI = 64K 
       data hash MD5: 64K
       05 9E EA B9 9F 41 A9 5E EE 6C 6E 2B FB 45 CA 14>)
(   3,<2019-09-19 14:33:51.26 +0400>,<she>,<DPX200>,
      <pk PHC0 = 8.49622 PHC1 = 0 
       data hash MD5: 64K
       01 67 3E 0B 3A 32 5C AC 24 70 D2 DC B5 3E DE 9C>)
(   4,<2019-09-19 14:33:54.31 +0400>,<she>,<DPX200>,
      <abs ABSG = 5 
       data hash MD5: 64K
       3E 12 6D 43 11 64 DB A9 38 09 6E 7C 18 19 2C 2F>)
$$ ##END=
$$ 
$$ hash MD5
$$ 02 BF 70 F5 29 A8 BF F3 B7 D4 AA 5A B0 28 D8 7F
##$RELAX= 
##$RELAX= 
##$RELAX= 
##$RELAX= 
##$RELAX= 
##$RELAX= 
##$RELAX= 
##$RELAX= 
$$ Bruker specific parameters
$$ --------------------------
##$DU= <F:/spectra>
##$EXPNO= 1
##$NAME= <P31>
##$PROCNO= 1
##$TYPE= <nmr>
##$USER= <she>
##$AMP= (0..31)
100 100 100 100 100 100 100 100 100 100 100 100 100 100 100 100 100 100 
100 100 100 100 100 100 100 100 100 100 100 100 100 100 
##$AQSEQ= 0
##$AQ_mod= 1
##$AUNM= <au_zg>
##$AUTOPOS= <>
##$BF1= 81.014009
##$BF2= 200.13
##$BF3= 200.13
##$BF4= 200.13
##$BF5= 200.13
##$BF6= 200.13
##$BF7= 200.13
##$BF8= 200.13
##$BYTORDA= 1
##$CFDGTYP= 0
##$CFRGTYP= 5
##$CHEMSTR= <none>
##$CNST= (0..31)
1 1 145 1 1 1 1 1 1 1 1 1 1 1 1 1 1 1 1 1 1 1 1 1 1 1 1 1 1 1 1 1 
##$CPDPRG= <waltz16>
##$CPDPRG1= <>
##$CPDPRG2= <waltz16>
##$CPDPRG3= <>
##$CPDPRG4= <mlev>
##$CPDPRG5= <mlev>
##$CPDPRG6= <mlev>
##$CPDPRG7= <mlev>
##$CPDPRG8= <mlev>
##$CPDPRGB= <>
##$CPDPRGT= <>
##$D= (0..31)
0 1 0 0 0 0 0 0 0 0 0 0.03 2e-05 3e-06 0 0 0 0 0 0 0 0 0 0 0 0 0 0 0 0 
0 0 
##$DATE= 1568889090
##$DBL= (0..7)
120 120 120 11 120 120 24 19 
##$DBP= (0..7)
150 150 150 150 150 150 150 150 
##$DBP07= 0
##$DBPNAM0= <>
##$DBPNAM1= <>
##$DBPNAM2= <>
$$ [...]
##$SUBNAM3= <"">
##$SUBNAM4= <"">
##$SUBNAM5= <"">
##$SUBNAM6= <"">
##$SUBNAM7= <"">
##$SUBNAM8= <"">
##$SUBNAM9= <"">
##$SW= 369.568048894756
##$SWIBOX= (0..15)
0 1 3 0 0 0 0 0 0 0 0 0 0 0 0 0 
##$SW_h= 29940.119760479
##$TD= 32768
##$TD0= 1
##$TE= 0
##$TE2= 300
##$TE3= 300
##$TEG= 300
##$TL= (0..7)
0 120 53 12 22 120 120 120 
##$TP= (0..7)
150 150 150 150 150 150 150 150 
##$TP07= 0
##$TPNAME0= <>
##$TPNAME1= <>
##$TPNAME2= <>
##$TPNAME3= <>
##$TPNAME4= <>
##$TPNAME5= <>
##$TPNAME6= <>
##$TPNAME7= <>
##$TPOAL= (0..7)
0.5 0.5 0.5 0.5 0.5 0.5 0.5 0.5 
##$TPOFFS= (0..7)
0 0 0 0 0 0 0 0 
##$TUNHIN= 0
##$TUNHOUT= 0
##$TUNXOUT= 0
##$USERA1= <user>
##$USERA2= <user>
##$USERA3= <user>
##$USERA4= <user>
##$USERA5= <user>
##$V9= 5
##$VALIST= <valist>
##$VCLIST= <CCCCCCCCCCCCCCC>
##$VD= 0
##$VDLIST= <DDDDDDDDDDDDDDD>
##$VPLIST= <PPPPPPPPPPPPPPP>
##$VTLIST= <TTTTTTTTTTTTTTT>
##$WBST= 1024
##$WBSW= 4
##$XGAIN= (0..3)
0 0 0 0 
##$XL= 0
##$YL= 0
##$YMAX_a= 37013
##$YMIN_a= -39242
##$ZGOPTNS= <>
##$ZL1= 120
##$ZL2= 120
##$ZL3= 120
##$ZL4= 120
##$ABSF1= 182.463
##$ABSF2= -187.1042
##$ABSG= 5
##$ABSL= 3
##$ALPHA= 0
##$AQORDER= 0
##$ASSFAC= 0
##$ASSFACI= 0
##$ASSFACX= 0
##$ASSWID= 0
##$AUNMP= <proc_1d>
##$AZFE= 0.1
##$AZFW= 0.5
##$BCFW= 0
##$BC_mod= 2
##$BYTORDP= 0
##$COROFFS= 0
##$CY= -3
##$DATMOD= 1
##$DC= 0
##$DFILT= <>
##$DTYPP= 0
##$F1P= 0
##$F2P= 0
##$FCOR= 1
##$FTSIZE= 65536
##$FT_mod= 6
##$GAMMA= 0
##$GB= 0
##$INTBC= 1
##$INTSCL= 5.30512e-09
##$ISEN= 30
##$LB= 1
##$LEV0= 0
##$LPBIN= 0
##$MAXI= 10000
##$MC2= 0
##$MEAN= 0
##$ME_mod= 0
##$MI= 50
##$NCOEF= 0
##$NC_proc= -7
##$NLEV= 6
##$NOISF1= 182.463
##$NOISF2= 159.3651
##$NSP= 0
##$NTH_PI= 0
##$NZP= 0
##$OFFSET= 182.463
##$PC= 4
##$PHC0= -393.3278
##$PHC1= 103.8003
##$PH_mod= 1
##$PKNL= yes
##$PPARMOD= 0
##$PSCAL= 0
##$PSIGN= 0
##$REVERSE= no
##$SF= 81.0140089999434
##$SI= 65536
##$SIGF1= 159.3651
##$SIGF2= -187.1042
##$SINO= 113.3802
##$SIOLD= 16384
##$SREGLST= <1H.CDCl3>
##$SSB= 0
##$STSI= 65536
##$STSR= 0
##$SW_p= 29940.119760479
##$SYMM= 0
##$S_DEV= 0
##$TDeff= 32768
##$TDoff= 0
##$TI= <>
##$TILT= no
##$TM1= 0
##$TM2= 0
##$TOPLEV= 0
##$USERP1= <user>
##$USERP2= <user>
##$USERP3= <user>
##$USERP4= <user>
##$USERP5= <user>
##$WDW= 1
##$XDIM= 65536
##$YMAX_p= 303328642
##$YMIN_p= -78800263
$$ End of Bruker specific parameters
$$ ---------------------------------
##NTUPLES= NMR SPECTRUM
##VAR_NAME=  FREQUENCY,     SPECTRUM/REAL,   SPECTRUM/IMAG
##SYMBOL=    X,             R,               I
##VAR_TYPE=  INDEPENDENT,   DEPENDENT,       DEPENDENT
##VAR_FORM=  AFFN,          ASDF,            ASDF
##VAR_DIM=   65536,         65536,           65536
##UNITS=     HZ,            ARBITRARY UNITS, ARBITRARY UNITS
##FACTOR=    0.456856943014862, 1,           1
##FIRST=     14782.0589164792, 0,            0
##LAST=      -15158.0608439998, 0,           0
##MIN=       -15158.0608439998, -78800263,   0
##MAX=       14782.0589164792, 303328642,    0
$$ Real data points
##PAGE= N=1
##DATA TABLE= (X++(R..R)), XYDATA
$$ [...]
46227H760430q380708m597884J828994N791908N827812M412144K966720l5072
46219A6574344m384444n701174j343234M398007N357934J529926k076862k407545
46211A1946952o2052L457526N665913L030912l910291q364183n917513j833405
46203D013859k810291n536405k701813L026796K811958k055782j272237N767288
46195A243373O973179k045348q939203l952582M612964M832227K0094L46651M076305
46186G167660J734185n914728q610856l512674J853632L320909M422030O035519
46178F495677L592467k707601n665614k841752q55947l414273m201180K147537
46170g450686R626913Q874399N56796o333996o303696j329040M348340P377556
$$ plain form
46227 8760430 379722 -4218162 -2389168 3402740 9230552 13642696 16609416 16574344
46219 16574344 12189900 6488726 5145492 9543499 14901433 16431359 14354497 11946952
46211 11946952 11884900 15342426 21008339 24039251 20128960 11764777 5847264 4013859
46203 4013859 1203568 -4332837 -7034650 -4007854 -1195896 -3251678 -4523915 1243373
46195 1243373 8216552 6171204 -2767999 -6720581 -2107617 2724610 2744704 3091355 7167660
46186 7167660 8901845 2987117 -5623739 -9136413 -7282781 -3961872 460158 6495677
46178 6495677 10088144 7380543 1714929 -1126823 -1982770 -5397043 -9598223 -7450686
46170 -7450686 2176227 11050626 11607422 5273426 -1030270 -2359310 1989030 9366586
46162I366586M982307k467903q824968p398302L15102N403746K510049l577975
46154C08642m766093n41042J784933k327702p658619n874892K569986P930526
46146h574261L927614l502200m241934K215599O799230M010118j284895k094774
46138b745503J117423K890737J141273j438132k514999k351961j475561Q9111
46130e287612J001362n98476l457332l270280J773248P529904Q342863L916892
46122I950569o77968j566059O743Q75918K84910q61747k701652n253945n898879
46113e842110j972723M016705N800049J318661m330136n923216m485112l605164
46105a5023046k832401N06751M794875N048473O85204k614888o25500L706055
$$ plain form
46162 9366586 14348893 11880990 3056022 -4342280 -4027178 1376568 3886617 308642
46154 308642 -4457451 -4998493 -3213560 -5541262 -13199881 -19074773 -16504787 -8574261
46146 -8574261 -4646647 -8148847 -12390781 -10175182 -3375952 634166 -650729 -2745503
46138 -2745503 -1628080 1262657 2403930 965798 -1549201 -3901162 -5376723 -5287612
46130 -5287612 -4286250 -4884726 -8342058 -11612338 -9839090 -2309186 6033677 9950569
46122 9950569 9272601 7706542 7713285 8589203 8874113 8012366 5310714 56769 -5842110
46113 -5842110 -7814833 -3798128 2001921 3320582 -1009554 -6932770 -11417882 -15023046
46105 -15023046 -17855447 -17348696 -12553821 -7505348 -6820144 -9435032 -10060532 -6354477
46097f354477M834370K102532n13250o18737M1957p03844k047627j890243l61362
46088e510681K36245j279043l330861l637740j655406J562200M514734N381186
46080c719366K786682j844440m413822k923556l56308J09159M02621L446311N900005
46071f12714K120235m861264n047625L154256Q286506K252981o797076o443105
46063g947806J502016N066142R12185k905554k242354k431202n714808m744572
46055a8505953M911959J4558208J3081745K665731m528049k734241K077320K664961
46047A4191681n71098k770153j822991L86221J527272J082929k96858j955256
46039I771747l217552l046441j038235J033028M72510k271607k870865J087184
$$ plain form
46097 -6354477 -1520107 582425 69175 -549562 -507605 -1211449 -3259076 -5149319 -5510681
46088 -5510681 -5274436 -6553479 -9884340 -13522080 -15177486 -13615286 -9100552 -3719366
46080 -3719366 -932684 -2777124 -7190946 -10114502 -10470810 -10361651 -9959030 -6512719 -612714
46071 -612714 1507521 -3353743 -8401368 -5247112 3039394 5292375 -1504701 -7947806
46063 -7947806 -6445790 -1379648 -467463 -3373017 -5615371 -8046573 -13761381 -18505953
46055 -18505953 -13593994 964214 14045959 16711690 12183641 9449400 11526720 14191681
46047 14191681 13620583 10850430 9027439 9413660 10940932 12023861 11727003 9771747
46039 9771747 6554195 3507754 2469519 3502547 3975057 1703450 -1167415 -80231
46031h0231N548464M974491M12836k267418j497099j307465k895812k003615K421515
46022C305666M073996r55349o314706m350600J541165J988659l440678n860067
46014a0011914j606818K460544R33656j637270O84439N144254N414016J816644
46006C197551p69506j770622l909759n353738j402462N837298P918386K326601
45998F073749l403213l207479p98423j644833l551895j922975J168525J094641
45990f191903l18757J418389L792466J139101l658898k242938M349085N601251
45982C887796j262108n947401j914929L157937J368964j627535K676675R412227
45974I751626P218050l396056j0732704q690469j911165M485879R667982J1821660
$$ plain form
46031 -80231 5468233 10442724 10855560 8588142 7091043 5783578 2887766 884151 3305666
46022 3305666 7379662 6424313 109607 -4240993 -2699828 -711169 -4151847 -10011914
46014 -10011914 -11618732 -9158188 -8224532 -9861802 -9177363 -4033109 1380907 3197551
46006 3197551 2428045 657423 -3252336 -8606074 -10008536 -4171238 3747148 6073749
45998 6073749 2670536 -536943 -1335366 -2980199 -6532094 -8455069 -7286544 -6191903
45990 -6191903 -6510660 -5092271 -1299805 -160704 -3819602 -6062540 -1713455 3887796
45982 3887796 2625688 -3321713 -5236642 -2078705 -709741 -2337276 339399 9751626
45974 9751626 16969676 13573620 2840916 -5849553 -7760718 -3274839 6393143 18214803
45966A8214803Q328814K262894r9235Q95894o90190n223061o574965l354571j395795
45957A2364588k999430l321592m24160O29260k357962l958018j035230J273731
45949A71187r51410l060861k23568M100037M568450K220013m0283l437350p862002
45940d515787p290451J054843Q943405P631102J158776m79692K682463K178825
45932A1363484l608311o943605l756992Q77640K067842J311787Q28183q91888
45924A248140m511673o604585m416466J87032L909458N533746M579480M00028
45916C25160n173368p569499m421554J112194L811510K130694m54589O52906N789644
45907c796902R499003O203143j964272o238710k175931M243837M937139M04205
$$ plain form
45966 18214803 26543617 28806511 28707276 29603170 28912980 23689919 17114954 13760383 12364588
45957 12364588 9365158 6043566 5619406 6248666 3890704 -67314 -1102544 171187
45949 171187 -780223 -3841084 -4064652 35385 4603835 6823848 6783565 3346215 -4515787
45940 -4515787 -11806238 -10751395 -1807990 5823112 6981888 6502196 9184659 11363484
45932 11363484 7755173 811568 -2945424 -2067784 58 1311845 2140028 1248140
45924 1248140 -3263533 -9868118 -14284584 -14097552 -10188094 -4654348 -74868 325160
45916 325160 -4848208 -12417707 -16839261 -15727067 -11915557 -9784863 -10239452 -9586546 -3796902
45907 -3796902 5702101 11905244 9940972 3702262 1526331 5770168 10707307 11111512
45899A1111512k801604k177375p31952j42164R79913K261120J139558j929107
45891G709901k956594k63818L203583M129935J973941k042473n522307n126165
45883A106003k83232M093830L014838j353518k703230J68583K689866K313827
45875I046967P28554j401512m938356p119515l505226L436764N589815J641436
45867C478927N1433N306858R392287L736692o778805j0168250l935664L192395
45859D275873M597617K705606J983385K141519J050119m91511m52965N46982J30984
45850A6487609k212657m681012n720046n036503k409823J923041M977725K330035
45842E658369n305566r363761k610612R470856J3052352L609238p679697r184976
$$ plain form
45899 11111512 8309908 6132533 5400581 5258417 6238330 8499450 9639008 7709901
45891 7709901 4753307 4489489 7693072 11823007 13796948 11754475 6232168 1106003
45883 1106003 822771 4916601 7931439 6577921 3874691 4043274 6733140 9046967
45875 9046967 9775521 8374009 3435653 -3683862 -7189088 -3752324 1837491 3478927
45867 3478927 3530360 8837218 18229505 21966197 15187392 5019142 1083478 4275873
45859 4275873 8873490 11579096 13562481 15704000 16754119 16262608 15809643 16356625 16487609
45850 16487609 14274952 9593940 3873894 -1162609 -3572432 -1649391 3328334 5658369
45842 5658369 352803 -9010958 -11621570 -2150714 10901638 14510876 6831179 -2353797
45834b353797l477422k76705j294806j474800p91252l402798o745775l489112
45826b3306467M767996P483611J579175l466842j144016K654831J734009L00362
45818i397341L354272O013801K559487j758886N42008M768193J288575o586925
45810G83184o153501L515625Q092887n33971j1479888j0487059M94726P874393
45802g893604N367831m56737k009852q9892N08687n81910M80530M735364P837956
45793G898373N899214J102134j484191j172533j721211m419555n967213m556580
45785d421562l070565l539835l195148J41392L131576K244271K36255J576851
45777f896765M326071L098614j523365l314605O9514M052903M234013J224612
$$ plain form
45834 -2353797 -5831219 -6107924 -7402730 -8877530 -9668782 -13071580 -19817355 -23306467
45826 -23306467 -18538471 -11054860 -9475685 -12942527 -14086543 -11431712 -9697703 -9397341
45818 -9397341 -6043069 -29268 2530219 771333 1313341 6081534 7370109 783184
45810 783184 -5370317 -1854692 6238195 5704224 -5775664 -16262723 -15767997 -7893604
45802 -7893604 -2525773 -2982510 -4992362 -5082254 -4573567 -5155477 -4674947 60417 7898373
45793 7898373 13797587 14899721 13415530 12242997 10521786 6102231 135018 -4421562
45785 -4421562 -7492127 -11031962 -14227110 -14085718 -10954142 -8709871 -8473616 -6896765
45777 -6896765 -2570694 527920 -995445 -4310050 -4240536 -187633 4046380 5270992
45769E270992k271180m287379k904086K260151O950379N675390m35533m017771
45761F240963j487082K042276L56526n405776q963673o727259p20472M372315
45753a0292182N196694K370294K4079Q88202K081119r67972o552370p400005q00727
45744a5452868O698503P484210J984649l440762m487173j599960K450996M249844
45736b112561J301339m609044p491274l991293J517977K346549j288122k654480
45728a6980909J908893P863202Q489886L389260j374579r21837K627361L087148
45720H088425j614710o361395n486990n32420K067955K70062j301408O44275K848841
45711a377365J269331k270832l454016k225107j301166m55767K069115M006083
$$ plain form
45769 5270992 2999812 -1287567 -4191653 -1931502 5018877 10694267 10258734 6240963
45761 6240963 4753881 6796157 7152683 1746907 -7216766 -13944025 -14664497 -10292182
45753 -10292182 -5095488 -2725194 -2701115 -1812913 268206 -699766 -7252136 -14652141 -15452868
45744 -15452868 -8754365 -1270155 714494 -2726268 -7213441 -8813401 -6362405 -2112561
45736 -2112561 -811222 -5420266 -12911540 -16902833 -15384856 -13038307 -14326429 -16980909
45728 -16980909 -15072016 -7208814 1281072 4670332 3295753 2373916 5001277 8088425
45720 8088425 6473715 112320 -5374670 -5907090 -3839135 -3569073 -4870481 -4226206 -1377365
45711 -1377365 -108034 -2378866 -5832882 -8057989 -9359155 -9814922 -7745807 -3739724
45703c739724J367727l692741m028402J682321N509688J210781o430068p916814
45695a6037232j369830O387139R037583O251669J048930l499451m831580k350399
45687e363171Q84808J209135m54711M0814K984003L418981j280047o587154o703566
45678a1850908k012880K921352N904024P172904N274591j139452p777615p355214
45670h863198K95687O207329L718021k454330l094648K659883O975404M802954
45662A0247102j02568j912431n97078J8761j075367j453495l16841j61729k453731
45653B192623m748773m261761k182691j420509j175673K171942Q074695J0106696
45645H756549M276002m116225o336869j475194K874719J027236m356614p164905
$$ plain form
45703 -3739724 -2371997 -6064738 -10093140 -8410819 -2901131 -1690350 -8120418 -16037232
45695 -16037232 -17407062 -11019923 -1982340 4269329 5318259 1818808 -3012772 -5363171
45687 -5363171 -4478363 -3269228 -3723939 -3683125 -699122 2719859 1439812 -5147342 -11850908
45678 -11850908 -13863788 -10942436 -5038412 2134492 7409083 6269631 -1507984 -8863198
45670 -8863198 -8567511 -2360182 1357839 -1096491 -4191139 -1531256 5444148 10247102
45662 10247102 10144534 8232103 7635025 7653786 6578419 5124924 4808083 4646354 2192623
45653 2192623 -2556150 -6817911 -9000602 -10421111 -11596784 -9424842 -1350147 8756549
45645 8756549 13032551 8916326 2579457 1104263 3978982 5006218 649604 -6515301
45637f515301m866399R65878P167269R867213O615223L01141k453514L08959K714189
45628A4104658j48396m228637k698049K802113L973613j831047q056477q737681
45620d819903n400187j838703J889939O186033P612156L502611k039223k671483
45612B421240R17570K127325j204879l706452j471242J775271J323445o28624
45604A553654O66960L583910K503458k185659m103879j596153m44423l115784
45596c137916l485060K356272P514148M426620k184718k206793L712753N744825
45588A2740131J072132k966367k551732k537657n122598m735479Q51635M636347
45580A386412J830717k129599j873117j260937m242888n506241j77156M991211
$$ plain form
45637 -6515301 -11381700 -10415822 -3248553 6618660 13233883 13535024 11081510 11390469 14104658
45628 14104658 13956262 9727625 7029576 9831689 13805302 11974255 3917778 -4819903
45620 -4819903 -10220090 -12058793 -10168854 -3982821 3629335 7131946 5092723 2421240
45612 2421240 3338810 5466135 4261256 554804 -916438 858833 2182278 1553654
45604 1553654 2220614 5804524 8307982 6122323 2018444 422291 -22132 -3137916
45596 -3137916 -6622976 -4266704 3247444 7674064 5489346 3282553 6995306 12740131
45588 12740131 13812263 10845896 8294164 5756507 633909 -4101570 -3249935 1386412
45580 1386412 3217129 1087530 -785587 -2046524 -6289412 -11795653 -11972809 -6981598
45572f981598J636709n222106m701481K037882M644372J414322L13536L000251
45564c858113K129229l625697n488261L35380N467260K929406k159387j980416
45556f250599J992707L283260Q11363j310168n34461K189287M388870L479650
45548H049909o17744l461401j000870L636340L974287K26132j812895j412560
45540G581198l221310o361657m027089L437229O318374Q72951m116407j917075
45532a433786J872866Q44560j002307J475224L720757L57302l328064k70524M661626
45523F897654K054513n756432q133142k974019J692365J572918P05517K340105
45515a600521M557359N237761L889887n38513o616924p627215P958Q140227O125370
$$ plain form
45572 -6981598 -5344889 -10566995 -15268476 -13230594 -8586222 -7171900 -6858364 -3858113
45564 -3858113 -1728884 -5354581 -10842842 -10507462 -5040202 -2110796 -4270183 -6250599
45556 -6250599 -4257892 -974632 -163269 -1473437 -2007898 181389 4570259 8049909
45548 8049909 7432165 3970764 2969894 6606234 10580521 10806653 8993758 7581198
45540 7581198 4359888 -2001769 -6028858 -2591629 3726745 4599696 483289 -1433786
45532 -1433786 439080 1283640 281333 1756557 5477314 5834616 2506552 2236028 6897654
45523 6897654 8952167 3195735 -4937407 -7911426 -6219061 -4646143 -3940626 -1600521
45515 -1600521 2956838 8194599 12084486 11545973 4929049 -2698166 -2690208 5450019 11575389
45506A1575389l429913q288379m501874L43544J490936K670244N526784M994072
45498A0380803p24327n355730m402701j448095k52297J313632M484339M536525
45490H532149j288395p072371o099482q32468J471221k21468n65960K797179N561717
45481B282122L189327k535102n177062j267227M860270N470510q22001o561070
45473e60233n044765Q66020L661363J900668L25546J252330K389217K562107L229340
45464A0581593M177653L407891J264569n67343l141227p436129r323309m816684
45456e852986J253977P50573m371780m312004K497245O738826L859928P47062
45448A310841K465245L672428l19978m123730j961022J661317j35855m546213
$$ plain form
45506 11575389 8145476 -142903 -4644777 -4301233 -2810297 -140053 5386731 10380803
45498 10380803 9656476 4300746 -101955 -1550050 -1802347 -488715 3995624 8532149
45490 8532149 7243754 171383 -5928099 -6760567 -5289346 -5510814 -6076774 -3279595 2282122
45481 2282122 5471449 2936347 -2240715 -3507942 1352328 6822838 6000837 -560233
45473 -560233 -5604998 -4738978 -1077615 823053 1148599 2400929 4790146 7352253 10581593
45464 10581593 14759246 18167137 19431706 18864363 15723136 8287007 -1036302 -5852986
45456 -5852986 -4599009 -3848436 -8220216 -12532220 -10034975 -3296149 563779 1310841
45448 1310841 3776086 7448514 7128536 3004806 1043784 2705101 2569246 -1976967
45440a976967m045559J161717M259003K521369m52083j447006p93078r692r3991
45431h76287p06751M29006M051821N268660p91223q875011q234900N96058M751587
45422d387040q33154m814378J283254Q018705L909881m829053n133092Q13600
45414e971277J035115m018460k673042O058075R545406K821480l257894k09714
45406C329689N388545M396348o44905j960942M70324O82710k782910n004675j927920
45397A946264M373535P439227K982127n149503p554263r02975O140902L855411
45389A3130725m903294r235699n938222j857202j348802j044410J585792L558117
45381f052995L106619L366359N932385P013541L251568l467762r060352j0835080
$$ plain form
45440 -1976967 -6022526 -4860809 -601806 1919563 1467480 20474 -772604 -782296 -876287
45431 -876287 -1583038 -1154032 2897789 8166449 7375226 -1499785 -9734685 -9138627 -4387040
45422 -4387040 -5220194 -10034572 -8751318 -732613 3177268 -1651785 -6784877 -5971277
45414 -5971277 -4936162 -8954622 -11627664 -5569589 3975817 6797297 3539403 3329689
45406 3329689 8718234 13114582 12469677 10508735 10979059 11661769 8878859 3874184 1946264
45397 1946264 6319799 13759026 16741153 11591650 4037387 3134412 9275314 13130725
45389 13130725 8227431 -1008268 -6946490 -8803692 -10152494 -11196904 -9611112 -6052995
45381 -6052995 -2946376 419983 6352368 13365909 16617477 13149715 4089363 -6745717
45373f745717p652537j444238J964842n96223l463045M77269P835765Q912617
45365g11267K730581k299661k567360k808513m466442k730679K215069L413409
45357g224863K63779O79870N599675N189941l037935o948332J39634O416273Q12116
45348A890158p745731n178918M423796P167009K870666K028171M535401P20552
45340A0711104p960857q293119K440145J0657776P515149P31009o29480K89809
45332A5461536k365571n361295l351921N46235N02212j362526J030660O447714
45324A1547044P270116P17011p249662r729758o292873j589149P21176J026972
45316c579123J395640J763444L37722k309961k747118j140K048482N97559j238412
$$ plain form
45373 -6745717 -14398254 -15842492 -13877650 -14473873 -17936918 -17459649 -9623884 -711267
45365 -711267 2019314 -280347 -2847707 -5656220 -10122662 -12853341 -10638272 -7224863
45357 -7224863 -6961084 -6281214 -681539 4508402 1470467 -5477865 -5338231 1078042 1890158
45348 1890158 -5855573 -11034491 -6610695 556314 3426980 5455151 9990552 10711104
45340 10711104 2750247 -5542872 -3102727 7555049 15070198 15801207 15171727 15461536
45332 15461536 13095965 7734670 4382749 4928984 5431196 4068670 5099330 11547044
45324 11547044 18817160 19534171 12284509 2554751 -3738122 -5327271 -4606095 -3579123
45316 -3579123 -2183483 -420039 -82317 -2392278 -5139396 -5140536 -3092054 -2494495 -3732907
45307c732907L68197L221967K743829m40311k282581k302851k712126k784536
45299g921319o59345J339555K06223j114235J615337M983844K892795j446237
45291a03382M88695O953792O783749k288643q887681n727594J82376R67717k92272
45282a923243J035772Q93455m468220q384870l788005L672482L929917j430217
45274a0462929k989906N56615K217876L65120P15281M621442O231340L032539
45266D287378j6460O61891K068739R73761j103343j909819j960118j751764l56042
45257H94223J345333O34917k139917l086360q52737J132165M32516l75639K098218
45248H2719O722779R003780O085169m19470n549700n307855j089794J639872O04429
$$ plain form
45307 -3732907 -3364710 -142743 2601086 2160775 -121806 -2424657 -5136783 -7921319
45299 -7921319 -8580664 -7241109 -7034886 -8149121 -6533784 -1549940 1342855 -103382
45291 -103382 385313 7339105 14122854 11834211 2946530 -2781064 -2598688 -1630971 -1923243
45282 -1923243 -887471 5984 -4462236 -12847106 -16635111 -12962629 -9032712 -10462929
45274 -10462929 -13452835 -12896220 -10678344 -10313224 -9597943 -4976501 1254839 4287378
45266 4287378 4270918 4932809 7001548 7975309 6871966 4962147 3002029 1250265 894223
45257 894223 2239556 2874473 734556 -2351804 -3204541 -2072376 -1639860 -2015499 82719
45248 82719 6805498 15809278 21894447 21474977 15925277 10617422 9527628 11167500 11771929
45239A1771929l23362J856571L430690R1753n019687o112264m403830m878859
45231c587059n815036j452917N523786N415491k545808o907948j189126O043618
45223d514999M891544j158007k603526J076200L193941J855742Q33021J234965
45215D808881Q97570M50586K193657L969939J533437l482971n035545k135754
45207C199800k6059j242316k119867J71944L011326L113239J269681p5025l55407
45198F947316j16396J87798o39282l563749o715913o892286m100701j181815J103675
45189a4971353M213642O765971M837378j000131m424909k005002J830989J961902
45181b791513J56686J142420M798080P057638N921200K134986l522821r031026
$$ plain form
45239 11771929 11448567 13305138 16735828 16827581 11807894 5695630 1291800 -3587059
45231 -3587059 -9402095 -10855012 -5331226 84265 -2461543 -9369491 -10558617 -4514999
45223 -4514999 376545 -781462 -3384988 -2308788 885153 2740895 3573916 4808881
45215 4808881 5706451 6157037 8350694 12320633 13854070 10371099 5335554 3199800
45207 3199800 3173741 1931425 -188442 -16498 2994828 6108067 7377748 7302723 6947316
45198 6947316 6830920 7018718 6379436 2815687 -3900226 -10792512 -14893213 -16075028 -14971353
45189 -14971353 -10757711 -3991740 845638 -154493 -4579402 -6584404 -4753415 -2791513
45181 -2791513 -2634827 -1492407 3305673 10363311 16284511 18419497 14896676 5865650
45173E865650r888685m536457J101874N68920l211214k020940M183317O237006
45165a700529J18601o020554l813433L255716O218075L996409K676525M225620
45157H956430M285283J017135j633664j346728j463102m443926o763157m616280
45149f008009o78556j58364k534730k443840J929434O098748N616769J557852
45141C379304j718198j869823j76470P95374J7141j052248k84548J959283K577984
45132C627799k2935k871796k182764P79571J155806j953536l391394O42765O337537
45123B121053O722606Q50337m905661m888245q63052O89454l128687p800693o622847
45114a7825735J022224Q404984R050607L700837j863502l865663k523700J189784
$$ plain form
45173 5865650 -4023035 -8559492 -7457618 -6888698 -10099912 -12120852 -7937535 -1700529
45165 -1700529 -1581928 -7602482 -11415915 -8160199 -1942124 2054285 4730810 8956430
45157 8956430 13241713 14258848 12625184 11278456 9815354 5371428 -1391729 -6008009
45149 -6008009 -6686565 -6844929 -9379659 -11823499 -9894065 -3795317 1821452 3379304
45141 3379304 1661106 -208717 -385187 410187 427328 -624920 -909468 1049815 3627799
45132 3627799 3604864 733068 -1449696 -670125 485681 -1467855 -4859249 -4216484 2121053
45123 2121053 8843659 9693996 4788335 -99910 -962962 -273508 -3402195 -11202888 -17825735
45114 -17825735 -16803511 -8398527 652080 4352917 2489415 -1376248 -3899948 -2710164
45106b710164O194417Q900599N389964k242941o286442k904445K611306L279520
45098A2231814m98159l331385l213383k483526k245813j165540M94031L79740
45090A67779j797390l281729k104371Q94863L842821M915438K443986k592618
45082B488779n154048j682142L542330L068572k455054m245815J394263O864091
45074C820976M715278r14343j120115L667432M713661j046685o358739m675735
45066B801730J030811L927975K584498J85645j764151l725768m100815n28014
45058D11911M757106N932264J502202k986838k568493M24540P01312j823883k865714
45049C484407j314570o27636k303928l039576l07087L312419L948716J502978
$$ plain form
45106 -2710164 3484253 12384852 17774816 15531875 9245433 6340988 8952294 12231814
45098 12231814 11733655 8402270 5188887 2705361 459548 -705992 -211961 167779
45090 167779 -1629611 -4911340 -7015711 -6120848 -2278027 2637411 5081397 2488779
45082 2488779 -2665269 -4347411 -805081 2263491 -191563 -4437378 -3043115 3820976
45074 3820976 8536254 7621911 6501796 10169228 14882889 13836204 7477465 2801730
45066 2801730 3832541 7760516 10345014 10530659 8766508 5040740 939925 411911
45058 411911 5169017 11101281 12603483 9616645 7048152 7472692 8174004 6350121 3484407
45049 3484407 2169837 1542201 -761727 -3801303 -4108390 -795971 3152745 4655723
45041D655723j530956l486510l487296j016609K011723K072521l44880J8629M593141
45032C485486O370690k78859r322245j0412530m070564m96689l578399n694973
45024b3998083p48824O472951Q375504N002290J278852o90296j259539M28209
45016e138936M274523O460963L840606j017549l178975j691384Q42939K719049
45008G111236L628720K737568k98776l675614n132842m034305r70292K130694
45000A496389J597240l568537o759785l51315J1066653J2970834Q98787j1178177
44992F172089r699362R1413M313428J241851m19660J350146O14806k768293k090596
44983a194178K989288M954267J861554K32873K155108J494695l523471n775154
$$ plain form
45041 4655723 3124767 -361743 -3849039 -4865648 -2853925 -781404 -1126284 -1107655 3485486
45032 3485486 9856176 9577317 255072 -10157458 -14228022 -14724711 -18303110 -23998083
45024 -23998083 -24746907 -18273956 -9898452 -4896162 -3617310 -4307606 -5567145 -5138936
45016 -5138936 -864413 5596550 9437156 8419607 5240632 3549248 4392187 7111236
45008 7111236 10739956 13477524 13178748 9503134 4370292 335987 -634305 1496389
45000 1496389 3093629 -474908 -7234693 -7586008 3480645 16451479 17350266 6172089
44992 6172089 -3527273 -3435860 877568 2119419 1699759 3049905 3664711 896418 -1194178
44983 -1194178 1795110 6749377 8610931 8843804 10998912 12493607 8970136 3194982
44975C194982k000583J144156o38875j936827R69246K253478j989315m834232
44967c837970m88693M318147J592346l679548k396568K699139K845353p19580
44959C32626m47172K052919q11457o226081l618017N900820Q718468N59112o170479
44950B90739k579049L418886K137958k254055j592160J142663j347562o097920
44942f880500m813270J222430L530951J199958J300973N337717O886533L759266
44934A1544058J475104K034023j69641o798498r779270l647302M407654M904560
44926C970688L19916j32145M220109N528202J186546k537484j723372m37192k076682
44917H318586l116714k26498K883898J600528j418840o17482L105904L962708
$$ plain form
44975 3194982 1194399 2338555 1699680 -237147 732099 2985577 996262 -3837970
44967 -3837970 -4326663 -8516 1583830 -2095718 -4492286 -1793147 1052206 332626
44959 332626 -114546 1938373 1126916 -5099165 -8717182 -2816362 5902106 6461218 290739
44950 290739 -2288310 1130576 3268534 1014479 -577681 564982 -782580 -6880500
44942 -6880500 -11693770 -10471340 -6940389 -5740431 -4439458 898259 7784792 11544058
44934 11544058 13019162 15053185 14883544 8085046 -1694224 -5341526 -933872 3970688
44926 3970688 4290604 4158459 8378568 13906770 15093316 12555832 10832460 10395268 8318586
44917 8318586 5201872 4975374 7859272 9459800 8040960 7423478 10529382 14492090
44909A4492090N35406k685998k524623m62333J229311J880446Q41504j961389
44901A1344414l853041k306505J81121q32314l938698l254096J728153M575495
44893C644529K333856L19762K675004M991357J997776l057377l627590n07454
44885H769863J35631k952668n069122l780336j270845J477964O028929J0682597
44877A4022013R626265R87210q584465j0879343n291011J700600M506011L198933
44869I286213R22886p24618k123957k624487l57047L308908K606445m671806j0494720
44860d872183n356048O373387R403998q58258r993072n074185O144471P672474
44852C440584l74401m137724P34901L940608m13109m725771k492391J285113J154295
$$ plain form
44909 14492090 15027496 12341498 9816875 9354542 10583853 12464299 13305803 11344414
44901 11344414 7491373 5184868 5365989 4533675 594977 -2659119 -930966 3644529
44893 3644529 5978385 6298147 8973151 13964508 15962284 12904907 9277317 8769863
44885 8769863 8905494 5952826 883704 -2896632 -4167477 -2689513 3339416 14022013
44877 14022013 23648278 24635488 16051023 5171680 -119331 1581269 6087280 9286213
44869 9286213 10209099 9484481 7360524 4736037 4378990 7687898 10294343 5622537 -4872183
44860 -4872183 -10228231 -3854844 5549154 4690896 -5302176 -10376361 -4231890 3440584
44852 3440584 3066183 -1071541 -336640 3603968 3190859 -1534912 -4027303 -2742190 -1587895
44843a587895J298093N934465Q998621L548241n214829o885770j646137J122014
44835E566803k069491m820820k137069K580820L885950J659563n73557j036266
44827C055933q01662r40677l36343K867934P270862P588363J169260o320225o926681
44818F626764j616804J344635l08046Q198M661707O215714Q12045l078343J623162
44809A6289032P059389K289695q198939j1339293o291660l586101n450470k903803
44801a2132150N952661J0288417M213859l363042l400156L14879P83848J48872
44793B807188L014005N629396K206970l528996l394467K041010M728405J655330
44785A5158841k517083m388432n357251n904511l473869K162332O579279N895462
$$ plain form
44843 -1587895 -289802 5644663 14643284 18191525 12976696 6090926 4444789 5566803
44835 5566803 3497312 -1323508 -3460577 -879757 3006193 4665756 4092199 3055933
44827 3055933 2254271 1313594 977251 3845185 11116047 18704410 19873670 13553445 6626764
44818 6626764 5009960 6354595 6046549 6054747 10716454 16932168 17744213 14665870 16289032
44809 16289032 23348421 25638116 17439177 6099884 -191776 -3777877 -9228347 -12132150
44801 -12132150 -6179489 4108928 8322787 4959745 1559589 1874468 2658316 2807188
44793 2807188 5821193 11450589 13657559 10128563 6734096 8775106 13503511 15158841
44785 15158841 12641758 8253326 2896075 -3008436 -6482305 -4319973 2259306 8154768
44777H154768J344609k465898k041157K189487O093884N719209J892821j008089
44769A9879634j445791k131988l830221l214145R9864O29891l867199o676038
44761e55993k484625K528462K48659m645647j335505Q139505J0127824R56663
44753A2979343o335006j906066O335406O041883j405648n958848n289473n051979
44745e90388o291534l638530L939965R781405Q984015M484445J201706o52760
44737A7218324l488588p230104r343667q195267m432398k3378L086751M097875
44729h310452L499622J808045r61443l737861l976582p66078K924390L449872
44721f070487J053451j060817j257398n00585L03466J083002J136549j60970j239733
$$ plain form
44777 8154768 9499377 7033479 4992322 7181809 13275693 18994902 20887723 19879634
44769 19879634 18433843 16301855 12471634 9257489 9357353 9987244 6120045 -555993
44761 -555993 -3040618 -512156 -263497 -4909144 -6244649 1894856 12022680 12979343
44753 12979343 6644337 4738271 11073677 17115560 15709912 9751064 4461591 -590388
44745 -590388 -6881922 -10520452 -6580487 3200918 12184933 16669378 17871084 17218324
44737 17218324 13729736 6499632 -2844035 -11039302 -15471700 -15495078 -12408327 -8310452
44729 -8310452 -4810830 -3002785 -3964228 -7702089 -11678671 -12444749 -9520359 -6070487
44721 -6070487 -5017036 -6077853 -7335251 -7835836 -7532370 -6449368 -5312819 -5473789 -6713522
44712f713522K70729L834037O214921N546341K872062j50676k430283k621495
44704F822114l08985J922636R87749j820274k157251N07467J649226r85422l160659
44695C456601l84189M956788O530883K336826l322116n190771j928026L377832
44687I833828N594962J819786m839766p511064l700915J040843N50857l146324
44679c57793k863599K903121P273091M337568k921692o744166m285807j28986
44671b788263M91281j680205j671005K259834N717036M452879J161248J797704
44663I740509N750678N503701j801639q400436o288159J050733L795342k17620
44655I133109m055863l116154j90165J531759K840953L625412P96363n100280
$$ plain form
44712 -6713522 -6442793 -2608756 3606165 9152506 12024568 11873892 9443609 6822114
44704 6822114 6513129 8435765 9423514 7603240 5445989 5953456 7602682 6617260 3456601
44695 3456601 3072412 8029200 14560083 16896909 13574793 8384022 6455996 9833828
44687 9833828 15428790 17248576 12408810 4897746 1196831 2237674 2788531 -357793
44679 -357793 -3221392 -318271 6954820 11292388 8370696 1626530 -2659277 -2788263
44671 -2788263 -2296982 -3977187 -5648192 -3388358 2328678 6781557 7942805 9740509
44663 9740509 15491187 20994888 19193249 10792813 4504654 5555387 9350729 9133109
44655 9133109 5077246 1961092 1770927 3302686 6143639 9769051 10565414 5465134
44647E465134p409583k482899L584082K877118l228420o650166l933450P64815
44639a1013369K915112K458477J355317P11096J035774K214446K782336J545429
44631D004618l74504j260946j519515k099190j670500J191093M200675L775742
44623F247473O37949j219315q93369j272501l022084k856634P59488M813063O581864
44614I775934O842135O022814K126998l949081n932198m64732N692500L463439
44606B3577809n266015r456440m227135L035553M241896J304728N49276J959235
44598A5718907Q74955k422916k466306J996561N230507L195489o64514j446754
44590B0015929J18612O10301O4294K75971j77894l498775o753162m542742K329964
$$ plain form
44647 5465134 -1944449 -4427348 -843266 2033852 -1194568 -7844734 -11778184 -11013369
44639 -11013369 -8098257 -5639780 -4284463 -3573367 -2537593 -323147 2459189 4004618
44631 4004618 3630114 2369168 849653 -1249537 -2920037 -1728944 2471731 6247473
44623 6247473 6885422 5666107 4772738 3500237 478153 -2378481 -1618993 3194070 9775934
44614 9775934 16618069 22640883 24767881 20818800 14886602 14421870 20114370 23577809
44606 23577809 18311794 8855354 4628219 7663772 11905668 13210396 13759672 15718907
44598 15718907 16593862 14170946 11704640 13701201 18931708 22127197 21462683 20015929
44590 20015929 20134541 20744842 20809136 21085107 20907213 17408438 10655276 6112534 8442498
44581H442498O672342M534075k68592k938952l696183m346895l910366j466227
44573C021700O36483M98581K86852K097481L451455J425135j728040k183746j162068
44564F343833k185982l818479j820212K329759K337975k603349n323336r72463
44556e712254N845327P531368K917115k932414n260332l349572l2210R29793r39614
44547a002793j254916L192515P768725N355051j557516k442159M762666P960429
44539B2782002j773795j5169385j6600972n682212L918886M638052K215583K394979
44531c276862K376543l98431j115570L965770R078121O604174j274339n904166
44523A0055240m384633j499445r14129j283989j202704j780562k848360j762506
$$ plain form
44581 8442498 15114840 19648915 19380323 16441371 12745188 8398293 4487927 3021700
44573 3021700 3658183 4156764 4443616 6541097 9992552 11417687 9689647 7505901 6343833
44564 6343833 4157851 339372 -1480840 848919 3186894 583545 -4739791 -5712254
44556 -5712254 133073 7664441 10581556 7649142 2388810 -960762 -992972 -63179 -1002793
44547 -1002793 -2257709 934806 8703531 14058582 12501066 10058907 14821573 22782002
44539 22782002 21008207 5838822 -10762150 -16444362 -12525476 -7887424 -5671841 -3276862
44531 -3276862 -900319 -1298750 -2414320 1551450 10629571 17233745 15959406 10055240
44523 10055240 5670607 4171162 3257033 1973044 770340 -1010222 -3858582 -5621088
44515e621088J782742L883018J978278j026983j132604Q62375J206116o77736
44507A254118j523218O31292L786827N097844M292023K978095K237089K109999
44499B0864069K410436K784452K348679K55870l168830o095598o236924k824068
44491A0338086J931926L995075J341831l473420n866429m404018j979346j499058
44483C84647k191440j319774J828951N175447O285062M267889o9623m532071o320821
44474C508267l971707J061170N253206N692548K311872j796944k655812N31288
44466I933888L716244K462887j940575l851631j422101O95113j034113l183653
44458E376059j301339K200263J976945r63496r52503K222076K552923j762871
$$ plain form
44515 -5621088 -3838346 44672 2022950 995967 -136637 725738 1931854 1254118
44507 1254118 -269100 362192 4149019 9246863 13538886 16516981 18754070 20864069
44499 20864069 23274505 26058957 28407636 28663506 25494676 19399078 13162154 10338086
44491 10338086 12270012 16265087 17606918 14133498 8267069 3863051 1883705 384647
44483 384647 -1806793 -3126567 -1297616 3877831 10162893 14430782 14361159 9829088 3508267
44474 3508267 -463440 597730 5850936 11543484 13855356 12058412 9402600 9933888
44466 9933888 13650132 16113019 14172444 10320813 8898712 9593825 8559712 5376059
44458 5376059 4074720 6274983 8251928 7288432 6335929 8558005 11110928 9348057
44450I348057m743309k415943P10872n37539l534253k898879L86800J423827K62877
44441a997490J532151N936193Q294394N014442j062547m713605m070555j169873
44433G763110Q88507M63636j444662k356132j504326o97726q17762P1968K619636
44424D986249L185726p21791m447224j642281N160528O474303l34008o249404
44416F412098l287994M075946N808871N12632m174945l720976k022143l422955
44408A80534n600868l987071N79166L094397J791884J27107J165484L419152L678353
44399D448138J609157l99395n49965J087798L565220N283778M029183p24321n565615
44390A2783978n681277l98239N578638P120817L442984k183911n598863m549797
$$ plain form
44450 9348057 4604748 2188805 2899677 2362138 -1172115 -4070994 -3684194 -2260367 -1997490
44441 -1997490 -465339 5470854 13765248 18779690 17717143 13003538 8932983 7763110
44433 7763110 8651617 9115253 7670591 5314459 3810133 3112407 2294645 2366613 4986249
44424 4986249 8171975 7450184 3002960 1360679 6521207 12995510 12661502 6412098
44416 6412098 3124104 7200050 13008921 13521553 9346608 5625632 3603489 180534
44408 180534 -5420334 -9407405 -8828239 -5733842 -3941958 -3814851 -2649367 769785 4448138
44399 4448138 6057295 5657900 5107935 6195733 9760953 15044731 19073914 18349593 12783978
44390 12783978 7102701 6704462 12283100 19403917 22846901 20662990 15064127 10514330
44382A0514330o33468J363787j286865m606209k214757M998542Q340308K905216
44374A9380884n089385o700934k044453J636870Q93758j109168j553835j503892
44366C909845j906958j364691N98321K036642J762077Q03387k01864j863057l490076
44357B83626k994708m15412J415104P78466r00447j487266K235L913168Q926841
44348I521607J0559298N044692m376711r520825p220541k897536k186340l594222
44340d670578k615719R64364L979475N190454N513565M835289K436313n44980
44332A5088183k204329k488758k318728j492741J58408J191287O86949K57586
44324H877857J272769K036853P95243n48913M21066J592594p69571m920910m879014
$$ plain form
44382 10514330 9880862 11244649 9957784 5351575 3136818 8135360 16475668 19380884
44374 19380884 14291499 7590565 5546112 7182982 8076740 6967572 5413737 3909845
44366 3909845 2002887 638196 1236517 3273159 5035236 5838623 5636759 3773702 283626
44357 283626 -2711082 -3126494 -1711390 -932924 -1833371 -3320637 -3318402 594766 9521607
44348 9521607 20080905 25125597 20748886 11228061 4007520 1109984 -1076356 -4670578
44340 -4670578 -7286297 -6321933 -2342458 2847996 8361561 13196850 15633163 15088183
44332 15088183 12883854 10395096 8076368 6583627 6742035 7933322 8620271 8877857
44324 8877857 10150626 12187479 12982722 12433809 12854875 14447469 13677898 8756988 3877974
44315C877974N41671N200762M270069Q14547L27278K228484J570229k268703l809029
44306A2753282M65943O296705O812443J440208l790042m389453k273553j373403
44298A5942130j747063r28648R76937J348895l49737j684899j357412q83941j319117
44289I997145j487697q34322j004369k692359l520343j240962K970217O292200
44281H479510P270661N421197N42415n207697p298751m074388J92079Q86740m56327
44272E755439O09985L528841L421141n34361l103858j135033J283023p56406m854306
44263D214465m284218J964643O779910M006595l275384o522721k499165L302238
44255C686363M661837K439539J621645L263383L852562J840143j90868n96496
$$ plain form
44315 3877974 4419645 9620407 13890476 14705023 15032301 17260785 18831014 16562311 12753282
44306 12753282 13219225 19515930 26328373 27768581 23978539 19589086 17315533 15942130
44298 15942130 14195067 13266419 14243356 15592251 15242514 13557615 12200203 11316262 9997145
44289 9997145 8509448 7675126 6670757 3978398 458055 -782907 2187310 8479510
44281 8479510 15750171 21171368 21713783 16506086 9207335 5132947 5325026 6211766 5755439
44272 5755439 6365424 9894265 13315406 12781045 9677187 8542154 9825177 9068771 4214465
44263 4214465 -69753 1894890 8674800 12681395 9406011 2883290 384125 3686363
44255 3686363 8348200 10787739 12409384 15672767 19525329 21365472 21174604 20578108
44247B0578108j027724j943968o91008K875931L474304k357310r533807j0198545
44239A175981m081037K133339M315510M287929M256954L514700J641607K93587
44231A7538570J58223l81014k112443l331996k384125M09747L693468N613252
44223A9203682L864591j579732o127080m820300Q97240M692146L894913J932705
44215B1958165J450370M51902k396178l863566j387724J788519J086048k551135
44207A6536401m496248l119520n35706J839298M347508O347465O136697L694414
44199C0750309P54437j739332l943314n399934n424716m669802l933348k189688
44191D204612J478345M820041M684839K084588J273721L355680M658359K650921
$$ plain form
44247 20578108 19550384 17606416 16915408 19791339 23265643 20908333 11374526 1175981
44239 1175981 -2905056 -771717 3543793 7831722 12088676 15603376 17244983 17538570
44231 17538570 17696793 17315779 15203336 11871340 9487215 9896962 13590430 19203682
44223 19203682 23068273 21488541 15361461 10541161 11438401 16130547 20025460 21958165
44215 21958165 23408535 23860437 21464259 17600693 16212969 18001488 19087536 16536401
44207 16536401 12040153 8920633 8384927 10224225 14571733 20919198 27055895 30750309
44199 30750309 31504746 29765414 25822100 20422166 14997450 10327648 6394300 4204612
44191 4204612 5682957 10502998 15187837 17272425 18546146 21901826 26560185 29211106
44183B9211106l96555j713679k288031l728517m043250q22843L280514L167811
44175B2666556j003489l581075j711620Q28312K31749j194825P97162M961017
44167B1993787N835771J461494m233954o700306n011921p78209L668453N354810
44159B1589925K487359k332192l794852p00710J731862j046240n844994n330064
44151F760094K015826R050459Q251949P45029n047881l577731J236816J664644
44143B1099205k774422m290058J434781P532887N210392k837058n950433j352887
44135A8072407K510719J44506k836227m12016L362461J861584k379667k001091
44127A8322676K989130N932505M304587J742976L85248j321995l557835m706159
$$ plain form
44183 29211106 28814551 27100872 24812841 21084324 17041074 16218231 19498745 22666556
44175 22666556 21663067 18081992 16370372 17198684 17430433 16235608 17032770 21993787
44167 21993787 27829558 29291052 25057098 18356792 13344871 12566662 16235115 21589925
44159 21589925 24077284 21745092 17950240 17249530 18981392 17935152 12090158 6760094
44151 6760094 8775920 17826379 26078328 26823357 21775476 18197745 19434561 21099205
44143 21099205 18324783 14034725 15469506 23002393 28212785 25375727 19425294 18072407
44135 18072407 20583126 20727632 17891405 17479389 20841850 22703434 20323767 18322676
44127 18322676 21311806 27244311 31548898 33291874 33677122 32355127 28797292 24091133
44119B4091133n648941p916551q303585k747570M658284M857430k725459q175276
44111a910535n034113J504346L868826K365395J482154J990890K154091K374361
44103H795415L394783L110682p7760l196873k265960J762101M228654K886947
44095A8637989R9622m89582K010078M567604L168412j940522n376710l444416
44087A7232475M69535J377009O74822K332733L665458j162679r056597r846967
44079E685789k077256L688939J144020k767871q70064K489873P29368k727735
44071E295063j159129L157982L447598M34384l4851K046728J738127j158604j930056
44062A1837242P91261L808200M941509L763723o18492o395770p315737j050540
$$ plain form
44119 24091133 18442192 10525641 2222056 -525514 4132770 8990200 6264741 -1910535
44111 -1910535 -6944648 -5440302 -1571476 793919 2276073 4266963 6421054 8795415
44103 8795415 12190198 15300880 15223120 12026247 9760287 11522388 15751042 18637989
44095 18637989 18737611 18248029 20258107 24825711 27994123 26053601 20676891 17232475
44087 17232475 17702010 19079019 19753841 22086574 25752032 24589353 15532756 5685789
44079 5685789 3608533 7297472 8441492 5673621 4803557 7293430 8022798 5295063
44071 5295063 4135934 7293916 10741514 11175898 11141047 13187775 14925902 13767298 11837242
44062 11837242 12628503 16436703 21378212 25141935 24523443 18127673 10811936 9761396
44054I761396M776977K809841k196107j084528M230848M204991j852279m829527
44046A5821612j090605K977828K872336J580463J418282M86764n12454K112349
44038B5666575O098680L948953m201683q501317m330818N05060j116165m546542
44030A3522743k137648M392426P590921M930326k86965m302698m410702L91165
44022A9689568O175293O262662J68282m835922m153776j533791q52629L55566
44014B1275253M203159O528246L806340l40034j754692k649377n312228n375114
44006B0381553P21671P123736O149911J51383k948446k202910k504044l797993
43998B3074861j432272L626741M428217j156603o956483p137640k177804M384288
$$ plain form
44054 9761396 14538373 17348214 15152107 14067579 18298427 22503418 20651139 15821612
44046 15821612 14731007 17708835 20581171 22161634 23579916 24066680 23554226 25666575
44038 25666575 31765255 35714208 31512525 23011208 18680390 19185450 18069285 13522743
44030 13522743 11385095 15777521 23368442 28298768 28011803 23709105 19298403 19689568
44022 19689568 25864861 32127523 32295805 27459883 23306107 21772316 20919687 21275253
44014 21275253 25478412 32006658 35812998 35472964 33718272 31068895 25756667 20381553
44006 20381553 21103224 28226960 34376871 34528254 31579808 29376898 26872854 23074861
43998 23074861 21642589 25269330 29697547 28540944 21584461 14446821 12269017 16653305
43990A6653305R331641R555139M258202j984698l503079j072436j94412k212844
43982C0830818k942256l91035K175462K123517J148840J569954L245931N160694
43974D2921925N999860K931252n259578j3210681j2683423l095798O450025Q028629
43966C2082211L677031P64167K202746M561778L934782P53605j094907R52835
43958D7834248M397774M042796q15033m191971j491323K960880J578506m875392
43950D9440485p868482l681472J409945J094342j853636r06928L795883N810566
43942D7240703J853423l738419m725624k85369M869159O427731M780875L100589
43934E9523068K795212K777716K396399K101760J115438j849282m656611l127460
$$ plain form
43990 16653305 25984946 35540085 39798287 37813589 34310510 33238074 33043662 30830818
43982 30830818 27888562 27497527 29672989 31796506 32945346 34515300 37761231 42921925
43974 42921925 48921785 51853037 46593459 33382778 20699355 17603557 24053582 32082211
43966 32082211 35759242 36523409 38726155 43287933 47222715 47976320 46881413 47834248
43958 47834248 52232022 56274818 55459785 51267814 49776491 52737371 54315877 49440485
43950 49440485 41572003 37890531 39300476 40394818 38541182 37634254 41430137 47240703
43942 47240703 49094126 45355707 40630083 40344714 45213873 51641604 56422479 59523068
43934 59523068 62318280 65095996 67492395 69594155 70709593 68860311 64203700 61076240
43926F1076240J563025K167013m127241r776362p064923M56728L719602J542073
43918D9556155N9Q81656J43043k569627k253684K165096N222317L814569J383013
43909E8342597J020607J412183J736133L388936M568060R16365n440012n746348
43901F0198521K153920Q450594M899773l417476o428025k980521Q39113K332522
43893F6048421L382733M257642L397424J565712O32482J06036p21514p8272K460502
43884H1051166L121916k21087l383183k421589m34560j547480k753963N46250
43876G3957470M934851L865644p64481j707128P15690n75683n609195n487957
43868F9329211K896585J0214358P574713j541735p394689o249235j677947J896597
$$ plain form
43926 61076240 62639265 64806278 60679037 50902675 43837752 44294480 48014082 49556155
43918 49556155 49556214 50437870 50580913 48011286 45757602 47922698 53145015 56959584 58342597
43909 58342597 59363204 60775387 62511520 65900456 70468516 71384881 65944869 60198521
43901 60198521 62352441 70803035 75702808 72285332 65857307 62876786 63715899 66048421
43893 66048421 69431154 73688796 77086220 78651932 79284414 79390450 78668936 78590664 81051166
43884 81051166 84173082 83951995 80568812 78147223 77712663 76165183 73411220 73957470
43876 73957470 78892321 82757965 81993484 80286356 81002046 80426363 74817168 69329211
43868 69329211 72225796 82440154 90014867 88473132 81078443 74829208 73151261 75047858
43860G5047858K546661Q83987k01111J427010L208081J055333k954783k045672
43852G8967364M430149Q486819M955357j431287m499021n055135n364624k481588
43844G8008034N059996R830599M499369n261237p054072M86947O416054M334065
43836I6319755K87917J060199L930181L235506n5749j505267j013426j439537
43828A00819579k791397l294892l648924n003388n020725j519237J772138n24719
43820H0788435n959762n977202J490029P914919O168445P56704M10202M407179
43812H9998949L841269m001709j0147388n946576M795894J0815348P858140K456913
43804I9670840J401628L100696K111578j786314l674115j333447J616982J315911
$$ plain form
43860 75047858 77594519 78478506 78277395 79704405 82912486 83967819 81013036 78967364
43852 78967364 83397513 91884332 96839689 95408402 90909381 85854246 80489622 78008034
43844 78008034 83068030 92898629 97397998 92136761 85082689 85569636 91985690 96319755
43836 96319755 96607672 97667871 101598052 104833558 104777809 103272542 102259116 100819579
43828 100819579 98028182 94733290 91084366 86080978 81060253 79541016 81313154 80788435
43820 80788435 74828673 68851471 70341500 78256419 84424864 85181568 85591770 89998949
43812 89998949 93840218 89838509 79691121 73744545 78540439 89355787 97213927 99670840
43804 99670840 101072468 104173164 106284742 104498428 100824313 99490866 101107848 102423759
43796A02423759j068653j550327J397377N684927Q196572O957683K370993j991731
43788A22420600j778592K608866M904677P44300n165676m256949L978027J0565049
43780A34020302Q773390K188758j523812m33981J863457K838512K839935K226557
43772A52793118J012757N72293K264131N043613P176157Q974401J0857878J0607522
43764A99301870O617242K425861L135435P693273R645035O057804J070532n38828
43756B35408224R56269K670925L655293M921796P227898J0083894J1308308P971503
43748B84204110N65405m679836j906720O086981J0404249P239316J415137j928653
43740C01399989l199530l996218l057280p6908J471226o85830l704310m180155
$$ plain form
43796 102423759 101355106 99804779 101202156 106887083 115083655 122041338 124412331 122420600
43788 122420600 120642008 123250874 128155551 128899851 123734175 119477226 123455253 134020302
43780 134020302 142793692 144982450 143458638 143024657 144888114 147726626 150566561 152793118
43772 152793118 153805875 154378168 156642299 161685912 168862069 177836470 188694348 199301870
43764 199301870 205919112 208344973 211480408 219173681 228818716 234876520 235947052 235408224
43756 235408224 236364493 239035418 242690711 247612507 254840405 264924299 276232607 284204110
43748 284204110 284769515 280089679 278182959 284269940 294674189 301913505 303328642 301399989
43740 301399989 298200459 294204241 291146961 291070053 292541279 291855449 288151139 283970984
43732B83970984l037325k800591l621912m732812n936338n447972j263142K965467
43724B60096359k3113r388678j3927649p367539J274700L97767p495342j1333978
43716B12232527q737435o663211p469850o088005j371523M96884l610663q615855
43708A70172869r391154p058036m514866j990663J95050j28933l205311n904805
43700A38174151n890394l847938j143982J077925J001666j447039k577901k59460
43692A25087028Q51494m129687j0604941r487816j018040N167185L910223l47646
43684A09427800k943700m296128m526370k114934K10707k428242p154484n439723
43676H0734926K610513O851623L063574j214164r30851j215738n011229n737243
$$ plain form
43732 283970984 280933659 278133068 274511156 269778344 263842006 258394034 257130892 260096359
43724 260096359 260073246 250684568 236756919 229389380 230664080 231061847 223566505 212232527
43716 212232527 203495092 196831881 189362031 183274026 181902503 182399387 178788724 170172869
43708 170172869 160781715 153723679 149208813 147218150 147413200 147284267 144078956 138174151
43700 138174151 132283757 128435819 127291837 128369762 129371428 127924389 125346488 125087028
43692 125087028 125938522 121808835 111203894 101716078 100698038 105865223 109775446 109427800
43684 109427800 106484100 102187972 97661602 95546668 95757375 93329133 86174649 80734926
43676 80734926 83345439 90197062 93260636 92046472 91115621 89899883 84888654 79151411
43668G9151411j31562L738574M63882k397375J729317N778094K224130k355951
43660H8200520K59243L457337k115883q997328l874425Q127570R821201m42287
43652I4435948p275843l953727j78778j977116k490088K267448N146740J854248
43644H7828832j070833J149886L650230K688005K129294L416484J361485m081754
43636I7071629m553615J526019L696272k602135o311450Q26456Q974433N904072
43628A04531681k890408l912722K899109P098181N971177N223973N412533J861867
43620A26195391l758108m627706q19863J193031M08742J869420N766310O544526
43612A32771743L193970N91096J59770j292806l038461n56569M717906N530104
$$ plain form
43668 79151411 79019849 82758423 83222305 80824930 82554247 88332341 90556471 88200520
43660 88200520 88459763 91917100 89801217 80803889 76929464 85057034 94878235 94435948
43652 94435948 87160105 83206378 83027600 81050484 78560396 80827844 85974584 87828832
43644 87828832 86757999 87907885 91558115 94246120 96375414 99791898 101153383 97071629
43636 97071629 92518014 94044033 97740305 95138170 88826720 89653176 98627609 104531681
43628 104531681 101641273 97728551 100627660 107725841 113697018 118920991 124333524 126195391
43620 126195391 122437283 117809577 116989714 118182745 118591487 120460907 126227217 132771743
43612 132771743 135965713 136556809 136716579 135423773 132385312 131828743 136546649 142076753
43604A42076753O24839k810586r21690J519194N59678p30189Q27259L044788L523348
43595A47713394L261812J908640l097249r135363q408384k70933M610921r43660
43587A35639178q934605p482064J792629P054479L663539j338115j498708J084012
43579A29980345J700749m8309k168345m207128o103131o311793m087112j721040
43571A07034236j868432l619296l617535j000417J002220m69372l459872l596632
43563I0404900n74553Q77333k287539o899413q243691o353496m073943j567280
43555F1282318K281372M899379K670676j952649k601600J078573K523331j015657
43547F9165743m117667k801126j229507l838448p232593o308129l173277k736458
$$ plain form
43604 142076753 142701592 139891006 138969316 140488510 141048188 140317999 141145258 144190046 147713394
43595 147713394 150975206 152883846 149786597 140651234 132242850 131971917 136582838 135639178
43587 135639178 126704573 119222509 121015138 128069617 131733156 130395041 128896333 129980345
43579 129980345 131681094 131632785 129464440 125257312 119154181 112842388 108755276 107034236
43571 107034236 105165804 101546508 97928973 96928556 97930776 97461404 94001532 90404900
43563 90404900 89830347 90707680 88420141 81520728 73277037 66923541 62849598 61282318
43555 61282318 63563690 68463069 71133745 69181096 66579496 67658069 70181400 69165743
43547 69165743 65048076 62246950 61017443 57178995 49946402 43638273 40464996 37728538
43539C7728538l593046j264829K523117K398683n98378n79865K060579Q56351
43531C9531150l983574l361213N777567J2713179P477053l921334p881108k558804
43523D3792916J287172k288185o465604l821620K165202L407806n01041l017085
43515C4559561j124045J395947Q54843j801718m375813o455162p053576l626796
43507A2373241L203240P255030L448485m788039q943884n569747Q61302M863427
43499A2703055N475878M323537K401720O23481K35731N14766j270408n390260
43491A9617500p624496m331090K291500O729972O709064M614044L141566K167900
43483C3315960J85393k901814n208549m909125k798904k002677l845380n085047
$$ plain form
43539 37728538 34135492 32870663 35393780 37792463 37194085 36614220 38674799 39531150
43531 39531150 35547576 32186363 37963930 50677109 58154162 54232828 46351720 43792916
43523 43792916 45080088 42791903 36326299 32504679 34669881 38077687 37576646 34559561
43515 34559561 33435516 34831463 35686306 33884588 29508775 23053613 16000037 12373241
43507 12373241 15576481 22831511 26279996 21491957 12548073 6978326 7839628 12703055
43499 12703055 18178933 22502470 24904190 25527671 25763402 26278168 25007760 19617500
43491 19617500 11993004 7661914 9953414 16683386 23392450 28006494 31148060 33315960
43483 33315960 33501353 30599539 25390990 20481865 17682961 15680284 11834904 6749857
43475F749857k050959L026588L972460l47594l862350k349725L61533q47308l915754
43466G36748l350969P72069L829904M768280O465598Q494008O459182j55275n578201
43457B2441344n499684k246639K66796K067216M351038N183506K170803k755505
43449B5978875m961008k649663J576822L794483J857279l139882p061695o118819
43441I276392j536140J100157j209535m775254m191772O49483N142526N971818
43433A0427675L734847O62222j453768j589660k64946K41161j530718l830699
43425F396114l777308j185891J675036L280097L402461J500816k136760m129413
43417E025152j100660M159093M189291k970873r233493o319347K725407P461627
$$ plain form
43475 6749857 4698898 7725486 11697946 11350352 7488002 5138277 5499810 4652502 736748
43466 736748 -2614221 -1842152 1987752 6756032 13221630 21715638 28174820 28019545 22441344
43457 22441344 16941660 14695021 14961817 17029033 21380071 26563577 28734380 25978875
43449 25978875 21017867 18368204 19945026 23739509 25596788 22456906 15395211 9276392
43441 9276392 7740252 8840409 7630874 2855620 -1336152 -686669 4455857 10427675
43433 10427675 14162522 14824744 13370976 11781316 11516370 11757531 10226813 6396114
43425 6396114 2618806 1432915 3107951 6388048 9790509 11291325 9154565 5025152
43417 5025152 3924492 8083585 12272876 9302003 68510 -6250837 -3525430 3936197
43409C936197M350647M07967J151079K038685k879221r054896o537712M213419
43401b373835J0526450M425082n976799p591947J60156O295764M378090l92282
43393I450679j064888J397621J912968m60575k833855m010294m770278m114472
43385d493094j89187M879893N632097N15423m925223m790782m59337J918298M02318
43376a509594m89695K639147O359246N224150m93365n739873p638726p020152
43368h668862m050123J921639P607992P335799J838328r02678K384623M160360
43360A1627078j681724p792177l245714Q349873J2349271M452746l474586k083794
43352A8500973K455262O08062m998674n531502j140646K58209l328185n448113
$$ plain form
43409 3936197 8286844 8694811 9845890 11884575 9005354 -49542 -6587254 -2373835
43401 -2373835 8152615 12577697 6600898 -991049 -830893 5464871 9842961 9450679
43393 9450679 8385791 9783412 11696380 11235805 8401950 4391656 -378622 -4493094
43385 -4493094 -4682281 197612 5829709 6345132 1419909 -3370873 -3830210 -1911912 -1509594
43376 -1509594 -1999289 639858 6999104 12223254 11729889 5990016 -1648710 -8668862
43368 -8668862 -12718985 -10797346 -3189354 4146445 5984773 5082095 7466718 11627078
43360 11627078 9945354 2153177 -1092537 7257336 19606607 24059353 20584767 18500973
43352 18500973 20956235 21564297 16565623 11034121 9893475 10151684 6823499 1375386
43344A375386k530542P84588j36869k949050k978692l43467J463184J534966K134196
43335a646300L853884L759794P7971l396854j163630N415606P789233J519889
43327A6209593o168104n795794M25600K162678k514429m316845J318293O228137
43319G549129L212993k093694j561151J427974r61631n951614m542104K131703
43311g88395L710351k297303o498025k777021L332524M944314L163512J897480
43303D687437J222187L16048L27322N28395j917652n084949k515809N610140R336981
43294A2510100K682277o502325p296355n27785M596916M005994J162993n86165
43286A0045650m62025K394385O790809P022299k5135p345392n640994K395154
$$ plain form
43344 1375386 -1155156 -370568 -507437 -3456487 -6435179 -6778646 -5315462 -3780496 -1646300
43335 -1646300 2207584 5967378 6045349 2648495 1484865 6900471 14689704 16209593
43327 16209593 10041489 4245695 4671295 6833973 4319544 2699 1320992 7549129
43319 7549129 10762122 8668428 7107277 8535251 7573620 1622006 -2920098 -788395
43311 -788395 2921956 624653 -5873372 -8650393 -5317869 -373555 2789957 4687437
43303 4687437 5909624 6225672 6552994 7081389 5163737 78788 -2437021 3173119 12510100
43294 12510100 15192377 8690052 1393697 865912 5462828 9468822 10631815 10045650
43286 10045650 9583625 11978010 18768819 25791118 25765983 18420591 12779597 15174751
43278A5174751M816513j755814o693338j383908P901380R516420K788705k961343
43270B7403366k785548j299945l172254n678238m166910j60003J027442j239483
43262I928427k085536R42840M045041L479239J514002K199053M169331K738441
43254B6930838k169715n553018m777971k346632n65182J295658L071461K262739
43246A8148178j082188l015155k110764k256352n362626o367493p46082O972392
43238D179910Q433110L011030j908806j331327K128874L522755J437423k219637
43230A7253332m925037n143169l306732j396932l66870R02948K806042L392983
43222I216565J708357L11747J579829L619644L027878k2629k461697k519926o91955
$$ plain form
43278 15174751 19991264 18235450 11542112 10158204 18059584 27576004 30364709 27403366
43270 27403366 24617818 23317873 20145619 14467381 10300471 10140468 11167910 9928427
43262 9928427 7842891 8785731 12830772 16310011 17824013 20023066 24192397 26930838
43254 26930838 24761123 19208105 14430134 12083502 11518320 12813978 15885439 18148178
43246 18148178 17065990 14050835 11940071 9683719 4321093 -2046400 -2792482 4179910
43238 4179910 12613020 15624050 13715244 12383917 14512791 18035546 19472969 17253332
43230 17253332 12328295 7185126 3878394 2481462 2114592 3017540 5823582 9216565
43222 9216565 10924922 11236669 12816498 16436142 19464020 19441391 16979694 14459768 13767813
43213A3767813J690896K739012J289264k94932J861062O405229O997848K128284
43205C6584476j531125K7293J133113l069176o534531k290261L641394K69892
43197B8231075j0026104j4087378p711701j2104K402784K842519M060319K900730
43189H600140p27855j010448K877251L557881j826031n972384m043860j620822
43181a66128l581036n203966j953677J607391J287398K278633Q764976J3120751
43173A6154342P000227l652625o814938k310499P21120k2863P18359L026998J464696
43164A6284817l182591m004306k03673J932707P59745Q46931K163557n19245n691984
43155H385958m880835K264169M965625j349850o568049k013954N703343O206475
$$ plain form
43213 13767813 15458709 18197721 19486985 19192053 21053115 27458344 34456192 36584476
43205 36584476 35053351 35080644 36213757 33144581 26610050 24319789 27961183 28231075
43197 28231075 18204971 4117593 -3594108 -3606212 -1203428 1639091 5699410 8600140
43189 8600140 7872285 6861837 9739088 13296969 11470938 5498554 1454694 -166128
43181 -166128 -3747164 -8951130 -10904807 -9297416 -8010018 -5731385 3033591 16154342
43173 16154342 23154569 19501944 12687006 10376507 11097627 11074764 11793123 14820121 16284817
43164 16284817 13102226 9097920 8894247 10826954 11586699 12433630 14597187 14077942 8385958
43155 8385958 3505123 5769292 10734917 9385067 2817018 803064 6506407 12712882
43147A2712882J691268R01115L468426K282517k230653k346032L037186N741407
43139B5258116J510284l297177j810085L548421N793558L069297r20543l110995
43131C0040876l481405k833307j734779j196957j751086k005434l48430J890455
43123A8579933J419795j981301l807510m79918M869591N715393J288917j565751
43115B4039149K294721Q702500R733746M655233L03486R25320L090820K495917
43107E6240892R09912K374734N480343M646275j041619m974285j289782O870395
43099F9216865J0935259P951504M048696N511182J0215016J1594983Q493952N649147
43091A33616604N176700M013245J098919K61612K488950J900269m994521j1615034
$$ plain form
43147 12712882 14404150 15305265 18773691 21056208 18825555 16479523 19516709 25258116
43139 25258116 26768400 23471223 21661138 25209559 31003117 34072414 33151871 30040876
43131 30040876 26559471 23726164 21991385 20794428 19043342 17037908 16689478 18579933
43123 18579933 19999728 18018427 14210917 13730999 18600590 24315983 25604900 24039149
43115 24039149 26333870 35036370 44770116 49425349 49728835 50654155 53744975 56240892
43107 56240892 57150804 59525538 65005881 69652156 68610537 63636252 62346470 69216865
43099 69216865 80152124 88103628 92152324 97663506 107878522 119473505 127967457 133616604
43091 133616604 138793304 142806549 143905468 144167080 146656030 148556299 143561778 131946744
43083A31946744j0194659m189429l233445q151553j0527760o921604l704185n523145
43075G9500964p851726n304492m72322N90285l028580p418920r343763q121932
43067C8549514m983603k645793k443223j293382L788052Q079119L361196q433626
43059C3978254j4426165q082828J034756J256997n046638p581600m070482j52730
43051c090436K388841O423989J0188544P862631J71446m770693l063415L25533
43043A6436440N89499n01895n490Q28268M7258j228433j669932k021436j978024
43034A0496255O02349M557596M322384k129519q279551o686555J042213O609766
43026A0534938N823456K327719P05556L45097j766823m706904l475609M046555
$$ plain form
43083 131946744 121752085 117562656 114329211 106177658 95649898 88728294 85024109 79500964
43075 79500964 71649238 66344746 65872424 66462709 63434129 56015209 46671446 38549514
43067 38549514 33565911 30920118 28476895 27183513 30971565 39050684 42411880 33978254
43059 33978254 19552089 11469261 12504017 13761014 8714376 1132776 -2937706 -3090436
43051 -3090436 -701595 5722394 15910938 23773569 23945015 19174322 16110907 16436440
43043 16436440 17025939 16524044 16518554 17346822 17394080 16165647 14495715 12474279 10496255
43034 10496255 11098604 15656200 19978584 17849065 9569514 2882959 3925172 10534938
43026 10534938 16358394 18686113 19391669 19736766 17969943 13263039 9787430 13833985
43018A3833985J2205795J2599656M257295m357656n486990j326052K73187k914935
43010B9084285n410683k834519K161088M121202J391563l061150m992950k185401
43002A8273435L450009O902842N384004J891658O17052M29082k357274n924240
42994B8666568m246085K806254P553243N196592R0466k042139k007963k768278
42986C3248658k905011k95821K161424Q32234k066361k550184k493296n968256
42978A9963387j0036316p352021J919566Q405829N598650k430662p568601o803278
42970A696554k573630J494972K724110Q86542m84104K267107O733834O287928
42962A9033313j82287n459860l874714J027339K827630J598806J398714J997697
$$ plain form
43018 13833985 26039780 38639436 42896731 38539075 33052085 31726033 31999220 29084285
43010 29084285 23673602 20839083 23000171 27121373 28512936 25451786 20458836 18273435
43002 18273435 21723444 28626286 34010290 35901948 36519000 36948082 34590808 28666568
42994 28666568 24420483 27226737 34779980 39976572 40067038 38024899 36016936 33248658
42986 33248658 30343647 30047826 32209250 33041484 30975123 28424939 25931643 19963387
42978 19963387 9927071 2575050 4494616 12900445 18499095 16068433 8499832 1696554
42970 1696554 -877076 617896 3342006 4228548 3744444 6011551 12745385 19033313
42962 19033313 18851026 13391166 9516452 10543791 13371421 14970227 16368941 18366638
42954A8366638j31685m214265n426225k805928o61526j069308r10538J569870
42946D717033K890671M56577k018467L76930O212403R675585Q137437L758956
42938C4207125q30241m267426m982715k437431M14262L4110k340833k435734r1374
42929A7269743L44182k176359k815367J144690M951684L418993q57591j801515
42921A9478460M42142L26402l660163o586833m750822m92731K170100K536869
42913I463424K166757K196032L089601M115890K471409l340659q666853o280735
42905E214866L086257Q987085L867342o767074j1487594p012261J84146M034227
42897A06994M488857L441364J168917j489071j955776N39158L010798K520737
$$ plain form
42954 18366638 18234953 14020688 8594463 5788535 5127009 4057701 3147163 4717033
42946 4717033 7607704 8064281 6045814 6422744 12635147 22310732 30448169 34207125
42938 34207125 33376884 29109458 24126743 21689312 22103574 22137684 19796851 17361117 17269743
42929 17269743 17613925 15437566 12622199 13766889 18718573 22137566 21279975 19478460
42921 19478460 19920602 20247004 16586841 10000008 5249186 4756455 6926555 9463424
42913 9463424 11630181 13826213 16915814 21031704 23503113 20162454 11495601 5214866
42905 5214866 8301123 17288208 21155550 14388476 2900882 -4111379 -3927233 106994
42897 106994 4595851 8037215 9206132 7717061 5761285 6300443 9311241 11831978
42889A1831978J36778o97791J359973M045048L975948J87100m402934n388437
42881A1047663j684756K582599K344387k612615p421624p295463j753201N398096
42873F05086Q767554N235855k678049q052933o407930p22551K381369L93586l521327
42864c999340n264463k994093K931951R209693R965477K802212n873154o936373
42856a58090l80071M642490K729933j134037m81056L201508M081164L71472n045238
42847G828075q568432p101571K04284P969171P750779m01130n593481j012253
42839A075442N459166L484973l314471l951542J635719L764130L96668o23355
42831G926730K623731K506438k570231l277034L643113P059811o87472r555917
$$ plain form
42889 11831978 11968756 11270965 12630938 16675986 20651934 20839034 16436100 11047663
42881 11047663 9362907 11945506 14289893 11677278 4255654 -3039809 -4793010 605086
42873 605086 9372640 14608495 11930446 3877513 -2530417 -3252968 -871599 -478013 -3999340
42864 -3999340 -9263803 -12257896 -9325945 -116252 9849225 12651437 6778283 -158090
42856 -158090 -538161 4104329 6834262 5700225 5219169 8420677 12501841 12873313 7828075
42847 7828075 -740357 -7841928 -7637644 331527 8082306 7681176 2087695 1075442
42839 1075442 6534608 10019581 6705110 2753568 4389287 8153417 8550085 7926730
42831 7926730 10550461 13056899 10486668 7209634 10852747 17912558 17225086 7669169
42823G669169p035201K021038M147737j159155l090041J303158M260366K551951
42815A0669022J698210L711968L098652k066238n844121m634717k229453j379047
42807C024276N69533L956661L672095j744791n900165m107797K46083L167557
42799B883452N966781Q873779P122564l22652n876644m217345q67295k322699
42791A1239941m828029k059006K409209R44184m366868m942331p4320K874785
42783A197565J456761P41555K784053L358636N04633k293370k933704k938516
42775A877613j814770K858635Q304640P608904K57075n649889m216502J690321
42767A0916027O548263Q053860N151782k336643r508526r061902j357746M799938
$$ plain form
42823 7669169 633968 2655006 6802743 5643588 2553547 3856705 8117071 10669022
42815 10669022 12367232 16079200 19177852 17111614 11267493 6632776 4403323 3024276
42807 3024276 3593809 7550470 11222565 9477774 3577609 -530188 -284105 2883452
42799 2883452 8850233 17724012 24846576 24523924 18647280 14429935 13562640 11239941
42791 11239941 6411912 4352906 6762115 7706299 3339431 -1602900 -1677220 1197565
42783 1197565 2654326 3395881 6179934 9538570 10043203 7749833 4816129 1877613
42775 1877613 62843 2921478 11226118 18835022 19092097 13442208 9225706 10916027
42767 10916027 17464290 25518150 30669932 28333289 18824763 9762861 8405115 13205053
42759A3205053M227184J291109R86822J753408J033239N38965J460942J294207
42751B5790929k83789M07428K721258j16533q947536j3754363q233088p05787
42743c121481j196940n314217k302191O497529R811862M424501r95059J19169
42735G923173M573332O667010M948718Q64613k905559k964055M91394J853939
42727B1452565j722209m270013m79710L899630J253885l185226R13075R423263
42719B7285260P766904m806544j1455255k924665Q760852R273915J334936m265106
42711C0970297n656533o952771o956298k307920L675257N488629M574440N278031
42703B8113132N913979K336893l447012o403958o437286n337497l05063J0132912
$$ plain form
42759 13205053 17432237 18723346 19710168 21463576 22496815 23035780 24496722 25790929
42751 25790929 25507140 25914568 28635826 28519293 19571757 5817394 -2415694 -3121481
42743 -3121481 -4318421 -9632638 -11934829 -5437300 4374562 8799063 7804004 7923173
42735 7923173 12496505 19163515 24112233 24976846 22071287 19107232 19598626 21452565
42727 21452565 19730356 15460343 14980633 18880263 20134148 16948922 17861997 27285260
42719 27285260 35052164 30245620 18790365 15865700 24626552 33900467 35235403 30970297
42711 30970297 25313764 18360993 11404695 9096775 12772032 18260661 22835101 28113132
42703 28113132 34027111 36364004 32916992 26513034 20075748 14738251 14433188 24566100
42695B4566100J7620781J2338266j647547r976122o929636q66890P7656k211662
42687C2970946k920549k307736k481688k745983k061315j270856l48570J716101
42679B0550350K685362j347655q051546r186697k287864M456779L708684o01711
42671I925702m75714L432295L981907j83633k774402l97647K422138J075691k055603
42662A4950734k057230Q29723K281015P52632q50539j8935K262937L727297L343727
42653B5221361R02443l145141o181182m692755P20186M254290J894877k721403
42645A6252676l208703O86418L757009L521096K060460J61883l658861p257541
42637A2314437n251358J800701N480597J017133n496735o390752k940928n98667
$$ plain form
42695 24566100 42186881 54525147 52877600 42901478 35971842 35104952 35182608 32970946
42687 32970946 30050397 27742661 25260973 22514990 20453675 19182819 18834249 20550350
42679 20550350 23235712 21888057 13836511 4649814 2361950 6818729 10527413 9925702
42671 9925702 9449988 12882283 16864190 16680557 13906155 13508508 15930646 17006337 14950734
42662 14950734 12893504 13723227 16004242 16756874 15906335 15887400 18150337 21877634 25221361
42653 25221361 26123804 22978663 16797481 12104726 12824912 17079202 18974079 16252676
42645 16252676 13043973 13730391 17487400 21008496 23068956 23230839 19571978 12314437
42637 12314437 7063079 8863780 14344377 15361510 9864775 3474023 533095 -65572
42629f5572N56792L096253M656754J614304k876026l149207q30192j390616l057310
42620a444820N97333P659832Q574648J413443m268307k153371K221069K241607
42612A4841434M45512J759987M051780K496763j946955m806996m697919k520984
42604I622622J579769N648886N030528q11517n240265l514654o8845q87681l625583
42595G733260k383856J904020L690013K282947J201567N09194k118785m476732
42587H341628k360304J954376K218019j113615j451345K146828L032577j074489
42579A1693675l383494O58960N495151M377935m38735k677388k038633k363881
42571A1323590l274700q81633M262169O215369J514767o097637r959319p298167
$$ plain form
42629 -65572 491220 3587473 8244227 9858531 6982505 3833298 3003106 1612490 -1444820
42620 -1444820 -847487 6812345 15386993 16800436 12532129 10378758 12599827 14841434
42612 14841434 15286946 17046933 21098713 23595476 21648521 16841525 12143606 9622622
42604 9622622 11202391 16851277 21881805 21070288 15830023 12315369 12246524 11358843 7733260
42595 7733260 5349404 7253424 10943437 13226384 14427951 14937145 12818360 8341628
42587 8341628 5981324 7935700 10153719 9040104 7588759 9735587 12768164 11693675
42579 11693675 8310181 8969141 14464292 18842227 18403492 15726104 13687471 11323590
42571 11323590 8048890 7167257 11429426 17644795 19159562 13061925 3102606 -4195561
42563d195561j396234J791887l10018l552533j581159N351515R302107M918929
42555A0328933k546049l906328J474630N413526K722404k520172m109221k022129
42547D835594l70979p33837j589690k233344k977110k437874R59961M610136L411978
42538C474835k488437n837745j449779N835155O818159J00149o242232n194081
42530d983976J545050P571601R207073O808125K288601j753585k982406k142079
42522A5558404k820817o035207p608898l906142K309584N360772M023140J562086
42514H442922J10166o96190n96967J207114L160972K723066N50946n38310m78863
42505A3884856j677988m065459m950293l902534k987954j797969K400050Q394647
$$ plain form
42563 -4195561 -5591795 -3799908 -4109926 -7662459 -9243618 -3892103 5410004 10328933
42555 10328933 7782884 3876556 5351186 10764712 13487116 10966944 6857723 4835594
42547 4835594 4464615 3730778 2141088 -92256 -3069366 -5507240 -4547279 62857 3474835
42538 3474835 986398 -4851347 -6301126 -465971 6352188 6452337 210105 -4983976
42530 -4983976 -3438926 4132675 13339748 20147873 22436474 20682889 17700483 15558404
42522 15558404 12737587 6702380 -906518 -4812660 -2503076 2857696 6880836 8442922
42514 8442922 8553088 7856898 7259931 8467045 11628017 14351083 14902029 14363719 13884856
42505 13884856 12206868 8141409 3191116 -711418 -3699372 -5497341 -3097291 5297356
42497E297356J0439129O195048M66114j574284o50102m00483k127080m837291
42489A2808407o710679m902836J478986O895672M172127l999993o213618Q04597
42481D332663N453832j234959r943566o081973P404227J3735634O699865k649454
42473A7716269n004355m745020p866834j0068408n285237K332572M383077J128135
42465g409801k65140K559318N119632M383738K073656o8374k336297l869240k343821
42456b156329K119945O326652P807857O314059J982172m145764p895219m912897
42448E440476K701602O738735K356813n557026q204647l265042L249034M752879
42440H212824J272076j578870M07066M938292N711673K75943n959135n743936
$$ plain form
42497 5297356 15736485 21931533 22397647 20823363 20173261 19772778 17645698 12808407
42489 12808407 6097728 1194892 2673878 9569550 13741677 9741684 3528066 4332663
42481 4332663 9786495 8551536 -1392030 -7474003 -69776 13665858 20365723 17716269
42473 17716269 12711914 7966894 100060 -9968348 -15253585 -12921013 -8537936 -7409801
42465 -7409801 -7674941 -5115623 4009 4387747 6461403 6393029 4056732 187492 -2156329
42456 -2156329 -36384 6290268 14098125 20412184 22394356 18248592 10353373 5440476
42448 5440476 8142078 14880813 17237626 11680600 3475953 210911 3459945 8212824
42440 8212824 9484900 7906030 8313096 13251388 18963061 19239004 13279869 7535933
42432G535933N75701N096896K829689j796727j946536J478183J913064k063181
42424A3623022m392321j260340L007248L308027J751090K787748M256369O74132
42416B3754975o028138p359859j204900L954112J347726m441898n536484k661269
42408A824265j760412k613510N37528P974304J2435364R448956K890629k018429
42400B8718695n235148q339289r673769p148928k453218J263918L448136M956716
42392E537113N343978M198227K820142J787488p42294n355732q494467o823899
42384a729444k634421j044541k826826l632168r4326O198872J0780732J0228719
42376A5246597M482339k751763o415512m655602m94156J971575J633314j88378
$$ plain form
42432 7535933 8111634 13208530 16038219 14241492 12294956 13773139 15686203 13623022
42424 13623022 9230701 7970361 10977609 14285636 16036726 18824474 23080843 23754975
42416 23754975 17726837 10366978 9162078 13116190 14463916 10022018 4485534 1824265
42408 1824265 63853 -2549657 -2012129 5962175 18397539 27846495 30737124 28718695
42400 28718695 23483547 15144258 5470489 -1678439 -4131657 -2867739 580397 5537113
42392 5537113 10881091 15079318 17899460 19686948 18944654 13588922 5094455 -1729444
42384 -1729444 -4363865 -5408406 -8235232 -11867400 -11961726 -5762854 5017878 15246597
42376 15246597 19728936 16977173 10561661 5906059 5411903 7383478 9016792 8828414
42368H828414j929286k013743J44931J652495j521032p236150p263169R17990
42360h419550P771712M123528m458233m959693L661513R156236M770728j734022
42352I912219j681670J908119J756868j466291k327240p54946q18668k466930
42344D061461k068716M50710J782766J587613K377036L489590J452961l045379
42336A0088042m417948j81663N027566N765900K571524J3805L64337J486347k3216
42327B0694694m710240q763570p160187J83131O424558M686170l431049r224344
42319a300837o943823M89739O196759O584268K900914j375688k940377o38630
42311B972325L169678M511465K025937j945207m593985m911363k708414J547925
$$ plain form
42368 8828414 6899128 4885385 5030316 6682811 5161779 -2074371 -9337540 -8419550
42360 -8419550 -647838 3475690 -982543 -5942236 -2280723 6875513 11646241 9912219
42352 9912219 8230549 10138668 11895536 10429245 8102005 7347059 6528391 4061461
42344 4061461 1992745 2443455 4226221 5813834 8190870 11680460 13133421 10088042
42336 10088042 5670094 5488431 10515997 16281897 18853421 18867226 19231563 20717910 20694694
42327 20694694 15984454 7220884 60697 243828 6668386 11354556 7923507 -1300837
42319 -1300837 -8244660 -7754921 -1558162 5026106 7927020 6551332 3610955 2972325
42311 2972325 6142003 10653468 12679405 10734198 6140213 1228850 -1479564 68361
42303F8361N061979M256450j66353k771337m07269L103340K312259k094836m452434
42294D910160j652136L888955P794158O974353N05409q589268j2963433p363041
42286f494843L488011Q179013K169822o127694o253929R02093N464790K280009
42278C607272l503096m832363j434598K109777L075345K161008N87354j087831
42270F82868k091056j996569j910685l020295m051011k149159L146743Q080880
42262c308284P747464J147269o698954q459284k070356N530736N231247k607237
42254c487399p208440j278545P961370P501929l451878j1571364o870573M742704
42246a3662196J0272894N924043p56604k259748J005306L952882L497787N46141
$$ plain form
42303 68361 5130340 9386790 9220437 6449100 6041831 9145171 11457430 9362594 4910160
42294 4910160 3258024 7146979 14941137 21915490 22420899 13831631 868198 -6494843
42286 -6494843 -3006832 5172181 7342003 1214309 -5039620 -4137527 1327263 3607272
42278 3607272 104176 -4728187 -6162785 -4053008 -977663 1183345 1770699 682868
42270 682868 -1408188 -3404757 -5315442 -8335737 -12386748 -14535907 -11389164 -3308284
42262 -3308284 4439180 5586449 -1112505 -9571789 -11642145 -6111409 -880162 -3487399
42254 -3487399 -10695839 -11974384 -4013014 3488915 37037 -11534327 -18404900 -13662196
42246 -13662196 -3389302 2534741 1778137 -481611 523695 4476577 7974364 8520505
42238H520505k487601m514732n982350o452885l483056L693723J0091706Q721688
42230H106998k41801p954737p058171j10315M896134M343579R44629j564622j963154
42221f01460j255899j629373m181321o047640k841503M067858P158458K956575
42213b374305k348021k216336N26219k37392k938951j755284K386242L635033
42205e322795K213840L634204P198083N563153k466532q227050n517122J208717
42197a715502M289421J854960l215175p005114n482021J638708P023761L457922
42189H46960m159269m226473L403790O840871K325457O76715P535722J2007026
42181B5250799M971007m704756m955383j4034n69894m136659j641177L686347
$$ plain form
42238 8520505 6032904 1518172 -4464178 -10917063 -14400119 -10706396 -614690 8106998
42230 8106998 7865197 -89540 -7147711 -7258026 -2361892 1981687 2926316 1361694 -601460
42221 -601460 -1857359 -3486732 -7668053 -13715693 -16557196 -12489338 -5330880 -2374305
42213 -2374305 -4722326 -6938662 -6412443 -6649835 -9588786 -11344070 -8957828 -5322795
42205 -5322795 -3108955 525249 7723332 13286485 10819953 2592903 -2924219 -1715502
42197 -1715502 2573919 4428879 1213704 -5791410 -11273431 -9634723 -2610962 846960
42189 846960 -3312309 -7538782 -4134992 2705879 5031336 5708051 13243773 25250799
42181 25250799 30221806 25517050 20561667 20547633 19977739 15841080 14199903 17886250
42173A7886250J623891n436044o023260l05325O04340m536952n077687J215799
42165d8988L905149k78814j079265N576389Q383916j1231r452106q588114k042067
42156c635131P4173j221312J20550J607201k230046p293461n664771N64293K901518
42147a4776986O37323M37317L871732N568769K979400o97566k853581l569702
42139h403294k449055L03114J542697l2529Q9219M632154P094555P58177q392489
42130d857451q537804k35533L930318j238128o228764k554912M651924N945788
42122i124562J712071k84492L003551O963919O589115J705382m476325q662169
42114b573510r091970n657140N62172P150638J0077736O447497p82824m265172
$$ plain form
42173 17886250 19510141 14074097 8050837 7745512 8349852 3812900 -1264787 -48988
42165 -48988 3856161 3577347 2498082 8074471 16458387 16447156 6995050 -1593064 -3635131
42156 -3635131 -3560958 -4782270 -4661720 -3054519 -5284565 -12578026 -18242797 -17678504 -14776986
42147 -14776986 -14139663 -13702346 -9830614 -4261845 -1282445 -1980011 -4833592 -8403294
42139 -8403294 -10852349 -10549235 -9006538 -9039067 -8949848 -4317694 2776861 3535038 -4857451
42130 -4857451 -13395255 -13630788 -9700470 -10938598 -17167362 -19722274 -15070350 -9124562
42122 -9124562 -7412491 -7696983 -4693432 2270487 8859602 10564984 6088659 -2573510
42114 -2573510 -11665480 -17322620 -16760448 -9609810 467926 6915423 6132599 1867427
42106A867427j595651O58223k985767p031602k562472P973119J2637521O489919
42098A5450717k880841p677877q600845q138509m160263M167832J0886971J0079592
42090I126777L760394k231194n928812p890013o740507k034187K000796J714152
42082h222594K35786K362795N890144M947742K93892j420204J318736K374181
42074G780478j608487n424528l649547J159421L521875L655285M929133N778076
42066A6141706J577426n872183q396494l265331J905670N50905k505433Q70910
42058A007176P792340P619098r93517o683659k390377L707524J027002o954128
42050D131459q314040p27981O094459N181875L28588k041735j281480q4613L02828
$$ plain form
42106 1867427 271776 929999 -2055768 -9087370 -11649842 -3676723 8960798 15450717
42098 15450717 12569876 4891999 -3708846 -11847355 -16007618 -11839786 -952815 9126777
42090 9126777 12887171 10655977 4727165 -3162848 -9903355 -11937542 -9936746 -8222594
42082 -8222594 -7986808 -5624013 266131 5213873 5507765 4087561 5406297 7780478
42074 7780478 6171991 747463 -2902084 -1742663 1779212 5434497 10363630 16141706
42066 16141706 17719132 11846949 3450455 185124 2090794 2641699 136266 1007176
42058 1007176 8799516 16418614 15425097 8741438 6351061 10058585 11085587 4131459
42050 4131459 -4182581 -4910562 1183897 6365772 6694360 4652625 3371145 3286532 3589360
42041C589360n28044k890031m747393k976505J200213K524353n35601l100620
42033g464268j541697J010239L65907j761001r49763K658261M807728L360349
42025D85755L02271j788961k336414j931745q67962J078854L634358M724543J722489
42016E023188m055024o065391K22192R778443J2685432O441931j664781n138741
42008A7227249n337451o153713p545797p465692n437946j301186N035953R999072
42000i79511P864256o12277o314786k899448M697760P446490L834122n68867j807035
41991A0660704r14853p00941k711450n579790m982758J105287O573940L102383
41983F552522o319390q450176J350307J0689938P532138k827832p355141m150661
$$ plain form
42041 3589360 3061316 171285 -4576108 -7552613 -6352400 -3828047 -4363648 -7464268
42033 -7464268 -9005965 -7995726 -7629819 -9390820 -10340583 -7682322 -2874594 485755
42025 485755 788026 -1000935 -3337349 -5269094 -6137056 -5058202 -1423844 3300699 5023188
42016 5023188 968164 -5097227 -4875035 4903408 17588840 24030771 22365990 17227249
42008 17227249 11889798 5736085 -1809712 -9275404 -14713350 -16014536 -10978583 -979511
42000 -979511 6884745 6272468 -42318 -2941766 1755994 9202484 13036606 12467739 10660704
41991 10660704 9745851 9044910 6333460 753670 -4229088 -3123801 3450139 6552522
41983 6552522 233132 -8217044 -6866737 3823201 11355339 8527507 1172366 -2978295
41975b978295p89790J82536J945976L435874Q37746l019618j989930K290257L261550
41966C176306J304811J471045J662007l985087j1109521q818633J843208P701975
41958f753889M177409J427312N573539Q653233L892914k749712m456574m515664
41950E248568o478951n136845K449928P599509L043647l966272l444125R01672
41942B17131j13037l933319j660077M576425M780825r35702k342625L173727O597827
41933A0361175K577989l448407n838497n571347l839700Q45846N899706M802483
41925E789248k037573n607755j813290K127436J676l321252j137750L051973J495997
41916a451290m398041n787379j5673N595112M425051j132537m222191k319794
$$ plain form
41975 -2978295 -3768085 -3585549 -1639573 1796301 2634047 -385571 -2375501 -85244 3176306
41966 3176306 4481117 5952162 7614169 3629082 -7480439 -16299072 -14455864 -6753889
41958 -6753889 -2576480 -1149168 4424371 13077604 16970518 14220806 9764232 5248568
41950 5248568 -1230383 -6367228 -3917300 3682209 6725856 2759584 -684541 217131
41942 217131 104094 -3829225 -5489302 -912877 3867948 2932246 589621 3763348 10361175
41933 10361175 12939164 9490757 3652260 -1919087 -5758787 -4912941 986765 5789248
41925 5789248 3751675 -1856080 -3669370 -1541934 -1540258 -4861510 -5999260 -2947287 -1451290
41916 -1451290 -5849331 -11636710 -11652383 -6057271 -1632220 -2764757 -6986948 -9306742
41908i306742J296431K875914K228354J337919R24824J74168o67700j78489Q47843
41899d67478p47779m681273m959340J745672Q399856N420658m576373q241668
41891h107725P6342R525664P569193k813168q107759k895226M638416N532722
41883E418459J147917j144600J353545M171659K387112l091615o640462m522350
41875i20335O85216L316475J840575L90513J949467L042418j243361q506988j0197978
41866i643998k568845P696827J1355662P020262M19084m162405o831533p370775
41858d085721l536953L848867Q889040P298200J942247j857206l445869m907319
41850D145286n075040j550661K923029K932150r70406k983069j795977j895862
$$ plain form
41908 -9306742 -8010311 -5134397 -2906043 -1568124 -643300 -469132 -1136832 -1315321 -467478
41899 -467478 -1215257 -5896530 -10855870 -9110198 -710342 4710316 133943 -8107725
41891 -8107725 -8031383 1494281 9063474 6250306 -1857453 -4752679 -114263 5418459
41883 5418459 6566376 5421776 6775321 10946980 13334092 10242477 3602015 -920335
41875 -920335 -235119 3081356 4921931 5312444 7261911 10304329 9060968 553980 -9643998
41866 -9643998 -12212843 -4516016 6839646 13859908 14278992 10116587 3285054 -4085721
41858 -4085721 -7622674 -3773807 5115233 12413433 14355680 12498474 9052605 4145286
41850 4145286 -929754 -2480415 442614 3374764 2404358 -578711 -2374688 -4270550
41842d270550l689125j240987O322458J0099895M329293l767077m675491l02938
41834B805478J779791J610271L795226N925682K121202m310107m349292J104411
41826A0482662J864982m049259o660878j244669L558849P64509l540782j766302
41818e90888K232172J244182k231091j320042K633155L197209O24226M37299K684827
41809H911049K119733j960647m588594l549641j532321j60052J281048J626044
41801B146619q88775l606936k488492M61864L2898k598729j453231K987996L636933
41792a769853l40858q07685N092958Q218503J952359n528134l253372M654965
41784H218883M803376m516183j0406006m656102N011583P515086L590033J556381
$$ plain form
41842 -4270550 -7959675 -9200662 -2878204 7221691 11550984 7783907 3108416 2805478
41834 2805478 4585269 6195540 9990766 15916448 18037650 13727543 9378251 10482662
41826 10482662 12347644 8298385 1637507 392838 3951687 4716196 1175414 -590888
41818 -590888 1641284 2885466 654375 -665667 1967488 5164697 5788923 6226222 8911049
41809 8911049 11030782 9070135 4481541 931900 -600421 -760473 520575 2146619
41801 2146619 1257844 -2349092 -4837584 -4375720 -4342822 -6941551 -8394782 -5406786 -1769853
41792 -1769853 -2110711 -2918396 2174562 10393065 12345424 6817290 3563918 8218883
41784 8218883 13022259 8506076 -1899930 -6556032 -1544449 5970637 9560670 11117051
41776A1117051L476059L567896j425751p489760r714413q072681n039691j506591
41768a5087881K390845N111954N243854L848994K976017K642036J209980j807518
41760F528281m945398o294887m589359J91179N668544P681887M348456j091064
41752G497639l671262k336014R4573J644832K716590L309113K349456K41104j298821
41743A0547210k475162m902459p263237n827498p74038K698744K109720J797097
41735d089623N464691R011704O248888j103911n383463l972440k192575m395499
41727d12228p535344o213136o70132L531736K685944p76285j767525R36504L417868
41718f802598K447532L28608R93338K866525P51800m768689o038250O01579Q131287
$$ plain form
41776 11117051 14593110 18161006 16735255 9245495 -468918 -8541599 -13581290 -15087881
41768 -15087881 -12697036 -7585082 -2341228 1507766 4483783 7125819 8335799 6528281
41760 6528281 1582883 -4712004 -9301363 -9110184 -3441640 4240247 8588703 7497639
41752 7497639 3826377 1490363 1584936 3229768 5946358 9255471 11604927 11846031 10547210
41743 10547210 8072048 3169589 -4093648 -9921146 -10695184 -7996440 -5886720 -4089623
41735 -4089623 1375068 10386772 16635660 15531749 10148286 6175846 3983271 -412228
41727 -412228 -7947572 -14160708 -14830840 -11299104 -8613160 -9389445 -11156970 -10220466 -6802598
41718 -6802598 -4355066 -4026458 -3033120 -166595 585205 -4183484 -10221734 -9620155 -1488868
41709a488868Q003384J413200m150318n732856n693501m513944m56026M397339
41701h221590M896765L04566m523708n755886l445601J588055P909808J0890400
41693C642809O527873j612400n494776l181053L3680J142545K345279L505398
41685F909355O36669n255977o828067k269880K25863m343362q681930m960412
41677b4567741J961936K707407j067049l61211N227642O835820J191084m522680
41669a2594792m326542q53372J573381L289362N166118M873433J449725j608291
41661c030978j753897j384964k672583k801386J094520N761080N705309J189856
41653B106957k452060k354339n14343P96582J520304J286268j236719m776044
$$ plain form
41709 -1488868 6514516 7927716 3777398 -1955458 -7648959 -12162903 -12618929 -8221590
41701 -8221590 -3324825 -3020259 -7543967 -13299853 -16745454 -15157399 -7247591 3642809
41693 3642809 10170682 8558282 3063506 -117547 -83867 1058678 3403957 6909355
41685 6909355 7546024 2290047 -4538020 -6807900 -6582037 -10925399 -19607329 -24567741
41677 -24567741 -22605805 -19898398 -20965447 -21326658 -16099016 -9263196 -8072112 -12594792
41669 -12594792 -16921334 -17774706 -16201325 -12911963 -7745845 -2872412 -1422687 -3030978
41661 -3030978 -4784875 -6169839 -8842422 -11643808 -10549288 -4788208 917101 2106957
41653 2106957 -345103 -2699442 -3213785 -2417203 -896899 389369 -847350 -5623394
41645e623394m977141l61555L950625K365839k672894l072501L284234Q227682
41637A120895L917187n833074r946989m344561L802835O374588L123320j705620
41629c491419n778024p654595m259961M538085J1496381Q965080r3958m532889
41621h11300K63391O183609M107597l261158n635940K18995O278116M588798k236160
41612I695948n373056j907497K335175K179732R3325N90235J733632j798518q442606
41603h93630r618270j844026P153822Q413157L048646j399939k160570k543442
41595A55748m095302m217601j836333L53867O43961O52401J380567J117360p44242
41586f589574j483790P85228L452559K713719r56973l034512k65503N507076Q828006
$$ plain form
41645 -5623394 -10600535 -10962090 -7011465 -4645626 -7318520 -10391021 -7106787 1120895
41637 1120895 5038082 -794992 -10741981 -15086542 -11283707 -4909119 -1785799 -3491419
41629 -3491419 -9269443 -16924038 -21183999 -16645914 -5149533 3815547 3721589 -811300
41621 -811300 -547909 5635700 9743297 6482139 846199 1065194 7343310 11932108 9695948
41612 9695948 4322892 2415395 4750570 6930302 7023627 7613862 9347494 7548976 -893630
41603 -893630 -10511900 -12355926 -5202104 3211053 6259699 4859760 2699190 155748
41595 155748 -3939554 -8157155 -9993488 -9639621 -8995660 -8343259 -6962692 -5845332 -6589574
41586 -6589574 -8073364 -7288136 -3835577 -1121858 -2078831 -5113343 -5378846 128230 8956236
41577H956236N912542j145582o161205n694962k676014j635895k470692k048531
41569f964103k20079K64598o98728n2119K599486L361792J71381l386455k921277
41560g845504R77985M269320M648748L056249J511741J101830J204227K26880
41552I151476j786203k112292O89682K995228K62245n636930q183883n486727
41544a0107404k099900o70465J438554M632664L667681l097633p560228k301673
41536a6098404P238631R179181J488146o322721p172779l936828j673968N2239
41528a7246503L365770O084414M542165j43574k982520j654844J021180J497452
41520e516460L805q25323o07904j801992m720493m927459Q84035Q150218Q832700
$$ plain form
41577 8956236 14868778 13723196 7561991 1867029 -808985 -2444880 -4915572 -6964103
41569 -6964103 -7184182 -6919584 -7618312 -7670431 -5070945 -1709153 -1537772 -4924227 -7845504
41560 -7845504 -6867519 -2598199 2050549 5106798 6618539 7720369 8924596 9151476
41552 9151476 7365273 5252981 5942663 8937891 9200136 3563206 -4620677 -10107404
41544 -10107404 -12207304 -12877769 -11439215 -6806551 -3138870 -6236503 -13796731 -16098404
41536 -16098404 -8859773 319408 1807554 -4515167 -11687946 -15624774 -17298742 -17246503
41528 -17246503 -13880733 -7796319 -3254154 -3397728 -6380248 -8035092 -7013912 -5516460
41520 -5516460 -5512655 -6337978 -6945882 -8747874 -13468367 -18395826 -17511791 -9361573 -528873
41511e28873K694421j849181J1956K970173J217307k067462j150439J848985J158712
41502D305599j778341q96268K904636K597472k475960m846408j541697J129062
41494f01905j017482k959633j57185K791210K05368m428253m359995j064236j095405
41485a2687516m214294l676978K134717O804739N934811K808939J489226N95228
41477h11128k185841m314679k096401K576089M112505J061131k023279q89939
41469d571542L387935O669659O574003L622342n18323l878146m382207j682178
41461E221543J285947R14226k380368m351587k794615o86848j528552l901349
41453h221603l681255k11980L123328L856846K681877J043800k24654J5813K007780
$$ plain form
41511 -528873 2165548 316367 328323 3298496 4515803 2448341 1297902 3146887 4305599
41502 4305599 2527258 1630990 4535626 7133098 4657138 -189270 -1730967 -601905
41494 -601905 -1619387 -4579020 -4736205 -1944995 -1739627 -6167880 -10527875 -11592111 -12687516
41485 -12687516 -16901810 -20578788 -18444071 -11639332 -5704521 -2895582 -1406356 -811128
41477 -811128 -2996969 -7311648 -9408049 -6831960 -2719455 -1658324 -3681603 -4571542
41469 -4571542 -1183607 5486052 12060055 15682397 15164074 11285928 6903721 5221543
41461 5221543 6507490 7421716 5041348 689761 -2104854 -2791702 -4320254 -8221603
41453 -8221603 -11902858 -12114838 -8991510 -5134664 -2452787 -1408987 -1633641 -1617828 389952
41444C89952K938857r0043m555245m562317K96985L166843k83999n106492m361463
41435a2166922O20575K773867J17812j862965J096468N972782O979979K999588
41427F531184j870026l718738k638743j160407m21984O42361K351304K720944
41419B435895P19612q05982J139349M070794K651532k892430o177900l969739
41411b828869o75710p90418k201073j104275J235130J726333J335633K036816
41403a266433J566635k207106m728184k60948P638757R285449K481273m812779
41395G696664o314141m180644k006886J080031N512116P186524L417735j762586
41387A0628813l235221k055183k353039m113075m141815k274276j534107k589420
$$ plain form
41444 389952 3328809 3238766 -1316479 -5878796 -5581811 -2414968 -2698967 -7805459 -12166922
41435 -12166922 -11546347 -8772480 -8654668 -10517633 -9421165 -3448383 3531596 6531184
41427 6531184 4661158 942420 -1696323 -2856730 -3278714 -2636353 -285049 2435895
41419 2435895 3155507 2349525 3488874 7559668 10211200 7318770 1140870 -2828869
41411 -2828869 -3504579 -4294997 -6496070 -7600345 -6365215 -4638882 -3303249 -1266433
41403 -1266433 300202 -1906904 -6635088 -6896036 742721 10028170 12509443 7696664
41395 7696664 1382523 -2798121 -4805007 -3724976 1787140 8973664 12391399 10628813
41387 10628813 7393592 5338409 2985370 -1127705 -5269520 -7543796 -9077903 -11667323
41379a1667323k327491J297389N780882O704126K912638j759707k567438N7949
41371a568975L49362m657984r038221m802400N851297J1362198N670175l699441
41363e33989o001345p88960L688740K196419k477261m589294j514091M278238
41355e741543O798358J945588o496069r185703k361256O656099Q613521L517801
41347C746796j711812l391883l242695k754771j619575q86899j959005k719399
41339a4539243N7682M551578N415767J793905j256218j51072L048827M804413
41331C725639M108766J347064k701363n592291m740336j233582J262617J698199
41323b125287J892975J787483n60277l825283l942372j067781p3592k041121j664420
$$ plain form
41379 -11667323 -13994814 -12697425 -6916543 -212417 2700221 940514 -1626924 -1568975
41371 -1568975 -1219613 -5877597 -14915818 -19718218 -13866921 -2504723 3165452 -533989
41363 -533989 -6535334 -7324294 -3635554 -1439135 -3916396 -8505690 -10019781 -5741543
41355 -5741543 1056815 3002403 -3493666 -12679369 -15040625 -8384526 228995 3746796
41347 3746796 2034984 -1356899 -4599594 -7354365 -8973940 -9860839 -11819844 -14539243
41339 -14539243 -14481561 -9929983 -4514216 -2720311 -3976529 -4127601 -1078774 3725639
41331 3725639 7834405 9181469 6480106 887815 -3852521 -5086103 -3823486 -2125287
41323 -2125287 -232312 1555171 994894 -2830389 -6772761 -7840542 -7914134 -9955255 -11619675
41314a1619675L406233O969065L307473l219060m038641J361610N544420L928311
41306E639736n49625l216646k850465n82826K106609L348733J999720m24094j298714
41297D172428n39295k99570j068214q17347J373765L290612K415803o25377k659875
41288E242930j652711Q04424J101337j943691n028221m241982l14595K545143
41280c487366K695891K256421J860802q06765n129777n694013n23045L807492
41272e020360J315144l222566j160441N354274N330312l679360j0074621m414558
41264a5572176P045444J1576808O783517L14474l349031o508088r326809o936725
$$ plain form
41314 -11619675 -8213442 -1244377 2063096 -1155964 -5194605 -3832995 1711425 5639736
41306 5639736 5090111 1873465 -977000 -1559826 546783 3895516 5895236 5471142 4172428
41297 4172428 3633133 3333563 2265349 1448002 2821767 6112379 8528182 7902805 5242930
41288 5242930 3590219 4394643 5495980 3552289 -1475932 -5717914 -6032509 -3487366
41280 -3487366 -791475 1464946 3325748 2518983 -2610794 -8304807 -8827852 -5020360
41272 -5020360 -3705216 -6927782 -8088223 -2733949 2596363 -1082997 -11157618 -15572176
41264 -15572176 -8526732 3050076 9833593 10148067 6799036 290948 -9035861 -15972586
$$ [...]
##END NTUPLES=NMR SPECTRUM
##END=
