##TITLE=31Pdec_LR-688B-MC1-TFA
 CDCl3, 24 sc
 2.8.2019
##JCAMPDX= 6.0         $$ Bruker NMR JCAMP-DX V2.0
##DATA TYPE= NMR SPECTRUM
##DATA CLASS= NTUPLES
##ORIGIN= UXNMR, Bruker Analytische Messtechnik GmbH
##OWNER= root
$$ XWIN-NMR		Version 3.5
$$ Fri Aug  2 14:23:25 2019 Russian Standard Time (UT+4h)  she@DPX200
##.OBSERVE FREQUENCY= 81.013821
##.OBSERVE NUCLEUS= ^31P
##.ACQUISITION MODE= SIMULTANEOUS
##.ACQUISITION SCHEME= undefined
##.AVERAGES= 24
##.DIGITISER RES= 17
##SPECTROMETER/DATA SYSTEM= spect
##.PULSE SEQUENCE= zgpg30
##.SOLVENT NAME= CDCl3
##.SHIFT REFERENCE= (INTERNAL, CDCl3, 0, 182.463)
##AUDIT TRAIL= $$ (NUMBER, WHEN, WHO, WHERE, WHAT)
$$ ##TITLE= Audit trail, XWIN-NMR		Version 3.5
$$ ##JCAMPDX= 5.01
$$ ##ORIGIN= Bruker BioSpin GmbH
$$ ##OWNER= she
$$ F:/spectra/data/she/nmr/P31/1/pdata/1/auditp.txt
$$ ##AUDIT TRAIL=  $$ (NUMBER, WHEN, WHO, WHERE, WHAT)
(   1,<2019-08-02 14:22:20.46 +0400>,<she>,<DPX200>,
      <created by zg, POWCHK disabled, PULCHK disabled
       terminated by command 'halt'
       configuration hash MD5:
       00 E9 B6 7A A2 85 ED C7 34 08 36 98 17 FE 4E 26
       data hash MD5: 32K
       CE 3E 5D A3 E3 A3 C6 F3 1C 1B 09 9D 9B 8E BB 92>)
(   2,<2019-08-02 14:22:23.20 +0400>,<she>,<DPX200>,
      <Start of raw data processing
       efp BC_mod = 2 LB = 1 FT_mod = 6 PKNL = 1 PHC0 = -579.3793 PHC1 = 654.2003 SI = 64K 
       data hash MD5: 64K
       72 9C A7 EC A7 CE 0F 53 F7 86 6C D4 31 EB 28 F7>)
(   3,<2019-08-02 14:22:45.20 +0400>,<she>,<DPX200>,
      <pk PHC0 = -20.47035 PHC1 = 75 
       data hash MD5: 64K
       9F 97 CF D3 10 AE 55 74 86 53 FA D1 42 E2 43 D7>)
(   4,<2019-08-02 14:22:48.78 +0400>,<she>,<DPX200>,
      <abs ABSG = 5 
       data hash MD5: 64K
       12 AE 40 60 6D 54 2B 78 3D 6C 20 94 C1 3C 46 79>)
$$ ##END=
$$ 
$$ hash MD5
$$ 9C 97 F9 99 6C 21 60 A3 78 FF AB B5 14 47 70 48
##$RELAX= 
##$RELAX= 
##$RELAX= 
##$RELAX= 
##$RELAX= 
##$RELAX= 
##$RELAX= 
##$RELAX= 
$$ Bruker specific parameters
$$ --------------------------
##$DU= <F:/spectra>
##$EXPNO= 1
##$NAME= <P31>
##$PROCNO= 1
##$TYPE= <nmr>
##$USER= <she>
##$AMP= (0..31)
100 100 100 100 100 100 100 100 100 100 100 100 100 100 100 100 100 100 
100 100 100 100 100 100 100 100 100 100 100 100 100 100 
##$AQSEQ= 0
##$AQ_mod= 1
##$AUNM= <au_zg>
##$AUTOPOS= <>
##$BF1= 81.014009
##$BF2= 200.13
##$BF3= 200.13
##$BF4= 200.13
##$BF5= 200.13
##$BF6= 200.13
##$BF7= 200.13
##$BF8= 200.13
##$BYTORDA= 1
##$CFDGTYP= 0
##$CFRGTYP= 5
##$CHEMSTR= <none>
##$CNST= (0..31)
1 1 145 1 1 1 1 1 1 1 1 1 1 1 1 1 1 1 1 1 1 1 1 1 1 1 1 1 1 1 1 1 
##$CPDPRG= <waltz16>
##$CPDPRG1= <>
##$CPDPRG2= <waltz16>
##$CPDPRG3= <>
##$CPDPRG4= <mlev>
##$CPDPRG5= <mlev>
##$CPDPRG6= <mlev>
##$CPDPRG7= <mlev>
##$CPDPRG8= <mlev>
##$CPDPRGB= <>
##$CPDPRGT= <>
##$D= (0..31)
0 1 0 0 0 0 0 0 0 0 0 0.03 2e-05 3e-06 0 0 0 0 0 0 0 0 0 0 0 0 0 0 0 0 
0 0 
##$DATE= 1564741339
##$DBL= (0..7)
120 120 120 11 120 120 24 19 
##$DBP= (0..7)
150 150 150 150 150 150 150 150 
##$DBP07= 0
$$ [...]
##$SUBNAM3= <"">
##$SUBNAM4= <"">
##$SUBNAM5= <"">
##$SUBNAM6= <"">
##$SUBNAM7= <"">
##$SUBNAM8= <"">
##$SUBNAM9= <"">
##$SW= 369.568048894756
##$SWIBOX= (0..15)
0 1 3 0 0 0 0 0 0 0 0 0 0 0 0 0 
##$SW_h= 29940.119760479
##$TD= 32768
##$TD0= 1
##$TE= 0
##$TE2= 300
##$TE3= 300
##$TEG= 300
##$TL= (0..7)
0 120 53 12 22 120 120 120 
##$TP= (0..7)
150 150 150 150 150 150 150 150 
##$TP07= 0
##$TPNAME0= <>
##$TPNAME1= <>
##$TPNAME2= <>
##$TPNAME3= <>
##$TPNAME4= <>
##$TPNAME5= <>
##$TPNAME6= <>
##$TPNAME7= <>
##$TPOAL= (0..7)
0.5 0.5 0.5 0.5 0.5 0.5 0.5 0.5 
##$TPOFFS= (0..7)
0 0 0 0 0 0 0 0 
##$TUNHIN= 0
##$TUNHOUT= 0
##$TUNXOUT= 0
##$USERA1= <user>
##$USERA2= <user>
##$USERA3= <user>
##$USERA4= <user>
##$USERA5= <user>
##$V9= 5
##$VALIST= <valist>
##$VCLIST= <CCCCCCCCCCCCCCC>
##$VD= 0
##$VDLIST= <DDDDDDDDDDDDDDD>
##$VPLIST= <PPPPPPPPPPPPPPP>
##$VTLIST= <TTTTTTTTTTTTTTT>
##$WBST= 1024
##$WBSW= 4
##$XGAIN= (0..3)
0 0 0 0 
##$XL= 0
##$YL= 0
##$YMAX_a= 15029
##$YMIN_a= -16021
##$ZGOPTNS= <>
##$ZL1= 120
##$ZL2= 120
##$ZL3= 120
##$ZL4= 120
##$ABSF1= 182.463
##$ABSF2= -187.1042
##$ABSG= 5
##$ABSL= 3
##$ALPHA= 0
##$AQORDER= 0
##$ASSFAC= 0
##$ASSFACI= 0
##$ASSFACX= 0
##$ASSWID= 0
##$AUNMP= <proc_1d>
##$AZFE= 0.1
##$AZFW= 0.5
##$BCFW= 0
##$BC_mod= 2
##$BYTORDP= 0
##$COROFFS= 0
##$CY= -3
##$DATMOD= 1
##$DC= 0
##$DFILT= <>
##$DTYPP= 0
##$F1P= 0
##$F2P= 0
##$FCOR= 1
##$FTSIZE= 65536
##$FT_mod= 6
##$GAMMA= 0
##$GB= 0
##$INTBC= 1
##$INTSCL= 5.30512e-09
##$ISEN= 30
##$LB= 1
##$LEV0= 0
##$LPBIN= 0
##$MAXI= 10000
##$MC2= 0
##$MEAN= 0
##$ME_mod= 0
##$MI= 50
##$NCOEF= 0
##$NC_proc= -7
##$NLEV= 6
##$NOISF1= 182.463
##$NOISF2= 159.3651
##$NSP= 0
##$NTH_PI= 0
##$NZP= 0
##$OFFSET= 182.463
##$PC= 4
##$PHC0= -599.8496
##$PHC1= 729.2003
##$PH_mod= 1
##$PKNL= yes
##$PPARMOD= 0
##$PSCAL= 0
##$PSIGN= 0
##$REVERSE= no
##$SF= 81.0140089999434
##$SI= 65536
##$SIGF1= 159.3651
##$SIGF2= -187.1042
##$SINO= 113.3802
##$SIOLD= 16384
##$SREGLST= <1H.CDCl3>
##$SSB= 0
##$STSI= 65536
##$STSR= 0
##$SW_p= 29940.119760479
##$SYMM= 0
##$S_DEV= 0
##$TDeff= 32768
##$TDoff= 0
##$TI= <>
##$TILT= no
##$TM1= 0
##$TM2= 0
##$TOPLEV= 0
##$USERP1= <user>
##$USERP2= <user>
##$USERP3= <user>
##$USERP4= <user>
##$USERP5= <user>
##$WDW= 1
##$XDIM= 65536
##$YMAX_p= 306763483
##$YMIN_p= -35906492
$$ End of Bruker specific parameters
$$ ---------------------------------
##NTUPLES= NMR SPECTRUM
##VAR_NAME=  FREQUENCY,     SPECTRUM/REAL,   SPECTRUM/IMAG
##SYMBOL=    X,             R,               I
##VAR_TYPE=  INDEPENDENT,   DEPENDENT,       DEPENDENT
##VAR_FORM=  AFFN,          ASDF,            ASDF
##VAR_DIM=   65536,         65536,           65536
##UNITS=     HZ,            ARBITRARY UNITS, ARBITRARY UNITS
##FACTOR=    0.456856943014862, 1,           1
##FIRST=     14782.0589164792, 0,            0
##LAST=      -15158.0608439998, 0,           0
##MIN=       -15158.0608439998, -35906492,   0
##MAX=       14782.0589164792, 306763483,    0
$$ Real data points
##PAGE= N=1
##DATA TABLE= (X++(R..R)), XYDATA
$$ [...]
$$ plain form
45651 8073633 3307660 -2319369 -5163289 -4046049 -1414763 -469419 -1561103 -2171665
45643 -2171665 -231544 3366329 5725817 4974124 2139281 31118 145024 939319 -131169
45634 -131169 -3089498 -5279127 -4956310 -3237166 -1591940 409235 2929524 3573084 469188
45625 469188 -3509101 -3435428 814690 4265581 4059217 2878453 3515336 4205019 2483217
45616 2483217 315963 1233846 4408214 5932133 4947806 4164405 4546435 3866052 1269244
45607 1269244 -728248 -321803 901567 1294064 2192047 5151608 8392950 8815678 6257998
45598 6257998 3213466 1150798 -536796 -2429159 -4186734 -5681412 -7059307 -7500424
45590 -7500424 -5616168 -1508743 2830069 5523719 6220881 5467887 3955242 2685477
$$ packed form
45651H073633m765973n627029k843920J117240K631286R45344j091684o10562
45643b171665J940121L597873K359488p51693k834843k108163J13906P94295j070488
45634a31169k958329k189629L22817J719144J645226K001175K520289O43560l103896
45625D69188l978289P3673M250118L450891k06364j180764O36883O89683j721802
45616B483217k167254R17883L174368J523919r84327p83401L82030o80383k596808
45607A269244j997492M06445J223370L92497Q97983K959561L241342M22728k557680
45598F257998l044532k062668j687594j892363j757575j494678j377895m41117
45590g500424J884256M107425M338812K693650O97162p52994j512645j269765
$$ plain form
45582 2685477 2602361 3383118 3528000 2342337 1099043 1480014 3310490 4517336 3190082
45573 3190082 -589858 -4623015 -6097530 -3866667 243959 2910389 2738080 1795981
45565 1795981 2943950 5997818 7703052 5593555 644993 -4376279 -7856579 -9519250
45557 -9519250 -8929349 -5915276 -2192073 -202766 256800 1951531 5504681 7270092
45549 7270092 4391408 11833 -244661 3776753 6572833 5217751 3191899 3935990
45541 3935990 5067697 2998056 -18731 1089874 5469630 6486457 1385307 -4431375
45533 -4431375 -5041390 -1735041 76588 -1323455 -2959749 -2345967 -78340 2224518
45525 2224518 3591049 3257810 923946 -2238977 -4516050 -5652003 -6474408 -6801096 -5521492
$$ packed form
45582B685477q3116P80757J44882j185663j243294L80971J830476J206846j327254
45573C190082l779940m033157j474515K230863M110626K666430j72309r42099
45565A795981J147969L053868J705234k109497m948562n021272l480300j662671
45557i519250N89901L014073L723203J989307M59566J694731L553150J765411
45549G270092k878684m379575k56494M021414K796080j355082k025852P44091
45541C935990J131707k069641l016787J108605M379756J016827n101150n816682
45533d431375o10015L306349J811629j400043j636294O13782K267627K302858
45525B224518J366531l33239k333864l162923k277073j135953q22405l26688J279604
$$ plain form
45516 -5521492 -2802148 -487547 49987 -788426 -1752636 -1792705 -385526 1799915 2806004
45507 2806004 1509346 -425031 -469861 1183565 2099097 1461897 813081 621293 -799013
45498 -799013 -3739265 -5424011 -3921217 -1332693 -612511 -1030116 428257 4262467 7792030
45489 7792030 8775905 7365030 4820566 2522712 2071395 4157574 7092315 8213377
45481 8213377 6962226 5123290 4131818 3784595 3525682 3187260 2285760 339285 -1744913
45472 -1744913 -2134577 -293687 2561923 5274557 7450283 8328132 6904892 3766142
45464 3766142 1120457 322535 722188 1315924 1869816 1973611 935214 -581883 -747600
45455 -747600 578317 1135833 -230178 -1298198 372277 3492988 4479406 2018562 -1803097
$$ packed form
45516e521492K719344K314601N37534q38413r64210m0069J407179K185441J006089
45507B806004j296658j934377m4830J653426R15532o37200o48816j91788j420306
45498g99013k940252j684746J502794K588524P20182m17605J458373L834210L529563
45489G792030R83875j410875k544464k297854m51317K086179K934741J121062
45481H213377j251151j838936r91472l47223k58913l38422r01500j946475k084198
45472a744913l89664J840890K855610K712634K175726Q77849j423240l138750
45464C766142k645685p97922L99653N93736N53892J03795j038397j517097j65717
45455g47600J325917N57516j366011j068020J670475L120711R86418k460844l821659
$$ plain form
45446 -1803097 -4364618 -4523364 -2095689 2493742 7511087 10395760 9877617 7128067
45438 7128067 4490741 3411199 3595200 3730848 2895819 1373686 104244 -369750 16696
45429 16696 1297506 2976935 3561427 2230424 773423 1633408 3729452 3077310 -1106194
45420 -1106194 -3895790 -874920 5348424 8208255 5611682 1822918 1234227 3683916
45412 3683916 6490658 7964860 7491768 4579780 -142471 -4215013 -5427282 -4298560
45404 -4298560 -3449880 -4627206 -6933364 -7996192 -6603952 -3937645 -1917191 -692162
45396 -692162 1096294 3503903 4554364 3255669 1407083 663195 -410355 -3862505
45388 -3862505 -8280827 -10240497 -9228762 -7979588 -7958581 -7723365 -6340800 -5392368 -6349162
$$ packed form
45446a803097k561521j58746K427675M589431N017345K884673n18143k749550
45438G128067k637326j079542J84001J35648q35029j522133j269442m73994L86446
45429A6696J280810J679429N84492j331003j457001Q59985K096044o52142m183504
45420a106194k789596L020870O223344K859831k596573l788764n88691K449689
45412C683916K806742J474202m73092k911988m722251m072542j212269J128722
45404d298560Q48680j177326k306158j062828J392240K666307K020454J225029
45396f92162J788456K407609J050461j298695j848586p43888j073550l452150
45388c862505m418322j959670J011735J249174K1007K35216J382565R48432r56794
$$ plain form
45379 -6349162 -8240557 -9082731 -7876625 -4688805 -825146 804803 -1809457 -6268753
45371 -6268753 -7667245 -4914202 -1930719 -1275005 -446768 2968519 6268471 5668839 2643587
45362 2643587 1551722 2357219 708713 -4619035 -9007053 -8280780 -4272322 -1825139
45354 -1825139 -2378958 -3019653 -1145214 2078064 3436284 1737166 -996992 -2483668
45346 -2483668 -2991644 -3881727 -4431674 -2789685 -63151 -5126 -3241166 -5324844 -3185670
45337 -3185670 -214086 -948757 -3327978 -1631968 3842584 6057855 1270896 -5545347
45329 -5545347 -7798723 -5514766 -3210249 -2800984 -2576354 -1450067 -357719 151672 688342
45320 688342 1261357 992785 -153874 -1032512 -885487 -4117 1062804 1743347 1205167
$$ packed form
45379f349162j891395q42174J206106L187820L863659J629949k614260m459296
45371f268753j398492K753043K983483O55714Q28237L415287L299952n99632l025252
45362B643587j091865Q05497j648506n327748m388018P26273M008458K447183
45354a825139n53819o40695J874439L223278J358220j699118k734158j486676
45346b483668n07976q90083n49947J641989K726534N8025l236040k083678K139174
45337c185670K971584p34671k379221J696010N474552K215271m786959o816243
45329e545347k253376K283957K304517M09265K24630J126287J092348N09391N36670
45320F88342N73015k68572j146659q78638J47025Q81370J066921O80543n38180
$$ plain form
45311 1205167 -657314 -2175438 -1438160 1050173 2855132 3038476 3300672 4846534 5861869
45302 5861869 3863157 -379152 -3377589 -3433913 -2684077 -3839253 -6433182 -7768390 -6714474
45293 -6714474 -4798733 -3667587 -3192121 -2563912 -1847644 -1618268 -2034627 -2993903 -4277282
45284 -4277282 -4874862 -3329050 188166 3131445 3172392 818411 -1641499 -2851701 -2711836
45275 -2711836 -1127819 1521596 3313870 2498987 296017 -116966 2320612 5341179
45267 5341179 6429782 5139372 2052789 -2140887 -5491377 -4999600 45452 6074111
45259 6074111 8298271 5377244 180675 -3351329 -3297188 -605209 2041787 2565083 1251234
45250 1251234 -181932 -1122665 -2413729 -4056995 -4413228 -2585700 20093 1693006
$$ packed form
45311A205167j862481j518124P37278K488333J804959J83344K62196J545862J015335
45302E861869j998712m242309k998437n6324P49836j155176k593929j335208J053916
45293f714474J915741J131146M75466O28209P16268K29376m16359r59276j283379
45284d277282n97580J545812L517216K943279M0947k353981k459910j210202J39865
45275b711836J584017K649415J792274q14883k202970m12983K437578L020567
45267E341179J088603j290410l086583m193676l350490M91777N045052O028659
45259F074111K224160k921027n196569l532004N4141K691979K646996N23296j313849
45250A251234j433166r40733j291064j643266l56233J827528K605793J672913
$$ plain form
45242 1693006 2478276 2836254 1706261 -2060689 -7007393 -9732824 -8315399 -4035150
45234 -4035150 50655 1432275 -311353 -3215742 -4571815 -3609151 -1947424 -971973
45226 -971973 -195435 799564 648668 -1564767 -3786298 -3310729 -958981 -172252 -1897622
45217 -1897622 -3069106 -1010774 2766378 4409766 2101156 -2393886 -5723446 -5874715
45209 -5874715 -3756496 -2171799 -2708469 -3906049 -3358151 -1051496 881217 1339015 1219836
45200 1219836 1179627 664235 -150839 374901 2823869 5116827 4953260 2655879 138597
45191 138597 -1822143 -3519902 -4300982 -2784196 637444 3186939 2527124 -510349 -2806995
45182 -2806995 -2380627 -300564 1043711 1046944 1270830 2502303 2808420 52786 -4277434
$$ packed form
45242A693006P85270L57978j129993l766950m946704k725431J417425M280249
45234d035150M085805J381620j743628k904389j356073R62664J661727R75451
45226i71973P76538R94999j50896k213435k221531M75569K351748P86729j725370
45217a897622j171484K058332L777152J643388k308610m495042l329560j51269
45209e874715K118219J584697n36670j197580N47898K306655J932713M57798j19179
45200A219836m0209n15392q15074N25740K448968K292958j63567k297381k517282
45191A38597j960740j697759p81080J516786L421640K549495o59815l037473k296646
45182b806995M26368K080063J344275L233K23886J231473L06117k755634m330220
$$ plain form
45173 -4277434 -5920603 -3065091 1061870 1974094 -937147 -4336007 -5130392 -3259507
45165 -3259507 -638854 1272604 2484170 3697775 4947791 5238286 3878680 1866185
45157 1866185 897583 938619 167955 -2135434 -4216485 -4419578 -3617229 -3456393 -3498419
45148 -3498419 -2335458 -806372 -1419990 -4347352 -6472764 -5451708 -2858508 -2001089
45140 -2001089 -3879683 -6557351 -7590696 -5956077 -2425146 780182 1424378 -392292
45132 -392292 -1893963 -928925 1010999 818948 -1419763 -1891506 1859739 7214029 9443662
45123 9443662 7279875 3740903 2016985 2509097 3935773 5232350 5498767 3889548
45115 3889548 1089646 -336330 1040414 2796496 1103436 -4001994 -7896799 -6803300
$$ packed form
45173d277434j643169K855512M126961R12224k911241l398860p94385J870885
45165c259507K620653J911458J211566J213605J250016K90495j359606k012495
45157A866185r68602M1036p70664k303389k081051k03093Q02349J60836m2026
45148c498419J162961J529086o13618k927362k125412J021056K593200Q57419
45140b001089j878594k677668j033345J634619L530931L205328O44196j816670
45132c92292j501671R65038J939924j92051k238711m71743L751245N354290K229633
45123I443662k163787l538972j723918M92112J426676J296577K66417j609219
45115C889548k799902j425976J376744J756082j693060n105430l894805J093499
$$ plain form
45107 -6803300 -2291398 991579 967973 -159705 516299 2908795 4293430 2625604 -1040522
45098 -1040522 -3527236 -3033499 -1366718 -1788074 -4574045 -6249170 -4205874 -553371
45090 -553371 582228 -1307322 -2725663 -1484166 262590 -538349 -3472598 -5645274
45082 -5645274 -5829637 -5500374 -5943093 -6179959 -4482151 -1138301 1095221 -352774 -4648291
45073 -4648291 -7596203 -6050577 -2117398 -1107906 -4633853 -7905655 -5716759 646356
45065 646356 5137646 4613680 1661157 -116876 -332774 -360062 -502044 -300649 320958
45056 320958 1721534 4498943 7413661 7569874 4566286 2183735 3342301 5488327
45048 5488327 4420590 1100011 328078 3099658 4946191 2806845 -771719 -2197034
$$ packed form
45107f803300M511902L282977k3606j127678O76004K392496J384635j667826l666126
45098a040522k486714M93737J666781m21356k785971j675125K043296L652503
45090e53371J135599j889550j418341J241497J746756q00939k934249k172676
45082e645274j84363L29263m42719k36866J697808L343850K233522j447995m295517
45073d648291k947912J545626L933179J009492l525947l271802K188896O363115
45065F46356M491290n23966k952523j778033k15898k7288j41982K01395O21607
45056C20958J400576K777409K914718J56213l003588k382551J158566K146026
45048E488327j067737l320579p71933K771580J846533k139346l578564j425315
$$ plain form
45040 -2197034 -1853833 -1966862 -2486888 -2168352 -1472816 -1255592 -379293 2106454 3927955
45031 3927955 2325484 -1170032 -2513071 -1237654 -746622 -2388441 -3634204 -3278553
45023 -3278553 -3917285 -6685572 -7517166 -2669167 4498843 6859495 2810843 -2103959
45015 -2103959 -3198689 -2138571 -2720197 -4536337 -4017302 -337598 3009701 2890186 472491
45006 472491 -654728 1014102 3697260 5069870 4685156 3421261 1879041 322589
44998 322589 -578136 -307636 299191 -293876 -2146446 -3419319 -2747238 -1125082 -614213
44989 -614213 -1882165 -3979014 -5975607 -7573381 -8240418 -7091021 -4113536 -668260
44981 -668260 1794185 2978142 3313601 2928528 1732250 118544 -1231967 -2158994 -2887642
$$ packed form
45040b197034L43201j13029n20026L18536O95536K17224Q76299K485747J821501
45031C927955j602471l495516j343039J275417M91032j641819j245763L55651
45023c278553o38732k768287q31594M847999P168010K360652m048652m914802
45015b103959j094730J060118n81626j816140N19035L679704L347299j19515k417695
45006D72491j127219J668830K683158J372610l84714j263895j542220j556452
44998C22589r00725K70500O06827n93067j852570j272873O72081J622156N10869
44989f14213j267952k096849j996593j597774o67037J149397K977485L445276
44981f68260K462445J183957L35459l85073j196278j613706j350511r27027p28648
$$ plain form
44972 -2887642 -3108715 -2155356 -460874 213569 -998480 -2342208 -1406474 1353865 2802450
44963 2802450 1363531 -683722 -490027 1227105 1456539 -353191 -1415263 -97
44955 -97 1674460 561183 -2675630 -4297481 -2289983 1269265 2937526 1667980 -797805
44946 -797805 -2367784 -2479618 -1881150 -1528899 -2049924 -3697402 -6086244 -7924738 -7679145
44937 -7679145 -5082717 -1852842 -415501 -1733326 -4493269 -6387584 -6075207 -4049671
44929 -4049671 -1879609 -693058 -423158 -539301 -1097509 -2417934 -3914367 -4311352 -3318592
44920 -3318592 -2037581 -1238695 -453984 487231 519060 -687338 -1173413 900628 4147096
44911 4147096 5425955 4025877 2239978 1970750 2912697 4051363 4739886 4199082 2220006
$$ packed form
44972b887642k21073R53359J694482O74443j212049j343728R35734K760339J448585
44963B802450j438919k047253J93695J717132K29434j809730j062072J415166
44955i7J674557j113277l236813j621851K007498L559248J668261j269546k465785
44946g97805j569979j11834N98468L52251n21025j647478k388842j838494K45593
44937g679145K596428L229875J437341j317825k759943j894315L12377K025536
44929d049671K170062J186551K69900j16143n58208j320425j496433l96985R92760
44920c318592J281011P98886P84711R41215L1829j206398m86075K074041L246468
44911D147096J278859j400078j785899k69228R41947J138666O88523n40804j979076
$$ plain form
44902 2220006 470782 654154 1323759 -421713 -3661323 -3767999 737686 5065607 4296660
44893 4296660 -322645 -3919443 -4234485 -2433503 -90264 1348964 53592 -3763957
44885 -3763957 -6419861 -5090863 -2074402 -1279892 -2161515 -1304111 1290642 2392752 1583525
44876 1583525 2020334 4609518 6185498 4731941 2203762 778074 249462 502285 2459201
44867 2459201 4913564 4608606 1492224 -331776 820384 1322616 -974209 -1957004 2161549
44858 2161549 7616480 8149137 4432269 2364494 3706393 4654634 3058175 870969
44850 870969 -847914 -3374473 -5649463 -3980623 1442646 4955419 3259212 359484
44842 359484 1200833 4231974 4472996 1208167 -1795366 -2140984 -800309 867630 2406794
$$ packed form
44902B220006j749224J83372O69605j745472l239610j06676M505685M327921p68947
44893D296660m619305l596798l15042J800982K343239J439228j295372l817549
44885c763957k655904J328998L016461P94510q81623Q57404K594753J102110q09227
44876A583525M36809K589184J575980j453557k528179j425688n28612K52823J956916
44867B459201K454363l04958l116382j824000J152160N02232k296825r82795M118553
44858B161549N454931N32657l716868k067775J341899R48241j596459k187206
44850H70969j718883k526559k274990J668840N423269L512773j696207k899728
44842C59484Q41349L031141K41022l264829l003533l45618J340675J667939J539164
$$ plain form
44833 2406794 2906214 1578244 -326508 -879715 -541695 -1141043 -2041019 -502638 3684560
44824 3684560 6976482 6520408 3372860 308612 -1208186 -883349 980038 2514748
44816 2514748 1330782 -1685134 -2206933 1600934 5664916 5697468 3854925 5270164 9411868
44807 9411868 10450995 6664045 3813069 6699716 11990907 13185213 9446930 5245400
44799 5245400 3342711 2705498 2360167 2587001 2023720 -1925581 -8209442 -11224681 -7212107
44790 -7212107 631716 5661275 4948412 1113915 -1593650 -887632 3026950 8049989
44782 8049989 10975955 9504302 4637353 545464 991307 5398717 8853599 6915741
44774 6915741 651943 -4198367 -3752239 -337461 1044908 -845599 -2984001 -3064340 -1793317
$$ packed form
44833B406794M99420j327970j904752n53207L38020n99348q99976J538381M187198
44824C684560L291922m56074l147548l064248j516798L24837J863387J534710
44816B514748j183966l015916n21799L807867M063982L2552j842543J415239M141704
44807I411868J039127l786950k850976K886647N291191J194306l738283m201530
44799E245400j902689o37213l45331K26834n63281l949301o283861l015239M012574
44790g212107P843823N029559p12863l834497k707565P06018L914582N023039
44782H049989K925966j471653m866949m091889M45843M407410L454882j937858
44774F915741o263798m850310M46128L414778J382369j890507k138402q0339J271023
$$ plain form
44765 -1793317 -177152 2024059 4092019 3828200 1022549 -1273370 -990787 -50908 -752358
44756 -752358 -1580879 283987 4050168 6315342 5983960 4891441 4090925 2781018 853125
44747 853125 -551423 -1270668 -2125335 -2451468 -587492 2544665 3403366 736205 -2090509
44738 -2090509 -1495764 1616371 3633513 3292156 2701819 3807953 5724912 5909541 3088955
44729 3088955 -1240006 -3994333 -3352525 -560470 1375515 769988 -1320883 -2467471
44721 -2467471 -994922 2935021 7404730 9920295 9280265 6256831 2112378 -2645783
44713 -2645783 -7096602 -8810966 -6057506 -704807 3205883 3874452 2937232 2363251 2313371
44704 2313371 2357130 2610573 2931671 2773708 2461495 2932150 3781945 3448822 1779674
$$ packed form
44765a793317J616165K201211K067960k63819k805651k295919K82583R39879p01450
44756g52358q28521J864866L766181K265174l31382j092519q00516j309907j927893
44747H53125j404548p19245q54667l26133J863976L132157Q58701k667161k826714
44738b090509N94745L112135K017142l41357n90337J106134J916959J84629k820586
44729C088955m328961k754327O41808K792055J935985o05527k090871j146588
44721b467471J472549L929943M469709K515565o40030l023434m144453m758161
44713b645783m450819j714364K753460N352699L910690O68569r37220n73981m9880
44704B313371M3759K53443L21098j57963l12213M70655Q49795l33123j669148
$$ plain form
44695 1779674 347269 -282634 -1204894 -2313410 -1462361 2093729 5852441 7346929 7045205
44686 7045205 6199888 4216598 579576 -2628050 -2978503 -1197928 131040 174864 -370119
44677 -370119 -1828249 -4790515 -7421156 -6683324 -2491838 1847063 3652673 3231404 2074531
44668 2074531 835684 -457298 -1936932 -4056887 -6849961 -9040563 -9362821 -8522641
44660 -8522641 -8159969 -8200047 -7257203 -5415701 -4212497 -3761907 -2498233 -298278 858070
44651 858070 433271 903591 3984482 7377738 7547937 4467193 1380274 544520 1291241
44642 1291241 2136724 2865094 3924953 4939595 4690667 2434627 -1026703 -3706370 -4133374
44633 -4133374 -2766410 -1402724 -1222769 -1953564 -2884089 -3755010 -4308249 -3941068 -2592856
$$ packed form
44695A779674j432405o29903r22260j108516Q51049L556090L758712J494488l01724
44686G045205q45317j983290l637022l207626l50453J780575J328968M3824n44983
44677c70119j458130k962266k630641P37832M191486M338901J805610m21269j156873
44668B074531j238847j292982j479634k119955k793074k190602l22258Q40180
44660h522641L62672m0078R42844J841502J203204M50590J263674K199955J156348
44651H58070m24799M70320L080891L393256J70199l080744l086919q35754P46721
44642A291241Q45483P28370J059859J014642k48928k256040l461330k679667m27004
44633d133374J366964J363686J79955p30795r30525q70921n53239L67181J348212
$$ plain form
44624 -2592856 -1344336 -1235348 -1806920 -1742089 -931230 -901635 -2611163 -4471341 -3724925
44615 -3724925 1877 3671145 4327637 2796549 2344821 4088256 5917326 6319803 6668563
44606 6668563 8248966 9383457 7917063 4872992 2824273 1804074 -2044 -2153046
44598 -2153046 -2097573 409808 2540202 2858800 3235796 4977457 6275542 5486920 4097900
44589 4097900 3916911 3653529 1169508 -2576830 -4829136 -5105079 -5023625 -4913561 -3716818
44580 -3716818 -1964417 -1650760 -2751634 -2833503 -1056828 160741 -1011509 -2671964 -2070621
44571 -2070621 2104 430887 -1168069 -1434651 1946102 6651469 8499137 6451103
44563 6451103 2906792 -170251 -2823676 -4608757 -3573810 361234 3305481 1650848
$$ packed form
44624b592856J248520J08988n71572O4831Q10859K9595j709528j860178P46416
44615c724925L726802L669268O56492j531088m51728J743435J829070M02477L48760
44606F668563J580403J134491j466394l044071k048719j020199j806118k151002
44598b153046N5473K507381K130394L18598L76996J741661J298085p88622j389020
44589D097900j80989k63382k484021l746338k252306k75943Q1454J10064J196743
44580c716818J752401L13657j100874q1869J776675J217569j172250j660455O01343
44571b070621K072725M28783j598956k66582L380753M705367J847668k048034
44563F451103l544311l077043k653425j785081J034947L935044K944247j654633
$$ plain form
44555 1650848 -2710038 -4668613 -3011873 -1616250 -2965143 -4354674 -2552033 1015063
44547 1015063 2668185 1848203 846100 573182 -68947 -1195868 -1481020 -804005 -754561
44538 -754561 -2145682 -4118672 -5856129 -7089198 -6854513 -4176580 -501187 901879
44530 901879 -1059679 -3755975 -4171225 -2041023 1132342 4198011 6226585 6075836 3807830
44521 3807830 1377729 384336 128051 -622944 -955829 1182996 5625476 9349933 9529860
44512 9529860 6302841 2443020 929925 2599937 5437083 6375510 4466162 1939082
44504 1939082 1429969 2691719 3225251 1981972 1023293 2940328 7502979 11634037 12446781
44495 12446781 9884118 6505836 4934831 5417643 5758783 3751492 -280053 -3550372
$$ packed form
44555A650848m360886j958575J656740J395623j348893j389531J802641L567096
44547A015063J653122q19982j002103k72918o42129j126921k85152O77015M9444
44538g54561j391121j972990j737457j233069K34685K677933L675393J403066
44530I01879j961558k696296m15250K130202L173365L065669K028574j50749k268006
44521C807830k430101r93393k56285p50995l32885K138825M442480L724457J79927
44512I529860l227019l859821j513095J670012K837146R38427j909348k527080
44504A939082n09113J261750N33532j243279r58679J917035M562651M131058Q12744
44495A2446781k562663l378282j571005M82812L41140k007291m031545l270319
$$ plain form
44487 -3550372 -3586164 -794302 2036327 2810179 2231964 2433937 3999674 5476961 5945243
44478 5945243 6478678 7865986 8221989 5177102 214363 -1803494 1559998 7114693
44470 7114693 10219041 10276862 9735025 9016606 5920732 334234 -3845150 -3390613 -233220
44461 -233220 1017928 -1172063 -4319324 -6012743 -6286805 -5727761 -3832530 -427877 3182820
44452 3182820 5877417 7964287 9349580 8219609 3761662 -1180281 -3052107 -2516651
44444 -2516651 -3207026 -5661286 -6340190 -3735797 -1398872 -2357199 -4072658 -2720671 170227
44435 170227 155939 -2338649 -2003982 3165872 8617002 9787851 7612826 5122519 2453107
44426 2453107 -1373330 -4668392 -5155383 -4153080 -4700895 -6351698 -5699447 -1938749 1864890
$$ packed form
44487c550372l5792K791862K830629P73852n78215K01973J565737J477287M68282
44478E945243N33435J387308L56003l044887m962739k017857L363492N554695
44470G114693L104348N7821n41837p18419l095874n586498m179384M54537L157393
44461b33220J251148k189991l147261j693419k74062N59044J895231L404653L610697
44452C182820K694597K086870J385293j129971m457947m941943j871826N35456
44444b516651o90375k454260o78904K604393K336925r58327j715459J351987K890898
44435A70227j4288k494588L34667N169854N451130J170849k175025k490307k669412
44426B453107l826437l295062m86991J002303n47815j650803O52251L760698L803639
$$ plain form
44417 1864890 3619602 4817481 7038510 8890026 8323428 5761812 2980160 662225
44409 662225 -983950 -812145 1743314 4850507 6419717 7368171 10081140 13704530 13947934
44400 13947934 8803245 2244411 254401 4173860 9757282 12361500 11326083 9033112
44392 9033112 7239071 5515961 2879410 -171261 -1831263 -1025402 1299007 3266234
44384 3266234 4098795 4344651 4187677 2683821 -611504 -4099461 -5400826 -3965631 -1465124
44375 -1465124 303511 935556 912620 734175 806514 1161799 960687 -675771 -2929112
44366 -2929112 -3550946 -1582187 1195947 2277931 948416 -1833232 -4666621 -5771601
44358 -5771601 -3457192 1525959 5199669 4266554 391546 -1653247 26124 2608639
$$ packed form
44417A864890J754712J197879K221029J851516n66598k561616k781652k317935
44409F62225j646175J71805K555459L107193J569210R48454K712969L623390K43404
44400A3947934n144689o558834j990010L919459N583422K604218j035417k292971
44392I033112j794041j723110k636551l050671j660002Q05861K324409J967227
44384C266234Q32561K45856j56974j503856l295325l487957j301365J435195K500507
44375a465124J768635O32045k2936j78445P2339L55285k01112j636458k253341
44366b929112o21834J968759K778134J081984j329515k781648k833389j104980
44358e771601K314409M983151L673710r33115l875008k044793J679371K582515
$$ plain form
44350 2608639 2852262 783651 -1610395 -3105499 -3450630 -2692967 -1709430 -2063189 -3988137
44341 -3988137 -5520325 -4719396 -1848498 1433180 3881623 4849541 4016043 2044331 373932
44332 373932 -612885 -2018299 -4226082 -5883180 -6081383 -5598369 -4607539 -1545337 3512725
44323 3512725 6723588 5012270 1129104 406315 3307619 5228220 3600973 983027
44315 983027 255763 823866 1286398 2267741 4185805 5139216 3809935 2252284 2945435
44306 2945435 4840980 5291912 4484177 4683093 5863643 5527338 2960594 572471 328483
44297 328483 1529222 3069257 5337379 8312800 9870527 8112757 4249071 1233119
44289 1233119 267212 444699 1168832 2629963 3850285 2789337 -414674 -2293786 -115792
$$ packed form
44350B608639K43623k068611k394046j495104l45131P57663R83537l53759j924948
44341c988137j532188Q00929K870898L281678K448443R67918q33498j971712j670399
44332C73932r86817j405414k207783j657098j98203M83014R90830L062202N058062
44323C512725L210863j711318l883166p22789K901304J920601j627247k617946
44315I83027p27264N68103M62532R81343J918064R53411j329281j557651O93151
44306B945435J895545M50932q07735J98916J180550l36305k566744k388123k43988
44297C28483J200739J540035K268122K975421J557727j757770l863686l015952
44289A233119r65907J77487P24133J461131J220322j060948l204011j879112K177994
$$ plain form
44280 -115792 4008761 5388417 2843100 122777 666504 3263930 4472627 3599255 2986825
44271 2986825 4055696 5405805 5096870 3012524 395225 -1601350 -2276290 -1443025 109675
44262 109675 901896 -2642 -2490398 -5974852 -9443266 -11043905 -9281926 -5240232 -2139055
44253 -2139055 -1730411 -2323093 -1396435 1011510 2830371 2932904 2072300 1331917 1027257
44244 1027257 982922 831633 173748 -794989 -1217956 -864949 -715713 -1216850 -961430 1170760
44234 1170760 3313932 2493143 -688396 -1894790 1161755 4965074 4407583 -349666
44226 -349666 -3741513 -1643507 3813494 7329133 6821844 4939441 4647785 5435453 4961694
44217 4961694 3157351 2732461 5424095 9206622 10168633 6655360 938037 -2960929
$$ packed form
44280a15792M124553J379656k545317k720323N43727K597426J208697q73372o12430
44271B986825J068871J350109l08935k084346k617299j996575o74940Q33265J552700
44262A09675P92221r04538k487756l484454l468414j600639J761979M041694L101177
44253b139055M08644n92682R26658K407945J818861J02533q60604p40383l04660
44244A027257m4335j51289o57885r68737m22967L53007J49236n01137K55420K132190
44234A170760K143172q20789l181539j206394L056545L803319n57491m757249
44226c49666l391847K098006N457001L515639n07289j882403k91656P87668m73759
44217D961694j804343m24890K691634L782527R62011l513273n717323l898966
$$ plain form
44209 -2960929 -2807326 91410 2395146 2236312 1022879 1098519 2169929 1813403 -360897
44200 -360897 -1525157 -28387 1317376 -986547 -5383315 -6632590 -2968500 1267823
44192 1267823 1313782 -2099790 -4245009 -2288135 2111725 5312233 5205339 2426089 -778312
44183 -778312 -2625531 -3087155 -3167660 -3259629 -3013915 -2604482 -2645471 -2465600 -149009 4530918
44173 4530918 8511745 8411798 4518996 347827 -1491933 -1616025 -2118723 -3801160 -5471069
44164 -5471069 -5218851 -2236966 2010428 4529900 3539008 518819 -1232419 -141977
44156 -141977 2309682 3778370 3509666 2269132 914388 -77475 -214279 903409 2989320
44147 2989320 4976914 5548882 3826693 179394 -3237995 -3540611 110430 4860326
$$ packed form
44209b960929J53603K898736K303736j58834j213433P5640J071410l56526k174300
44200c60897j164260J496770J345763k303923m396768j249275L664090M236323
44192A267823M5959l413572k145219J956874M399860L200508j06894k779250l204401
44183g78312j847219m61624q0505r1969K45714M09433m0989J79871K316591M679927
44173D530918L980827r9947l892802m171169j839760j24092n02698j682437j669909
44164e471069K52218K981885M247394K519472r90892l020189j751238J090442
44156a41977K451659J468688k68704j240534j354744r91863j36804J117688K085911
44147B989320J987594N71968j722189l647299l417389l02616L651041M749896
$$ plain form
44139 4860326 6504882 4006911 777929 704736 3655737 6057039 5465576 3020951 1155414
44130 1155414 521739 253794 108214 739024 2127640 3122805 2729847 983937 -1422748
44121 -1422748 -3415148 -3496620 -753811 3569954 6468455 5862344 2492523 -1066925 -2644789
44112 -2644789 -1659074 882537 3074319 3614769 3078732 3029174 3793651 4265330 4032476
44103 4032476 4008323 4377093 3980132 2961484 3738323 7175413 9865906 8379551 4869259
44094 4869259 4578726 8122965 10517493 8690856 5593244 4687653 4369112 1463856 -2575566
44085 -2575566 -3487081 -966893 932569 333537 320926 3796679 8683642 10334006 6927522
44076 6927522 800483 -4343638 -6225404 -4996727 -2537009 -177985 2892208 7540789
$$ packed form
44139D860326J644556k497971l228982p3193K951001K401302n91463k444625j865537
44130A155414o33675k67945j45580O30810J388616R95165l92958j745910k406685
44121a422748j992400q1472K742809M323765K898501o06111l369821l559448j577864
44112b644789R85715K541611K191782N40450n36037m9558P64477M71679k32854
44103D032476k4153L68770l96961j018648P76839L437090K690493j486355l510292
44094D869259k90533L544239K394528j826637l097612r05591l18541k905256m039422
44085b575566r11515K520188J899462n99032j2611L475753M886963J650364l406484
44076F927522o127039n144121j881766J228677K459718K359024L070193M648581
$$ plain form
44068 7540789 11344348 10362294 5327600 2665073 6616066 13013927 14598711 10770575
44060 10770575 7619811 8796329 11154038 10499820 7385630 5036374 4825890 6294433
44052 6294433 8987613 11624370 11732825 9026834 7216817 9295040 12672308 12624380 9335651
44043 9335651 7242311 7753629 7447302 4531563 2339157 3732958 5828266 4095931
44035 4095931 -554086 -2942461 -1066037 1587296 1715873 892185 2810361 7734856
44027 7734856 11832357 11779025 8657436 6700964 8497514 12097639 13389967 10987575
44019 10987575 7638937 6530168 7525906 8095010 6953353 5312991 4895062 6057815
44011 6057815 7860109 8904675 8130614 5745494 3408287 2665892 3270545 3811429 3707270
$$ packed form
44068G540789L803559r82054n034694k662527L950993O397861J584784l828136
44060A0770575l150764J176518K357709o54218l114190k349256k10484J468543
44052F294433K693180K636757J08455k705991j810017K078223L377268m7928l288729
44043I335651k093340N11318l06327k915739k192406J393801K095308j732335
44035D095931m650017k388375J876424K653333J28577q23688J918176M924495
44027G734856M097501n3332l121589j956472J796550L600125J292328k402392
44019A0987575l348638j108769R95738N69104j141657j640362m17929J162753
44011F057815J802294J044566p74061k385120k337207p42395O04653N40884j04159
$$ plain form
44002 3707270 3487802 3298220 2507562 1090076 236485 1080830 3537085 6569058 8809873
43993 8809873 8954831 6778749 4096566 3510972 5636290 8537680 10325861 11113030 11882576
43984 11882576 12912574 14289817 16432987 18552228 17963224 13204093 7212960 4899474
43976 4899474 7362692 10801743 11740630 10964875 10997768 11949768 12200078 11809489 12437563
43967 12437563 14186742 15246918 15103871 15565706 17550421 19188799 18836376 17997949 18872162
43958 18872162 20313700 19095871 14764095 10410355 8442972 8334511 9165029 11416924
43950 11416924 14684100 16231601 14270772 11001153 9891878 10994362 11356844 9374143
43942 9374143 6338793 4058052 3210997 3881447 5524542 6533422 6090799 6301092 9818457
$$ packed form
44002C707270k19468j89582p90658j417486q53591Q44345K456255L031973K240815
43993H809873J44958k176082k682183n85594K125318K901390J788181P87169P69546
43984A1882576J029998J377243K143170K119241n89004m759131n991133k313486
43976D899474K463218L439051R38887p75755L2893R52000K50310l90589O28074
43967A2437563J749179J060176j43047M61835J984715J638378l52423q38427Q74213
43958A8872162J441538j217829m331776m353740j967383j08461Q30518K251895
43950A1416924L267176J547501j960829l269619j109275J102484L62482j982701
43942I374143l035350k280741q47055O70450J643095J008880m42623K10293L517365
$$ plain form
43933 9818457 15152288 17427891 14865193 11475843 11445200 13477363 13393222 10515151 8290988
43924 8290988 9177649 11820251 13673144 14222707 14752930 16256437 18448379 20228469 20584973
43915 20584973 19311054 17100545 14997633 13848674 13992747 14896447 15451167 15705734 17844156
43906 17844156 23441462 29638896 30831927 25601665 19478475 18557723 22368677 25786575
43898 25786575 26251038 25539206 25322327 25097966 24961315 26646821 30427756 33959266 35741558
43889 35741558 36992405 38236974 36816498 30726377 23208423 20125903 23014837 27483149
43881 27483149 28874678 27215077 25588062 25462540 25494409 24508296 23771648 25148591 27694871
43872 27694871 27942136 24445092 20616432 21089579 25711232 29405296 28440194 24678706
$$ packed form
43933I818457N333831K275603k562698l389350l0643K032163q4141k878071k224163
43924H290988Q86661K642602J852893N49563N30223J503507K191942J780090L56504
43915B0584973j273919k210509k102912j148959J44073R03700N54720K54567K138422
43906A7844156N597306O197434J193031n230262o123190r20752L810954L417898
43898B5786575M64463p11832k16879k24361j36651J685506L780935L531510J782292
43889C5741558J250847J244569j420476o090121p517954l082520K888934M468312
43881B7483149J391529j659601j627015j25522L1869r86113p36648J376943K546280
43872B7694871K47265l497044l828660M73147M621653L694064r65102l761488
$$ plain form
43864 24678706 22466167 23112509 24207698 23384835 21017467 19483905 20847789 24907681
43856 24907681 28835608 29474507 26743540 23850673 23405215 24690415 25862342 26987960
43848 26987960 28781533 29857696 28288375 25423946 24995295 27892713 30558038 29584923
43840 29584923 25682611 21916912 20052652 20059000 21480254 23615698 25593467 27701560
43832 27701560 31310273 35940294 38013362 34874187 29024341 25563061 25680842 25636867
43824 25636867 22730464 19264194 18833209 21038300 22569954 22369931 22662911 24678049
43816 24678049 26165262 24685590 21599287 20648845 23101313 26245917 26969924 25203117
43808 25203117 23019420 21601420 20450165 19048130 17855144 17494804 17971580 18962088
$$ packed form
43864B4678706k212539O46342J095189q22863k367368j533562J363884M059892
43856B4907681L927927O38899k730967k892867m45458J285200J171927J125618
43848B6987960J793573J076163j569321k864429m28651K897418K665325r73115
43840B9584923l902312l765699j864260O348J421254K135444J977769K108093
43832B7701560L608713M630021K073068l139175n849846l461280J17781m3975
43824B5636867k906403l466270m30985K205091J531654k00023K92980K015138
43816B4678049J487213j479672l086303r50442K452468L144604P24007j766807
43808B5203117k183697j418000j151255j402035j192986l60340M76776R90508
$$ plain form
43800 18962088 20019905 20224304 18688442 16136964 15041639 16967060 20210584 21456072
43792 21456072 19800075 17702973 17476306 18372880 18396870 17723702 18224672 19967756 20634215
43783 20634215 19100677 17353858 17359982 17982524 17303773 16614169 19022502 24412442 28949162
43774 28949162 30122975 29238608 27910562 25497519 22154442 21197159 24938266 30316526
43766 30316526 32685239 32686996 34930918 40195888 43875788 43309692 42009951 44107856 48343553
43757 48343553 50899037 51537479 53267202 57566441 63623538 71538818 82758732 97175243
43749 97175243 112524718 127011424 140466565 153048273 165159822 178646336 195350021
43742 195350021 213749459 229319830 239114691 243956628 245258301 242053736 232870398 218755957
$$ packed form
43800A8962088J057817K04399j535862k551478j095325J925421L243524J245488
43792B1456072j655997k097102k26667Q96574K3990o73168N00970J743084O66459
43783B0634215j533538j746819O124O22542o78751o89604K408333N389940M536720
43774B8949162J173813q84367j328046k413043l343077r57283L741107N378260
43766C0316526K368713J757K243922N264970L679900n66096j299741K097905M235697
43757D8343553K555484O38442J729723M299239O057097P915280J1219914J4416511
43749I7175243J5349475J4486706J3455141J2581708J2111549J3486514J6703685
43742A95350021J8399438J5570371R794861M841937J301673l204565r183338j4114441
$$ plain form
43734 218755957 202366048 185052980 166869940 148982124 133967666 123113774 114594785
43727 114594785 105245313 93915731 82489341 73421318 66824241 60822676 54598127 49535528
43719 49535528 46633296 44470174 41338907 37913223 35547211 33214332 29175027 24881511
43711 24881511 23403035 23894875 21976349 16851748 13615767 15941061 20409473 21604227
43703 21604227 19644824 18553988 19549148 20480408 20404005 20160425 19306686 16958925 15134182
43694 15134182 16589085 19396004 18507539 13258962 8434775 6835533 5927284 3779403
43686 3779403 3070396 5975649 9641262 10836894 11497058 15117834 20362464 22956249
43678 22956249 22108991 20539366 19473987 18106447 17116280 18208670 20463134 21346420
$$ packed form
43734B18755957j6389909j7313068j8183040j7887816j5014458j0853892q518989
43727A14594785r349472j1329582j1426390r068023o597077o001565o224549n062599
43719D9535528k902232k163122l131267l425684k366012k332879m039305m293516
43711B4881511j478476M91840j918526n124601l235981K325294M468412J194754
43703B1604227j959403j090836R95160R31260p6403k43580q53739k347761j824743
43694A5134182J454903K806919q88465n248577m824187j599242r08249k147881
43686C779403p09007K905253L665613J195632O60164L620776N244630K593785
43678B2956249q47258j569625j065379j367540r90167J092390K254464Q83286
$$ plain form
43670 21346420 21224472 22693784 25400493 25933747 23393997 20670761 19313537 17660132
43662 17660132 15377357 15047503 17063877 17727025 15524502 14766853 18815077 23629936
43654 23629936 23256535 18838962 16307626 16877676 16395760 13943548 14215508 19317651 24158573
43645 24158573 23735230 20709620 21194269 25605520 28495669 26571097 22499638 20313907
43637 20313907 20629041 21794730 23109275 24820488 26384376 26838469 26504471 26622408 27190827
43628 27190827 26668195 24499152 22777292 24139391 28489383 33218763 36681974 39849947
43620 39849947 43859305 47598987 49395114 50124104 52525208 57529429 63350227 68698171
43612 68698171 74851827 83262469 92626645 100162434 105189186 109751136 115661966 122225720
$$ packed form
43670B1346420j21948J469312K706709N33254k539750k723236j357224j653405
43662A7660132k282775l29854K016374O63148k202523p57649M048224M814859
43654B3629936l73401m417573k531336N70050m81916k452212K71960N102143M840922
43645B4158573m23343l025610M84649M411251K890149j924572m071459k185731
43637B0313907L15134J165689J314545J711213J563888M54093l33998J17937N68419
43628B7190827n22632k169043j721860J362099M349992M729380L463211L167973
43620C9849947M009358L739682J796127P28990K401104N004221N820798N347944
43612F8698171O153656Q410642R364176P535789N026752M561950N910830O563754
$$ plain form
43604 122225720 127203496 129093329 127943564 124443320 118809293 110707539 100268231 89012029
43596 89012029 79258044 72285468 67405583 63138574 58834558 54632688 50312556 45108243
43588 45108243 38785700 32377647 27599676 25496614 25347495 24858276 22171825 18115755
43580 18115755 15574252 15813545 16430210 14424558 10605188 8819419 10699678 13407309
43572 13407309 13524081 11247155 9202504 8612299 8673380 8900610 9776531 10949250 10720884
43563 10720884 8143183 4599025 2699035 4147252 8676671 14157447 17691769 17729211
43555 17729211 15480556 13423428 12399513 11420287 10367519 10881503 13517349 15815110
43547 15815110 15053828 11870734 9122920 7734675 5930235 2712072 -124562 -438921
$$ packed form
43604A22225720M977776J889833j149765l500244n634027q101754j0439308j1256202
43596H9012029r753985o972576m879885m267009m304016m201870m320132n204313
43588D5108243o322543o408053m777971k103062j49119m89219k686451m056070
43580A8115755k541503K39293O16665k005652l819370j785769J880259K707631
43572A3407309J16772k276926k044651n90205O1081K27230Q75921J172719k28366
43563A0720884k577701l544158j899990J448217M529419N480776L534322L7442
43555A7729211k248655k057128j023915r79226j052768N13984K635846K297761
43547A5815110p61282l183094k747814j388245j804440l218163k836634l14359
$$ plain form
43539 -438921 1303609 2763174 2588553 1509611 1083356 2250530 4854678 7807129 9721055
43530 9721055 9842862 8485109 6585102 5102696 4752256 5670006 7054202 7613896 6740810
43521 6740810 5065747 3901456 4488134 7397019 11670764 14655663 14089883 10827107
43513 10827107 8190944 7950819 8309300 6845173 3909828 1504131 171633 -685069
43505 -685069 -270591 2844841 7226831 8848016 6182275 2610574 1840340 2897475 2279126
43496 2279126 -128895 -550667 3047962 7768979 9521838 7789785 4934499 2495521
43488 2495521 627453 284930 2869842 7078907 8714105 5331501 -459213 -4073127
43480 -4073127 -4206935 -3145008 -2706437 -2284688 -870907 1270566 3480023 5336404 5848237
$$ packed form
43539d38921J742530J459565j74621j078942m26255J167174K604148K952451J913926
43530I721055J21807j357753j900007j482406l50440R17750J384196N59694q73086
43521F740810j675063j164291N86678K908885M273745K984899n65780l262776
43513A0827107k636163k40125L58481j464127k935345k405697j332498q56702
43505f85069M14478L115432M381990J621185k665741l571701p70234J057135o18349
43496B279126k408021m21772L598629M721017J752859j732053k855286k438978
43488B495521j868068l42523K584912M209065J635198l382604n790714l613914
43480d073127j33808J061927M38571M21749J413781K141473K209457J856381N11833
$$ plain form
43471 5848237 4018532 1035639 -236823 812698 1320928 -643000 -2748721 -2040297
43463 -2040297 87570 66185 -1716968 -992911 3854176 9005498 10251494 7919790 5192326
43454 5192326 3910346 3861307 4338499 4499110 3498695 1895390 1776897 4058820 6741095
43445 6741095 7171270 5020646 1914833 -656149 -1946753 -1934769 -1985897 -4015378 -7596205
43436 -7596205 -9613750 -8381781 -6083403 -5086610 -4186871 -1509635 1014173 159035 -2839854
43427 -2839854 -3624349 -1595223 -748790 -2896240 -4708435 -3328089 -791282 -340096 -1819942
43418 -1819942 -3613611 -6030238 -9296010 -10609407 -7171091 -867985 3658809 4818293
43410 4818293 4640712 4292885 2723631 -117147 -2209034 -2471154 -2087582 -2003893 -1684199
$$ packed form
43471E848237j829705k982893j272462J049521N08230j963928k105721P08424
43463b040297K127867k1385j783153P24057M847087N151322J245996k331704k727464
43454E192326j281980m9039M77192J60611j000415j603305j18493K281923K682275
43445F741095M30175k150624l105813k570982j290604J1984n1128k029481l580827
43436g596205k017545J231969K298378R96793Q99739K677236K523808q55138k998889
43427b839854p84495K029126Q46433k147450j812195J380346K536807M51186j479846
43418a819942j793669k416627l265772j313397L438316O303106M526794J159484
43410D818293j77581l47827j569254k840778k091887k62120L83572Q3689L19694
$$ plain form
43401 -1684199 -1271866 -2300251 -4781021 -5967030 -3954101 -667794 868350 790722 1486323
43392 1486323 3275874 3715774 1406040 -1820800 -3442113 -3274918 -2604670 -1444091 1337732
43383 1337732 5069427 6391421 2794538 -3680752 -8010517 -7637947 -4833035 -3074404
43375 -3074404 -2879705 -2708560 -2445496 -3436738 -5467403 -6332502 -4926775 -2558197 -427158
43366 -427158 1987091 4775174 5997634 4270355 1453571 434181 1110509 1002887 -536243
43357 -536243 -1305714 199788 2569850 3766399 3758151 3563451 3116856 1765609 139993
43348 139993 -157271 1297883 3086930 3565675 2331065 115385 -1812464 -1977053 462536
43339 462536 4459633 7370538 7486342 6037112 5691286 7032534 7683101 5542757 1905846
$$ packed form
43401a684199M12333j028385k480770j186009K012929L286307J536144p7628O95601
43392A486323J789551M39900k309734l226840j621313J67195O70248J160579K781823
43383A337732L731695J321994l596883o475290m329765L72570K804912J758631
43375c074404J94699J71145K63064r91242k030665q65099J405727K368578K131039
43366d27158K414249K788083J222460j727279k816784j019390O76328j07622j539130
43357e36243p69471J505502K370062J196549q248j94700m46595j351247j625616
43348A39993k97264J455154J789047M78745j234610k215680j927849j64589K439589
43339D62536L997097K910905J15804j449230l45826J341248O50567k140344l636911
$$ plain form
43330 1905846 143062 1679394 4644027 6604417 7203487 7399639 7338381 6263641 3967591
43321 3967591 1084712 -1787367 -4052057 -4389821 -1689287 2737894 5342179 4055043
43313 4055043 1071738 399536 2802199 4874150 3725163 909818 52433 1570301
43305 1570301 2320965 879396 407358 4142545 9750581 11292929 6712296 479339
43297 479339 -2001685 -110749 3110956 5303682 5835244 4389214 1370508 -1021884
43289 -1021884 -745847 1205951 2015213 890331 -509285 -1285079 -2290994 -3573079 -3531303
43280 -3531303 -1613382 526604 1751041 3079805 5177228 6392821 5224387 2970771
43272 2970771 1911919 2376530 3661645 6197129 10144165 13173120 12910429 11108406
$$ packed form
43330A905846j762784J536332K964633J960390N99070J96152o1258j074740k296050
43321C967591k882879k872079k264690l37764K700534M427181K604285j287136
43313D055043k983305o72202K402663K071951j148987k815345q57385J517868
43305A570301P50664j441569m72038L735187N608036J542348m580633o232957
43297D79339k481024J890936L221705K192726N31562j446030l018706k392392
43289a021884K76037J951798Q09262j124882j399616p75794j005915j282085M1776
43280c531303J917921K139986J224437J328764K097423J215593j168434k253616
43272B970771j058852M64611J285115K535484L947036L028955k62691j802023
$$ plain form
43264 11108406 11950075 15853740 18357743 16512698 13443744 14209250 18922758 22699127
43256 22699127 21940342 18283160 15744661 15624364 15603961 13422041 9903847 7501611 6724400
43247 6724400 5698773 3406382 1494107 1783955 3526974 4743262 5062086 5242356 4859720
43238 4859720 2982046 750725 558904 2368720 3376174 1957946 -446571 -2152594
43230 -2152594 -3361756 -4254680 -3564017 -1021301 897761 64600 -1963101 -2124836 -260044
43221 -260044 1224385 1385081 1682620 2800810 3051181 928597 -2251829 -3328689 -446776
43212 -446776 4999099 9255815 9430947 6360637 3601567 2971416 2418450 -312438 -3420973
43203 -3420973 -2975543 1587401 6747903 9723129 10986649 11262042 9332924 4981526
$$ packed form
43264A1108406Q41669L903665K504003j845045l068954P65506M713508L776369
43256B2699127p58785l657182k538499j20297k0403k181920l518194k402236p77211
43247F724400j025627k292391j912275K89848J743019J216288L18824J80270l82636
43238D859720j877674k231321j91821J809816J007454j418228k404517j706023
43230b152594j209162q92924O90663K542716J919062q33161k027701j61735J864792
43221b60044J484429J60696K97539J118190K50371k122584l180426j076860K881913
43212d46776N445875M256716J75132l070310k759070o30151n52966k730888l108535
43203c420973M45430M562944N160502K975226J263520K75393j929118m351398
$$ plain form
43195 4981526 1512686 2214397 5554057 7069051 5604360 4330799 5029124 4864126 962334
43186 962334 -4458653 -6787664 -5531791 -4433175 -5159360 -4872604 -1539686 2043306 2426160
43177 2426160 899013 933442 2147688 1389415 -958330 -872168 2521502 5149450 4739719
43168 4739719 4437259 6782157 8662498 6421477 2301343 830354 1491671 473715
43160 473715 -2019326 -2144172 394905 1436477 -635236 -2285482 -652979 2664395
43152 2664395 5264009 6984332 7428327 4805439 -226561 -3380973 -2163147 834557
43144 834557 2579591 3933390 6299235 7600541 5679720 2991145 3574948 7125749
43136 7125749 9962745 10306810 8880852 6052807 2606340 1864166 6237402 12261804
$$ packed form
43195D981526l468840P01711L339660J514994j464691j273561O98325j64998l901792
43186I62334n420987k329011J255873J098616p26185K86756L332918L582992L82854
43177B426160j527147L4429J214246p58273k347745Q6162L393670K627948m09731
43168D739719l02460K344898J880341k241021m120134j470989O61317j017956
43160D73715k493041j24846K539077J041572k071713j650246J632503L317374
43152B664395K599614J720323M43995k622888n032000l154412J217826K997704
43144H34557J745034J353799K365845J301306j920821k688575N83803L550801
43136G125749K836996L44065j425958k828045l446467p42174M373236O024402
$$ plain form
43128 12261804 13799864 10157776 6426840 5515999 4865796 2352748 487222 2013494
43120 2013494 5070188 5968647 4406519 2998179 3190957 4097053 4309499 3013458 278647
43111 278647 -2300970 -2362017 565395 4359376 7350349 10383711 14282076 16985963 15651641
43102 15651641 10914106 6889056 6946151 10900343 16166512 20297062 22448275 23637816
43094 23637816 25850519 30221332 36122110 42558752 50153757 61021370 76811436 97435865
43086 97435865 121614640 148302270 177710777 210856136 247084708 281230921 303976310
43079 303976310 306763483 287655491 252909181 212928214 176220241 146160598 122290143
43072 122290143 103584772 89769735 80018302 72180790 64395560 56542150 49136982 41937306
$$ packed form
43128A2261804J538060l642088l730936r10841o50203k513048j865526J526272
43120B013494L056694Q98459j562128j408340J92778R06096K12446j296041k734811
43111B78647k579617o1047K927412L793981K990973L033362L898365K703887j334322
43102A5651641m737535m025050N7095L954192N266169M130550K151213J189541
43094B3637816K212703M370813N900778O436642P595005J0867613J5790066K0624429
43086I7435865K4178775K6687630K9408507L3145359L6228572L4146213K2745389
43079C03976310K787173j9107992l4746310l9980967l6707973l0059643k3870455
43072A22290143j8705371j3815037r751433p837512p785230p853410p405168p199676
$$ plain form
43064 41937306 34995685 29765500 27038935 24817302 20900249 16922029 16526104 19477964
43056 19477964 21207911 19080296 15471146 13052062 10783983 7227057 4407008 4615808
43048 4615808 5708256 3846309 -224349 -1802525 1089814 5399442 7720274 7877218
43040 7877218 7110721 5824823 4444823 4052821 4759203 5282018 5153650 5429438 6242731
43031 6242731 5858330 3594491 1562431 1553562 2063243 923020 -519859 888873 4504703
43022 4504703 5524628 1567437 -3151222 -2673899 3152953 8801436 10337909 9520181
43014 9520181 9670268 10353823 8879162 5675821 4703614 7953679 12307359 13454346 11161391
43005 11161391 8756702 8434504 9189387 9294463 8961748 9731127 12088643 14644989 15827963
$$ packed form
43064D1937306o941621n230185k726565k221633l917053l978220l95925K951860
43056A9477964J729947k127615l609150k419084k268079l556926k820049K08800
43048D615808J092448j861947m070658j578176K892339M309628K320832J56944
43040G877218p66497j285898j380000l92002P06382N22815j28368K75788Q13293
43031F242731l84401k263839k032060q869N09681j140223j442879J408732L615830
43022D504703J019925l957191m718659M77323N826852N648483J536473q17728
43014I520181J50087O83555j474661l203341r72207L250065M353680J146987k292955
43005A1161391k404689l22198P54883J05076l32715P69379K357516K556346J182974
$$ plain form
42996 15827963 16029320 17508876 21931222 28687078 36386558 45183406 56097580 68431082
42988 68431082 79681521 87876560 91943625 90074577 81002951 67826355 57072592 51806218
42980 51806218 48494293 43037755 36736046 32855735 30248030 25241056 18346002 13915583
42972 13915583 13425403 13932015 13432657 12855902 11910225 8177244 2400526 -149527 3243375
42963 3243375 8141359 8982148 6540740 5443845 6770489 7598561 6499771 4973309
42955 4973309 3738820 1729775 -753522 -1503973 -77733 1013610 196410 -637682 651619
42946 651619 2720093 2629030 460601 -558874 1204575 3137011 1844760 -1935917 -3912683
42937 -3912683 -1745949 2017164 3576685 2760590 2313875 3379259 4368735 4302383 4436565
$$ packed form
42996A5827963K01357J479556M422346O755856P699480Q796848J0914174J2333502
42988F8431082J1250439Q195039M067065j869048r071626j3176596j0753763n266374
42980E1806218l311925n456538o301709l880311k607705n006974o895054m430419
42972A3915583m90180N06612m99358n76755r45677l732981n776718k550053L392902
42963C243375M897984Q40789k441408j096895J326644Q28072j098790j526462
42955D973309j234489k009045k483297p50451J426240J091343q17200q34092J289301
42946F51619K068474r1063k168429j019475J763449J932436j292251l780677j976766
42937c912683K166734L763113J559521q16095m46715J065384R89476o6352J34182
$$ plain form
42928 4436565 5585319 6293595 5368517 4376108 5581712 8572615 10973658 11965990 13300535
42919 13300535 16856982 22370517 27563556 29891981 28486824 24821072 21035099 17694110
42911 17694110 14306195 11707150 11556166 12906213 12157386 8109603 4383590 4367404 6154048
42902 6154048 5697014 3102405 1893560 3048955 4022439 3700964 4123392 6176573 7218317
42893 7218317 4827859 249792 -3712060 -5998914 -6679433 -5119136 -1126028 3259521
42885 3259521 5369249 4953860 4068225 4150055 4505331 3731726 1691807 -327997 -1226959
42876 -1226959 -1534360 -2609960 -4093669 -3321728 1254612 6823729 8532321 5105304
42868 5105304 87356 -2819053 -3341641 -2812423 -1400058 910423 2513335 1926319 523949
$$ packed form
42928D436565J148754P08276r25078r92409J205604K990903K401043R92332J334545
42919A3300535L556447N513535N193039K328425j405157l665752l785973l340989
42911A7694110l387915k599045j50984J350047p48827m047783l726013j6186J786644
42902F154048m57034k594609j208845J155395R73484l21475M22428K053181J041744
42893G218317k390458m578067l961852k286854o80519J560297L993108M385549
42885C259521K109728m15389q85635Q1830L55276p73605k039919k019804q98962
42876a226959l07401j075600j483709P71941M576340N569117J708592l427017
42868E105304n017948k906409n22588N29218J412365K310481J602912n87016j402370
$$ plain form
42859 523949 1152919 4119721 6585724 6341457 4510201 3644500 4286541 4665392 3447558
42850 3447558 1471708 248988 -235000 -977796 -1751563 -1387638 -588589 -1981506 -5723283
42841 -5723283 -7407047 -3390512 3219864 5772951 2994461 501864 2455031 5912410
42833 5912410 5904495 2717087 765778 2315037 5678883 8493888 9774611 9424061 8343963
42824 8343963 8490483 10470261 11796123 10037805 6935800 6388490 8724946 10355259
42816 10355259 9419615 8244752 8990291 10201282 9816103 8862564 9276891 9827314 7521607
42807 7521607 2536214 -1335230 -1560738 345352 1826362 2791908 4431936 6208983
42799 6208983 6529250 5932436 6969345 10199250 12623590 11766163 9579342 9823751 12403736
$$ packed form
42859E23949O28970K966802K466003k44267j831256q65701O42041L78851j217834
42850C447558j975850j222720m83988p42796p73767L63925P99049j392917l741777
42841e723283j683764M016535O610376K553087k778490k492597J953167L457379
42833E912410p915l187408j951309J549259L363846K815005J280723l50550j080098
42824H343963J46520J979778J325862j758318l102005n47310K336456J630313
42816A0355259r35644j174863P45539J210991l85179r53539M14327N50423k305707
42807G521607m985393l871444k25508J906090J481010R65546J640028J777047
42799F208983L20267n96814J036909L229905K424340q57427k186821K44409K579985
$$ plain form
42790 12403736 13289659 10401339 6596367 5330464 5851876 5211486 3531202 4105779 8170160
42781 8170160 12245695 12033258 7659398 3670176 4026248 7962632 11159942 10711060 8093113
42772 8093113 6570928 6475070 4898064 327088 -4529754 -5928190 -3648744 -697116
42764 -697116 562876 235560 -424838 -312395 1222963 3710559 5388968 5145998 4310350
42755 4310350 4986303 6981922 8188259 7852717 7484839 8187488 8891255 7977194 5471991
42746 5471991 3053454 2561150 4435518 6835693 6865467 3913975 1034459 1320120 3783803
42737 3783803 5185535 5205955 6553067 9827781 11954878 10965164 8965649 8339888 7967099
42728 7967099 5964956 3921544 5086407 9421252 13429972 14524968 13141672 10856494
$$ packed form
42790A2403736Q85923k888320l804972j265903N21412o40390j680284N74577M064381
42781H170160M075535k12437m373860l989222L56072L936384L197310m48882k617947
42772H093113j522185r5858j577006m570976m856842j398436K279446K951628
42764f97116J259992l27316o60398J12443J535358K487596J678409k42970q35648
42755D310350O75953J995619J206337l35542l67878P02649P03767r14061k505203
42746E471991k418537m92304J874368K400175K9774k951492k879516K85661K463683
42737C783803J401732K0420J347112L274714K127097r89714j999515o25761l72789
42728G967099k002143k043412J164863M334845M008720J094996j383296k285178
$$ plain form
42720 10856494 8863805 8410208 10337597 13318664 14178282 11118424 5952458 2407922
42712 2407922 2448080 4582037 5727082 4591627 2892451 2902741 4431237 5398520 5035649
42703 5035649 4704328 5342494 6161632 6600148 7392426 8499812 8231246 6208729 5118654
42694 5118654 7228150 10949454 13477175 15224649 18501511 22946154 25870500 26731052
42686 26731052 27574482 28797059 28140112 24892866 21727428 20773977 20740804 19796657 18725396
42677 18725396 18860633 18925133 16736269 13018396 10873728 11654228 13412631 13641737 12039189
42668 12039189 10169010 9376127 9552379 9694420 9462523 9857751 11810155 14392594 15564729
42659 15564729 14766152 13477464 12968714 13087886 13879712 16515353 21201610 25619081 27234206
$$ packed form
42720A0856494j992689m53597J927389K981067Q59618l059858n165966l544536
42712B407922M0158K133957J145045j135455j699176J0290J528496R67283l62871
42703E035649l31321O38166Q19138M38516P92278J107386k68566k022517j090075
42694E118654K109496L721304K527721J747474L276862M444643K924346Q60552
42686B6731052Q43430J222577o56947l247246l165438r53451l3173r44147j071261
42677A8725396J35237O4500k188864l717873k144668P80500J758403K29106j602548
42668A2039189j870179p92883J76252J42041k31897L95228J952404K582439J172135
42659A5564729p98577j288688n08750J19172P91826K635641M686257M417471J615125
$$ plain form
42650 27234206 26332174 25116554 24486038 23474122 21543414 19593323 18406413 17446948
42642 17446948 15728210 13165732 10779462 9843367 10646016 11884000 11941474 11094826 11277344
42633 11277344 12904484 13538788 11362268 8534866 8607926 11407362 13476327 13525812 14039413
42624 14039413 16415948 17883717 15666114 11811848 10714804 12967709 14842049 13667006
42616 13667006 10758414 8470877 7095447 6098530 6315867 8787262 12349982 14316349
42608 14316349 13388464 10670075 8100610 7107558 8416123 11556510 14423006 14890269
42600 14890269 13353344 12272316 12671312 12772586 11158723 9474654 9980202 11655467
42592 11655467 11396289 8787464 6894289 7702977 9374355 9397428 8257289 7916826 8205280
$$ packed form
42650B7234206r02032j215620o30516j011916j930708j950091j186910r59465
42642A7446948j718738k562478k386270r36095Q02649J237984N7474q46648J82518
42633A1277344J627140O34304k176520k827402P3060K799436K068965M9485N13601
42624A4039413K376535J467769k217603l854266j097044K252905J874340j175043
42616A3667006k908592k287537j375430r96917K17337K471395L562720J966367
42608A4316349r27885k718389k569465r93052J308565L140387K866496M67263
42600A4890269j536925j081028L98996J01274j613863j684069N05548J675265
42592A1655467k59178k608825j893175Q08688J671378K3073j140139l40463K88454
$$ plain form
42583 8205280 7239458 4866797 3314984 4228466 6842189 9361915 10592873 9955117 7594503
42574 7594503 5110474 4613278 6131953 7265043 6422195 5105173 5573069 7365960 8051339
42565 8051339 6859372 5390832 4563018 3131707 381399 -1506478 282623 5218618
42557 5218618 9515254 10255454 8097751 5721856 4893177 5530598 6514649 6653197 5647841
42548 5647841 4746187 5597678 7821377 8864900 7429462 5872763 7327012 11045934
42540 11045934 12946891 11001357 7791588 6750243 7851193 8609906 7920357 6905921
42532 6905921 6577922 6547735 6138920 5382480 4608303 4001025 3812896 4261545 4910466 4637710
42522 4637710 2584269 -780308 -3409552 -2854640 1339141 6283718 8109748 6340848
$$ packed form
42583H205280r65822k372661j551813R13482K613723K519726J230958o37756k360614
42574G594503k484029m97196J518675J133090q42848j317022M67896J792891O85379
42565H051339j191967j468540q27814j431311k750308j887877J789101M935995
42557E218618M296636P40200k157703k375895q28679O37421R84051J38548j005356
42548E647841r01654Q51491K223699J043523j435438j556699J454249L718922
42540A1045934J900957j945534l209769j041345J100950P58713o89549j014436
42532F905921l27999l0187m08815p56440p74177o07278j88129M48649O48921k72756
42522D637710k053441l364577k629244N54912M193781M944577J826030j768900
$$ plain form
42514 6340848 4560453 5723566 8387729 9288536 8109213 7078864 6746993 5425892
42506 5425892 2946871 1577655 2070599 1920872 -459870 -2484936 -1042680 2475553
42498 2475553 4039884 2959523 2586451 4940145 7866177 8645757 7753759 7194233 6995732
42489 6995732 5659272 3201388 1495211 1585268 2440175 2792268 2839779 3411934 4366798
42480 4366798 4628755 3399610 860205 -1901269 -3322863 -2378977 233960 2402825
42472 2402825 2713808 1863051 1449201 2034945 3185017 4614599 6048585 6594311 5880561
42463 5880561 5442030 7077589 9920333 11251176 10373438 9218488 8597912 6852684 3615773
42454 3615773 1775993 3217038 5250902 4421486 1721558 466629 779029 375448 -402400
$$ packed form
42514F340848j780395J163113K664163R00807j179323j030349l31871j321101
42506E425892k479021j369216M92944j49727k380742k025066J442256L518233
42498B475553J564331j080361l73072K353694K926032P79580q91998n59526j98501
42489F995732j336460k457884j706177R0057Q54907L52093M7511N72155R54864
42480D366798K61957j229145k539405k761474j421594R43886K612937K168865
42472B402825L10983q50757m13850N85744J150072J429582J433986N45726p13750
42463E880561m38531J635559K842744J330843q77738j154950o20576j745228l236911
42454C615773j839780J441045K033864q29416k699928j254929L12400m03581p77848
$$ plain form
42445 -402400 804164 3064186 2678537 -209162 -720863 3185959 7102445 6815999 4170654
42436 4170654 2860197 2323684 210307 -1984951 -642729 4111323 8608804 10827324
42428 10827324 11525878 10973368 8435561 4727842 1907940 562844 253515 1811103
42420 1811103 5717220 9037722 8200035 4682727 3524198 5782054 7139776 5144246
42412 5144246 3033898 4123238 6630530 7150912 5944318 5447568 6030325 6480275 6810901
42403 6810901 7553433 7754729 6425244 4651860 3808096 3160330 1817786 1414554 3762418
42394 3762418 7110238 8146583 6993924 6717651 8126773 8723876 7335587 6240836
42386 6240836 7239746 8466968 7192076 3924621 1539777 1251846 1460405 525945 -828287
$$ packed form
42445d02400J206564K260022l85649k887699n11701L906822L916486k86446k645345
42436D170654j310457n36513k113377k195258J342222M754052M497481K218520
42428A0827324O98554n52510k537807l707719k819902j345096l09329J557588
42420A811103L906117L320502q37687l517308j158529K257856J357722j995530
42412E144246k110348J089340K507292N20382j206594m96750N82757M49950L30626
42403F810901P42532K01296j329485j773384q43764o47766j342544m03232K347864
42394C762418L347820J036345j152659k76273J409122N97103j388289j094751
42386F240836R98910J227222j274892l267455k384844k87931K08559r34460j354232
$$ plain form
42377 -828287 -552523 1901165 4657670 5566023 4506215 2690569 467594 -2215249 -3354541
42368 -3354541 21077 6827659 10932765 8066720 1705907 -1337499 311337 2311508
42360 2311508 2285708 2750987 5485721 7919139 7772450 7448931 10200443 14394480 15432841
42351 15432841 12153651 7837612 5364353 4562474 4388742 4742380 5422312 5724107 6069678
42342 6069678 8065045 11801365 14774911 14879631 13229918 12504186 13312366 13752456 12160311
42333 12160311 8874892 5480212 3687693 4812520 8559259 11898190 11112278 6284748
42325 6284748 2237671 3198943 7612209 10384743 9473407 7446376 6646378 6186520 4834697
42316 4834697 3586453 3163929 1717256 -1964795 -5004385 -3783975 425167 2956474
$$ packed form
42377h28287K75764K453688K756505R08353j059808j815646k222975k682843j139292
42368c354541L375618O806582M105106k866045o360813l043406J648836K000171
42360B311508k5800M65279K734734K433418j46689l23519K751512M194037J038361
42351A5432841l279190m316039k473259q01879j73732L53638O79932L01795L45571
42342F069678J995367L736320K973546J04720j649713p25732Q08180M40090j592145
42333A2160311l285419l394680j792519J124827L746739L338931p85912m827530
42325F284748m047077R61272M413266K772534r11336k027031p99998m59858j351823
42316D834697j248244m22524j446673l682051l039590J220410M209142K531307
$$ plain form
42308 2956474 2402642 1862920 3297873 4695856 4122781 2900735 2726885 2746150 2003664
42299 2003664 2235794 5231668 9184229 10766656 9817864 8993549 9240361 8568062 5685176
42290 5685176 2429912 1554919 3462805 5974653 6544081 4192259 -102515 -4267421
42282 -4267421 -6349340 -5290629 -1424408 3044769 4889407 2868148 -346092 -1166839
42274 -1166839 99996 18601 -2129292 -2707019 517029 4451962 5270464 3967741 3817947
42265 3817947 4595488 3510444 561585 -1299434 -780745 873863 3126112 6192409
42257 6192409 8158233 6563235 3211272 2717604 5247828 5446543 379830 -6036057
42249 -6036057 -9023586 -9091357 -9075175 -8924132 -7320146 -5461717 -5047085 -4635426 -2013925
$$ packed form
42308B956474n53832n39722J434953J397983n73075j222046j73850J9265p42486
42299B003664K32130K995874L952561J582427r48792q24315K46812o72299k882886
42290E685176l255264q74993J907886K511848N69428k351822m294774m164906
42282d267421k081919J058711L866221M469177J844638k021259l214240q20747
42274a166839J266835q1395k147893n77727L224048L934933Q18502j302723j49794
42265C817947P77541j085044k948859j861019N18689J654608K252249L066297
42257F192409J965824j594998l351963m93668K530224J98715n066713o415887
42249f036057k987529o7771J6182J51043J603986J858429M14632M11659K621501
$$ plain form
42240 -2013925 1521099 3113756 3106158 3970757 5724277 6373394 5961285 6064342 5946210
42231 5946210 3574674 300965 68474 3508159 7059165 8680472 10086102 12047736
42223 12047736 11923381 8139827 3486646 1387557 1806210 3084503 4821340 6445831
42215 6445831 5981173 3262851 1715990 3581721 5768507 4294740 969043 1226834
42207 1226834 6117745 10785866 11096198 7969881 4443846 1818911 44249 -634769
42199 -634769 23234 1682614 3873390 5898298 6442546 4896309 2777642 1928763 1742059
42190 1742059 506547 -1056626 -745449 732530 137613 -2591488 -2904349 1965170 8375587
42181 8375587 10754890 8309449 4501067 1841415 386405 302577 2715356 7708568
$$ packed form
42240b013925L535024J592657p598Q64599J753520O49117m12109J03057j18132
42231E946210k371536l273709k32491L439685L551006J621307J405630J961634
42223A2047736j24355l783554m653181k099089M18653J278293J736837J624491
42215F445831m64658k718322j546861J865731K186786j473767l325697K57791
42207A226834M890911M668121L10332l126317l526035k624935j774662o79018
42199f34769O58003J659380K190776K024908N44248j546237k118667q48879j86704
42190A742059j235512j563173L11177J477979n94917k729101l12861M869519O410417
42181H375587K379303k445441l808382k659652j455010q3828K412779M993212
$$ plain form
42173 7708568 13209527 16100063 14108298 7819684 1380830 -791655 903983 1734554
42165 1734554 -565760 -2597329 -1082121 1742208 2139499 1094361 1807010 3533970
42157 3533970 3564688 3576853 7430879 13101531 13921188 8886564 4616698 4752488 4547696
42148 4547696 -62579 -4709304 -3684478 419949 1040910 -1791888 -2407001 791095
42140 791095 3662987 4060316 4530868 6351936 6775748 4163561 1011654 -463731 -1694136
42131 -1694136 -4138577 -5739374 -4026720 -423020 1457109 432524 -1605722 -2670388
42123 -2670388 -2374560 -1291708 -127943 682938 1249163 1745378 1659609 399541 -1514687
42114 -1514687 -3086430 -4305831 -5345262 -4930777 -2071922 824596 -77450 -4207166
$$ packed form
42173G708568N500959K890536j991765o288614o438854k172485J695638Q30571
42165A734554k300314k031569J515208K824329L97291j045138P12649J726960
42157C533970L0718J2165L854026N670652Q19657n034624m269866J35790k04792
42148D547696m610275m646725J024826M104427O20961k832798o15113L198096
42140G91095K871892L97329M70552J821068M23812k612187l151907j475385j230405
42131a694136k444441j600797J712654L603700J880129j024585k038246j064666
42123b670388K95828J082852J163765Q10881N66225M96215q5769j260068j914228
42114a514687j571743j219401j039431M14485K858855K896518r02046m129716
$$ plain form
42106 -4207166 -6216020 -3199905 907326 780276 -3003023 -5372793 -3961635 -1517912
42098 -1517912 -1555051 -4450468 -8098336 -10239341 -9647616 -6674156 -3375409 -2209146 -3920792
42089 -3920792 -6771839 -7884581 -5611584 -1196213 2136080 2673048 2349919 3815278
42081 3815278 5954394 5139725 1265835 -902093 1911629 6865490 9191557 8355869
42073 8355869 6981689 5872102 3925505 1741574 1237734 1836198 732079 -2516342
42065 -2516342 -4895455 -4399503 -2804006 -2591826 -3332731 -2910162 -968516 790119 1447791
42056 1447791 2430826 5367247 8847519 8850255 3591720 -3177368 -6072730 -4804921 -3753336
42047 -3753336 -4609477 -3994419 -406924 1459826 -2364339 -7883108 -8467537 -4714042 -2553264
$$ packed form
42106d207166k008854L016115M107231j27050l783299k369770J411158K443723
42098a517912l7139k895417l647868k141005N91725K973460L298747J166263j711646
42089c920792k851047j112742K272997M415371L332293N36968l23129J465359
42081C815278K139116q14669l873890k167928K813722M953861K326067q35688
42073H355869j374180j109587j946597k183931n03840N98464j104119l248421
42065b516342k379113M95952J595497K12180p40905M22569J941646J758635O57672
42056A447791R83035K936421L480272K736n258535o769088k895362J267809J051585
42047c753336q56141O15058L587495J866750l824165n518769n84429L753495K160778
$$ plain form
42038 -2553264 -3136204 -1848497 2601740 5562547 4519639 2798286 2439080 93510
42030 93510 -5769374 -9460117 -5489030 2764114 7656332 7670392 7296049 8396354 7934773
42021 7934773 4336032 788832 818490 4043978 7534816 8960611 7725724 5018200
42013 5018200 3170897 3422884 4412155 4271092 3411514 3346751 3722020 3011370 1601841
42004 1601841 1484132 2937280 4099564 4143238 4487186 6114847 7587892 6753202 3408651
41995 3408651 -334180 -1854878 -319323 2275788 2859503 638428 -2203648 -3641104
41987 -3641104 -3972486 -3845807 -2337072 954572 3753518 3534496 697772 -2907843 -6689036
41978 -6689036 -9689554 -8557091 -1390708 7619243 11995538 10985145 9229904 8729321
$$ packed form
42038b553264n82940J287707M450237K960807j042908j721353l59206k345570
42030I3510n862884l690743L971087Q253144M892218J4060l74343J100305m61581
42021G934773l598741l547200K9658L225488L490838J425795j234887k707524
42013E018200j847303K51987R89271j41063q59578o4763L75269p10650j409529
42004A601841j17709J453148J162284M3674L43948J627661J473045q34690l344551
41995C408651l742831j520698J535555K595111N83715k221075k842076j437456
41987c641104l31382J26679J508735L291644K798946k19022k836724l605615l781193
41978f689036l000518J132463P166383R009951M376295j010393j755241n00583
$$ plain form
41970 8729321 6556514 1569263 -2272411 -2071025 -925092 -3080815 -7421608 -9620066
41962 -9620066 -8611728 -7157585 -7020151 -6846393 -4751358 -832734 3039872 4904520
41954 4904520 4467960 3535487 3770240 4194185 2878811 1011082 2056805 5884179 7411342
41945 7411342 3549402 -1645955 -2129354 1993400 5165684 4018734 721919 -921198
41937 -921198 456145 3808469 7156290 8487213 7050763 4287203 2367381 1898730
41929 1898730 2060568 2388774 3036790 3705889 3636621 2422424 117407 -2644837 -4072279
41920 -4072279 -2410383 1150765 2777686 979318 -819086 871810 4249739 5021743
41912 5021743 3014940 1973684 3323964 4377385 3277266 1789733 1681369 1503738
$$ packed form
41970H729321k172807m987251l841674K01386J145933k155723m340793k198458
41962i620066J008338J454143J37434J73758K095035L918624L872606J864648
41954D904520m36560r32473K34753M23945j315374j867729J045723L827374J527163
41945G411342l861940n195357m83399M122754L172284j146950l296815j643117
41937i21198J377343L352324L347821J330923j436450k763560j919822m68651
41929A898730J61838L28206O48016O69099o9268j214197k305017k762244j427442
41920d072279J661896L561148J626921j798368j798404J690896L377929P72004
41912E021743k006803j041256J350280J053421j100119j487533j08364j77631
$$ plain form
41904 1503738 -917789 -4808514 -7148134 -5951048 -1819160 2667270 4533109 2751949
41896 2751949 -402354 -1585985 -221265 1342399 1485613 1033216 840915 -34014 -2515018
41887 -2515018 -5518663 -7059795 -6276937 -3644156 -378151 1836694 1935488 821008 210698
41878 210698 -102174 -1843888 -4604281 -5101693 -1564886 3255028 5368015 4325532 2832994
41869 2832994 2866934 4247813 6245892 8428277 9951641 9630791 7087194 3196025 -453812
41860 -453812 -2233745 -1469678 458064 823921 -1601894 -4889209 -5950969 -3840116 -482483
41851 -482483 1411620 732851 -1200250 -1931114 -551891 1021547 442397 -1767075 -3029711
41842 -3029711 -2719001 -3013116 -5226598 -7854442 -9407440 -10564922 -11716120 -10900948 -6830337
$$ packed form
41904A503738k421527l890725k339620J197086M131888M486430J865839j781160
41896B751949l154303j183631J364720J563664J43214m52397j92301q74929k481004
41887b515018l003645j541132P82858K632781L266005K214845R8794j114480o10310
41878B10698l12872j741714k760393m97412L536807M819914K112987j042483j492538
41869B832994L3940J380879J998079K182385J523364l20850k543597l891169l649837
41860d53812j779933P64067J927742L65857k425815l287315j061760K110853L357633
41851d82483J894103o78769j933101p30864J379223J573438n79150k209472j262636
41842c029711L10710k94115k213482k627844j552998j157482j151198Q15172M070611
$$ plain form
41833 -6830337 -2139485 -713858 -2796619 -5343222 -6374252 -6415662 -6319712 -6293154 -6682872
41824 -6682872 -7190197 -5657465 -417530 6040796 8550052 5224493 -172225 -2674525
41816 -2674525 -1253038 1237517 1810161 253301 -874397 1071608 5476411 8374980
41808 8374980 6945302 3279143 1764634 3339341 4800855 3734619 1450252 410930
41800 410930 1093604 2356180 3050193 2393202 378240 -1500611 -1587125 -716276 -1688027
41791 -1688027 -5253351 -8352982 -7454400 -2520608 2898354 4472680 239442 -7131530
41783 -7131530 -11393489 -8602520 -2113893 1183563 -163422 -828326 2590417 6181825
41775 6181825 4966101 426292 -2465910 -2766359 -3143218 -3858976 -2693122 -417114 -811161
$$ packed form
41833f830337M690852J425627k082761k546603j031030m1410R5950K6558l89718
41824f682872n07325J532732N239935O458326K509256l325559n396718k502300
41816b674525J421487K490555N72644j556860j127698J946005M404803K898569
41808H374980j429678l666159j514509J574707J461514j066236k284367j039322
41800D10930O82674J262576O94013o56991k014962j878851q6514Q70849r71751
41791a688027l565324l099631Q98582M933792N418962J574326m233238p370972
41783g131530m261959K790969O488627L297456j346985o64904L418743L591408
41775F181825j215724m539809k892202l00449l76859p15758J165854K276008l94047
$$ plain form
41766 -811161 -4141483 -5447762 -1507574 4258119 6504042 4731896 2378562 1188769
41758 1188769 -59956 -1883003 -2432327 -409680 2412997 3107855 1317462 -304422
41750 -304422 463317 2664844 3808163 3535019 3973639 6285883 8772667 9419087 8619126
41741 8619126 7831557 7010735 5393709 3740661 3491707 4367573 5083597 5816759 7379028
41732 7379028 8379184 6297148 1676965 -1777945 -2105397 -1299624 -1617014 -2473057 -2475695
41723 -2475695 -1891587 -1176474 631381 3827604 6254575 5976298 4287178 3712722 4165307
41714 4165307 3426983 697084 -2409779 -3832779 -2452925 1472283 5576286 6420850
41706 6420850 3400322 361000 970791 3828193 5029668 4222815 4318521 5881423 6270359
$$ packed form
41766h11161l330322j306279L940188N765693K245923j772146k353334j189793
41758A188769j248725j823047n49324K022647K822677O94858j790393j621884
41750c04422P67739K201527J143319k73144M38620K312244K486784O46420p99961
41741H619126p87569q20822j617026j653048k48954Q75866P16024P33162J562269
41732G379028J000156k082036m620183l454910l27452Q05773l17390q56043k638
41723b475695N84108P15113J807855L196223K426971k78277j689120n74456M52585
41714D165307p38324k729899l106863j423000J379854L925208M104003Q44564
41706F420850l020528l039322O09791K857402J201475q06853R5706J562902L88936
$$ plain form
41697 6270359 4788431 4104091 5007660 4137226 -420623 -5054505 -5724269 -4225086 -5094829
41688 -5094829 -8071880 -8387483 -4281461 271306 1343827 -143865 -1194565 -1408015
41680 -1408015 -2462266 -4684905 -6631477 -7343827 -6988146 -5590215 -3039317 -486102
41672 -486102 6130 -2017093 -4369747 -4689408 -3247259 -2228645 -2597680 -3091983 -2685763
41663 -2685763 -2621553 -4639025 -7827091 -9026174 -6785412 -3523593 -2802065 -5328157 -8719593
41654 -8719593 -10571550 -10416854 -8871905 -6405924 -3602952 -1639699 -1443403 -2458861
41646 -2458861 -2850024 -1152384 2320156 5702369 7238189 6803065 5733516 5158892 4851570
41637 4851570 4008964 2800320 2482198 3897444 6297868 7861704 7242162 4625161 1451089
$$ packed form
41697F270359j481928o84340R03569q70434m557849m633882o69764J499183q69743
41688e094829k977051l15603M106022M552767J072521j487692j050700k13450
41680a408015j054251k222639j946572p12350L55681J397931K550898K553215
41672d86102M92232k023223k352654l19661J442149J018614l69035m94303M06220
41663b685763O4210k017472l188066j199083K240762L261819P21528k526092l391436
41654h719593j851957J54696J544949K465981K802972J963253J96296j015458
41646b458861l91163J697640L472540L382213J535820m35124j069549n74624l07322
41637D851570q42606j208644l18122J415246K400424J563836o19542k617001l174072
$$ plain form
41628 1451089 -887013 -2079959 -2507274 -2058955 -220465 2325320 3285329 1194925 -2182212
41619 -2182212 -3349580 -1137863 1998610 3240393 2860713 3536992 6811442 11224873
41611 11224873 14026834 14233532 13749981 15456004 20245109 26193844 30636978 32375133
41603 32375133 31526300 28422732 24003239 20428856 19238582 18929813 16413205 11226530
41595 11226530 6239684 3566944 2107313 322958 -956800 -441144 990063 1956997
41587 1956997 3137435 5375665 6746170 4915047 1547061 537005 1986625 1985764 -985409
41578 -985409 -3670052 -3652064 -3218322 -4847492 -6406042 -4670243 -1230211 -600576 -3596901
41569 -3596901 -6652574 -7301218 -6429101 -4942910 -2199471 1123752 2169596 -108070
$$ packed form
41628A451089k338102j192946m27315M48319J838490K545785R60009k090404l377137
41619b182212j167368K211717L136473J241783l79680O76279L274450M413431
41611A1224873K801961K06698m83551J706023M789105N948735M443134J738155
41603C2375133q48833l103568m419493l574383j190274l08769k516608n186675
41595A1226530m986846k672740j459631j784355j279758N15656J431207R66934
41587A956997J180438K238230J370505j831123l367986j010056J449620q61k971173
41578i85409k684643J7988M33742j629170j558550J735799L440032O29635k996325
41569c596901l055673o48644Q72117J486191K743439L323223J045844k277666
$$ plain form
41561 -108070 -2760436 -2826996 -1416336 -1432395 -2782693 -2562911 554010 4528137 6680101
41552 6680101 6396846 4770351 3010334 1876649 1750973 2471436 3296151 3397948 2494263
41543 2494263 1124891 288440 391398 443650 -1085484 -4225944 -6873623 -6708859 -3404405
41534 -3404405 1296926 5024679 5996413 3886193 446814 -1457125 -526132 1665203
41526 1665203 2852654 2894960 3333384 4894814 6922701 8792498 10163222 10062849 7716207
41517 7716207 4500916 3043477 3690948 3767581 1318921 -2166508 -4027731 -3807965 -2846958
41508 -2846958 -1943154 -1215718 -1128682 -1718708 -1770003 -754070 -555380 -2846710 -5688789
41499 -5688789 -5827463 -3912353 -3693206 -5627848 -5553619 -1534679 2064928 629908 -3708851
$$ packed form
41561a08070k652366o6560J410660j6059j350298K19782L116921L974127K151964
41552F680101k83255j626495j760017j133685j25676P20463Q24715J01797r03685
41543B494263j369372q36451J02958N2252j529134l140460k647679J64764L304454
41534c404405M701331L727753R71734k110220l439379j903939R30993K191335
41526A665203J187451M2306M38424J561430K027887J869797J370724j00373k346642
41517G716207l215291j457439O47471P6633k448660l485429j861223K19766R61007
41508b846958R03804P27436Q7036n90026n1295J015933J98690k291330k842079
41499e688789j38674J915110K19147j934642P4229M018940L599607j435020m338759
$$ plain form
41490 -3708851 -5268962 -2992166 -788616 -630064 -361303 1001185 695831 -2779291 -5802895
41481 -5802895 -3975631 1751205 6259165 6455203 3787011 1268890 321111 502453 551992
41472 551992 -717420 -3576775 -7052234 -9548142 -9535556 -6013413 310016 6168450 7963645
41463 7963645 5601289 2311217 -19926 -2801394 -6741812 -9136403 -7981298 -6073482
41455 -6073482 -7117875 -9576432 -8848848 -4632975 -1291278 -863169 -664294 1096784 2112388
41446 2112388 534211 -1327257 -593129 2074803 4547316 6386077 7193371 4935187
41438 4935187 -528873 -4727914 -3422834 1376521 4050421 2843553 871130 517769
41430 517769 935489 1058457 1224116 1225341 113876 -1298185 -766598 1705263 3265078
$$ packed form
41490c708851j560111K276796K203550J58552K68761J362488l05354l475122l023604
41481e802895J827264N726836M507960J96038k668192k518121r47779J81342M9539
41472E51992j269412k859355l475459k495908J2586L522143O323429N858434J795195
41463G963645k362356l290072k331143k781468l940418k394591J155105J907816
41455f073482j044393k458557P27584M215873L341697M28109J98875J761078J015604
41446B112388j578177j861468P34128K667932K472513J838761Q07294k258184
41438D935187n464060m199041J305080M799355K673900j206868j972423l53361
41430E17769M17720J22968J65659J225j111465j412061N31587K471861J559815
$$ plain form
41421 3265078 2132986 -442576 -2805167 -4663880 -5466765 -4132193 -1735321 -1376682
41413 -1376682 -3558489 -4632687 -2124107 1191197 1411359 -658458 -1296746 122946
41405 122946 815300 -296027 -1026094 -34312 819263 -471283 -3025586 -4556595 -4225344
41396 -4225344 -2742784 -979615 250074 74926 -1460810 -2959996 -3262101 -2885003 -2897409
41387 -2897409 -3039918 -2351399 -1351903 -1901292 -4386364 -6474383 -5780842 -2954880 -830276
41378 -830276 -896221 -1971103 -2332290 -1672876 -538166 715776 1566522 1234085 65258
41369 65258 -174421 1209215 2179663 675542 -1817522 -1713992 1770907 5481968 6543479
41360 6543479 5644234 5234778 6137107 7105586 6717491 4760415 2277521 508628 -733817
$$ packed form
41421C265078j132092k575562k362591j858713q02885J334572K396872L58639
41413a376682k181807j074198K508580L315304K20162k069817o38288J419692
41405A22946O92354j111327p30067R91782Q53575j290546k554303j531009L31251
41396d225344J482560J763169J229689j75148j535736j499186l02105L77098j2406
41387b897409j42509O88519R99496n49389k485072k088019O93541K825962K124604
41378h30276o5945j074882l61187O59414J134710J253942Q50746l32437j168827
41369F5258k39679J383636R70448j504121k493064J03530L484899L711061J061511
41360F543479q99245m09456R02329R68479l88095j957076k482894j768893j242445
$$ plain form
41351 -733817 -3097701 -6922915 -9407850 -7830598 -4017209 -2518133 -4187820 -5080097
41343 -5080097 -2707792 204655 12556 -3119322 -6945182 -10311780 -11981694 -9719135
41335 -9719135 -4137763 -475494 -2241093 -5469573 -4038208 1261117 4392227 3541189
41327 3541189 2646881 3360998 2139261 -2574443 -6174454 -4509251 -315209 1080520
41319 1080520 -504304 -913048 1469720 3649062 2616886 -859716 -3559315 -3468677 -1725838
41310 -1725838 -1152679 -2634558 -3679715 -2006883 461667 69314 -2578547 -3060086 -224721
41301 -224721 1623619 -501865 -3737038 -4524394 -4170062 -5392536 -6999685 -6759793 -6582688
41292 -6582688 -9250420 -11985899 -9510318 -2895352 905366 -989205 -3863007 -3531750
$$ packed form
41351g33817k363884l825214k484935J577252L813389J499076j669687q92277
41343e080097K372305K912447j92099l131878l825860l366598j669914K262559
41335i719135N581372L662269j765599l228480J431365N299325L131110q51038
41327C541189q94308P14117j221737m713704l600011J665203M194042J395729
41319A080520j584824m08744K382768K179342j032176l476602k699599R0638J742839
41310a725838N73159j481879j045157J672832K468550l92353k647861m81539K835365
41301b24721J848340k125484l235173p87356L54332j222474j607149K39892J77105
41292f582688k667732k735479K475581O614966L800718j894571k873802L31257
$$ plain form
41284 -3531750 -2375326 -4200188 -7592960 -8328787 -5550088 -1926742 380241 758810
41276 758810 -1160076 -4654255 -6871316 -5685381 -3007797 -2505709 -4362450 -5066524 -2631458
41267 -2631458 572836 1166088 -960826 -2999868 -2717827 -314375 2613287 4671114
41259 4671114 5169514 4091004 2272644 1170430 1544772 2370336 1969163 450326 -148293
41250 -148293 1207996 2871058 3079738 2877485 4382362 7035221 8258402 7676638 7653881
41241 7653881 8905691 8592196 4514885 -1128832 -4351406 -4096650 -2226599 -202778
41233 -202778 1736689 2893162 2241683 369355 -736581 -215212 856788 1442822 1851265
41224 1851265 2505736 2650168 1273988 -1107909 -2452293 -1300506 1264368 2349654
$$ packed form
41284c531750J156424j824862l392772p35827K778699L623346K306983L78569
41276G58810j918886l494179k217061J185935K677584N02088j856741p04074K435066
41267b631458L204294N93252k126914k039042K82041K403452K927662K057827
41259D671114M98400j078510j818360j102214L74342Q25564m01173j518837n98619
41250a48293J356289J663062K08680k02253J504877K652859J223181n81764k2757
41241G653881J251810l13495m077311n643717l222574K54756J870051K023821
41233b02778J939467J156473o51479j872328j105936N21369J072000N86034M08443
41224A851265O54471J44432j376180k381897j344384J151787K564874J085286
$$ plain form
41216 2349654 421572 -2869305 -5082161 -6485236 -9026259 -11902340 -11317423 -6177359
41208 -6177359 -1014402 -322956 -2150283 -1104827 3373337 6102623 3857232 -169396
41200 -169396 -1258937 734078 2549539 2560413 2052885 2628368 4501755 6810262 8062371
41191 8062371 6921317 3928354 1751848 2293564 4140796 4322090 2065431 -689075
41183 -689075 -2055016 -1724829 129820 3462007 7147006 8767060 6939696 3262936
41175 3262936 842681 997221 2231173 2565001 2043561 2188171 3294659 3548920 1553251
41166 1553251 -1298968 -2539396 -2322987 -3279572 -6128117 -7765065 -5444465 -1004547
41158 -1004547 1686742 2402428 4301237 7846231 8680830 3633408 -3714763 -6456760
$$ packed form
41216B349654j928082l290877k212856j403075k541023k876081N84917N140064
41208f177359N162957O91446j827327J045456M478164K729286k245391m026628
41200a69396j089541J993015J815461J0874n07528N75483J873387K308507J252109
41191H062371j141054k992963k176506N41716J847232J81294k256659k754506
41183f89075j365941L30187J854649L332187L684999J620054j827364l676760
41175C262936k420255J54540J233952L33828n21440J44610J106488K54261j995669
41166A553251k852219j240428K16409r56585k848545j636948K320600M439918
41158a004547K691289P15686J898809L544994Q34599n047422p348171k741997
$$ plain form
41150 -6456760 -2389080 4050942 7566135 7133374 5051415 3465427 3172846 4000207 4585564
41141 4585564 2975982 -689242 -2898329 -306885 5631778 9702709 8858701 5030467
41133 5030467 1550206 -604561 -1533819 -175980 3564302 6132722 3746465 -1680495
41125 -1680495 -4015686 -1194235 1949792 1144309 -941645 562108 4492109 5147651
41117 5147651 1064206 -2820632 -2480378 262255 1898914 2431783 3674638 5244880
41109 5244880 5347810 3665510 710771 -3808207 -8877141 -10278757 -4957192 3382962
41101 3382962 7363705 4998928 1570439 1503877 2827038 2079014 609006 1915206 5218242
41092 5218242 6370037 4397603 2771549 3738093 5249026 4845818 3326904 2473009 1639021
$$ packed form
41150f456760M067680O440022L515193m32761k081959j585988k92581Q27361N85357
41141D585564j609582l665224k209087K591444N938663M070931q44008l828234
41133E030467l480261k154767r29258J357839L740282K568420k386257n426960
41125a680495k335191K821451L144027q05483k085954J503753L930001O55542
41117E147651m083445l884838L40254K742633J636659N32869J242855J570242
41109E244880J02930j682300k954739m518978n068934j401616N321565Q340154
41101C382962L980743k364777l428489o6562J323161p48024j470008J306200L303036
41092E218242J151795j972434j626054R66544J510933m03208j518914q53895q33988
$$ plain form
41083 1639021 -681215 -3334141 -3415669 -389219 3090057 4682558 4651545 4100330 2931709
41074 2931709 902656 -684962 -210475 1758059 2812150 1651952 -622313 -2300198
41066 -2300198 -2667884 -1407759 1780621 5625345 6865388 3529059 -1986573 -5239384
41058 -5239384 -4919359 -3526812 -2997801 -2487689 -1270729 -766418 -1718417 -1927049 474827
41049 474827 3389985 3610305 2044067 2446979 5338770 7028853 5280842 2304684 752651
41040 752651 72508 -1056511 -1517625 153268 2357307 2190942 -253430 -2060666 -1624456
41031 -1624456 -239198 389395 68049 -740923 -1821609 -2584311 -1883158 734040 4173782
41022 4173782 6544746 6551607 4544140 2693446 3373152 6387193 8563091 7412947 4461812
$$ packed form
41083A639021k320236k652926q1528L026450L479276J592501l1013n51215j168621
41074B931709k029053j587618M74487J968534J054091j160198k274265j677885
41066b300198l67686J260125L188380L844724J240043l336329n515632l252811
41058e239384L20025J392547N29011N10112J216960N04311r51999k08632K401876
41049D74827K915158K20320j566238M02912K891791J690083j748011k976158j552033
41040G52651o80143j129019m61114J670893K204039j66365k444372j807236M36210
41031a624456J385258O28593l21346q08972j080686p62702P01153K617198L439742
41022D173782K370964O861k007467j850694O79706L014041K175898j150144k951135
$$ plain form
41013 4461812 3165202 4002562 3940064 1052016 -2669172 -4252328 -3661854 -3105963 -3520691
41004 -3520691 -3632211 -2381293 -717871 -340420 -1360253 -1995898 -655789 2112485 4145481
40995 4145481 3990505 2205053 421464 -84353 1146663 3437500 4550794 2114422
40987 2114422 -3227954 -7389140 -7266692 -4471395 -2586881 -1918484 -13015 3062987
40979 3062987 3774905 509332 -3419911 -4151269 -2174662 -613244 -565559 -618590 336050
40970 336050 2158198 4358886 5801558 4478492 -83726 -4877713 -6212342 -4012857
40962 -4012857 -1151734 786678 2252762 2635671 49152 -4797580 -7779743 -6398167
40954 -6398167 -3281592 -2420772 -3739466 -3996954 -1931587 359408 993712 645613 660531
$$ packed form
41013D461812j296610Q37360o2498k888048l721188j583156N90474N55891m14728
41004c520691j11520J250918J663422L77451j019833o35645J340109K768274K032996
40995D145481j54976j785452j783589n05817J231016K290837J113294k436372
40987B114422n342376m161186J22448K795297J884514O68397J905469L076002
40979C062987P11918l265573l929243p31358J976607J561418M7685n3031R54640
40970C36050J822148K200688J442672j323066m562218m793987j334629K199485
40962d012857K861123J938412J466084L82909k586519m846732k982163J381576
40954f398167L116575Q60820j318694k57488K065367K290995O34304l48099J4918
$$ plain form
40945 660531 794608 -47210 -1951056 -3864475 -4668432 -3700461 -883765 2852963 5731525
40936 5731525 6622633 6376792 6942089 8918427 10480973 9203842 4885536 147485 -2063062
40927 -2063062 -1398086 -105078 -104447 -826016 -527280 971694 2180705 2457151 3022421
40918 3022421 4774942 6509162 6551393 5063990 3161386 726783 -2674243 -5188094
40910 -5188094 -3851349 939159 4774857 4510746 2014462 873288 1443911 1624957 915074
40901 915074 647096 977544 753804 208278 786732 2079218 1896987 -10991 -1320470
40892 -1320470 -1212045 -2017797 -5076808 -7738551 -6941423 -3746630 -1625228 -1496614 -1045983
40883 -1045983 1617305 5718282 8927303 9248221 6342059 2174903 -461398 -1115686
$$ packed form
40945F60531J34077q41818j903846j913419q03957R67971K816696L736728K878562
40936E731525Q91108k45841N65297J976338J562546j277131m318306m738051k210547
40927b063062O64976J293008O31p21569K98736J498974J209011K76446N65270
40918C022421J752521J734220M2231j487403j902604k434603l401026k513851
40910e188094J336745M790508L835698k64111k496284j141174N70623J81046p09883
40901I15074k67978L30448k23740n45526N78454J292486j82231j907978j309479
40892a320470J08425q05752l059011k661743P97128L194793K121402J28614M50631
40883a045983K663288M100977L209021L20918k906162m167156k636301o54288
$$ plain form
40875 -1115686 -2118757 -4764622 -6949629 -6439541 -4476552 -3524848 -3108882 -1065514 2224866
40866 2224866 4337690 4904600 5622807 6365594 5071750 1984688 323536 1652551 3826372
40857 3826372 4740240 4939253 5037486 3792738 897605 -1052403 134629 3018807 4862727
40848 4862727 5320333 5586940 5731272 5369061 5447056 6695488 7446799 5709851 2761936
40839 2761936 2107669 4994861 8963689 10742812 9039783 4881115 731273 -1160550
40831 -1160550 -844253 -389416 -456897 1201801 5866616 10324167 10386052 6908584 4656754
40822 4656754 5333680 5619650 2970177 -462686 -1702545 -1609197 -2751885 -4597731 -4195787
40813 -4195787 -1172299 1020264 -336095 -3486426 -4514828 -2439116 -288023 -921011
$$ packed form
40875a115686j003071k645865k185007N10088J962989R51704M15966K043368L290380
40866B224866K112824N66910P18207P42787j293844l087062j661152J329015K173821
40857C826372R13868J99013R8233j244748k895133j950008J187032K884178J843920
40848D862727M57606K66607J44332l62211P7995J248432P51311j736948k947915
40839B761936o54267K887192L968828J779123j703029m158668m149842j891823
40831a160550L16297M54837o7481J658698M664815M457551O1885l477468k251830
40822D656754O76926K85970k649473l432863j239859R3348j142688j845846M01944
40813d195787L023488K192563j356359l150331j028402K075712K151093o32988
$$ plain form
40805 -921011 -3313641 -4319903 -3331470 -3058964 -5248142 -7802629 -7790310 -5807713 -5153684
40796 -5153684 -7310470 -10382428 -11870614 -11070281 -8672714 -5857219 -4110118 -4338463
40788 -4338463 -5707117 -6503139 -6153017 -5163642 -3545486 -1172231 651044 399475 -806380
40779 -806380 -214203 2172768 3144635 1371601 -47827 1836263 5170534 5801778 2737131
40770 2737131 -1452929 -4369746 -5306054 -4036115 -968684 1717675 1643658 -799863 -2945210
40761 -2945210 -3327991 -2757654 -1916381 -163339 2536600 4365190 3557945 609600 -2245351
40752 -2245351 -3127492 -1729637 757398 2532175 2655191 1930976 1815919 2505146 2885325
40743 2885325 2334633 1560835 1440200 1921514 2376371 2287347 1368708 -246837 -1710821
$$ packed form
40805i21011k392630j006262R88433K72506k189178k554487J2319J982597O54029
40796e153684k156786l071958j488186Q00333K397567K815495J747101k28345
40788d338463j368654p96022L50122R89375J618156K373255J823275k51569j205855
40779h06380N92177K386971R71867j773034j419428J884090L334271O31244l064647
40770B737131m190060k916817r36308J269939L067431K686359p4017k443521k145347
40761b945210l82781N70337Q41273J753042K699939J828590q07245k948345k854951
40752b245351q82141J397855K487035J774777J23016p24215j15057O89227L80179
40743B885325n50692p73798j20635M81314M54857q9024r18639j615545j463984
$$ plain form
40734 -1710821 -2048028 -1253667 -197564 568226 1097102 1148854 118727 -1737466 -2989923
40725 -2989923 -2594299 -1136035 -10551 71710 -662648 -1632678 -2126914 -1454233 354355
40716 354355 2075256 2075548 -199902 -3516111 -5636135 -5119987 -2736629 -940756 -1494807
40707 -1494807 -3709301 -5408023 -5254771 -3472290 -813506 1869246 3128756 1660078
40699 1660078 -1697216 -3889187 -2715365 568027 2620982 1689859 -831469 -2296941
40691 -2296941 -1552417 288519 1372541 1131843 665736 1122720 2194273 2730617 2389008
40682 2389008 1730606 932597 -355130 -1799452 -2399082 -2082167 -1878021 -1886318 -656927
40673 -656927 2267852 4655550 4122914 1407789 -772403 -1501911 -2135871 -3081353 -2593155
$$ packed form
40734a710821l37207P94361J056103P65790N28876N1752j030127j856193j252457
40725b989923L95624J458264J125484Q2261p34358r70030m94236O72681J808588
40716C54355J720901K92k275450l316209k120024N16148K383358J795873n54051
40707a494807k214494j698722J53252J782481K658784K682752J259510j468678
40699A660078l357294k191971J173822L283392K052955r31123k521328j465472
40691b296941P44524J840936J084022k40698m66107M56984J071553N36344l41609
40682B389008o58402p98009j287727j444322n99630L16915K04146q297J229391
40673f56927K924779K387698n32636k715125k180192p29508o33960r45482M88198
$$ plain form
40664 -2593155 161740 2764569 2191036 -911344 -2514699 -153343 3792197 4843702
40656 4843702 1953422 -1073273 -148898 4209781 7790384 7907133 5925945 4291507
40648 4291507 3023372 639894 -2680116 -4881538 -4801880 -3523959 -2718598 -2897103 -3689574
40639 -3689574 -4752101 -5695020 -5764298 -4416351 -2223033 -771104 -1253025 -2984456 -3757756
40630 -3757756 -2356699 -366544 -250784 -1760474 -2160415 -521531 622303 -597967
40622 -597967 -2020488 -719193 2391351 4520965 6016618 9171972 12570582 11488704
40614 11488704 4979286 -1848254 -4499451 -4157009 -3840331 -3428686 -1726508 -131281
40606 -131281 -268985 -419652 1551893 3605749 2313029 -1032414 -1777586 1047434 3606920
$$ packed form
40664b593155K754895K602829n73533l102380j603355K361356L945540J051505
40656D843702k890280l026695R24375M358679L580603J16749j981188j634438
40648D291507j268135k383478l320010k201422P9658J277921Q05361j78505p92471
40639c689574j062527r42919o9278J347947K193318J451929m81921j731431p73300
40630c757756J401057J990155J15760j509690l99941J638884J143834j220270
40622e97967j422521J301295L110544K129614J495653L155354L398610j081878
40614A1488704o509418o827540k651197L42442L16678M11645J702178J595227
40606a31281j37704j50667J971545K053856j292720l345443p45172K825020K559486
$$ plain form
40597 3606920 3305070 1515220 -290328 -2641683 -5093418 -5502040 -4147043 -4567903 -7968208
40588 -7968208 -10522626 -9061747 -5972697 -5049615 -5506846 -4164628 -1302078 162354
40580 162354 1805 611788 2009085 1354896 -1933455 -4484788 -3631889 -653083 1984619
40571 1984619 3834494 5261781 5384900 3316903 92788 -2336733 -3155342 -2714027 -1742997
40562 -1742997 -1576994 -3695905 -7501351 -9731572 -7957507 -3989653 -1856927 -2592103
40554 -2592103 -3074094 -605063 3189859 4465782 2205772 -628560 -1035991 649428
40546 649428 2236992 3091429 4183498 5334953 4876183 2616909 781041 488378 -641815
40537 -641815 -5029686 -10621275 -12703165 -9884661 -5576016 -3364565 -3587369 -5118137
$$ packed form
40597C606920l01850j789850j805548k351355k451735m08622J354997m20860l400305
40588g968208k554418J460879L089050R23082m57231J342218K862550J464432
40580A62354j60549O09983J397297o54189l288351k551333Q52899K978806K637702
40571A984619J849875J427287J23119k067997l224115k429521q18609M41315R71030
40562a742997J66003k118911l805446k230221J774065L967854K132726p35176
40554b592103m81991K469031L794922J275923k260010k834332m07431J685419
40546F49428J587564Q54437J092069J151455m58770k259274j835868k92663j130193
40537f41815m387871n591589k081890K818504M308645K211451k22804j530768
$$ plain form
40529 -5118137 -7760673 -11167058 -13310975 -12173130 -8281306 -4226803 -2110134 -2194548
40521 -2194548 -3266180 -3520871 -1898246 674346 2071449 1558140 682034 1015045 2089698
40512 2089698 2337065 1057191 -1296173 -3746881 -5007670 -4314508 -2912556 -3298184 -5794404
40503 -5794404 -7286679 -4966457 -251607 2802942 2346667 326662 -366168 1123893
40495 1123893 3337441 4164700 3001299 1734218 2753254 5577443 7063340 5823048
40487 5823048 4240305 4389096 4385375 1706778 -1764715 -1840177 1645530 4532218 4377839
$$ packed form
40529e118137k642536l406385k143917J137845L891824M054503K116669q4414
40521b194548j071632k54691J622625K572592J397103n13309q76106L33011J074653
40512B089698K47367j279874k353364k450708j260789O93162J401952l85628k496220
40503e794404j492275K320222M714850L054549m56275k020005o92830J490061
40495A123893K213548Q27259j163401j267081J019036K824189J485897j240292
40487E823048j582743J48791l721k678597l471493p5462L485707K886688j54379
$$ [...]
##END NTUPLES=NMR SPECTRUM
##END=
