##TITLE=31Pdec_LR-688B-M-TFA
 CDCl3, 24 sc
 30.7.2019
##JCAMPDX= 6.0         $$ Bruker NMR JCAMP-DX V2.0
##DATA TYPE= NMR SPECTRUM
##DATA CLASS= NTUPLES
##ORIGIN= UXNMR, Bruker Analytische Messtechnik GmbH
##OWNER= root
$$ XWIN-NMR		Version 3.5
$$ Tue Jul 30 16:30:15 2019 Russian Standard Time (UT+4h)  she@DPX200
##.OBSERVE FREQUENCY= 81.013821
##.OBSERVE NUCLEUS= ^31P
##.ACQUISITION MODE= SIMULTANEOUS
##.ACQUISITION SCHEME= undefined
##.AVERAGES= 24
##.DIGITISER RES= 17
##SPECTROMETER/DATA SYSTEM= spect
##.PULSE SEQUENCE= zgpg30
##.SOLVENT NAME= CDCl3
##.SHIFT REFERENCE= (INTERNAL, CDCl3, 0, 182.463)
##AUDIT TRAIL= $$ (NUMBER, WHEN, WHO, WHERE, WHAT)
$$ ##TITLE= Audit trail, XWIN-NMR		Version 3.5
$$ ##JCAMPDX= 5.01
$$ ##ORIGIN= Bruker BioSpin GmbH
$$ ##OWNER= she
$$ F:/spectra/data/she/nmr/P31/1/pdata/1/auditp.txt
$$ ##AUDIT TRAIL=  $$ (NUMBER, WHEN, WHO, WHERE, WHAT)
(   1,<2019-07-30 16:28:45.21 +0400>,<she>,<DPX200>,
      <created by zg, POWCHK disabled, PULCHK disabled
       configuration hash MD5:
       00 E9 B6 7A A2 85 ED C7 34 08 36 98 17 FE 4E 26
       data hash MD5: 32K
       28 A8 49 51 5E 03 8E 50 2D 4D BF A0 94 3C 8D 83>)
(   2,<2019-07-30 16:28:58.37 +0400>,<she>,<DPX200>,
      <Start of raw data processing
       efp BC_mod = 2 LB = 1 FT_mod = 6 PKNL = 1 PHC0 = -379.8266 PHC1 = 101.2 SI = 64K 
       data hash MD5: 64K
       FF 0E E0 02 CA 36 2E 14 39 63 6F 86 E8 C4 64 0A>)
(   3,<2019-07-30 16:29:11.90 +0400>,<she>,<DPX200>,
      <pk PHC0 = -11.86577 PHC1 = -1.8 
       data hash MD5: 64K
       90 5E B1 95 BC C1 F9 7A 98 80 3B 98 D9 9D C1 78>)
(   4,<2019-07-30 16:29:34.39 +0400>,<she>,<DPX200>,
      <pk PHC0 = -197.3602 PHC1 = 581.0003 
       data hash MD5: 64K
       A6 89 D4 90 A8 92 93 C8 F2 72 DF 46 BF A1 F7 B5>)
$$ ##END=
$$ 
$$ hash MD5
$$ 39 C4 09 BD E6 32 E0 66 AF 40 B0 82 23 8A F8 6B
##$RELAX= 
##$RELAX= 
##$RELAX= 
##$RELAX= 
##$RELAX= 
##$RELAX= 
##$RELAX= 
##$RELAX= 
$$ Bruker specific parameters
$$ --------------------------
##$DU= <F:/spectra>
##$EXPNO= 1
##$NAME= <P31>
##$PROCNO= 1
##$TYPE= <nmr>
##$USER= <she>
##$AMP= (0..31)
100 100 100 100 100 100 100 100 100 100 100 100 100 100 100 100 100 100 
100 100 100 100 100 100 100 100 100 100 100 100 100 100 
##$AQSEQ= 0
##$AQ_mod= 1
##$AUNM= <au_zg>
##$AUTOPOS= <>
##$BF1= 81.014009
##$BF2= 200.13
##$BF3= 200.13
##$BF4= 200.13
##$BF5= 200.13
##$BF6= 200.13
##$BF7= 200.13
##$BF8= 200.13
##$BYTORDA= 1
##$CFDGTYP= 0
##$CFRGTYP= 5
##$CHEMSTR= <none>
##$CNST= (0..31)
1 1 145 1 1 1 1 1 1 1 1 1 1 1 1 1 1 1 1 1 1 1 1 1 1 1 1 1 1 1 1 1 
##$CPDPRG= <waltz16>
##$CPDPRG1= <>
##$CPDPRG2= <waltz16>
##$CPDPRG3= <>
##$CPDPRG4= <mlev>
##$CPDPRG5= <mlev>
##$CPDPRG6= <mlev>
##$CPDPRG7= <mlev>
##$CPDPRG8= <mlev>
##$CPDPRGB= <>
##$CPDPRGT= <>
##$D= (0..31)
0 1 0 0 0 0 0 0 0 0 0 0.03 2e-05 3e-06 0 0 0 0 0 0 0 0 0 0 0 0 0 0 0 0 
0 0 
##$DATE= 1564489724
##$DBL= (0..7)
120 120 120 11 120 120 24 19 
##$DBP= (0..7)
150 150 150 150 150 150 150 150 
##$DBP07= 0
##$DBPNAM0= <>
$$ [...]
##$SUBNAM2= <"">
##$SUBNAM3= <"">
##$SUBNAM4= <"">
##$SUBNAM5= <"">
##$SUBNAM6= <"">
##$SUBNAM7= <"">
##$SUBNAM8= <"">
##$SUBNAM9= <"">
##$SW= 369.568048894756
##$SWIBOX= (0..15)
0 1 3 0 0 0 0 0 0 0 0 0 0 0 0 0 
##$SW_h= 29940.119760479
##$TD= 32768
##$TD0= 1
##$TE= 0
##$TE2= 300
##$TE3= 300
##$TEG= 300
##$TL= (0..7)
0 120 53 12 22 120 120 120 
##$TP= (0..7)
150 150 150 150 150 150 150 150 
##$TP07= 0
##$TPNAME0= <>
##$TPNAME1= <>
##$TPNAME2= <>
##$TPNAME3= <>
##$TPNAME4= <>
##$TPNAME5= <>
##$TPNAME6= <>
##$TPNAME7= <>
##$TPOAL= (0..7)
0.5 0.5 0.5 0.5 0.5 0.5 0.5 0.5 
##$TPOFFS= (0..7)
0 0 0 0 0 0 0 0 
##$TUNHIN= 0
##$TUNHOUT= 0
##$TUNXOUT= 0
##$USERA1= <user>
##$USERA2= <user>
##$USERA3= <user>
##$USERA4= <user>
##$USERA5= <user>
##$V9= 5
##$VALIST= <valist>
##$VCLIST= <CCCCCCCCCCCCCCC>
##$VD= 0
##$VDLIST= <DDDDDDDDDDDDDDD>
##$VPLIST= <PPPPPPPPPPPPPPP>
##$VTLIST= <TTTTTTTTTTTTTTT>
##$WBST= 1024
##$WBSW= 4
##$XGAIN= (0..3)
0 0 0 0 
##$XL= 0
##$YL= 0
##$YMAX_a= 15970
##$YMIN_a= -19605
##$ZGOPTNS= <>
##$ZL1= 120
##$ZL2= 120
##$ZL3= 120
##$ZL4= 120
##$ABSF1= 0
##$ABSF2= 0
##$ABSG= 0
##$ABSL= 0
##$ALPHA= 0
##$AQORDER= 0
##$ASSFAC= 0
##$ASSFACI= 0
##$ASSFACX= 0
##$ASSWID= 0
##$AUNMP= <proc_1d>
##$AZFE= 0.1
##$AZFW= 0.5
##$BCFW= 0
##$BC_mod= 2
##$BYTORDP= 0
##$COROFFS= 0
##$CY= -3
##$DATMOD= 1
##$DC= 0
##$DFILT= <>
##$DTYPP= 0
##$F1P= 0
##$F2P= 0
##$FCOR= 1
##$FTSIZE= 65536
##$FT_mod= 6
##$GAMMA= 0
##$GB= 0
##$INTBC= 1
##$INTSCL= 5.30512e-09
##$ISEN= 30
##$LB= 1
##$LEV0= 0
##$LPBIN= 0
##$MAXI= 10000
##$MC2= 0
##$MEAN= 0
##$ME_mod= 0
##$MI= 50
##$NCOEF= 0
##$NC_proc= -6
##$NLEV= 6
##$NOISF1= 182.463
##$NOISF2= 159.3651
##$NSP= 0
##$NTH_PI= 0
##$NZP= 0
##$OFFSET= 182.463
##$PC= 4
##$PHC0= -589.0526
##$PHC1= 680.4003
##$PH_mod= 1
##$PKNL= yes
##$PPARMOD= 0
##$PSCAL= 0
##$PSIGN= 0
##$REVERSE= no
##$SF= 81.0140089999434
##$SI= 65536
##$SIGF1= 159.3651
##$SIGF2= -187.1042
##$SINO= 113.3802
##$SIOLD= 16384
##$SREGLST= <1H.CDCl3>
##$SSB= 0
##$STSI= 65536
##$STSR= 0
##$SW_p= 29940.119760479
##$SYMM= 0
##$S_DEV= 0
##$TDeff= 32768
##$TDoff= 0
##$TI= <>
##$TILT= no
##$TM1= 0
##$TM2= 0
##$TOPLEV= 0
##$USERP1= <user>
##$USERP2= <user>
##$USERP3= <user>
##$USERP4= <user>
##$USERP5= <user>
##$WDW= 1
##$XDIM= 65536
##$YMAX_p= 308317277
##$YMIN_p= -18679219
$$ End of Bruker specific parameters
$$ ---------------------------------
##NTUPLES= NMR SPECTRUM
##VAR_NAME=  FREQUENCY,     SPECTRUM/REAL,   SPECTRUM/IMAG
##SYMBOL=    X,             R,               I
##VAR_TYPE=  INDEPENDENT,   DEPENDENT,       DEPENDENT
##VAR_FORM=  AFFN,          ASDF,            ASDF
##VAR_DIM=   65536,         65536,           65536
##UNITS=     HZ,            ARBITRARY UNITS, ARBITRARY UNITS
##FACTOR=    0.456856943014862, 1,           1
##FIRST=     14782.0589164792, 0,            0
##LAST=      -15158.0608439998, 0,           0
##MIN=       -15158.0608439998, -18679219,   0
##MAX=       14782.0589164792, 308317277,    0
$$ Real data points
##PAGE= N=1
##DATA TABLE= (X++(R..R)), XYDATA
$$ [...]
$$ plain form
45784 1865519 1868007 722260 153484 806521 1401390 1195994 1390732 2873075 4223927
45775 4223927 3679630 1911869 926910 953126 568102 -334191 -38734 2022162 3885132
45766 3885132 3760169 2537228 2215594 3035807 3771935 4032023 4414786 4701793 3840160
45757 3840160 2010933 974220 1645089 2761170 2867828 2345899 2315295 2672162 2722317
45748 2722317 2902522 4021766 5180807 4486961 2034626 204813 334303 930943 323286
45739 323286 -584408 83507 1918634 2613943 1293256 -384957 -643821 376688 1387704
45730 1387704 1532653 740291 -429017 -780097 620900 2853404 3447938 1315392 -1338464
45721 -1338464 -1314093 1594981 4231613 3956260 1723670 515849 1513637 3022541 3064232
$$ packed form
45784A865519K488j145747n68776O53037N94869k05396J94738J482343J350852
45775D223927n44297j767761r84959K6216l85024r02293K95457K060896J862970
45766C885132j24963j222941l21634Q20213P36128K60088L82763K87007q61633
45757C840160j829227j036713O70869J116081J06658n21929l0604L56867N0155
45748B722317J80205J119244J159041o93846k452335j829813J29490N96640o07657
45739C23286r07694O67915J835127O95309j320687j678213k58864J020509J011016
45730A387704J44949p92362j169308l51080J400997K232504N94534k132546k653856
45721a338464K4371K909074K636632k75353k232590j207821R97788J508904M1691
$$ plain form
45712 3064232 1758146 524996 -132957 -887271 -1901600 -2222799 -1329082 -321319 -690969
45703 -690969 -2324029 -3574693 -3233240 -1738252 -377566 144865 133457 248915 694142
45694 694142 1006430 632566 -310632 -1032212 -879756 93130 1414304 2616137 3185031
45685 3185031 2618256 988601 -840087 -1922015 -1942721 -1148013 -107953 319455 -348713
45676 -348713 -1198243 -574213 1550519 2965933 2039415 90810 -428307 811087 2277055
45667 2277055 3266249 4182572 4574619 3405660 1455724 905897 1817304 1500461 -1363857
45658 -1363857 -4229778 -4046740 -1313534 1191217 2302308 2899044 3385502 3047480 1686469
45649 1686469 32812 -1436665 -2633717 -3017438 -2113710 -765596 -433885 -1285438 -2281207
$$ packed form
45712C064232j306086j233150o57953p54314j014329l21199Q93717J007763l69650
45703f90969j633060j250664L41453J494988J360686N22431j1408J15458M45227
45694F94142L12288l73864r43198p21580J52456R72886J321174J201833N68894
45685C185031n66775j629655j828688j081928k0706P94708J040060M27408o68168
45676c48713q49530O24030K124732J415414r26518j948605n19117J239394J465968
45667B277055R89194R16323L92047j168959j949936n49827R11407l16843k864318
45658a363857k865921J83038K733206K504751J111091N96736M86458l38022j361011
45649A686469j653657j469477j197052l83721R03728J348114L31711q51553r95769
$$ plain form
45640 -2281207 -2990683 -3808839 -4417051 -3748099 -1865444 -334718 -101305 -293834 157195
45631 157195 864531 815263 -6009 -740265 -906719 -789209 -801320 -915263 -630074 510215
45621 510215 2092698 2799950 1849417 209990 -528817 -287586 -291375 -796023 -597063 731894
45611 731894 1702001 1005412 -495926 -1098266 -659382 -356333 -641099 -779446 -191019
45602 -191019 895568 2050773 2971510 3279940 2861992 2364263 2555564 3229206 3505094
45593 3505094 3168643 2880417 3033323 3287264 3414538 3712351 4172294 4026828 2780477
45584 2780477 1242213 845521 2039381 3815877 4826371 4616383 3668141 2507361 1149281
45575 1149281 -382323 -1280287 -411396 2079642 4181507 3822475 1171987 -1533869 -2427541
$$ packed form
45640b281207p09476q18156o08212O68952J882655J530726K33413j92529M51029
45631A57195P07336m9268q21272p34256j66454J17510j2111j13943K85189J140289
45621E10215J582483P07252r50533j639427p38807K41231l789n04648J98960J328957
45611G31894R70107o96589j501338o02340M38884L03049k84766j38347N88427
45602a91019J086587J155205R20737L08430m17948m97729J91301O73642K75888
45593C505094l36451k88226J52906K53941J27274K97813M59943j45466j246351
45584B780477j538264l96692J193860J776496J010494k09988r48242j160780j358080
45575A149281j531604q97964Q68891K491038K101865l59032k650488k705856q93672
$$ plain form
45566 -2427541 -1550882 -4271 1381017 2096329 1716438 504533 -373383 -171483 350965
45557 350965 101253 -578934 -539383 112377 131738 -606583 -740311 107928 322979 -1029777
45547 -1029777 -2183232 -1133773 1122207 2074269 1639951 1931993 3187686 2948294 240823
45538 240823 -2200662 -1711388 459748 1359477 778392 776111 1640012 1336554 -812713
45529 -812713 -2579771 -1923949 314392 2008988 2611584 3099300 3940834 4408417 3681029
45520 3681029 1874323 66598 -471078 525467 1758047 1658047 413748 -119803 1117330
45511 1117330 2931700 3477717 2489623 1127016 273596 -42083 63511 569095 1079684
45502 1079684 934328 8719 -1030252 -1388898 -775336 598855 2261847 3646026 4325878
$$ packed form
45566b427541Q76659J546611J385288P15312l79891j211905q77916K01900N22448
45557C50965k49712o80187L9551O51760J9361p38321j33728Q48239K15051j352756
45547a029777j153455J049459K255980R52062m34318K92042J255693k39392k707471
45538B40823k441485M89274K171136Q99729n81085k281Q63901l03458k149267
45529h12713j767058O55822K238341J694596O02596M87716Q41534M67583p27388
45520C681029j806706j807725n37676R96545J232580j00000j244299n33551J237133
45511A117330J814370N46017r88094j362607q53420l15679J05594N05584N10589
45502A079684j45356r25609j038971l58646O13562J374191J662992J384179O79852
$$ plain form
45493 4325878 4304945 3975346 3641635 3101840 1911406 226832 -888289 -556262 546180
45484 546180 724509 -499847 -1614900 -1289512 -357155 -402179 -1103327 -693764 1118156
45475 1118156 2512627 2198156 1065363 553940 766037 1014219 1049959 853042 197338
45466 197338 -700342 -968686 -301083 483606 826612 1386512 2736222 4050434 4093142
45457 4093142 2762606 829880 -982399 -1871517 -1065848 839025 1805874 930110 -34962
45448 -34962 742405 2195742 1913666 -156873 -1796534 -1944798 -1768653 -2219729 -2691050
45439 -2691050 -2595241 -2403982 -2411067 -2022939 -1061462 -488357 -1047822 -2182221 -2919939 -2980030
45429 -2980030 -2542054 -1761017 -882132 -96117 826739 1906318 2137316 651827 -1269423
$$ packed form
45493D325878k0933l29599l33711n39795j190434j684574j115121L32027J102442
45484E46180J78329j224356j115053L25388R32357m5024p01148M09563J811920
45475A118156J394471l14471j132793n11423K12097K48182L5740j96917o55704
45466A97338q97680k68344O67603P84689L43006N59900J349710J314212M2708
45457D093142j330536j932726j812279q89118Q05669J904873R66849q75764r65072
45448c4962P77367J453337k82076k070539j639661j48264J76145m51076m71321
45439b691050R5809J91259p085L88128R61477N73105n59465j134399p37718o0091
45429b980030M37976P81037Q78885P86015R22856J079579K30998j485489j921250
$$ plain form
45420 -1269423 -1009513 2015662 5264579 6070181 4446721 2156685 299133 -1116934
45412 -1116934 -2192343 -2860290 -3053418 -2451550 -667817 1821460 3718786 4377375 4399289
45403 4399289 4344580 3875003 2721389 1393880 263129 -961145 -2136096 -2269808 -1041525
45394 -1041525 452253 1368154 2241798 3394530 3643466 2053885 -241208 -1581421 -2062343
45385 -2062343 -2578469 -2670338 -1385676 513144 1474174 1823916 3126589 5009911 5171314
45376 5171314 3005364 882709 910866 2370410 3432995 3709762 3795977 3640818 2827976
45367 2827976 1692988 997950 1018508 1678499 2840149 3757405 3173528 915750 -1384264
45358 -1384264 -2150012 -1752490 -1553106 -1780101 -1585800 -708923 263403 1049084 1758520
$$ packed form
45420a269423K59910L025175L248917Q05602j623460k290036j857552j416067
45412a116934j075409o67947j93128O01868J783733K489277J897326O58589K1914
45403D399289n4709m69577j153614j327509j130751j224274j174951j33712J228283
45394a041525J493778R15901Q73644J152732K48936j589581k295093j340213m80922
45385b062343n16126r1869J284662J898820R61030L49742J302673J883322J61403
45376E171314k165950k122655K8157J459544J062585K76767Q6215j55159q12842
45367B827976j134988o95038K0558O59991J161650R17256n83877k257778k300014
45358a384264p65748L97522J99384k26995J94301Q76877R72326P85681P09436
$$ plain form
45349 1758520 1905605 755904 -1048976 -1553885 150044 2621584 3865644 3571663 2667461
45340 2667461 1452727 -425398 -2352506 -2666826 -808722 1530802 2347047 1770295 1532562
45331 1532562 2322926 2911253 2088023 340021 -1008434 -1478500 -1469319 -1209697 -615627
45322 -615627 80408 441201 500425 605768 687419 443126 161712 458223 1127120 1241398
45312 1241398 629378 197336 318986 52012 -1150001 -1964133 -802650 1667657 3182778
45303 3182778 2985268 2627403 3231268 3588880 2171893 -135726 -987344 163859 1458489
45294 1458489 1471435 1064775 1643876 2830767 3107515 2128645 1137032 1255293 2385508
45285 2385508 3749652 4574333 4215317 2596854 788452 281219 1288556 2411509 2320115
$$ packed form
45349A758520J47085j149701j804880n04909J703929K471540J244060k93981r04202
45340B667461j214734j878125j927108l14320J858104K339524Q16245n76752k37733
45331A532562P90364N88327q23230j748002j348455m70066R181K59622N94070
45322f15627O96035L60793N9224J05343Q1651k44293k81414K96511O68897J14278
45312A241398o12020m32042J21650k66974j202013q14132J161483K470307J515121
45303C182778j97510l57865O03865L57612j416987k307619q51618J151203J294630
45294A458489J2946m06660N79101J186891K76748r78870r91613J18261J130215
45285B385508J364144Q24681l59016j618463j808402n07233J007337J122953r1394
$$ plain form
45276 2320115 1178037 157525 199505 1505095 3532962 5191833 5745315 5753052 6256517
45267 6256517 6889848 6123914 3904904 2455167 3290978 4871866 4836402 3430377 2719113
45258 2719113 3156562 3249365 2454474 2054989 2726826 3320808 2864791 2055374 1841352 1993017
45248 1993017 2030982 2252064 2820969 3028022 2494136 2049313 2385100 2864877 2720587 2375492
45238 2375492 2430409 2417391 1894739 1736756 2778295 4108501 4470605 4532108 5717305
45229 5717305 7414379 7774426 7108277 7778877 10212048 11692328 10297476 7639817 6040408
45220 6040408 5081518 3156888 823711 -67758 239289 -365768 -2360408 -3872013 -3852895
45211 -3852895 -3579111 -4069173 -4130311 -2419101 131013 1609230 1800673 1895323 2239886
$$ packed form
45276B320115j142078j020512M1980J305590K027867J658871N53482P737N03465
45267F256517O33331p65934k219010j449737Q35811J580888l5464j406025p11264
45258B719113M37449R2803p94891l99485O71837N93982m56017q09417k14022J51665
45248A993017L7965K21082N68905K07053n33886m44823L35787M79777j44290l45095
45238B375492N4917j3018n22652j57983J041539J330206L62104O1503J185197
45229E717305J697074L60047o66149O70600K433171J480280j394852k657659j599409
45220F040408r58890j924630k333177q91469L07047o05057j994640j511605J9118
45211c852895K73784m90062o1138J711210K550114J478217J91443R4650L44563
$$ plain form
45202 2239886 2117496 1497465 1349001 2046673 2789877 2927066 2802990 2963994 3413833
45193 3413833 3947436 4402511 4321921 3182657 1254625 -502376 -1587273 -2203314 -2276102
45184 -2276102 -1341041 254406 1239679 1130700 957490 1593311 2498591 2971640 3402028
45175 3402028 4101377 4100849 2702236 1274245 1626638 3195279 3862536 3261980 3031030
45166 3031030 3644524 3396556 1417073 -347755 432028 3442206 6463415 8016780 7915980
45157 7915980 6165143 3002367 -260152 -1892977 -1445670 -16575 1121816 1538121
45149 1538121 1492497 1461200 1699807 1781387 848271 -1146778 -2853626 -2880205 -1395411 388910
45139 388910 1965856 3706116 5377767 5738653 4118010 1571839 -194390 -551063 10754
$$ packed form
45202B239886j22390o20031j48464O97672P43204J37189j24076J61004M49839
45193C413833N33603M55075q0590j139264j928032j757001j084897o16041p2788
45184b276102R35061J595447R85273j08979j73210O35821R05280M73049M30388
45175C402028O99349n28j398613j427991L52393J568641O67257o00556k30950
45166C031030O13494k47968j979483j764828P79783L010178L021209J553365j00800
45157G915980j750837l162776l262519j632825M47307J429095J138391M16305
45149A538121m5624l1297K38607Q1580r33116j995049j706848k6579J484794J784321
45139C88910J576946J740260J671651L60886j620643k546171j766229l56673N61817
$$ plain form
45130 10754 1087731 2680908 4289825 4709627 3481821 2057544 2468700 4725353 6528110
45121 6528110 6100472 4397897 3536351 3726008 3213713 1144705 -1086981 -1823395 -1176642
45112 -1176642 -299115 331614 888415 1181496 807228 21394 -488557 -624358 -915685
45103 -915685 -1531973 -1883906 -1371253 -188230 763409 738152 -997 -336894 333552 1099383
45093 1099383 650694 -670519 -1040561 264997 1639637 1305311 -276066 -1241619 -892396
45084 -892396 -191528 -38693 -249545 -269281 45553 535750 1015622 1325956 1461056 1541254
45074 1541254 1432669 804766 -94476 -320739 565298 1798398 2558149 3117958 4010077
45065 4010077 4777216 4684866 4117899 3976699 4042318 3338271 1993344 1297290 1725011 2239356
$$ packed form
45130A0754J076977J593177J608917M19802j227806j424277M11156K256653J802757
45121F528110m27638j702575q61546J89657n12295k069008k231686p36414O46753
45112a176642Q77527O30729N56801K93081l74268p85834n09951j35801k91327
45103i15685o16288l51933N12653J183023R51639k5257p39149l35897O70446P65831
45093A099383m48689j321213l70042J305558J374640l34326j581377r65553L49223
45084h92396P00868J52835k10852j9736L14834M90197M79872L10334J35100Q0198
45074A541254j08585o27903q99242k26263Q86037J233100P59751N59809Q92119
45065D010077P67139r2350n66967j41200O5619p04047j344927o96054M27721N14345
$$ plain form
45055 2239356 1955365 1321920 1077954 1019673 572886 -18341 147055 1420720 3000562
45046 3000562 3615453 2825124 1631121 1458617 2334585 2614386 1014783 -1600232 -3159295
45037 -3159295 -2723942 -1192544 -39803 -68398 -1033470 -1784480 -1192273 382503 1137765
45028 1137765 129618 -1251735 -1146143 250333 1314310 1379372 993345 498527 38001
45019 38001 335725 1605005 2303935 1130642 -304209 608488 3142636 3810463 1602719
45010 1602719 -446349 155209 2219706 3697428 4694656 5731472 5620216 3581322 1483832
45001 1483832 1344440 2058852 1205337 -1021195 -2250828 -1562613 -232957 656934 1064766
44992 1064766 701398 -895816 -2904974 -3628558 -2533227 -553443 1441250 3098914
$$ packed form
45055B239356k83991o33445k43966n8281m46787n91227J65396J273665J579842
45046C000562O14891p90329j194003j72504Q75968K79801j599603k615015j559063
45037c159295M35353J531398J152741k8595r65072p51010N92207J574776P55262
45028A137765j008147j381353J05592J396476J063977O5062l86027m94818m60526
45019C8001K97724J269280O98930j173293j434851R12697K534148O67827k207744
45010A602719k049068O01558K064497J477722R97228J036816j11256k038894k097490
45001A483832j39392P14412q53515k226532j229633O88215J329656Q89891M07832
44992A064766l63368j597214k009158p23584J095331J979784J994693J657664
$$ plain form
44984 3098914 3848383 3288279 2193587 1766998 2082316 2484064 2999361 3866671 4258759
44975 4258759 3302175 1999169 2191322 3761853 4823757 4665833 4470881 4906617 5078798
44966 5078798 4409747 3678270 3482243 3282935 2677595 2171359 2056337 1889602 1582717
44957 1582717 1575564 1522139 491082 -976426 -942355 838353 1832616 176604 -2398274
44948 -2398274 -2830228 -790579 1271493 1414840 -59652 -1645539 -1956262 -401251 2142745
44939 2142745 3634908 3019758 1711344 1720351 2723356 2533735 429846 -1648957 -1759948
44930 -1759948 -473832 174629 -583223 -1618095 -1702063 -958613 -280509 46365 522200
44921 522200 1336871 1718441 776959 -1264105 -3122066 -3655543 -2670207 -731865 1269333
$$ packed form
44984C098914P49469n60104j094692m26589L15318M01748N15297Q67310L92088
44975D258759r56584j303006J92153J570531J061904j57924j94952M35736J72181
44966E078798o69051p31477j96027j99308o05340n06236j15022j66735l06885
44957A582717p153n3425j031057j467508L4071J780708R94263j656012k574878
44948b398274m31954K039649K062072J43347j474492j585887l10723J555011K543996
44939B142745J492163o15150j308414R007J003005j89621k103889k078803j10991
44930a759948J286116O48461p57852j034872q3968P43450O78104L26874M75835
44921E22200Q14671L81570r41482k041064j857961n33477R85336J938342K001198
$$ plain form
44912 1269333 2430261 2346222 1491073 714933 380580 401983 889212 1973742 3056631
44903 3056631 3174065 2320136 1542043 1437654 1446726 1043729 710728 1043487 1615776 1572695
44893 1572695 968897 754464 1508298 2651581 2964644 1828806 76452 -629634 284805
44884 284805 1355478 877421 -663050 -1218219 -210322 654743 84928 -896080 -740826
44875 -740826 244506 592603 -155031 -1203371 -1781129 -1615179 -769305 53801 -168050
44866 -168050 -1159698 -1009001 1282399 3877899 4359192 3112505 2552848 3485330 4435628
44857 4435628 4545752 4786792 5711385 6161986 5338582 4437145 4838727 5919710 6119323
44848 6119323 5271695 4358555 3533242 2020291 -86364 -1418805 -1178765 -351746 -438316
$$ packed form
44912A269333J160928q4039q55149p76140l34353K1403M87229J084530J082889
44903C056631J17434q53929p78093j04389R072m02997l33001L32759N72289m3081
44893A572695o03798k14433P53834J143283L13063j135838j752354p06086R14439
44884B84805J070673m78057j540471n55169J007897Q65065n69815r81008J55254
44875g40826R85332L48097p47634j048340n77758J65950Q45874Q23106k21851
44866a68050r91648J50697K291400K595500M81293j246687n59657R32482R50298
44857D435628J10124K41040R24593M50601q23404r01437M01582J080983J99613
44848F119323q47628r13140q25313j512951k106655j332441K40040Q27019q6570
$$ plain form
44839 -438316 -1592924 -2692489 -2940612 -2701268 -2670514 -2782427 -2342459 -1046931 560182
44830 560182 1693567 2076630 1998996 1920796 2152515 2661221 3072767 3143601 3269685 4052507
44820 4052507 5223960 5660711 4868867 3792198 3493010 3591653 2893182 1232461 -277763
44811 -277763 -773233 -488649 60582 917995 2300183 3834126 4573758 3745378 1557933
44802 1557933 -617875 -1267961 -325275 672050 531709 -26725 417256 1718672 2336010
44793 2336010 1652737 854945 1246707 2767334 4511655 5730853 5938074 4989875 3533086
44784 3533086 2488113 1672546 -36451 -2610919 -4129774 -3136668 -809242 479338
44776 479338 173517 -221808 366434 1219413 1133565 -20866 -1478069 -2569339 -3067669
$$ packed form
44839d38316j154608j099565k48123K39344L0754j11913M39968J295528J607113
44830E60182J133385L83063p7634p8200K31719N08706M11546P0834J26084P82822
44820D052507J171453M36751p91844j076669k99188R8643o98471j660721j510224
44811b77763m95470K84584N49231Q57413J382188J533943P39632q28380k187445
44802A557933k175808o50086R42686R97325j40341n58434M43981J301416O17338
44793B336010o83273p97792L91762J520627J744321J219198K07221r48199j456789
44784C533086j044973q15567j708997k574468j518855R93106K327426J288580
44776D79338l05821l95325N88242Q52979q5848j154431j457203j091270m98330
$$ plain form
44767 -3067669 -2952231 -2202365 -763032 1206837 2901627 3143407 1731700 200147 304231
44758 304231 1810024 2822576 2478728 2095553 3006353 4406671 4526700 3233305 2047676
44749 2047676 1809290 1792005 1345517 983169 1162875 1181268 326009 -660455 -429069 1093691
44739 1093691 2750453 3772254 4231822 4070937 2962689 1300575 134320 -234013 -528224
44730 -528224 -989560 -750663 602572 1874956 1607950 -77657 -1789414 -2437861 -1812123
44721 -1812123 -265801 1334777 1924255 1359484 776765 1127698 1939540 2237848 1950498
44712 1950498 1536191 1048234 582762 743143 1437632 1235575 -503265 -1878847 -870704
44703 -870704 1309890 1801308 625168 712794 3109386 5216686 4928765 3690531 3641998
$$ packed form
44767c067669J15438P49866J439333J969869J694790K41780j411707j531553J04084
44758C04231J505793J012552l43848l83175R10800J400318J20029j293395j185629
44749B047676k38386j7285m46488l62348J79706J8393q55259r86464K31386J522760
44739A093691J656762J021801M59568j60885j108248j662114j166255l68333k94211
44730e28224m61336K38897J353235J272384k67006j685607j711757o48447O25738
44721a812123J546322J600578N89478n64771n82719L50933Q11842K98308k87350
44712A950498m14307m87957m65472J60381O94489k02057j738840j375582J008143
44703h70704K180594M91418j176140Q7626K396592K107300k87921j238234m8533
$$ plain form
44694 3641998 4092171 3190973 1460836 1073053 2408362 3664708 3625663 2904198 2457439
44685 2457439 2446645 2706637 3137421 3491372 3604159 3723599 3915353 3562449 2299826
44676 2299826 956077 593487 1059953 1491349 1779767 2446462 3460925 4313105 4910784
44667 4910784 5300307 4905685 3305129 1471667 914453 1690624 2463271 2391115 1764077
44658 1764077 956775 77255 -444463 -276101 -125453 -847248 -1691027 -1112121 531138
44649 531138 977372 -643610 -2327778 -2042718 -539469 31725 -743639 -1271100 -345620
44640 -345620 1383890 2301087 1539586 -71329 -578847 1067927 3404994 3717160 1308289
44631 1308289 -1443191 -1937612 -353254 1061497 932488 -38819 -381791 593365 2372783
$$ packed form
44694C641998M50173r01198j730137l87783J335309J256346l9045p21465m46759
44685B457439j0794K59992M30784L53951J12787J19440J91754l52904j262623
44676B299826j343749l62590M66466M31396K88418O66695J014463Q52180N97679
44667D910784L89523l94622j600556j833462n57214P76171P72647p2156o27038
44658A764077q07302q79520n21718J68362J50648p21795q43779N78906J643259
44649E31138M46234j620982j684168K85060J503249N71194p75364n27461R25480
44640c45620J729510R17197p61501j610915n07518J646774K337067L12166k408871
44631A308289k751480m94421J584358J414751j29009r71307l42972R75156J779418
$$ plain form
44622 2372783 3689181 3579961 2441152 1654461 1806710 1974691 1375382 858568 1664121
44613 1664121 3248962 3675123 2111710 -149540 -1290347 -659009 1245236 3489295
44605 3489295 4992251 4912402 3478461 2135271 2247241 3612115 4631909 4167594 3034171
44596 3034171 3206150 5334159 7552289 7450267 5005024 2585919 1968365 2515152 2803174
44587 2803174 2748643 2999377 3225528 2586709 1451957 1037355 1399159 1412278 1002760 1685140
44577 1685140 4031928 6084445 5684560 3521243 2290692 3128294 4423559 4387586 3351934
44568 3351934 2717786 2657604 2104820 695382 -510974 -491546 476644 1494377 2271273
44559 2271273 3011384 3570377 3567305 3151475 2857723 2708459 2197019 1228515 346966 -91826
$$ packed form
44622B372783J316398j09220j138809p86691J52249J67981n99309n16814Q05553
44613A664121J584841M26161j563413k261250j140807O31338J904245K244059
44605C489295J502956p9849j433941j343190J11970J364874J019794m64315j133423
44596C034171J71979K128009K218130j02022k445243k419105o17554N46787K88022
44587B803174n4531K50734K26151o38819j134752m14602L61804J3119m09518O82380
44577A685140K346788K052517l99885k163317j230551Q37602J295265l5973j035652
44568C351934o34148o0182n52784j409438j206356J9428R68190J017733P76896
44559B271273P40111N58993l072m15830k93752j49264n11440r68504q81549m38792
$$ plain form
44549 -91826 -198521 181250 1563965 3731230 5361005 5430807 4415210 3491386 3136439
44540 3136439 3137601 3334014 3485199 2906833 1243691 -620233 -1348355 -788955 -63237
44531 -63237 -60998 -532989 -672412 -36669 1078725 1808132 1524318 834844 1180980 2853906
44521 2853906 4216516 3899317 2957833 3366637 4909391 5420035 4089756 2623640 2651102
44512 2651102 3704944 4499540 4681998 4402882 3515511 2279753 1725924 2217971 2659633
44503 2659633 2226116 1862987 2772303 4312720 4918860 4489779 4260059 4602747 4562664
44494 4562664 3618706 2474459 1779018 1209488 271596 -795782 -1307710 -832632 478487
44485 478487 1776833 1875835 397550 -1543200 -2442157 -1970455 -727631 1110436 3696229
$$ packed form
44549i1826j06695L79771J382715K167265J629775O9802j015597r23824l54947
44540C136439J162J96413J51185n78366j663142j863924p28122N59400P25718
44531f3237K239m71991j39423O35743J115394P29407k83814o89474L46136J672926
44521B853906J362610l17199r41484M08804J542754N10644j330279j466116K7462
44512B651102J053842P94596J82458k79116q87371j235758n53829M92047M41662
44503B659633m33517l63129R09316J540417O06140m29081k29720L42688m0083
44494D562664r43958j144247o95441n69530r37892j067378n11928M75078J311119
44485D78487J298346R9002j478285j940750q98957M71702J242824J838067K585793
$$ plain form
44476 3696229 6223496 7172605 6220175 4768419 4101934 4004660 3703410 3200864 2949381
44467 2949381 2909875 2662515 2038787 1185484 410199 201197 811399 1635535 1789609 1542922
44457 1542922 2139180 3721996 4629856 3640279 1842120 1066227 1294335 1083167 36046
44448 36046 -790434 -864119 -934478 -1432415 -1502272 -344662 1494202 2993551 4088455 5362408
44438 5362408 6768778 7534346 7187174 5973335 4315136 2547548 1257166 1099624 1821764
44429 1821764 2050753 825190 -886279 -1083053 738069 2904521 3878217 4208293 5164668
44420 5164668 6300678 6043757 4481441 3652348 4581106 5767981 5545648 4351540 3380705
44411 3380705 2466374 1097557 402280 1823338 4266785 4952796 3301106 1757002 2122048
$$ packed form
44476C696229K527267R49109r52430j451756o66485r7274l01250n02546k51483
44467B949381l9506k47360o23728q53303p75285k09002O10202Q24136J54074k46687
44457A542922N96258J582816R07860r89577j798159p75893K28108k11168j047121
44448C6046q26480p3685p0359m97937o9857J157610J838864J499349J094904J273953
44438E362408J406370P65568l47172j213839j658199j767588j290382j57542P22140
44429A821764K28989j225563j711469j96774J821122K166452R73696L30076R56375
44420E164668J136010k56921j562316q29093R28758J186875k22333j194108r70835
44411C380705r14331j368817o95277J421058K443447O86011j651690j544104L65046
$$ plain form
44402 2122048 3141228 2888024 1816478 1803977 3169167 4288564 3831681 2149297 567635
44393 567635 171610 1160202 2738946 3753575 3805697 3434382 3001058 2160029 920090
44384 920090 284806 903106 1825648 1746441 961637 831334 1602468 2169121 2041060 2140750
44374 2140750 3138542 4107577 3655470 1828032 168855 66140 1438195 2949339 3315909
44365 3315909 2448147 1305652 607314 52431 -828417 -1539644 -1198858 -146042 5628
44356 5628 -1729326 -4458893 -6470253 -6956950 -6246864 -4891197 -3270484 -1883020 -1211320
44347 -1211320 -1021877 -259673 1870427 4732279 6560553 6219010 4486736 3201707 3161363
44338 3161363 3405367 2770210 1543091 1004965 1669435 2645906 2739091 1721366 470773
$$ packed form
44402B122048J019180k53204j071546j2501J365190J119397m56883j682384j581662
44393E67635l96025R88592J578744J014629N2122l71315m33324q41029j239939
44384I20090o35284O18300R22542p9207p84804j30303P71134N66653j28061R9690
44374B140750R97792R69035m52107j827438j659177j02715J372055J511144L66570
44365C315909q67762j142495o98338n54883q80848p11227L40786J052816J51670
44356E628j734954k729567k011360m86697P10086J355667J620713J387464O71700
44347a211320J89443P62204K130100K861852J828274l41543j732274j285029m0344
44338C161363K44004o35157j227119n38126O64470R76471R3185j017725j250593
$$ plain form
44329 470773 107183 928871 2046097 2286194 1564504 886937 814977 719361 84966 -355512
44319 -355512 235462 1283086 1691547 1688897 2281690 3214240 3226657 2365155 2158749 3065457
44309 3065457 3583021 2669625 1292267 522724 -160158 -1201428 -1225023 989325 3830953
44300 3830953 4462746 2704268 1094909 1065747 1283004 395940 -637725 -256704 1092968
44291 1092968 1632704 885760 179744 590442 1546567 1851440 1393077 1240934 2163658
44282 2163658 3533917 4038864 3355691 2624530 3022646 4331011 5411131 5745276 5763463
44273 5763463 5744818 5253316 3966099 2444711 1613349 1734682 2209817 2239769 1531800
44264 1531800 507935 -107052 -17636 422055 912102 1799438 3379556 4815252 4702143
$$ packed form
44329D70773l63590Q21688J117226K40097p21690o77567p1960r5616o34395m40478
44319c55512N90974J047624M08461k650N92793R32550J2417q61502k06406R06708
44309C065457N17564r13396j377358p69543o82882j041270k3595K214348K841628
44300C830953O31793j758478j609359k9162K17257q87064j033665L81021J349672
44291A092968N39736p46944p06016M10698R56125L04873m58363j52143R22724
44282B163658J370259N04947o83173p31161L98116J308365J080120L34145J8187
44273E763463j8645m91502j287217j521388q31362J21333M75135K9952p07969
44264A531800j023865o14987Q9416M39691M90047Q87336J580118J435696j13109
$$ plain form
44255 4702143 2995482 1503490 1823889 3397881 4398481 4136904 3612247 3752549 4185502
44246 4185502 4169244 3863821 3869754 3997436 3499984 2464192 1930731 2296545 2589126 2079460
44236 2079460 1769877 3032076 5158375 5809645 4155037 2125789 1824190 2906845 3596111
44227 3596111 3308642 2915702 3005998 3406985 4188578 5564529 6671666 6031468 3798861
44218 3798861 2175405 2674706 4045128 4035101 2480210 1334708 1916790 3395764 4201710
44209 4201710 3924374 3306733 2980249 2846841 2543280 2017928 1503381 1113767 680251
44200 680251 60850 -473508 -343883 751642 2415733 3768999 4069810 3169511 1514493
44191 1514493 -200715 -1416175 -1835558 -1337168 279 1715014 3087606 3730644 3943530
$$ packed form
44255D702143j706661j491992L20399J573992J000600k61577n24657J40302M32953
44246D185502j6258l05423N933J27682m97452j035792n33461L65814K92581n09666
44236B079460l09583J262199K126299O51270j654608k029248l01599J082655O89266
44227C596111k87469l92940R0296M00987P81593J375951J107137o40198k232607
44218C798861j623456M99301J370422j0027j554891j145502N82082J478974Q05946
44209D201710k77336o17641l26484j33408l03561n25352n14547l89614m33516
44200F80251o19401n34358J29625J095525J664091J353266L00811r00299j655018
44191A514493j715208j215460m19383M98390J337447J714735J372592O43038K12886
$$ plain form
44182 3943530 4248035 4683282 4804498 4267879 3162264 1887030 969982 833867 1390610
44173 1390610 2010113 2269927 2568020 3520352 4892122 5716041 5465788 4534302 3502888
44164 3502888 2557507 1788964 1447380 1554616 1688400 1463449 931407 337479 -157373
44155 -157373 -356513 -43465 662556 1318933 1718421 2103205 2672306 3226030 3442926 3195349
44145 3195349 2558497 1892032 1820658 2495784 2874534 1576083 -1263058 -3769470 -4368103
44136 -4368103 -3320333 -1815885 -390044 1008437 2061772 2212158 1547937 780276 345998
44127 345998 25612 -576238 -1448613 -1958071 -1198554 976968 3251374 3986551 3334853
44118 3334853 3221154 4707817 6507395 6975216 6402806 6014029 5688319 4452380 2700120
$$ packed form
44182C943530L04505M35247J21216n36619j105615j275234r17048j36115N56743
44173A390610O19503K59814K98093R52332J371770Q23919k50253r31486j031414
44164C502888r45381p68543l41584J07236J33784k24951n32042n93928m94852
44155a57373j99140L13048P06021O56377L99488L84784N69101N53724K16896k47577
44145C195349o36852o66465p1374O75126L78750j298451k839141k506412n98633
44136d368103J047770J504448J425841J398481J053335J50386o64221p67661m34278
44127C45998l20386o01850q72375n09458P59517K175522K274406P35177o51698
44118C334853j13699J486663J799578M67821n72410l88777l25710j235939j752260
$$ plain form
44109 2700120 1989540 2653728 3400460 3509224 3705833 4393751 4667413 3814425 2350229
44100 2350229 761546 -1314575 -3609950 -4364745 -2485152 382704 1561196 592545
44092 592545 -732833 -1215158 -1461708 -2239706 -3187306 -3624394 -3444828 -2673261 -1171888
44083 -1171888 585045 1376812 722660 -124928 442288 2385196 4213334 4923776 4839008
44074 4839008 4551962 4056388 3357276 3125799 3887851 4853058 4482315 2471010 497326
44065 497326 427633 2064105 3324587 2720363 1063192 338738 1288751 2736258 3243575
44056 3243575 2709951 1942907 1234249 199366 -1041331 -1434446 -223966 1943499 3726510
44047 3726510 4531513 4629324 4208467 3248054 2275201 2191458 2995239 3553877 3124901 2299757
$$ packed form
44109B700120p10580O64188P46732J08764J96609O87918K73662q52988j464196
44100B350229j588683k076121k295375p54795J879593K867856J178492r68651
44092E92545j325378m82325k46550p77998r47600m37088J79566P71567J501373
44083a171888J756933P91767o54152q47588N67216J942908J828138P10442q4768
44074D839008k87046m95574o99112k31477P62052R65207l70743k011305j973684
44065D97326o9693J636472J260482o04224j657171p24454R50013J447507N07317
44056C243575n33624p67044p08658j034883j240697l93115J210480K167465J783011
44047C726510Q05003R7811m20857r60413r72853q3743Q03781N58638m28976q25144
$$ plain form
44037 2299757 1889614 1785536 1759941 2473389 4384097 6263361 6389980 5079232 4396029
44028 4396029 5151710 5854570 5246456 4232048 4154115 4501077 3892707 2538690 2021478
44019 2021478 2863804 3802517 3583234 2292693 770147 -237347 -180008 974631 2288815
44010 2288815 2713006 2594525 3212530 4556389 4984159 3772308 2543802 2971471 4306650
44001 4306650 4781711 4530372 5125768 6628523 7300542 6511043 5822221 6376814 7066125
43992 7066125 6542361 5508342 5385151 5838236 5559989 4951839 5995429 9339571 13242192
43983 13242192 15875735 17243049 18098720 18177465 16571754 13333146 9837401 7684121
43975 7684121 7568810 8905418 10250621 10465558 9795269 9573598 10732622 12896405 14900506
$$ packed form
44037B299757m10143j04078k5595P13448J910708J879264J26619j310748o83203
44028D396029P55681P02860o08114j014408p7933L46962o08370j354017n17212
44019B021478Q42326R38713k19283j290541j522546j007494N7339J154639J314184
44010B288815M24191j18481O18005J343859M27770j211851j228506M27669J335179
44001D306650M75061k51339N95396J502755O72019p89499o88822N54593O89311
43992G066125n23764j034019j23191M53085k78247o08150J043590L344142L902621
43983A3242192K633543J367314Q55671P8745j605711l238608l495745k153280
43975G684121j15311J336608J345203K14937o70289k21671J159024K163783K004101
$$ plain form
43966 14900506 15686487 14736504 12403816 9990171 8717554 8362017 7711674 6650074 6709016
43957 6709016 8849855 11649047 12757538 11649667 9902606 9026155 8985053 8848106 8103444
43948 8103444 7119754 6664822 7019676 7492292 7141958 6139784 5839991 7135527 9341576
43939 9341576 11185293 12249987 12789304 12736137 11783006 10149858 8550929 7574591 7489784
43930 7489784 8203493 8996822 8965269 8231431 7929806 8441029 8750657 8432188 8944156 11486104
43920 11486104 14633291 15906618 14974932 13440991 12093569 10541851 9222848 9289311
43912 9289311 10230375 9927673 7742793 5512535 4713656 4633826 4350444 4566245 6044836
43903 6044836 7782405 8370491 8121662 8323003 9128592 9564733 9117526 8175524 7314686
$$ packed form
43966A4900506P85981r49983k332688k413645j272617l55537o50343j061600N8942
43957F709016K140839K799192J108491j107871j747061q76451m1102j36947p44662
43948H103444r83690m54932L54854M72616l50334j002174k99793J295536K206049
43939I341576J843717J064694N39317n3167r53131j633148j598929r76338q4807
43930G489784P13709P93329l1553p33838l01625N11223L09628l18469N11968K541948
43920A1486104L147187J273327r31686j533941j347422j551718j319003O6463
43912I289311R41064l02702k184880k230258p98879p9830k83382K15801J478591
43903F044836J737569N88086k48829K01341Q05589M36141m47207r42002q60838
$$ plain form
43894 7314686 7071713 7959673 9810529 11482731 12004697 11697113 11584161 12118366 13038027
43885 13038027 14022048 14894096 15473981 15597875 15034893 13419609 10910498 8848327 8747779
43876 8747779 10400637 11938624 12060306 11262350 10622573 10387963 10153011 9631374 9013947
43867 9013947 9100824 10692510 13091134 14218799 13598891 13730694 16171415 17981323 15802854
43858 15802854 12245671 13178342 18764870 22996325 23278048 24201056 29335001 35868741
43850 35868741 41360612 49324589 63046000 80917558 104954964 145579226 204833546
43843 204833546 258493288 270909962 232089683 169278803 117244922 86861083 68081168
43836 68081168 52241478 39778264 31490498 24576191 17983882 13873735 12564706 11378171
$$ packed form
43894G314686k42973Q87960J850856J672202N21966l07584j12952N34205R19661
43885A3038027R84021Q72048N79885J23894n62982j615284k509111k062171j00548
43876H747779J652858J537987J21682p97956o39777k34610k34952n21637o17427
43867I013947Q6877J591686K398624J127665o19908J31803K440721J809908k178469
43858A5802854l557183R32671N586528M231455K81723R23008N133945O533740
43850C5868741N491871P963977J3721411J7871558K4037406M0624262N9254320
43843B04833546N3659742J2416674l8820279o2810880n2033881l0383839j8779915
43836F8081168j5839690j2463214q287766o914307o592309m110147j309029j186535
$$ plain form
43828 11378171 9085759 7055509 5747402 4148728 2796615 3408720 5261318 5697185
43820 5697185 4643049 5001400 7863862 10716426 11389654 10783972 10482591 10268116 9403448
43811 9403448 8401534 8238877 9114953 10634841 12017417 12032963 10225885 8116268 7503039
43802 7503039 7807613 7064406 5240911 4156013 4125410 3391885 1357542 -245857 -208217
43793 -208217 558784 1174197 2192489 3807436 4913037 5124347 5533667 6218946 5364083
43784 5364083 2522346 489288 1740220 4750655 6176902 5362067 4321145 4244886 4489803
43775 4489803 4640151 5344217 6992831 9141386 11231607 12626462 12247758 9644423 6304125
43766 6304125 4517162 4846268 5783141 5855541 5041693 4155759 3825380 4111435 4386224
$$ packed form
43828A1378171k292412k030250j308107j598674j352113O12105J852598M35867
43820E697185j054136L58351K862462K852564O73228o05682l01381k14475q64668
43811I403448j001914j62657Q76076J519888J382576J5546j807078k109617o13229
43802G503039L04574p43207j823495j084898l0603p33525k034343j603399L7640
43793b08217P67001O15413J018292J614947J105601K11310M09320O85279q54863
43784E364083k841737k033058J250932L010435J426247q14835j040922p6259K44917
43775D489803J50348P04066J648614K148555K090221J394855l78704k603335l340298
43766F304125j786963L29106R36873P2400q13848q85934l30379K86055K74789
$$ plain form
43757 4386224 3714812 2038762 677537 912081 2444574 4025995 5107748 5969693 6752772
43748 6752772 7447131 8433428 9979871 11589458 12821626 14205789 16316538 18771488
43740 18771488 21442641 25590162 32053327 39736087 48713098 63481177 88134445 116932787
43732 116932787 134367511 128686359 103751512 74605721 52814417 39174987 29148534
43725 29148534 20459364 13933037 10298458 8876877 8417819 7716834 6036336 3798244
43717 3798244 2240964 1879056 2072734 2395894 3240600 4550383 5292816 5013391 4627872
43708 4627872 4711002 4422199 3449436 3478504 5702020 8065195 7631751 5155642 4293036
43699 4293036 6012392 6995538 4867325 1987905 1694496 3106271 2837855 601398 -456218
$$ packed form
43757D386224o71412j676050j361225K34544J532493J581421J081753Q61945P83079
43748F752772O94359R86297J546443J609587J232168J384163K110749K454950
43740A8771488K671153M147521O463165P682760Q977011J4768079K4653268K8798342
43732A16932787J7434724n681152k4934847k9145791k1791304j3639430j0026453
43725B9148534q689170o526327l634579j421581m59058p00985j680498k238092
43717C798244j557280l61908J93678L23160Q44706J309783P42433k79425l85519
43708D627872Q3130k88803r72763K9068K223516K363175m33444k476109q62606
43699D293036J719356R83146k128213k879420k93409J411775k68416k236457j057616
$$ plain form
43690 -456218 1078530 2835534 2818001 2690684 4974262 8947490 11665686 11987265 11290546
43681 11290546 10609559 9348697 7212760 5492212 5424875 6474828 7310404 7722148 8441299
43672 8441299 9446173 9659661 8521125 6966907 6336348 6756102 7116625 6458813 4947770
43663 4947770 3536313 3088152 3901887 5644729 7398463 8038982 7168745 5868678 6071412
43654 6071412 8614356 11882747 12906445 10233367 5575113 2226898 1888760 3390206
43646 3390206 4435178 3935537 2432662 1052224 781729 2219283 4954376 7251159
43638 7251159 7357022 5410399 3342764 2696848 3268959 4042779 4473246 4425724 3892214
43629 3892214 3526336 4546448 7099191 9388794 9522924 7747209 5790919 4528741
$$ packed form
43690d56218J534748J757004j7533j27317K283578L973228K718196L21579o96719
43681A1290546o80987j260862k135937j720548o7337J049953Q35576M11744P19151
43672H441299J004874K13488j138536j554218o30559M19754L60523o57812j511043
43663D947770j411457m48161Q13735J742842J753734O40519q70237j300067K02734
43654F071412K542944L268391J023698k673078m658254l348215l38138J501446
43646C390206J044972m99641j502875j380438k70495J437554K735093K296783
43638G251159J05863j946623k067635o45916N72111P73820M30467m7522n33510
43629C892214l65878J020112K552743K289603J34130j775715j956290j262178
$$ plain form
43621 4528741 3631181 3164908 3810338 5220160 5763328 4675111 3281664 3164412 3984211
43612 3984211 4170075 3246495 2430301 3035448 5073099 7461526 9036365 9269697 8470327
43603 8470327 7491001 6995374 6839330 6314578 5163151 4211896 4599591 6172214 7089817
43594 7089817 5710382 2762273 787824 1227311 2965067 4146363 4318927 4009209 3406138
43585 3406138 2818685 3445199 5864033 8279631 8260707 6117988 4552515 4811843 5345115
43576 5345115 4771514 3885126 3623179 3201997 1936491 1170315 2344308 4294754 4589739
43567 4589739 2926212 1256267 901438 1393315 2052017 2900397 3752838 3903572 3172198
43558 3172198 2184458 1376462 756142 777066 2193922 4589291 6149884 5657525 4030198
$$ packed form
43621D528741q97560m66273O45430J409822N43168j088217j393447j17252Q19799
43612C984211J85864r23580q16194O05147K037651K388427J574839K33332p99370
43603H470327r79326m95627j56044n24752j151427r51255L87695J572623R17603
43594G089817j379435k948109j974449M39487J737756J181296J72564l09718o03071
43585C406138n87453O26514K418834K415598j8924k142719j565473K59328N33272
43576E345115n73601q86388k61947m21182j265506p66176J173993J950446K94985
43567D589739j663527j669945l54829M91877O58702Q48380Q52441J50734p31374
43558C172198r87740q07996o20320K0924J416856K395369J560593m92359j627327
$$ plain form
43549 4030198 3208232 3930715 5216740 5872251 6006542 6860046 9170385 11927061 13169397
43540 13169397 12142159 10162742 9020824 9009259 9009809 8089242 6458730 5169410 5276240
43531 5276240 6879516 8622340 8760970 7203207 5709724 5484634 5585049 4691222 3402958
43522 3402958 3312036 4476135 5437234 5433143 5047064 4795336 4548207 4383889 4702502 5418327
43512 5418327 6118880 6821712 7398858 6710673 3937019 538598 -882636 304111 2422145
43503 2422145 4087904 5207485 5523487 4587113 3491316 4064069 5609963 5105003 1824049
43494 1824049 -861993 -37427 2771443 4239835 3775702 2977373 2337951 1337700 696149
43485 696149 1591070 3060410 2817276 629617 -1334503 -1590184 -779419 56981 795861
$$ packed form
43549D030198q21966P22483J286025O55511J34291Q53504K310339K756676J242336
43540A3169397j027238j979417j141918j1565N50r20567j630512j289320J06830
43531E276240J603276J742824J38630j557763j493483k25090J00415q93827j288264
43522C402958r0922J164099R61099m091l86079k51728k47129j64318L18613P15825
43512E418327P00553P02832N77146o88185k773654l398421j421234J186747K118034
43503B422145J665759J119581L16002r36374j095797N72753J545894n04960l280954
43494A824049k686042Q24566K808870J468392m64133p98329o39422j000251o41551
43485F96149Q94921J469340k43134k187659j964120k55681Q10765Q36400P38880
$$ plain form
43476 795861 1581788 2383486 3342928 4360563 4629075 3886921 3437220 4150562 4279808
43467 4279808 1698423 -2169943 -3569160 -1660461 524172 1018623 1535758 3642507
43459 3642507 5397978 4287686 1365348 -275723 133395 763838 439445 -296095 -965140
43450 -965140 -1726186 -2147240 -1385114 149341 952522 584495 200985 523638 689110
43441 689110 -144764 -1144965 -782953 986327 2414276 1926296 -28676 -1410131 -886103
43432 -886103 661005 1383356 944094 808362 1933525 3326786 3557112 2705717 1894324
43423 1894324 1672717 1877107 2376211 2866457 2589787 1445874 724117 1348690 2020342
43414 2020342 810166 -1742526 -3019757 -1850652 202970 1356327 1540428 1304119
$$ packed form
43476G95861P85927Q01698R59442J017635K68512p42154m49701P13342J29246
43467D279808k581385l868366j399217J908699K184633M94451N17135K106749
43459C642507J755471j110292k922338j641071M09118O30443l24393p35540o69045
43450i65140p61046m21054P62126J534455Q03181l68027l83510L22653J65472
43441F89110q33874j000201L62012J769280J427949m87980j954972j381455N24028
43432h86103J547108P22351m39262j35732J125163J393261K30326q51395q11393
43423A894324k21607K04390M99104M90246k76670j143913p21757O24573O71652
43414B020342j210176k552692j277231J169105K053622J153357J84101k36309
$$ plain form
43406 1304119 640198 -166711 -110142 1013928 1927328 1731804 1225408 1359121 1691185
43397 1691185 1561380 1530494 2337517 3724499 5783624 9945458 16410618 21738877 21816328
43388 21816328 17024295 11864137 9284915 7973761 5817292 3268000 1775476 1073260
43380 1073260 84371 -774993 -200590 1716433 3422474 3774534 2781019 937225 -980366
43371 -980366 -1874637 -1314386 -309071 1190 130774 1521825 4203716 6461188 6957963
43362 6957963 6078783 4934520 4040097 3343500 2763621 2263918 1837918 1557055 1248866
43353 1248866 364263 -1129584 -2006955 -967145 1509108 3601271 4452114 4717302 4669485
43344 4669485 3479523 1239323 97756 1815940 5076005 6842529 6007371 4185162
$$ packed form
43406A304119o63921q06909N6569J124070R13400j95524n06396J33713L32064
43397A691185j29805l0886Q07023J386982K059125M161834O465160N328259P7451
43388B1816328m792033n160158k579222j311154k156469k549292j492524p02216
43380A073260r88889q59364N74403J917023J706041L52060r93515j843794j917591
43371i80366q94271N60251J005315L10261J29584J391051K681891K257472M96775
43362F957963q79180j144263q94423o96597n79879m99703m26000k80863l08189
43353A248866q84603j493847q77371J039810K476253K092163Q50843K65188m7817
43344D669485j189962k240200j141567J718184L260065J766524q35158j822209
$$ plain form
43336 4185162 3048983 2474396 1703672 959317 964503 1565099 1773761 1044984 -115968
43327 -115968 -862154 -893290 -443826 320732 1434327 2585245 3005568 2464735 1997114
43318 1997114 2723302 4020031 4049652 2475343 1345699 2365232 4423519 5181712 4265561
43309 4265561 3216616 2790037 2295765 1642942 1881539 2975822 2973725 717418 -2039617
43300 -2039617 -2768272 -1430093 -13905 441155 524061 462881 -524729 -2437609 -3688590
43291 -3688590 -2993824 -990587 904063 2367640 3874179 5131579 5087447 3537657 1744166
43282 1744166 1026668 1267101 1274461 411335 -591287 -523386 884228 2695756 3846698
43273 3846698 4118841 3900411 3403811 2629600 1937168 2005469 3041418 4436583 5357524
$$ packed form
43336D185162j136179n74587p70724p44355N186O00596K08662p28777j160952
43327a15968p46186l1136M49464P64558J113595J150918M20323n40833m67621
43318A997114P26188J296729K9621j574309j129644J019533K058287P58193r16151
43309D265561j048945m26579m94272o52823K38597J094283k097k256307k757035
43300b039617p28655J338179J416188M55060Q2906o1180r87610j912880j250981
43291c688590O94766K003237J894650J463577J506539J257400m4132j549790j793491
43282A744166p17498K40433P360q63126j002622O7901J407614J811528J150942
43273C846698K72143k18430m96600p74211o92432O8301J035949J395165R20941
$$ plain form
43264 5357524 5311449 4103997 1886218 -433697 -1466867 -674643 897040 1799376 1855116
43255 1855116 2053987 2976714 4061894 4511078 4294943 4032579 4269123 5014838 5678913
43246 5678913 5457026 4214195 2980747 3001941 4154112 4901685 4131678 2508589 1599279
43237 1599279 2078610 3289083 4270517 4651701 4577483 4228456 3592796 2586051 1315963
43228 1315963 149670 -612097 -1020191 -1175130 -802968 373523 1904772 2913099 3213302
43219 3213302 3395494 3584084 3035667 1529602 297794 667020 2274111 3485572 3246455
43210 3246455 1785309 -51241 -1254697 -839130 1311829 3823975 4986005 4547979
43202 4547979 3644632 3153168 3078639 3363710 4072223 4639065 4133167 2633091 1347745
$$ packed form
43264E357524m6075j207452k217779k319915j033170P92224J571683R02336N5740
43255A855116J98871R22727J085180M49184k16135k62364K36544P45715O64075
43246E678913k21887j242831j233448K1194J152171P47573p70007j623089r09310
43237A599279M79331J210473R81434L81184p4218l49027o35660j006745j270088
43228A315963j166293p61767m08094j54939L72162J176491J531249J008327L00203
43219C213302J82192J88590n48417j506065j231808L69226J607091J211461k39117
43210C246455j461146j836550j203456M15567K150959K512146J162030m38026
43202D547979r03347m91464p4529K85071P08513N66842n05898j500076j285346
$$ plain form
43193 1347745 1027607 1225887 1455237 1961863 2818029 3345259 3197525 3068310 3457711
43184 3457711 3593007 2614665 1192960 808386 1740987 2845374 3222143 3151048 3283420
43175 3283420 3733277 4229377 4559536 4497767 3673596 2003888 274575 -108172 1589891
43166 1589891 4330146 5971727 5378993 3482397 1918768 1266268 1274455 2002547 3433780
43157 3433780 4461387 3876635 2299261 1538114 2011356 2571623 2995800 4374914 6333496
43148 6333496 6356974 3450993 354028 28223 1573474 1975299 708581 -23536 942455
43139 942455 2348092 2961334 3123681 3369941 3317829 2613345 1729743 1294430 1464930 2096531
43129 2096531 2712327 2480476 1196479 19030 139014 1053579 1406668 1197369 1674742
$$ packed form
43193A347745l20138J98280K29350N06626Q56166N27230j47734j29215L89401
43184C457711J35296r78342j421705l84574R32601J104387L76769p1095J32372
43175C283420M49857M96100L30159o1769q24171j669708j729313l82747J698063
43166A589891K740255J641581n92734j896596j563629o52500Q187P28092J431233
43157C433780J027607n84752j577374p61147M73242N60267M24177J379114J958582
43148F333496K3478k905981l096965l25805J545251M01825j266718p32117R65991
43139I42455J405637O13242J62347K46260n2112p04484q83602m35313J70500O31601
43129B096531O15796k31851j283997j177449J19984R14565L53089k09299M77373
$$ plain form
43120 1674742 3150430 4403954 4402263 3390356 2196133 1511437 1755977 2602179 2901400
43111 2901400 2157398 1563441 2295342 3467036 3459590 2670062 2894579 4242901 4801976
43102 4801976 3488741 1365716 -38234 -57190 1438605 4040715 6559606 8253953
43094 8253953 9801494 11527651 11855607 9766297 7451415 7558207 9035310 9191005 8595752
43085 8595752 9695212 11694182 11973779 11900614 15303794 21467951 26503171 31783423 42752177
43076 42752177 58849125 76083633 102886041 157732832 238231490 303796250 308317277
43069 308317277 249353389 170298947 113274628 84214595 66312377 49906109 37521367
43062 37521367 30499614 25358843 21036719 19608552 20134206 18897175 15550110 13302485
$$ packed form
43120A674742J475688J253524j691j011907j194223o84696K44540Q46202K99221
43111B901400p44002n93957P31901J171694p446p89528K24517J348322N59075
43102D801976j313235k123025j403950j8956J495795K602110K518891J694347
43094H253953J547541J726157L27956k089310k314882J06792J477103J55695n95253
43085H595752J099460J998970K79597p3165L403180O164157N035220N280252J0968754
43076D2752177J6096948J7234508K6802408N4846791Q0498658O5564760M521027
43069C08317277n8963888p9054442n7024319k9060033j7902218j6406268j2384742
43062C7521367p021753n140771m322124j428167N25654j237031l347065k247625
$$ plain form
43054 13302485 13137138 12736188 11084107 9690214 8993344 7450713 4703644 2410450
43046 2410450 1449062 1012366 738319 1168215 1864422 1537025 370249 -35 890008
43037 890008 1851677 2450862 3708573 5816985 7136183 6398124 4528119 3454153 4022507
43028 4022507 5522242 6452519 5616507 3342194 1640484 2214546 4367470 5879948 5833203
43019 5833203 5379615 5697453 6449527 6603128 5756297 4226311 2573743 1394363 1014450
43010 1014450 1134916 1176868 1026874 1034141 1346407 1731674 2016504 2270360 2594194 3062591
43000 3062591 3785852 4739614 5590137 5829991 5092019 3611505 2665327 3935408 7577753
42991 7577753 11517714 13919009 15711547 18952551 23627404 29101598 38270845 55338960
$$ packed form
43054A3302485j65347m00950j652081j393893o96870j542631k747069k293194
43046B410450r61388m36696k74047M29896O96207l27397j166776l70284Q90043
43037H90008R61669N99185J257711K108412J319198p38059j870005j073966N68354
43028D022507J499735R30277q36012k274313j701710N74062K152924J512478m6745
43019E833203m53588L17838P52074J53601q46831j529986j652568j179380l79913
43010A014450J20466M1952j49994P267L12266L85267K84830K53856L23834M68397
43000C062591P23261R53762Q50523K39854p37972j480514r46178J270081L642345
42991G577753L939961K401295J792538L241004M674853N474194R169247J7068115
$$ plain form
42983 55338960 77177665 91323525 87302594 68268548 47431509 34187003 27808670
42976 27808670 23681692 20155290 17725845 15919711 14046377 12861405 13106622 13740118
42968 13740118 13317567 11967534 10591505 9196722 7386635 5662288 4981638 5506806
42960 5506806 6590187 7489790 7594356 6655059 5297379 4605636 4803738 5043648 4694659
42951 4694659 3960207 3093626 2129265 1638827 2518012 4602315 6641621 7987129 9025516
42942 9025516 9618312 8731720 6362364 4291065 3911472 4640141 5484530 6725580 8668247
42933 8668247 10036971 9414383 7529364 6380650 6495151 6679794 6289632 6071993 6508653
42924 6508653 6770906 6028956 4923400 4939689 6604630 8828234 10055385 9862135 9318478
$$ packed form
42983E5338960K1838705J4145860m020931j9034046k0837039j3244506o378333
42976B7808670m126978l526402k429445j806134j873334j184972K45217O33496
42968A3740118m22551j350033j376029j394783j810087j724347o80650N25168
42960E506806J083381Q99603J04566r39297j357680o91743J98102K39910l48989
42951D694659p34452q66581r64361m90438Q79185K084303K039306J345508J038387
42942I025516N92796q86592k369356k071299l79593P28669Q44389J241050J942667
42933H668247J368724o22588j885019j148714J14501J84643l90162k17639M36660
42924F508653K62253p41950j105556J6289J664941K223604J227151j93250n43657
$$ plain form
42915 9318478 9811923 11668298 13965202 15357041 14894773 12693185 10507036 11013166 15179380
42906 15179380 20368266 22372096 19693202 14810545 11042268 9417055 8998184 8770821
42898 8770821 8192873 6919125 5116217 3564971 2793731 2677694 3264773 5001874 7487647
42889 7487647 9033756 8412944 6319481 4310456 3067096 2463715 2448450 2851369 3039347
42880 3039347 2753428 2682703 3343491 4106263 4267166 4304344 4957303 5772500 5901333 5943710
42870 5943710 7641989 11681554 16656412 20227087 20830088 18619936 15291936 12593803
42862 12593803 10650200 8405704 5911812 4842008 6007101 7845126 8625310 8785996
42854 8785996 9504354 10222359 9637180 8279955 7849549 8367180 8195380 6829266 5569607
$$ packed form
42915I318478M93445J856375K296904J391839m62268k201588k186149N06130M166214
42906A5179380N188886K003830k678894m882657l768277j625213m18871k27363
42898H770821n77948j273748j802908j551246p71240j16037N87079J737101K485773
42889G487647J546109o20812k093463k009025j243360o03381j5265M02919J87978
42880C039347k85919p0725O60788P62772J60903L7178O52959Q15197J28833M2377
42870E943710J698279M039565M974858L570675O03001k210152l328000k698133
42862A2593803j943603k244496k493892j069804J165093J838025P80184J60686
42854H785996P18358P18005n85179j357225m30406N17631j71800j366114j259659
$$ plain form
42845 5569607 5209823 5008903 4402043 3977662 4135885 4236907 3732278 2978294 2421098
42836 2421098 1987096 1609138 1386992 1071166 407903 7876 705193 2080188 2930749
42827 2930749 3190522 3883212 5074121 5516368 4691559 3617841 3120483 2764013 2052346
42818 2052346 1308010 805195 324854 20211 383821 991854 764045 -181820 -593622
42809 -593622 -329440 -524503 -952050 400034 3926451 6874714 6912705 5274146 4479844
42800 4479844 4749477 4861280 4976674 6017849 7240945 6994727 5359988 3789323 2675989
42791 2675989 1571719 1281594 3075857 5819685 6554601 4538217 2471168 2909174 5339245
42782 5339245 7625612 8610358 8332527 7184731 5899998 5230022 4833812 3587449 1584354
$$ packed form
42845E569607l59784k00920o06860m24381J58223J01022n04629p53984n57196
42836B421098m34002l77958k22146l15826o63263m00027O97317J374995Q50561
42827B930749K59773O92690J190909M42247q24809j073718m97358l56470p11667
42818B052346p44336n02815m80341l04643L63610O08033k27809r45865m11802
42809e93622K64182j95063m27547J352084L526417K948263L7991j638559p94302
42800D479844K69633J11803J15394J041175J223096k46218j634739j570665j113334
42791B675989j104270k90125J794263K743828P34916k016384k067049M38006K430071
42782E339245K286367R84746k77831j147796j284733o69976l96210j246363k003095
$$ plain form
42773 1584354 464084 1019587 1992487 2267618 2687528 4207089 5645347 5257333 3687539
42764 3687539 3194697 4241830 5008726 4447193 3690429 3753602 3848531 3269673 3288450 5272945
42754 5272945 7871884 8236036 5922453 3592932 3416292 4561644 5084979 4661704 4105170
42745 4105170 3462741 2392946 1753960 2855055 5141308 6349137 5323052 3286987
42737 3286987 1941368 1651323 2021188 2893731 3968150 4517900 4341511 4135597 4243292
42728 4243292 3977128 2921527 1940169 2024716 2964403 3935232 4578872 4824655 4632767
42719 4632767 4577526 5467838 6662653 6340173 4478709 3669843 5347847 7214279 6768761
42710 6768761 5584952 6896885 10078220 11231409 9110507 6800704 6880052 8224709
$$ packed form
42773A584354j120270N55503R72900K75131M19910J519561J438258l88014j569794
42764C687539m92842J047133P66896n61533p56764O3173R4929n78858J8777J984495
42754E272945K598939L64152k313583k329521j76640J145352N23335m23275n56534
42745D105170o42429j069795o38986J101095K286253J207829j026085k036065
42737C286987j345619k90045L69865Q72543J074419N49750j76389k05914J07695
42728D243292k66164j055601r81358Q4547R39687R70829O43640K45783j91888
42719D632767n5241Q90312J194815l22480j861464q08866J678004J866432m45518
42710F768761j183809J311933L181335J153189k120902k309803P9348J344657
$$ plain form
42702 8224709 8707529 8081040 6794008 4679856 2494449 2337537 4710156 7261544 8231953
42693 8231953 8968809 11014373 12926843 12578725 10766167 9619813 8907180 7198483 5725087
42684 5725087 7311156 11375472 13589359 11584014 8118936 7094944 8787316 10951223
42676 10951223 12899179 16005463 20569110 24245353 24320549 20778603 16488237 14387512
42668 14387512 14744996 15403425 14511530 12336785 10254064 8971984 8481266 8788356 9520333
42659 9520333 9487619 7986236 6053842 5051604 4519735 3140891 1457265 1497903 3522915
42650 3522915 5308631 5352412 4801058 5209142 6230763 6851739 7300721 8150155 8798393
42641 8798393 8538430 8115136 8466328 8783068 7766163 6186948 5993262 7021148 6907051
$$ packed form
42702H224709M82820o26489j287032k114152k185407j56912K372619K551388R70409
42693H231953P36856K045564J912470l48118j812558j146354p12633j708697j473396
42684E725087J586069M064316K213887k005345l465078j023992J692372K163907
42676A0951223J947956L106284M563647L676243P5196l541946m290366k100725
42668A4387512L57484O58429q91895k174745k082721j282080m90718L07090P31977
42659I520333l2714j501383j932394j002238n31869j378844j683626M0638K025012
42650C522915J785716M3781n51354M08084J021621O20976M48982Q49434O48238
42641H798393k59963m23294L51192L16740j016905j579215j93686J027886j14097
$$ plain form
42632 6907051 4708461 2437964 2020697 2611781 2405119 1690136 2259851 4487514 6814186
42623 6814186 7979923 8152547 7746536 6739905 5687020 5893237 7523185 8621578 7344342
42614 7344342 4538161 2728246 2878225 3627325 3709852 3503921 3707992 4024231 4099781
42605 4099781 4517264 5615900 6288543 5402164 3812235 3430673 4539826 5493864 5051133
42596 5051133 3613053 2075015 892937 595909 1786638 3977393 5536656 5463798 4362591
42587 4362591 3257207 2521651 2462231 3672712 5936792 7838688 8403707 8197706 7940220
42578 7940220 7163580 5434258 3821841 3583487 4096444 3739021 2400922 1500674 1763460
42569 1763460 2611031 3629498 4871997 5533296 4189751 1083075 -1319552 -974770 1573592
$$ packed form
42632F907051k198590k270497m17267N91084k06662p14983N69715K227663K326672
42623F814186J165737J72624m06011j006631j052885K06217J629948J098393j277236
42614G344342k806181j809915J49979P49100Q2527k05931K04071L16239P5550
42605D099781M17483J098636O72643q86379j589929l81562J109153R54038m42731
42596E051133j438080j538038j182078k97028J190729K190755J559263p2858j101207
42587D362591j105384p35556n9420J210481K264080J901896N65019k06001k57486
42578G940220p76640j729322j612417k38354N12957l57423j338099r00248K62786
42569A763460Q47571J018467J242499O61299j343545l106676k402627L44782K548362
$$ plain form
42560 1573592 4405726 6483883 7770444 8099002 7232610 5687832 4477992 4107980 4425668
42551 4425668 5237021 6452797 7742661 8512835 8204172 6523240 3778407 1142629 -75807
42542 -75807 122634 301682 -526839 -1454979 -853877 1425424 3880792 5202784 5496248
42533 5496248 5709392 6552630 8016826 9350937 9482734 8064861 6184537 5452003 6248914
42524 6248914 7417059 7798788 7445354 7027643 6735648 6355381 5998495 6001146 6173171 5817840
42514 5817840 4678637 3377996 2616509 2281875 1761529 984262 691984 1574714 3423041
42505 3423041 5260855 6102602 5515043 3776929 1747190 341180 -163589 -156547 158206
42496 158206 1261640 3450547 5726181 6356986 4774126 2344586 915394 942079 1362691
$$ packed form
42560A573592K832134K078157J286561L28558q66392j544778j209840l70012L17688
42551D425668Q11353J215776J289864P70174l08663j680932k744833k635778j218436
42542g5807J98441J79048q28521r28140O01102K279301K455368J321992K93464
42533E496248K13144Q43238J464196J334111J31797j417873j880324p32534P96911
42524F248914J168145L81729l53434m17711k91995l80267l56886K651J72025l55331
42514E817840j139203j300641p61487l34634n20346p77267k92278Q82730J848327
42505C423041J837814Q41747n87559j738114k029739j406010n04769P042L14753
42496A58206J103434K188907K275634O30805j582860k429540j429192K6685M20612
$$ plain form
42487 1362691 1031447 -94077 -1116617 -1316361 -1028746 -1286522 -2459101 -3514383 -3045309
42478 -3045309 -831310 2166703 5113343 7679336 9132686 8345212 5418423 2338539
42470 2338539 988501 1070619 1014671 476069 627229 1971695 3209490 2910268 1486166
42461 1486166 683386 1438670 2966391 3987476 4275497 4656258 5827528 7779431 10375591
42452 10375591 13642353 16823699 17887032 15348449 10596087 6989169 6176886 6620176
42444 6620176 6412054 5954130 6448157 7167932 6420040 4576242 3772715 4544341 5071589
42435 5071589 4360151 3947987 5234708 6949669 6978737 5511872 4562924 4997495 5741498
42426 5741498 5714592 5038444 4254853 3597131 3270578 3468439 3842078 3724472 3072946 2530511
$$ packed form
42487A362691l31244j125524j022540j99744K87615k57776j172579j055282M69074
42478c045309K213999K998013K946640K565993J453350p87474k926789l079884
42470B338539j350038Q2118n5948n38602J51160J344466J237795k99222j424102
42461A486166q02780P55284J527721J021085K88021L80761J171270J951903K596160
42452A0375591L266762L181346J063333k538583m752362l606918q12283M43290
42444F620176k08122m57924M94027P19775p47892j843798q03527P71626N27248
42435E071589p11438m12164J286721J714961K9068j466865r48948M34571P44003
42426E741498k6906o76148p83591o57722l26553J97861L73639j17606o51526n42435
$$ plain form
42416 2530511 2480043 2735443 3168674 3762421 3934648 2897370 1163855 653633 2411157
42407 2411157 4956474 6004466 5397372 5027920 5850660 6450220 5340518 3521631 3327257
42398 3327257 5111263 6626414 6038670 4222762 3219055 3466961 3875013 4063482 4951097
42389 4951097 7019381 9435932 11432485 13356986 15551122 17127777 16893431 14924264
42381 14924264 12269077 9526185 6724427 4317860 3155709 3407864 4503305 6308915
42373 6308915 9382399 13574158 17160849 18157917 16318072 13376050 11370109 10920654
42365 10920654 11009555 10227887 8254129 6133196 5057619 5059787 5211829 4977760 4831798
42356 4831798 5377567 6309863 6637961 5813891 4387312 3524890 3911269 5074614 5855407
$$ packed form
42416B530511n0468K55400M33231N93747J72227j037278j733515n10222J757524
42407B411157K545317J047992o07094l69452Q22740N99560j109702j818887j94374
42398C327257J784006J515151n87744j815908j003707K47906M08052J88469Q87615
42389D951097K068284K416551J996553J924501K194136J576655k34346j969167
42381A4924264k655187k742892k801758k406567j162151K52155J095441J805610
42373F308915L073484M191759L586691R97068j839845k942022k005941m49455
42365A0920654Q8901p81668j973758k120933j075577K168J52042k34069j45962
42356D831798N45769R32296L28098q24070j426579q62422L86379J163345P80793
$$ plain form
42347 5855407 5626332 4846791 4169458 3324252 1554074 -826349 -2102475 -919616 2002524
42338 2002524 4426260 4707069 2999951 662853 -904741 -872510 779461 3130150 4795647
42329 4795647 5089657 4628000 4371566 4215883 3176499 1069742 -792388 -1134360 -320323
42320 -320323 417540 935038 2167750 4108391 5128191 4082306 2181538 1687463 3116295
42311 3116295 4746674 4858382 3590568 2394350 2333801 3302069 4496065 5194676 5115318
42302 5115318 4352573 3258540 2389899 2178564 2289750 1658170 -151681 -1857841 -1768706
42293 -1768706 -224379 599471 -163561 -581371 1304208 4459683 6203644 5756218 4673204
42284 4673204 4191790 4042505 3839225 3742812 3427450 2151640 409670 -95656 1187729
$$ packed form
42347E855407k29075p79541o77333q45206j770178k380423j276126J182859K922140
42338B002524K423736K80809j707118k337098j567594L2231J651971K350689J665497
42329D795647K94010m61657k56434j55683j039384k106757j862130l41972Q14037
42320c20323P37863N17498J232712J940641J019800j045885j900768m94075J428832
42311C116295J630379J11708j267814j196218o0549R68268J193996O98611p9358
42302E115318p62745j094033q68641k11335J11186o31580j809851j706160Q9135
42293a768706J544327Q23850p63032m17810J885579L155475J743961m47426j083014
42284D673204m81414j49285k03280r6413l15362j275810j741970n05326J283385
$$ plain form
42275 1187729 2818114 3599394 4106149 5020830 5536724 4797252 3635558 3284497 3317817
42266 3317817 2544851 1238513 712516 1101882 1353554 1301787 1953738 3460923 4491294
42257 4491294 4248058 3696022 3866233 4038296 2819962 503753 -911951 -210759 1397812
42248 1397812 1691541 174585 -1306499 -923443 811547 1907063 1774877 1964747 3632209
42239 3632209 5588265 5952159 4833672 3934747 3915446 3730063 2666574 1563949 1446708
42230 1446708 2094226 2756344 3484653 4811363 6489467 7480260 7263515 6502115 6084434
42221 6084434 5896050 5101439 3689264 3117257 4814626 8284751 11462166 12990339 13335194
42212 13335194 13457423 13375065 12634613 11382125 10174202 9266480 8715620 8578223 8435032
$$ packed form
42275A187729J630385P81280N06755R14681N15894p39472j161694l51061L3320
42266C317817p72966j306338n25997L89366K51672n1767O51951J507185J030371
42257D491294k43236n52036J70211J72063j218334k316209j415704P01192J608571
42248A397812K93729j516956j481084L83056J734990J095516j32186J89870J667462
42239C632209J956056L63894j118487q98925j9301j85383j063489j102625j17241
42230A446708O47518O62118P28309J326710J678104R90793k16745p61400m17681
42221F084434j88384p94611j412175n72007J697369L470125L177415J528173L44855
42212A3335194J22229q2358p40452j252488j207923r07722n50860j37397j43191
$$ plain form
42203 8435032 7526530 6046944 5291794 5602204 5397007 3648350 2071190 2821868 4892781
42194 4892781 5271415 3399399 1840312 2202580 3017664 2609780 1753318 2031618 3268802
42185 3268802 4088677 3804473 2545098 662722 -911779 -961316 246194 736857 -415662
42176 -415662 -1415393 -223581 2523743 4677981 5534014 5790708 5475908 4050629 2230262
42167 2230262 1674475 2733210 4042505 4455489 4060943 3333039 2625959 2526791 3383605
42158 3383605 4366460 4181360 2823645 1578383 1328259 1940240 3149914 4751231 5952645
42149 5952645 5901274 4955478 4210101 3782831 2969176 2101401 2566494 4572137 6465562
42140 6465562 6893848 6273418 5495509 4551328 3244513 2052714 1393083 1001123 756331
$$ packed form
42203H435032r08502j479586p55150L10410k05197j748657j577160P50678K070913
42194D892781L78634j872016j559087L62268Q15084m07884q56462K78300J237184
42185C268802Q19875k84204j259375j882376j574501m9537J207510M90663j152519
42176d15662r99731J191812K747324K154238Q56033K56694l14800j425279j820367
42167B230262n55787J058735J309295M12984l94546p27904p07080r9168Q56814
42158C383605R82855j85100j357715j245262k50124O11981J209674J601317J201414
42149E952645n1371r45796p45377m27270q13655q67775M65093K005643J893425
42140F465562M28286o20430p77909r44181j306815j191799o59631l91960k44792
$$ plain form
42131 756331 1128577 2134674 2920917 3095351 3362587 4083306 4447426 4045742 3993437 5197738
42121 5197738 6538532 6218671 4238072 2243716 1548414 2448575 4673662 7076758 7602245
42112 7602245 5252882 1753972 -255255 -350149 -111847 -248575 77129 1025331 1308088
42103 1308088 314599 -710147 -508089 520121 1378953 2018723 2819846 3503183 3586582
42094 3586582 3243109 2840282 2267871 1525375 1299806 2041505 3003321 3132025 2511263
42085 2511263 2021293 1884091 1444287 246296 -1388385 -2686545 -2784647 -1241151 1036701
42076 1036701 1935761 350901 -2060354 -2630408 -1068037 378941 290886 -131750 583692
42067 583692 1692546 1580152 546496 439188 1836840 3289856 3534612 3024600 2790687
$$ packed form
42131G56331L72246J006097P86243J74434K67236P20719L64120m01684n2305J204301
42121E197738J340794l19861j980599j994356o95302R00161K225087K403096N25487
42112G602245k349363l498910k009227r4894K38302j36728L25704R48202K82757
42103A308088r93489j024746K02058J028210Q58832O39770Q01123O83337Q3399
42094C586582l43473m02827n72411p42496k25569P41699R61816J28704o20762
42085B511263m89970j37202m39804j197991j634681j298160r8102J543496K277852
42076A036701Q99060j584860k411255n70054J562371J446978q8055m22636P15442
42067E83692J108854j12394j033656j07308J397652J453016K44756n10012k33913
$$ plain form
42058 2790687 2955015 3039289 2863437 2440789 1676441 857051 832841 1965665 3364575
42049 3364575 3909713 3655047 3479667 3700067 3841199 3542951 2864363 1831242 493305
42040 493305 -651274 -1066428 -929891 -717744 -245511 912783 2229600 2686760 2501626
42031 2501626 3049703 4751548 6392440 7012054 7004871 6649391 5207600 2712240 1097085
42022 1097085 1803715 3426625 3733281 3143331 3855378 5932310 6897956 5558880 3681066
42013 3681066 2890211 2190346 164070 -2107213 -2344728 -337099 2029545 3542635 4625951
42004 4625951 5558126 5496733 3937954 1988692 1268127 1998938 2884351 2766834 1912168
41995 1912168 1512319 2209968 3492384 4564873 5302288 5889239 5959836 4940710 3150543
$$ packed form
42058B790687J64328Q4274j75852m22648p64348q19390k4210J132824J398910
42049C364575N45138k54666j75380K20400J41132k98248o78588j033121j337937
42040D93305j144579m15154J36537K12147M72233J158294J316817M57160j85134
42031B501626N48077J701845J640892O19614p183l55480j441791k495360j615155
42022A097085P06630J622910L06656n89950P12047K076932R65646j339076j877814
42013C681066p90855o99865k026276k271283k37515K007629K366644J513090J083316
42004D625951R32175o1393j558779j949262p20565P30811Q85413j17517q54666
41995A912168l99849O97649J282416J072489P37415N86951P0597j019126j790167
$$ plain form
41986 3150543 1634501 793348 131320 -433526 -187254 894523 1476323 658808 -484394
41977 -484394 -342361 909088 1652927 1091436 -45534 -822859 -1000768 -735751 -410500
41968 -410500 -647745 -1513618 -1891671 -730480 1256752 2362982 2287016 2382032 3335853
41959 3335853 4053956 3414703 1937948 961297 971420 1355354 1224816 225782 -823318
41950 -823318 -182812 2856799 6367982 7599800 6480234 5478845 5641422 5126001 2806328
41941 2806328 839321 1516213 3490744 3811240 2416141 1683256 2231486 2302847 1293273
41932 1293273 819394 1652269 2365227 2040229 1810778 2425572 2622652 1591988 974980
41923 974980 2354383 4382511 4687645 3493537 2981582 3747049 4268588 3699107 2953792
$$ packed form
41986C150543j516042q41153o62028n64846K46272J081777N81800q17515j143202
41977d84394J42033J251449P43839n61491j136970p77325j77909K65017L25251
41968d10500k37245q65873l78053J161191J987232J106230p5966R5016R53821
41959C335853P18103o39253j476755r76651J0123L83934j30538r99034j049100
41950h23318O40506L039611L511183J231818j119566j001389J62577n15421k319673
41941B806328j967007O76892J974531L20496j395099p32885N48230P1361j009574
41932A293273m73879Q32875P12958l24998k29451O14794J97080j030664o17008
41923I74980J379403K028128L05134j194108n11955P65467N21539n69481p45315
$$ plain form
41914 2953792 2796615 2762556 2443258 2257474 2437293 2619467 2901990 3936676 5391894
41905 5391894 5678529 4073301 2036563 1439551 2262561 3004091 2788049 2091007 1659012
41896 1659012 1541394 1238152 414026 -509454 -459149 1166156 3418465 4532291 3981552
41887 3981552 3029606 2837343 2963123 2519171 1962651 2503589 4048556 4953866 3982369
41878 3982369 1658954 -522407 -1568972 -1446186 -654728 260637 1002285 1535489 1816718
41869 1816718 1677766 1153022 633470 349013 -28246 -832463 -1736491 -2182022 -2238728 -2367039
41859 -2367039 -2444270 -1766531 -95527 1927384 3517062 4327170 4238406 3216437 1589074
41850 1589074 -25958 -1164350 -1428144 -180766 2689077 5643788 6434505 4814561
$$ packed form
41914B953792j57177l4059l19298j85784J79819J82174K82523J034686J455218
41905E391894K86635j605228k036738n97012Q23010P41530k16042o97042m31995
41896A659012j17618l03242q24126r23480N0305J625305K252309J113826n50739
41887C981552r51946j92263J25780m43952n56520N40938J544967R05310r71497
41878C982369k323415k181361j046565J22786P91458R15365P41648N33204K81229
41869A816718j38952n24744n19552k84457l77259q04217r04028m45531n6706j28311
41859b367039p7231O77739J671004K022911J589678Q10108q8764j021969j627363
41850A589074j615032j138392k63794J247378K869843K954711P90717j619944
$$ plain form
41842 4814561 3224689 3824393 5740674 6465115 5286378 3820461 3399267 3584676 3538660
41833 3538660 3345343 3295294 3125438 2893405 3525253 5274323 6444167 5181162 2226580
41824 2226580 289052 573755 1552054 1698164 1744247 2953549 4498106 4482406 3038923
41815 3038923 2327548 3256493 4161362 3539751 2375137 2391422 3275893 3357658 2332695
41806 2332695 1488777 1444377 1466091 1226098 1507006 2527554 3050422 2109488 530095
41797 530095 -262121 -79594 345684 705550 1037059 950919 155731 -655959 -634738 -185021
41787 -185021 -302893 -687484 56957 2124353 3770587 3471225 1807483 527952 523498
41778 523498 1462736 2821657 4406130 6033961 7322732 7836832 7259062 5632830 3624889
$$ packed form
41842D814561j589872N99704J916281P24441j178737j465917m21194J85409m6016
41833C538660j93317n0049j69856k32033O31848J749070J169844j263005k954582
41824B226580j937528K84703R78299J46110M6083J209302J544557j5700j443483
41815C038923p11375R28945R04869o21611j164614J6285Q84471Q1765j024963
41806B332695q43918m4400K1714k39993K80908J020548N22868r40934j579393
41797E30095p92216J82527M25278L59866L31509q6140p95188q11690K1221M49717
41787a85021j17872l84591P44441K067396J646234k99362j663742j279531m454
41778E23498R39238J358921J584473J627831J288771N14100n77770j626232k007941
$$ plain form
41769 3624889 2240349 1984657 2470501 2985038 3213212 3313506 3562446 4021335 4356625
41760 4356625 4103430 3409485 3169199 3763563 4049268 2720418 579896 18722 1833203
41751 1833203 3976924 4230254 2774127 1108908 -207203 -1248560 -1300709 277170 2309656
41742 2309656 2931171 2352589 2594811 4305949 5761018 5532160 4315033 3253611 2140166
41733 2140166 490906 -973817 -1390808 -1325291 -1769845 -2218947 -1303984 869825 2427511
41724 2427511 1926250 -105155 -1943884 -2258513 -937142 945456 1958591 1657647 979789
41715 979789 851894 881521 238659 -666917 -637896 311174 779694 102535 -591943 -34917
41705 -34917 1469035 2718346 3248335 3482281 3760557 4026444 4245978 4493374 4691188
$$ packed form
41769C624889j384540k55692M85844N14537K28174J00294K48940M58889L35290
41760D356625k53195o93945k40286N94364K85705j328850k140522n61174J814481
41751A833203K143721K53330j456127j665219j316111j041357n2149J577879K032486
41742B309656O21515n78582K42222J711138J455069k28858j217127j061422j113445
41733B140166j649260j464723m16991O5517m44554m49102R14963K173809J557686
41724B427511n01261k031405j838729l14629J321371J882598J013135l00944o77858
41715I79789j27895K9627o42862r05576K9021R49070M68520o77159o94478N57026
41705c4917J503952J249311N29989K33946K78276K65887K19534K47396J97814
$$ plain form
41696 4691188 4676691 4446100 4100665 3728050 3465662 3355651 3026064 2018476 659251
41687 659251 14737 589108 1622915 2139897 2096733 1916116 1524312 712221 -7022 93116
41677 93116 794895 1252270 1340041 1647001 2100634 1772148 442803 -681757 -511176 401268
41667 401268 609502 -414553 -1873852 -2664753 -2155699 -276153 2401889 4708570 5649451
41658 5649451 5312227 4666650 4392559 4188573 3333702 1777076 565490 1029901 3249766
41649 3249766 5405583 5301211 2850039 465765 472884 2652313 4976864 6155541 6402691
41640 6402691 6069833 4945271 3177751 1663066 903745 410912 -116616 67888 1497431
41631 1497431 3015904 2735892 376425 -2247206 -3165918 -2100803 -339510 733777
$$ packed form
41696D691188j4497k30591l45435l72615k62388j10011l29587j007588j359225
41687F59251o44514N74371J033807N16982m3164j80617l91804q12091p19243J00138
41677I3116P01779M57375Q7771L06960M53633l28486j329345j124560J70581R12444
41667D01268K08234j024055j459299p90901N09054J879546K678042K306681R40881
41658E649451l37224o45577k74091k03986q54871j556626j211586M64411K219865
41649C249766K155817j04372k451172k384274P119K179429K324551J178677K47150
41640F402691l32858j124562j767520j514685p59321m92833n27528J84504J429543
41631A497431J518473k80012k359467k623631r18712J065115J761293J073287
$$ plain form
41623 733777 935652 1380609 3102686 5383861 6072097 4197512 1636704 1117961 2951397
41614 2951397 4998004 5694103 5528678 5262677 4479015 2971036 2166814 3525761 6120589
41605 6120589 7445032 6702055 6071654 8319377 13814026 20125963 24063499 24041583 21039364
41596 21039364 17504787 15070040 13286628 10747098 7158817 3831345 2248491 2652244
41588 2652244 3995308 4866684 4501792 3264431 2148621 1670251 1547909 1645381 2532218
41579 2532218 4457433 6381574 6999536 6360269 5445693 4473865 2919636 1160075 616251
41570 616251 1823259 3586984 4636180 5043679 5390209 5605336 5515079 5668319 6607270
41561 6607270 7859523 8512316 8340141 7665023 6672856 5649924 5271982 5677684 5778440
$$ packed form
41623G33777K01875M44957J722077K281175O88236j874585k560808n18743J833436
41614B951397K046607O96099j65425k66001p83662j507979q04222J358947K594828
41605F120589J324443p42977o30401K247723N494649O311937L937536k1916l002219
41596B1039364l534577k434747j783412k539530l588281l327472j582854M03753
41588B652244J343064Q71376l64892j237361j115810m78370j22342R7472Q86837
41579B532218J925215J924141O17962o39267r14576r71828j554229j759561n43824
41570F16251J207008J763725J049196M07499L46530K15127r0257J53240R38951
41561F607270J252253O52793j72175o75118r92167j022932l77942M05702J00756
$$ plain form
41552 5778440 4649451 3280025 3603613 5715912 7346800 6585656 4131405 2114475
41544 2114475 1401032 1064784 341899 -2384 1119207 3141755 4170595 3453359 2471557
41535 2471557 2809135 3834904 3801474 2675669 2118458 2670802 2904326 1903754 671333
41526 671333 113822 -450780 -1385587 -1229563 896165 2963406 2667972 1329038 2216254
41517 2216254 5329525 6969854 5067206 2108866 1493967 3177385 4543558 4065836
41509 4065836 2436224 973443 358036 554978 1032576 1219187 1062612 769533 157963
41500 157963 -798476 -986958 816437 3784108 5501074 4976289 3566130 2488731 1398563
41491 1398563 245846 384974 2332097 4174167 3918997 2057819 249416 -1041525
$$ packed form
41552E778440j128989j369426L23588K112299J630888p61144k454251k016930
41544B114475p13443l36248p22885l44283J121591K022548J028840p17236r81802
41535B471557L37578J025769l3430j125805n57211N52344K33524j000572j232421
41526F71333n57511n64602r34807J56024K125728K067241k95434j338934Q87216
41517B216254L113271J640329j902648k958340o14899J683418J366173m77722
41509D065836j629612j462781o15407J96942M77598J86611j56575k93079o11570
41500A57963r56439j88482J803395K967671J716966n24785j410159j077399j090168
41491A398563j152717J39128J947123J842070k55170j861178j808403j290941
$$ plain form
41483 -1041525 -1847395 -1233028 1213592 3609304 3896134 2889795 2846831 3790112 3910396
41474 3910396 3094565 3087421 4113719 4341979 3299930 2983838 4496348 6116688 6128655
41465 6128655 5352467 5187669 5068510 3907944 2666956 3217775 5294545 6609425 5892799
41456 5892799 4208735 3144828 3031022 3300246 3611567 4015467 4405359 4275959 3158746
41447 3158746 1359036 118516 614621 2652340 4704223 5432237 4913095 4273874 4374453
41438 4374453 4896088 4615310 2808542 496713 -369752 584182 1394554 453581 -985492
41429 -985492 -513318 1891507 3881991 4023990 3104994 2217864 1602166 1549576 2291086
41420 2291086 2670340 1279343 -645099 -229890 2263974 2886787 -40107 -2641466 -911099
$$ packed form
41483a041525q05870O14367K446620K395712K86830j006339m2964R43281J20284
41474C910396q15831p144J026298K28260j042049l16092J512510J620340J1967
41465F128655p76188j64798j19159j160566j240988N50819K076770J314880p16626
41456E892799j684064j063907j13806K69224L11321M03900L89892j29400j117213
41447C158746j799710j240520M96105K037719K051883P28014n19142o39221J00579
41438D374453N21635k80778j806768k311829q66465R53934Q10372r40973j439073
41429i85492M72174K404825J990484J41999r18996q87130o15698n2590P41510
41420B291086L79254j390997j924442M15209K493864O22813k926894k601359J730367
$$ plain form
41411 -911099 3331000 5375509 4412717 3364960 3290335 2483677 954055 1257893 3868486
41402 3868486 5623482 4462814 2492265 2338270 3203688 2927639 1813263 1702897 2553721
41393 2553721 2569065 1218292 -75240 -200255 366988 669842 436630 14309 -39653
41384 -39653 663753 1792797 2412011 2182112 1908579 2234461 2486979 1816888 923071 1383432
41374 1383432 3416236 5458670 6059326 5200241 3563839 1503451 -687622 -2158982
41366 -2158982 -1998318 -371521 1310884 1699958 967250 681364 1989180 4108499 5066698
41357 5066698 3933067 1846620 697313 1194262 2385647 2717450 1454703 -574218
41349 -574218 -1604412 -728294 997265 1816379 1493349 1325940 1903765 2123651 1017162
$$ packed form
41411i11099M242099K044509r62792j047757p4625q06658j529622L03838K610593
41402C868486J754996j160668j970549j53995Q65418k76049j114376j10366Q50824
41393B553721J5344j350773j293532j25015N67243L02854k33212m22321n3962
41384c9653P03406J129044O19214k29899k73533L25882K52518o70091q93817M60361
41374A383432K032804K042434O00656q59085j636402k060388k191073j471360
41366b158982J60664J626797J682405L89074p32708k85886J307816K119319R58199
41357E066698j133631k086447j149307M96949J191385L31803j262747k028921
41349e74218j030194Q76118J725559Q19114l23030j67409N77825K19886j106489
$$ plain form
41340 1017162 -589546 -1193994 -570594 432149 1405328 2497645 3343959 3126573 1886547
41331 1886547 894432 1303550 2757814 3545098 2182831 -893615 -3268729 -2796589 -68616
41322 -68616 2142367 2131158 886760 44871 -276813 -449565 385481 3034033 6008952
41313 6008952 6740141 4913964 2690207 1561469 993409 490748 853302 2436720 3966267
41304 3966267 4315480 4064442 4057655 3719845 2271499 596972 294821 1478621 2938236
41295 2938236 3931194 4402456 4007245 2616793 1507256 2177240 3843047 3959535 1780779
41286 1780779 -335076 -124972 1603338 2574250 2483854 3035960 4917552 6515143 6052071
41277 6052071 3790789 1469505 315617 297994 898303 1869306 3156393 4445391 5054341
$$ packed form
41340A017162j606708o04448O23400J002743R73179J092317Q46314k17386j240026
41331A886547r92115M09118J454264P87284j362267l076446k375114M72140K727973
41322f8616K210983j1209j244398q41889l21684j72752Q35046K648552K974919
41313F008952P31189j826177k223757j128738n68060n02661L62554J583418J529547
41304C966267L49213k51038o787l37810j448346j674527l02151J183800J459615
41295B938236R92958M71262l95211j390452j109537O69984J665807J16488k178756
41286A780779k115855K10104J728310R70912r0396N52106J881592J597591m63072
41277F052071k261282k321284j153888j7623O00309R71003J287087J288998O08950
$$ plain form
41268 5054341 4439029 2920332 1721790 1915659 3327788 4807397 5519339 5494880 4943800
41259 4943800 3805075 2345677 1476043 1768104 2588801 2902854 2562657 2038408 1289824
41250 1289824 14475 -1143197 -985543 336737 1135307 579307 93229 1307083 3504619
41241 3504619 4436341 3228971 1198863 -56459 -147838 535046 1515636 2176271 2015547
41232 2015547 1388742 1215041 1617295 1679485 965867 391012 890874 1926662 2175735
41223 2175735 1345742 485667 589729 1519995 2345456 2334523 1569850 804253 667699 945598
41213 945598 886739 304276 -85671 294848 976340 1060305 443178 -102536 73556 864595
41203 864595 1684520 2008857 1695270 1080241 755768 1072857 1866212 2602481 2567137 1118334
$$ packed form
41268E054341o15312j518697j198542J93869J412129J479609P11942k4459n51080
41259D943800j138725j459398q69634K92061Q20697L14053l40197n24249p48584
41250A289824j275349j157672J57654J322280P98570n56000m86078J213854K197536
41241C504619R31722j207370k030108j255322r1379O82884R80590O60635j60724
41232B015547o26805j73701M02254O2190p13618n74855M99862J035788K49073
41223B175735q29993q60075J04062R30266Q25461j0933p64673p65597j36554K77899
41213I45598n8859n82463l89947L80519O81492Q3965o17127n45714J76092P91039
41203H64595Q19925L24337l13587o15029l24473L17089P93355P36269l5344j448803
$$ plain form
41193 1118334 -1532476 -3712463 -3405921 -527963 2685334 4220781 4456301 4948964 5907688
41184 5907688 6227472 5599570 5011756 5032899 4991902 4303585 3519429 3505950 4334907 5354672
41174 5354672 5676652 4468419 1729929 -974455 -1647176 -150775 1685771 2648724 3462821
41165 3462821 4805609 5585631 4654928 3048406 2686913 3526719 3898089 3336344 3034975
41156 3034975 3360702 2993558 1282890 -270594 -7400 1661427 3182570 4025143 4623542
41147 4623542 4868797 4158707 2821168 2139431 2585612 2938982 1769295 -609149 -2259285
41138 -2259285 -1759076 150486 1457641 1373082 1227880 2350699 3777691 3360117 987682
41129 987682 -894037 -491781 1133707 2062622 2313455 3109417 4341901 4695581 3967422
$$ packed form
41193A118334k650810k179987L06542K877958L213297J535447K35520M92663R58724
41184E907688L19784o27902n87814K1143m0997o88317p84156j3479Q28957J019765
41174E354672L21980j208233k738490k704384o72721J496401J836546R62953Q14097
41165C462821J342788P80022r30703j606522l61493Q39806L71370n61745l01369
41156C034975L25727l67144j710668j553484K63194J668827J521143Q42573N98399
41147D623542K45255p10090j337539o81737M46181L53370j169687k378444j650136
41138b259285N00209J909562J307155q4559j45202J122819J426992m17574k372435
41129I87682j881719M02256J625488R28915K50833P95962J232484L53680p28159
$$ plain form
41120 3967422 3369092 3384018 3036375 1733049 324118 -307081 -414869 -459717 -221020
41111 -221020 357347 589888 281723 471691 1776685 2902511 2212148 206937 -1018743
41102 -1018743 -545531 543944 1070109 1123338 1256830 1476528 1515048 1290549 709339 -276188
41092 -276188 -1128523 -1037144 -168843 173260 -769871 -1985869 -1859426 -222146 1478487
41083 1478487 2002172 1738073 2095053 3696357 5458193 5662403 3905618 1572153 142232
41074 142232 -405415 -898558 -1289501 -865025 27129 -32299 -1304429 -1980737 -490256
41065 -490256 2202087 3750820 3310442 2097196 1380622 1074463 357768 -1190891 -3153292
41056 -3153292 -4317320 -3373955 -459020 2179090 2223222 134664 -1250894 -339520 1335824
$$ packed form
41120C967422n98330J4926l47643j303326j408931o31199j07788m4848K38697
41111b21020N78367K32541l08165J89968J304994J125826o90363k005211j225680
41102a018743M73212J089475N26165N3229J33492K19698L8520k24499n81210r85527
41092b76188q52335R1379Q68301L42103r43131j215998J26443J637280J700633
41083A478487N23685k64099L56980J601304J761836K04210j756785k333465j429921
41074A42232n47647m93143l90943M24476Q92154n9428j272130o76308J490481
41065d90256K692343J548733m40378j213246p16574l06159p16695j548659j962401
41056c153292j164028R43365K914935K638110M4132k088558j385558R11374J675344
$$ plain form
41047 1335824 1655906 1034960 1470512 3155632 3952290 2534343 439689 26832 1410955
41038 1410955 2676163 2656564 2113957 2000477 1863615 821293 -666766 -1190517 -451335
41029 -451335 149296 -599567 -1958206 -2026294 -33239 2709447 4149868 3484849 1776969
41020 1776969 737781 945633 1378906 877292 -217102 -501234 463136 1515776 1709313
41011 1709313 1771601 2838951 4476675 5266518 5031998 4970014 5409053 5001288 2940236
41002 2940236 744126 551510 2221411 3411057 2453711 59366 -2050760 -3189244
40994 -3189244 -3741559 -3849666 -3134641 -1806381 -1057207 -1594289 -2307418 -1504689 556904
40985 556904 1696078 902555 10842 1016172 2873524 2950494 1152193 215330 1593744
$$ packed form
41047A335824L20082o20946M35552J685120P96658j417947k094654m12857J384123
41038A410955J265208j9599n42607j13480j36862j042322j488059n23751P39182
41029d51335O00631p48863j358639o8088J993055K742686J440421o65019j707880
41020A776969j039188K07852M33273n01614j094394k84132R64370J052640J93537
41011A709313O2288J067350J637724P89843k34520o1984M39039m07765k061052
41002B940236k196110j92616J669901J189646r57346k394345k110126j138484
40994c189244n52315j08107P15025J328260P49174n37082p13129Q02729K061593
40985E56904J139174p93523q91713J005330J857352P6970j798301r36863J378414
$$ plain form
40976 1593744 3429145 3612406 2692852 2188321 1879348 858914 -106701 365899 1696076
40967 1696076 2185909 1904965 2247994 2900740 2044593 -94323 -750776 1315672 3772490
40958 3772490 4101696 2810281 1653119 760842 -415685 -1059880 -270860 871905 933052
40949 933052 793674 2145661 4107354 4226799 2579092 1814296 2814728 3375431 2158481
40940 2158481 1028694 1811200 3229749 3241931 2507601 3054031 4745543 5620381 5063676
40931 5063676 4223904 3578571 2492503 1325220 1602722 3366728 4379547 3111167 972071
40922 972071 274395 1177749 2139056 2537454 3104079 3962726 3985387 2642875 1270320
40913 1270320 1563005 3391841 4970903 4957148 3615383 1977797 733302 255213 877497
$$ packed form
40976A593744J835401J83261r19554n04531l08973j020434r65615M72600J330177
40967A696076M89833k80944L43029O52746q56147k138916o56453K066448K456818
40958C772490L29206j291415j157162q92277j176527o44195P89020J142765O1147
40949I33052j39378J351987J961693J19445j647707p64796J000432N60703j216950
40940B158481j129787P82506J418549J2182p34330N46430J691512Q74838n56705
40931E063676q39772o45333j086068j167283K77502J764006J012819j268380k139096
40922I72071o97676R03354R61307L98398N66625Q58647K2661j342512j372555
40913A270320K92685J828836J579062j3755j341765j637586j244495m78089O22284
$$ plain form
40904 877497 2338191 3391527 2949795 1563623 839299 1242906 1484932 532018 -785432
40895 -785432 -1065906 -513716 -628796 -1933426 -3169321 -2998340 -1637783 -350651 176474
40886 176474 451486 1301483 2679149 3524389 2988239 1678562 1115541 1742492 2240769
40877 2240769 1443021 169525 69620 1099977 1581688 821405 204808 1051658 2545659
40868 2545659 2822756 1509788 132399 108715 1153622 1881791 1491732 451604 -350925
40859 -350925 -630214 -515498 256488 2039349 4049991 4591491 3223150 1695198 1648973
40850 1648973 2320689 1986928 871131 634569 1382560 1533475 874198 1263146 3393140
40841 3393140 5132077 4531320 2651471 1747311 2156920 2762800 3258206 4002774 4534729
$$ packed form
40904H77497J460694J053336m41732j386172p24324M03607K42026r52914j317450
40895g85432k80474N52190j15080j304630j235895J70981J360557J287132N27125
40886A76474K75012Q49997J377666Q45240n36150j309677n63021O26951M98277
40877B240769p97748j273496r9905J030357M81711p60283o16597Q46850J494001
40868B545659K77097j312968j377389k3684J044907P28169l90059j040128q02529
40859c50925k79289J14716P71986J782861K010642N41500j368341j527952m6225
40850A648973O71716l33761j115797k36562P47991J50915o59277L88948K129994
40841C393140J738937o00757j879849r04160M09609O05880M95406P44568N31955
$$ plain form
40832 4534729 4146067 3323081 2915843 2534170 1486163 580748 1020501 2049785 1853156
40823 1853156 522328 -55769 793410 1860262 2525220 3584957 5101196 5678201 4779793
40814 4779793 3815856 3900522 4255937 3874435 3079443 2279048 841448 -1333015 -2567234
40805 -2567234 -1448435 884053 2165484 2048732 2147835 3422028 4935838 5203180 3848042
40796 3848042 2016120 1643161 3810780 7253292 9171725 8212734 5936873 4692566
40788 4692566 4973643 5730651 6230962 6370223 5972323 5148353 4756302 5190528 5255539 3623269
40778 3623269 1007552 -508915 -90053 1177700 2003636 2032045 1423046 524418 -75667
40769 -75667 -176631 -435907 -1223016 -1461288 87770 2740727 4561337 4952207 5115384
$$ packed form
40832D534729l88662q22986m07238l81673j048007r05415M39753J029284j96629
40823A853156j330828n78097Q49179J066852O64958J059737J516239N77005q98408
40814D779793r63937Q4666L55415l81502p94992q00395j437600k174463j234219
40805b567234J118799K332488J281431j16752R9103J274193J513810K67342j355138
40796C848042j831922l72959K167619L442512J918433r58991k275861j244307
40788D692566K81077P57008N00311J39261l97900q23970l92051M34226O5011j632270
40778C623269k615717j516467M18862J267753Q25936K8409o08999q98628o00085
40769g5667j00964k59276p87109k38272J549058K652957J820610L90870J63177
$$ plain form
40760 5115384 5986475 7152947 7822277 7472615 5664173 2774738 781166 1423129 3492904
40751 3492904 3998613 2345394 1112426 1991610 3376026 3270085 2308148 2002175 1860857
40742 1860857 562771 -1243526 -1728284 -843491 -273807 -674340 -986570 -556085 -109486
40733 -109486 -306877 -821469 -1256434 -1746637 -2273004 -2420605 -2113851 -1649234 -843575 765202
40723 765202 2609179 3167570 1953483 494016 577665 2095871 3272117 2696587 703805
40714 703805 -997715 -858877 965952 2501587 1927602 -207762 -1501573 -729713 546523
40705 546523 143541 -1725829 -2738257 -1512590 833057 2423599 2866361 3050124 3397703
40696 3397703 3334582 2431253 1207452 473820 404666 623447 795055 731569 292568 -289989
$$ packed form
40760E115384Q71091J166472O69330l49662j808442k889435j993572O41963K069775
40751C492904N05709j653219j232968Q79184J384416j05941r61937l05973j41318
40742A860857j298086j806297m84758Q84793N69684m00533l12230M30485M46599
40733a09486j97391n14592m34965m90203n26367j47601L06754M64617Q05659J608777
40723G65202J843977N58391j214087j459467Q3649J518206J176246n75530j992782
40714G03805j701520J38838J824829J535635n73985k135364j293811P71860J276236
40705E46523m02982j869370j012428J225667K345647J590542M42762J83763L47579
40696C397703o3121r03329j223801p33632o9154K18781J71608o3486m39001n82557
$$ plain form
40686 -289989 -288952 649071 1671896 1533162 271862 -720167 -517775 270511 668473 754305
40676 754305 1184208 1856362 1974800 1298050 523340 320423 569344 787248 939167 1492446
40666 1492446 2659500 3740690 3529405 1685364 -497096 -1319193 -745000 -481893 -1620478
40657 -1620478 -2961782 -2473057 38785 2639185 3610664 3260438 3075632 3631506 4000648
40648 4000648 3359955 2629341 3625112 6343164 8128787 6651013 3064009 656361 588949
40639 588949 896051 -16821 -1148681 -1223576 -1013941 -1492098 -1445629 642849 3464442
40630 3464442 4247290 2730524 1261287 1130587 1343039 1158233 1276718 1890653 1902797
40621 1902797 976450 308253 438265 275042 -686064 -1166712 -338026 678114 912727
$$ packed form
40686b89989J037R38023J022825j38734j261300r92029K02392P88286L97962Q5832
40676G54305M29903O72154J18438o76750p74710k02917K48921K17904J51919N53279
40666A492446J167054J081190k11285j844041k182460q22097N74193K63107j138585
40657a620478j341304M88725K511842K600400R71479l50226j84806N55874L69142
40648D000648o40693p30614R95771K718052J785623j477774l587004k407648o7412
40639E88949L07102r12872j131860p4895K09635m78157M6469K088478K821593
40630C464442P82848j516766j469237j30700K12452j84806J18485O13935J2144
40621A902797r26347o68197J30012j63223r61106m80648Q28686J016140K34613
$$ plain form
40612 912727 1227098 2255050 2589153 1100604 -574776 -278329 1212172 1556400 718378
40603 718378 572991 1116546 228598 -2382973 -3925893 -2379204 654417 2410380 2598515
40594 2598515 2988532 4470046 6118599 6722545 5980452 4279252 2192998 401841 -334673
40585 -334673 472857 2395741 3797492 2956960 138581 -2091264 -1584662 829911 2586017
40576 2586017 2614981 1905148 1307278 718742 461783 1343757 2775664 2832740 1109823
40567 1109823 -329130 -2137 786658 312959 -616631 -62229 1781354 2830054 2129541
40558 2129541 764320 -6252 121466 1059991 2477372 3441995 3317186 2904273 3332183
40549 3332183 4049265 3540412 1930247 1001816 1390574 1694198 966290 181888 231050
$$ packed form
40612I12727L14371J027952L34103j488549j675380K96447J490501L44228q38022
40603G18378j45387N43555q87948k611571j542920J546689L033621J755963J88135
40594B598515L90017J481514J648553O03946p42093j701200k086254j791157p36514
40585c34673Q07530J922884J401751q40532k818379k229845N06602K414573J756106
40576B586017K8964p09833n97870n88536k56959Q81974J431907N7076j722917
40567A109823j438953L26993P88795m73699r29590N54402J843583J048700p00513
40558B129541j365221p70572J27718R38525J417381R64623j24809m12913M27910
40549C332183P17082n08853j610165r28431L88758L03624p27908p84402M9162
$$ plain form
40540 231050 230282 -750041 -1723432 -1305703 -249021 -573137 -2539901 -4231303 -4182944 -2948809
40530 -2948809 -1746797 -825244 232803 1463971 2467471 2956271 2898595 2380002 1629949
40521 1629949 993701 673856 584745 472661 65516 -761627 -1743083 -2307075 -2175542 -1648773
40511 -1648773 -927740 513454 3191338 6318790 8011128 7092963 4302028 1530900
40503 1530900 240085 689716 2199189 3808293 4913817 5475931 5537436 4741023 2801648
40494 2801648 389561 -1131031 -1051932 129872 1653594 3274672 4798195 5653543 5562312
40485 5562312 4971146 4122977 2441043 -111124 -1712266 -353271 3126871 5318436
40477 5318436 4237262 1716862 791343 1804793 2624945 2127851 1612063 2453683 3949362
$$ packed form
40540B31050p68r80323r73391M17729J056682l24116j966764j691402M8359J234135
40530b948809J202012R21553J058047J231168J003500M88800n7676n18593p50053
40521A629949o36248l19845q9111j12084m07145q27143r81456n63992J31533N26769
40511a648773P21033J441194K677884L127452J692338r18165k790935k771128
40503A530900j290815M49631J509473J609104J105524N62114O1505p96413j939375
40494B801648k412087j520592P9099J181804J523722J621078J523523Q55348r1231
40485E562312n91166q48169j681934k552167j601142J358995L480142K191565
40477E318436j081174k520400r25519J013450Q20152m97094n15788Q41620J495679
$$ plain form
40468 3949362 4434349 3546892 2258052 1205988 201237 -760018 -1191012 -1111913 -1360545
40459 -1360545 -2331016 -3129601 -2721687 -1450610 -610401 -729507 -1059994 -732920 285600
40450 285600 1436221 2101651 1827729 706991 -312127 -224525 729235 1379661 1492457
40441 1492457 2192041 3860877 4866112 3739627 1777457 1659225 3680441 5237066
40433 5237066 4439339 2491813 1611165 2059552 2508381 2249371 1534612 403394 -1171389
40424 -1171389 -2181751 -1295946 1020564 2496088 1787300 145181 -380444 513750 1550412
40415 1550412 1883657 1798216 1668411 1358046 787472 188030 -460349 -1410327 -2202063 -1661742
40405 -1661742 370903 2046629 1442844 -739756 -1754679 -357996 1520237 1446760 -228697
$$ packed form
40468C949362M84987q87457j288840j052064j004751r61255m30994P9099k48632
40459a360545r70471p98585M07914J271077Q40209j19106l30487L27074J018520
40450B85600J150621O65430k73922j120738j019118Q7602R53760O50426J12796
40441A492457O99584J668836J005235j126485j962170j18232K021216J556625
40433E237066p97727j947526q80648M48387M48829k59010p14759j131218j574783
40424a171389j010362Q85805K316510J475524p08788j642119n25625Q94194J036662
40415A550412L33245q5441j29805l10365n70574n99442o48379r49978p91736N40321
40405a661742K032645J675726o03785k182600j014923J396683J878233p3477j675457
$$ plain form
40396 -228697 -1014772 340490 2526537 3701171 3521834 2791456 2189542 1969454 2112896
40387 2112896 2157757 1504807 441853 176896 1192228 2245557 1878459 411896 -541096
40378 -541096 -252309 444598 566580 95949 -449206 -735012 -627433 -70106 798118 1748450
40368 1748450 2703397 3535072 3849215 3550332 3395593 4185493 5452317 5792849 4597719
40359 4597719 2682196 1136170 387556 482268 1288727 2166064 2457183 2671839 4042104
$$ packed form
40396b28697p86075J355262K186047J174634j79337p30378o01914k20088J43442
40387B112896M4861o52950j062954k64957J015332J053329l67098j466563r52992
40378e41096K88787O96907J21982m70631n45155k85806J07579N57327Q68224R50332
40368A748450R54947Q31675L14143k98883j54739P89900J266824L40532j195130
40359D597719j915523j546026p48614R4712Q06459Q77337K91119K14656J370265
$$ [...]
##END NTUPLES=NMR SPECTRUM
##END=
