##TITLE=31Pdec_LR-688B-M-OST
 CDCl3, 124 sc
 2.8.2019
##JCAMPDX= 6.0         $$ Bruker NMR JCAMP-DX V2.0
##DATA TYPE= NMR SPECTRUM
##DATA CLASS= NTUPLES
##ORIGIN= UXNMR, Bruker Analytische Messtechnik GmbH
##OWNER= root
$$ XWIN-NMR		Version 3.5
$$ Fri Aug  2 14:16:18 2019 Russian Standard Time (UT+4h)  she@DPX200
##.OBSERVE FREQUENCY= 81.013821
##.OBSERVE NUCLEUS= ^31P
##.ACQUISITION MODE= SIMULTANEOUS
##.ACQUISITION SCHEME= undefined
##.AVERAGES= 124
##.DIGITISER RES= 17
##SPECTROMETER/DATA SYSTEM= spect
##.PULSE SEQUENCE= zgpg30
##.SOLVENT NAME= CDCl3
##.SHIFT REFERENCE= (INTERNAL, CDCl3, 0, 182.463)
##AUDIT TRAIL= $$ (NUMBER, WHEN, WHO, WHERE, WHAT)
$$ ##TITLE= Audit trail, XWIN-NMR		Version 3.5
$$ ##JCAMPDX= 5.01
$$ ##ORIGIN= Bruker BioSpin GmbH
$$ ##OWNER= she
$$ F:/spectra/data/she/nmr/P31/1/pdata/1/auditp.txt
$$ ##AUDIT TRAIL=  $$ (NUMBER, WHEN, WHO, WHERE, WHAT)
(   1,<2019-08-02 14:15:05.96 +0400>,<she>,<DPX200>,
      <continue with go, POWCHK disabled, PULCHK disabled
       configuration hash MD5:
       00 E9 B6 7A A2 85 ED C7 34 08 36 98 17 FE 4E 26
       data hash MD5: 32K
       C8 AF EC 91 A7 6D 5E 0A 7E D7 6B 2D FC 48 FD A8>)
(   2,<2019-08-02 14:15:09.15 +0400>,<she>,<DPX200>,
      <Start of raw data processing
       efp BC_mod = 2 LB = 1 FT_mod = 6 PKNL = 1 PHC0 = -554.4413 PHC1 = 565.0003 SI = 64K 
       data hash MD5: 64K
       24 C5 50 8F E2 08 0A D9 98 C6 BC 02 00 19 ED 3B>)
(   3,<2019-08-02 14:15:39.65 +0400>,<she>,<DPX200>,
      <pk PHC0 = -24.93796 PHC1 = 89.20004 
       data hash MD5: 64K
       15 D7 EF 43 2C AB C5 6D AD BC 77 93 BA 3A 36 35>)
(   4,<2019-08-02 14:15:45.14 +0400>,<she>,<DPX200>,
      <abs ABSG = 5 
       data hash MD5: 64K
       55 32 44 9B 84 02 8F 6D BF 0B 05 5F CF 21 5F A5>)
$$ ##END=
$$ 
$$ hash MD5
$$ 82 9C B0 FB 9E 49 07 D6 72 7C E4 36 DE 7E 8A B8
##$RELAX= 
##$RELAX= 
##$RELAX= 
##$RELAX= 
##$RELAX= 
##$RELAX= 
##$RELAX= 
##$RELAX= 
$$ Bruker specific parameters
$$ --------------------------
##$DU= <F:/spectra>
##$EXPNO= 1
##$NAME= <P31>
##$PROCNO= 1
##$TYPE= <nmr>
##$USER= <she>
##$AMP= (0..31)
100 100 100 100 100 100 100 100 100 100 100 100 100 100 100 100 100 100 
100 100 100 100 100 100 100 100 100 100 100 100 100 100 
##$AQSEQ= 0
##$AQ_mod= 1
##$AUNM= <au_zg>
##$AUTOPOS= <>
##$BF1= 81.014009
##$BF2= 200.13
##$BF3= 200.13
##$BF4= 200.13
##$BF5= 200.13
##$BF6= 200.13
##$BF7= 200.13
##$BF8= 200.13
##$BYTORDA= 1
##$CFDGTYP= 0
##$CFRGTYP= 5
##$CHEMSTR= <none>
##$CNST= (0..31)
1 1 145 1 1 1 1 1 1 1 1 1 1 1 1 1 1 1 1 1 1 1 1 1 1 1 1 1 1 1 1 1 
##$CPDPRG= <waltz16>
##$CPDPRG1= <>
##$CPDPRG2= <waltz16>
##$CPDPRG3= <>
##$CPDPRG4= <mlev>
##$CPDPRG5= <mlev>
##$CPDPRG6= <mlev>
##$CPDPRG7= <mlev>
##$CPDPRG8= <mlev>
##$CPDPRGB= <>
##$CPDPRGT= <>
##$D= (0..31)
0 1 0 0 0 0 0 0 0 0 0 0.03 2e-05 3e-06 0 0 0 0 0 0 0 0 0 0 0 0 0 0 0 0 
0 0 
##$DATE= 1564740710
##$DBL= (0..7)
120 120 120 11 120 120 24 19 
##$DBP= (0..7)
150 150 150 150 150 150 150 150 
##$DBP07= 0
##$DBPNAM0= <>
##$DBPNAM1= <>
$$ [...]
##$SUBNAM3= <"">
##$SUBNAM4= <"">
##$SUBNAM5= <"">
##$SUBNAM6= <"">
##$SUBNAM7= <"">
##$SUBNAM8= <"">
##$SUBNAM9= <"">
##$SW= 369.568048894756
##$SWIBOX= (0..15)
0 1 3 0 0 0 0 0 0 0 0 0 0 0 0 0 
##$SW_h= 29940.119760479
##$TD= 32768
##$TD0= 1
##$TE= 0
##$TE2= 300
##$TE3= 300
##$TEG= 300
##$TL= (0..7)
0 120 53 12 22 120 120 120 
##$TP= (0..7)
150 150 150 150 150 150 150 150 
##$TP07= 0
##$TPNAME0= <>
##$TPNAME1= <>
##$TPNAME2= <>
##$TPNAME3= <>
##$TPNAME4= <>
##$TPNAME5= <>
##$TPNAME6= <>
##$TPNAME7= <>
##$TPOAL= (0..7)
0.5 0.5 0.5 0.5 0.5 0.5 0.5 0.5 
##$TPOFFS= (0..7)
0 0 0 0 0 0 0 0 
##$TUNHIN= 0
##$TUNHOUT= 0
##$TUNXOUT= 0
##$USERA1= <user>
##$USERA2= <user>
##$USERA3= <user>
##$USERA4= <user>
##$USERA5= <user>
##$V9= 5
##$VALIST= <valist>
##$VCLIST= <CCCCCCCCCCCCCCC>
##$VD= 0
##$VDLIST= <DDDDDDDDDDDDDDD>
##$VPLIST= <PPPPPPPPPPPPPPP>
##$VTLIST= <TTTTTTTTTTTTTTT>
##$WBST= 1024
##$WBSW= 4
##$XGAIN= (0..3)
0 0 0 0 
##$XL= 0
##$YL= 0
##$YMAX_a= 28723
##$YMIN_a= -18882
##$ZGOPTNS= <>
##$ZL1= 120
##$ZL2= 120
##$ZL3= 120
##$ZL4= 120
##$ABSF1= 182.463
##$ABSF2= -187.1042
##$ABSG= 5
##$ABSL= 3
##$ALPHA= 0
##$AQORDER= 0
##$ASSFAC= 0
##$ASSFACI= 0
##$ASSFACX= 0
##$ASSWID= 0
##$AUNMP= <proc_1d>
##$AZFE= 0.1
##$AZFW= 0.5
##$BCFW= 0
##$BC_mod= 2
##$BYTORDP= 0
##$COROFFS= 0
##$CY= -3
##$DATMOD= 1
##$DC= 0
##$DFILT= <>
##$DTYPP= 0
##$F1P= 0
##$F2P= 0
##$FCOR= 1
##$FTSIZE= 65536
##$FT_mod= 6
##$GAMMA= 0
##$GB= 0
##$INTBC= 1
##$INTSCL= 5.30512e-09
##$ISEN= 30
##$LB= 1
##$LEV0= 0
##$LPBIN= 0
##$MAXI= 10000
##$MC2= 0
##$MEAN= 0
##$ME_mod= 0
##$MI= 50
##$NCOEF= 0
##$NC_proc= -7
##$NLEV= 6
##$NOISF1= 182.463
##$NOISF2= 159.3651
##$NSP= 0
##$NTH_PI= 0
##$NZP= 0
##$OFFSET= 182.463
##$PC= 4
##$PHC0= -579.3793
##$PHC1= 654.2003
##$PH_mod= 1
##$PKNL= yes
##$PPARMOD= 0
##$PSCAL= 0
##$PSIGN= 0
##$REVERSE= no
##$SF= 81.0140089999434
##$SI= 65536
##$SIGF1= 159.3651
##$SIGF2= -187.1042
##$SINO= 113.3802
##$SIOLD= 16384
##$SREGLST= <1H.CDCl3>
##$SSB= 0
##$STSI= 65536
##$STSR= 0
##$SW_p= 29940.119760479
##$SYMM= 0
##$S_DEV= 0
##$TDeff= 32768
##$TDoff= 0
##$TI= <>
##$TILT= no
##$TM1= 0
##$TM2= 0
##$TOPLEV= 0
##$USERP1= <user>
##$USERP2= <user>
##$USERP3= <user>
##$USERP4= <user>
##$USERP5= <user>
##$WDW= 1
##$XDIM= 65536
##$YMAX_p= 294392193
##$YMIN_p= -40881652
$$ End of Bruker specific parameters
$$ ---------------------------------
##NTUPLES= NMR SPECTRUM
##VAR_NAME=  FREQUENCY,     SPECTRUM/REAL,   SPECTRUM/IMAG
##SYMBOL=    X,             R,               I
##VAR_TYPE=  INDEPENDENT,   DEPENDENT,       DEPENDENT
##VAR_FORM=  AFFN,          ASDF,            ASDF
##VAR_DIM=   65536,         65536,           65536
##UNITS=     HZ,            ARBITRARY UNITS, ARBITRARY UNITS
##FACTOR=    0.456856943014862, 1,           1
##FIRST=     14782.0589164792, 0,            0
##LAST=      -15158.0608439998, 0,           0
##MIN=       -15158.0608439998, -40881652,   0
##MAX=       14782.0589164792, 294392193,    0
$$ Real data points
##PAGE= N=1
##DATA TABLE= (X++(R..R)), XYDATA
$$ [...]
45246B519257N111770L467535J849703J757803J717339O7978k667599n091740
45238H732046o313484n162904j086072K928322K337304j793224k383099L176308
45230D35197P361551L222158m018319m249901J786385L957158q34750m394720
45222C264759j371930K724072J983778o48031n54832j4924k497962m842816k865148
45213d823034L00573o49288l811331l758909j049437J02290M70984L301317N708750
45204d208085K450703k980980j660137N835694Q578459J948762n097116l857832
45196A009468J990046L820534K68984m171707o848602p096745l583136K549949
45188a2061209N987208M143770J804836L579994N986703L148032l319288o741317
$$ plain form
45246 2519257 7631027 11098562 12948265 14706068 16423407 16491385 13823786 8732046
45238 8732046 2418562 -2744342 -3830414 -902092 1435212 -358012 -2741111 435197
45230 435197 7796748 11018906 7000587 2750686 4537071 8494229 7659479 3264759
45222 3264759 1892829 4616901 6600679 5952648 5397816 5382892 2884930 -1957886 -4823034
45213 -4823034 -4522461 -5171749 -8983080 -12741989 -13791426 -13689136 -13218152 -9916835 -4208085
45204 -4208085 -1757382 -4738362 -6398499 -562805 8015654 9964416 4867300 1009468
45196 1009468 2999514 6820048 7089032 2917325 -3931277 -11028022 -14611158 -12061209
45188 -12061209 -6074001 -1930231 -125395 3454599 9441302 12589334 9270046 2528729
45180B528729m988919j289083K072753M357215L022493k997027q078158n453077
45172a0825074K409244O206885K810610j389646j054516J615336L036208L719201
45164F528248M221500J985360l294279o161335k254666M787058P863489N212716
45156A8888091N37591l166226n359368n232292k138532J367032J091294l206223
45148B781367o680741n142993m3768L635921L454602K004261L091920O362456
45140I463025P263342L060766k729644m223365r13720J499870j100189n478503
45132F841582n282565N98690O625545P438116L867832R92452J277978J683460
45124B4043090j489277o546225q091596m781267j645299k627193m386370j505502
$$ plain form
45180 2528729 -2460190 -3749273 -1676520 2680695 5703188 2706161 -5371997 -10825074
45172 -10825074 -8415830 -2208945 601665 -787981 -1842497 -227161 2809047 6528248
45164 6528248 10749748 12735108 9440829 3279494 1024828 5811886 13675375 18888091
45156 18888091 19425682 16259456 10900088 5667796 3529264 4896296 5987590 2781367
45148 2781367 -3899374 -9042367 -9086135 -5450214 -1995612 8649 3100569 9463025
45140 9463025 16726367 19787133 17057489 12834124 11920404 13420274 12320085 6841582
45132 6841582 1559017 2157707 8783252 16221368 20089200 21081652 22359630 24043090
45124 24043090 22553813 16007588 7915992 3134725 1489426 -1137767 -5524137 -7029639
45116g029639M534527O762475K503741l305585n244730l411973j099511l40834
45108f631529j237527k546437j940531J276716L588700J397037k378055j395660
45100i867286L649886M625285j340690o242289l294914K302738J971886k359686
45092a0555070k073075L552397O481505L174138r42068j903234l021522o451181
45084a1738110p010812o62534O515539N484157k226691n778806r882P601130P556983
45075b69026P53397m280190l577255j258522r53882M649M485649Q482491N940391
45066I327702j544754o204674m830786j553556N67065L219758N856522L353730
45058H191007m278514p556291m17529Q742817Q127274n649l621820Q5655K064011
$$ plain form
45116 -7029639 -2495112 4267363 6771104 3465519 -1779211 -5191184 -6290695 -6631529
45108 -6631529 -7869056 -10415493 -12356024 -11079308 -7490608 -6093571 -8471626 -9867286
45100 -9867286 -6217400 -1592115 -2932805 -9175094 -12470008 -10167270 -8195384 -10555070
45092 -10555070 -12628145 -9075748 -2594243 579895 -362173 -2265407 -5286929 -11738110
45084 -11738110 -18748922 -19411456 -12895917 -7411760 -9638451 -15417257 -15427139 -7826009 -269026
45075 -269026 484371 -3795819 -7373074 -8631596 -9585478 -9580829 -5095180 3387311 9327702
45066 9327702 7782948 1578274 -3252512 -4806068 -4239003 -1019245 4837277 8191007
45058 8191007 3912493 -3643798 -4061327 4681490 12808764 12803115 9181295 9266950 11330961
45049A1330961k174706n997643m637412l037003n064769n205742J188725P706066
45041e891523O235617N48258M81308O136058Q092864K361024m354234n419501
45033H189871k365317P3909N25146m49109l214916o885746p752012l484465K937705
45024a2424934O244788M810729J696705N10656J670690K538688N83301l453452
45016B177171n705594l274489J920092M414267O97789p013011j2596936j1465000
45008c0845711m516998L003268O684560O666227N833957N558475M987858L583129
45000I54765J643648j243823n057593o829978l309056L371281P186378O417404
44992C133026N233036N506161L398731k563896o733475m991381k058027l473804
$$ plain form
45049 11330961 9156255 3158612 -1478800 -4515803 -9580572 -14786314 -13597589 -5891523
45041 -5891523 344094 892352 1373660 7509718 15602582 17963606 13609372 8189871
45033 8189871 5824554 5898463 6423609 5974500 2759584 -4126162 -11878174 -15362639 -12424934
45024 -12424934 -6180146 -1369417 327288 837944 2508634 5047322 5630623 2177171
45016 2177171 -3528423 -6802912 -4882820 -468553 229236 -6783775 -19380711 -30845711
45008 -30845711 -35362709 -32359441 -25674881 -19008654 -13174697 -7616222 -2628364 954765
45000 954765 2598413 1354590 -3703003 -10532981 -13842037 -10470756 -3284378 3133026
44992 3133026 8366062 13872223 17270954 14707058 7973583 2982202 924175 -2549629
44984b549629n890266l512120P22282K91755k198504J085858Q229581Q991015
44976E169972K036532j981866K151124O013354K197258m248822o213426n926303
44968h02177p251104o120347P25031N527743M69379p140748m411945N914882Q671152
44959d418134K77126n692067l63066P131103N255162k334756m216743J318596
44951c042779N987048M496459p55075n556808p203981l702123L650128Q070344
44943A943213M118242l848550o272191j323309L326393K451383j40578K54749
44935E09352J332933p73072l189831l74455N840804P509012K140888l443033l009875
44926F542723O38113Q18153l055712n285416k365510K424193L348889j130208
$$ plain form
44984 -2549629 -8439895 -11952015 -11229733 -10937978 -13136482 -12050624 -3821043 5169972
44976 5169972 7206504 5224638 7375762 13389116 15586374 11337552 5124126 -802177
44968 -802177 -8053281 -14173628 -13448597 -7920854 -7451475 -14592223 -19004168 -13089286 -4418134
44959 -4418134 -4141008 -9833075 -10196141 -3065038 2190124 -144632 -4361375 -3042779
44951 -3042779 2944269 7440728 6685653 1128845 -6075136 -9777259 -6127131 1943213
44943 1943213 6061455 2212905 -4059286 -5382595 -2056202 395181 254603 509352
44935 509352 1842285 1069213 -2120618 -2495073 3345731 10854743 12995631 9552598 6542723
44926 6542723 7180836 7998989 4943277 -342139 -2707649 -283456 3065433 1935225
44918A935225o562698o648691J54357P854684Q825281L197366j103621L57825
44910H009728J952352k786079r842636r899034k407681L947593M394659K744234
44902c886864J786957j395818p086388r092881m609535K48186R34870K343341
44894b0758132Q446791J2207233O329897k296091j526213O397129P784604q33039
44886A5752179p970900o204646k450891m153598p026591m137046J907867M439699
44878i843927L883251M828091O384632L911942j798984m477253j232940L863504
44870E518316N319496J875341l303683n833430l915463L9502K581525L453611
44862E735215L878946K077867l827093q798548m763441O294565J1630603M633552
$$ plain form
44918 1935225 -4627473 -11276164 -11121807 -3267123 5558158 8755524 7651903 8009728
44910 8009728 9962080 7176001 -2666635 -12565669 -14973350 -11025757 -6631098 -3886864
44902 -3886864 -2099907 -3495725 -10582113 -19674994 -24284529 -24036343 -23101473 -20758132
44894 -20758132 -12311341 -104108 6225789 3929698 2403485 8800614 16585218 15752179
44886 15752179 7781279 1576633 -874258 -5027856 -12054447 -16191493 -14283626 -9843927
44878 -9843927 -5960676 -1132585 5252047 9163989 7365005 2887752 1654812 5518316
44870 5518316 10837812 12713153 9409470 3576040 -339423 -299921 2281604 5735215
44862 5735215 9614161 11692028 7864935 -933613 -5697054 597511 12228114 16861666
44854A6861666n650412p936713l767958j201361o79917K391487O001003M194534
44846A0212329r01403j298356K945304L269985k633696o599894l703460J26354
44838A417163o01516j241324L892958R553429N956157n776725j3409924r366811
44830i576593P9051L978451N16583k486368P55149O439173P063047J728414l342853
44821E154054l610105r59148R02962Q99762j226048n720602q802100l865258Q192689
44812i033794J5477194R000899m216350r979801n441507M03615K406813M471373
44804C088442Q429135Q624078J532865p390920j0951859q356621k920305K502110
44796e443075M791529J264206n268406p226237j526140O108624Q649904N303313
$$ plain form
44854 16861666 11211254 3274541 -493417 -1694778 -2374695 16792 6017795 10212329
44846 10212329 9310926 8012570 10957874 14227859 11594163 4994269 1290809 1417163
44838 1417163 815647 -425677 3467281 13020710 18976867 13200142 -209782 -9576593
44830 -9576593 -9497542 -5519091 -5002508 -7488876 -6733727 -294554 6768493 8496907 5154054
44821 5154054 1543949 584801 1487763 2387525 1161477 -4559125 -13361225 -17226483 -9033794
44812 -9033794 6443400 15444299 11227949 1248148 -4193359 -3789744 -1382931 3088442
44804 3088442 11517577 20141655 21674520 14283600 3331741 -5024880 -7945185 -5443075
44796 -5443075 -651546 612660 -4655746 -11881983 -13408123 -7299499 1350405 6653718
44788F653718k92415m630689n392777k757646p72573k398373l552018R62314O526243
44779e654216L747736n005359o590267K010861P537605J958099l868369J298654
44771d565256R509543O840997l294032o430497q79214J680019k811649n612068
44763e562157j853913K391904K692312L046646N928906O479611J499875m575966
44755A0047218p010976o488824m289955M34807N322181M683406j413129n315925
44747d031197k855101J079618J892507K278004M707778M718832j258290p507949
44739i75798o375673J41004L933554L146647L052934N444601N020444j455805
44731A1931908q030435n964731M332159J1705566O566945o681958j3307714n731529
$$ plain form
44788 6653718 6361303 1730614 -3662163 -6419809 -7192382 -9590755 -13142773 -12180459 -5654216
44779 -5654216 -1906480 -6911839 -13502106 -11491245 -3953640 -1995541 -5863910 -4565256
44771 -4565256 4944287 11785284 8491252 2060755 1181541 2861560 49911 -5562157
44763 -5562157 -7416070 -5024166 -2331854 714792 6643698 13123309 14623184 10047218
44755 10047218 3036242 -3452582 -7742537 -7307730 -1985549 2697857 1284728 -4031197
44747 -4031197 -6886298 -5806680 -3914173 -1636169 3071609 7790441 6532151 -975798
44739 -975798 -7351471 -7210467 -3276913 -130266 2922668 8367269 13387713 11931908
44731 11931908 3901473 -2063258 2268901 13974467 20541412 13859454 551740 -5179789
44723e179789O715691R540436J210733o723929n981137m05128K358890P46197
44715B281964k038093l565176l076510p88786J312597J288693P08675K243168
44707a633468L967863J824570k272540k287851R77785k77587p151613r813308
44699a6666149k438033O608034P056557J699093J14825L125252L407961j497893
44691A409647o194513o401895l267260Q07296M232299M580966M95160m971823
44683i310123p165593n024399k80155N699182J0393673R357212K205853m254033
44675A621617m476556j845677j880715k658414O7743K866413j30267m984476k310060
44666a3730392O909020J1325798O196907o28389k219070j494764k500088k469619
$$ plain form
44723 -5179789 1535902 11076338 12287071 5563142 -417995 -823123 1535767 2281964
44715 2281964 243871 -3321305 -6397815 -7186601 -5874004 -4585311 -3876636 -1633468
44707 -1633468 2334395 4158965 1886425 -401426 576359 298772 -6852841 -16666149
44699 -16666149 -19104182 -12496148 -5439591 -3740498 -3625673 -500421 2907540 1409647
44691 1409647 -4784866 -11186761 -14454021 -13646725 -9414426 -4833460 -4338300 -9310123
44683 -9310123 -16475716 -21500115 -21780270 -16081088 -5687415 3669797 5875650 1621617
44675 1621617 -2854939 -4700616 -6581331 -9239745 -9172002 -6305589 -6435856 -11420332 -13730392
44666 -13730392 -6821372 4504426 10701333 10072944 7853874 6359110 3859022 1389403
44658A389403J406055M883682K938925k084863m352876k663079k2973J510259
44650C004533J611661K44651j376235r85672J342138K654231J247610j634288
44642F108629m458622n895349l318230L639420Q604567M741859m114107o785416
44634a477249n68780N204140L790371m94019k163288k670652l210792K25447P334871
44625E970049Q892445M93903q060095o913867j122539m80879k835998p40821K543489
44616b254313q18706o112436k024238Q497620J0761904K063964m528718k648111
44608B936966j201699n214796n671438K663964R106749M403012l015894j493559
44600B513305M004703J490677o541767p330991N76591N564583J973939k893563
$$ plain form
44658 1389403 2795458 7679140 10618065 8533202 4180326 1517247 1494274 3004533
44650 3004533 4616194 4860845 3484610 2498938 3841076 6495307 7742917 6108629
44642 6108629 1650007 -4245342 -7563572 -3924152 4680415 9422274 5308167 -1477249
44634 -1477249 -2046029 3158111 6948482 6454463 4291175 1620523 -1590269 -1364822 5970049
44625 5970049 14862494 15356397 7296302 382435 -740104 -1220983 -4056981 -4797802 -2254313
44616 -2254313 -3073019 -9185455 -11209693 -2712073 8049831 10113795 5585077 2936966
44608 2936966 1735267 -3479529 -9150967 -6487003 2619746 7022758 4006864 2513305
44600 2513305 6518008 8008685 1466918 -5864073 -5287482 277101 2251040 -642523
44592f42523k177324J646283L593608K612000p73596n212149n910229N13643P830911
44583A480624N953714l578992p592049J28378R836540J0309645L552165j485298
44575A8604727k534225l405423m714100l506108k4165J944931Q24306j374524
44567E815419k554859j818868J235155N136838O278675L337528K4293J35354J929576
44558A9519111R19100l557609p880872q675872n177279P08024M334678J552058
44550A741339n148789p705657l201839J375085j36068l258405q97141M038318
44542a3193157L526620j438305k485561J592845L335243M14616n98670K918528
44534e927841M292047j02139l457710l7967M887760M273585R82911J780164N429516
$$ plain form
44592 -642523 -2819847 -1173564 2420044 5032044 4258448 -953701 -6863930 -6350287 1480624
44583 1480624 7434338 3855346 -3736703 -3608325 6228215 16537860 20090025 18604727
44575 18604727 16070502 12665079 7950979 4444871 4420706 6365637 7189943 5815419
44567 5815419 3260560 1441692 2676847 7813685 14092360 17429888 17454181 17589535 19519111
44558 19519111 20438211 16880602 8999730 323858 -4853421 -4145397 189281 1741339
44550 1741339 -3407450 -11113107 -14314946 -12939861 -13075929 -16334334 -17231475 -13193157
44542 -13193157 -9666537 -11104842 -13590403 -11997558 -8662315 -8247699 -8846369 -5927841
44534 -5927841 -1635794 -1737933 -5195643 -5233610 -345850 3927735 4910646 6690810 12120326
44525A2120326N511687J176754k833863l962312k933930k21976K496792J156049
44517A2509527m269142o717821k246999K093280j072411o513098m642011K010576
44509h848099L097449j666617k833291J189797J557978l969253n950040J96973
44501a7225103O046582M817063J739919K369543K407532j810086l776077J435140
44493c995487N681909N27960o543692k803958Q341709J1656763L270956n138543
44485A0997617n446446k498327k135468k336932m83942J002685J049892L094138
44477C243217P165412O992543J25560o462304o391398k866845j950674l104573
44469c249062k907402k642802m689400n529662n52827O470868O921830R71n587758
$$ plain form
44525 12120326 17632013 18808767 15974904 12012592 9078662 8856686 11353478 12509527
44517 12509527 8240385 1522564 -724435 1368845 296434 -6216664 -10858675 -8848099
44509 -8848099 -5750650 -7417267 -10250558 -9060761 -7502783 -11472036 -17422076 -17225103
44501 -17225103 -11178521 -6361458 -4621539 -2251996 155536 -1654550 -5430627 -3995487
44493 -3995487 1686422 2214382 -4329310 -7133268 1208441 12865204 16136160 10997617
44485 10997617 5551171 3052844 917376 -1419556 -1903498 -900813 149079 3243217
44477 3243217 10408629 17401172 17526732 11064428 4673030 1806185 -144489 -3249062
44469 -3249062 -6156464 -8799266 -13488666 -19018328 -19571155 -13100287 -6178457 -6177486 -11765244
44460a1765244l830931J233730L008667J915479L141996P509520R459489M792286
44452A5464992k755601n318388p14055M570898L897411o27230j537805K911886
44444A5892108O257752L402470k544560n803218n720885m946049l548926k84349
44436B704343K488563R56823l509840n053043j195963M353374P456587P729991
44428A5930835N725036N47650o806744j1228876q644948j981912J694736l9980
44420d804203k196421M50150N842558P090530K012476l205537k164276K455227
44412E480504K349731l979725q169752m051503K908307L775775m25644j253105
44404c365412L004032M955824J244243j362344K274309N916444J553008o774468
$$ plain form
44460 -11765244 -15596175 -14362445 -11353778 -9438299 -6296303 1213217 10672706 15464992
44452 15464992 12709391 7391003 6676948 11247846 15145257 14518027 12980222 15892108
44444 15892108 22149860 25552330 23007770 17204552 11483667 6537618 2988692 2704343
44436 2704343 5192906 6149729 2639889 -2413154 -3609117 744257 8200844 15930835
44428 15930835 21655871 22203521 15396777 4167901 -4477047 -6458959 -4764223 -4804203
44420 -4804203 -7000624 -6550474 -707916 6382614 8395090 5189553 3025277 5480504
44412 5480504 7830235 3850510 -4319242 -8370745 -5462438 -1686663 -2112307 -3365412
44404 -3365412 -361380 4594444 5838687 4476343 6750652 12667096 14220104 7445636
44396G445636q019566o88643N091523K648832k654545k743541K334522P133995
44388A0548213Q868419P625793K590745n964636j2915295j2400073n658382p5350
44380g380566J29292j851524j408538J351655L626069M753379N825289O223236
44372A1268292L853118j416047o914935r819739q896758m095032L010647Q174034
44364d836420P162304J350866k093333J392705P202882P359491J579248k889884
44356A6227859k829816l629424q922974j2443171p227766J648808K974737l426322
44348a7628069n787762J641604J0063395J0203160N349713K979033J647735l630492
44340D838317q821539n885164K154896L824677k600037n847921L58048P857677
$$ plain form
44396 7445636 -573930 -1262573 3828950 6477782 3823237 1079696 3414218 10548213
44388 10548213 19416632 27042425 29633170 23668534 10753239 -1646834 -7305216 -7380566
44380 -7380566 -7251274 -9102798 -10511336 -9159681 -5533612 -780233 5045056 11268292
44372 11268292 15121410 13705363 6790428 -3029311 -11926069 -16021101 -13010454 -4836420
44364 -4836420 2325884 3676750 1583417 2976122 10179004 17538495 19117743 16227859
44356 16227859 13398043 9768619 845645 -11597526 -18825292 -17176484 -14201747 -17628069
44348 -17628069 -23415831 -21774227 -11710832 -1507672 3842041 6821074 8468809 4838317
44340 4838317 -3983222 -9868386 -7713490 -3888813 -6488850 -12336771 -11978723 -4121046
44332d121046Q133746M995386N053334M693410k587470j1753114j1352954j252840
44324h191548O077667L143812l389807m259317l77472J167920j128607j557592
44316h514944L716806J0346927J0393037K351229n536708m422750L285816N789361
44308A7408774k452821j2337171j2147882l169513L870284M558341L830563M311428
44300C872003K055606l707651o244139j731665L670199L185363m00660o75019
44292B4037J442284M94852l105705l805511q02772P22907j285942k644022o20758
44283i580630J719700J780078K312923N675523P567220K326980p410149j2361496
44275g969851q406259j565927R09474j37663O03961L270778K942004j070039k726669
$$ plain form
44332 -4121046 4012700 9008086 14061420 18754830 16167360 4414246 -6938708 -8191548
44324 -8191548 -2113881 1029931 -2359876 -6619193 -6996665 -5828745 -6957352 -8514944
44316 -8514944 -4798138 5548789 15941826 18293055 12756347 8333597 11619413 17408774
44308 17408774 14955953 2618782 -9529100 -12698613 -8828329 -4269988 -439425 3872003
44300 3872003 5927609 2219958 -4024181 -5755846 -2085647 1099716 699056 24037
44292 24037 1466321 1961173 -1144532 -4950043 -5752815 -5029908 -6315850 -8959872 -9580630
44283 -9580630 -7860930 -6080852 -3767929 1907594 9474814 11801794 4391645 -7969851
44275 -7969851 -16376110 -17942037 -17032563 -17170226 -16566265 -13295487 -10353483 -11423522 -14150191
44266a4150191J416533O028735M591444r89227l770821j836209J027270K707450
44258d975016M234213M820891K371901r85709p43673K160060K544413N75523J685949
44249A1688552N402783M264791k468811m927636J090964M786062l014117j3325426
44241C497162j1725925q52855M168001q58573n347196k918589N17468l3226q26461
44232a4380194R79077J683591J86393J960319P998910R936172L165956m331315
44224G198909m028062N06111J359799q50375j159683p68010l142570m780579p18764
44215f383224M432222K196597n192677p237040j453055M024402M624304M659896
44207c28575O214455M221747k558578n959855p32888N770232M316967k027107
$$ plain form
44266 -14150191 -12733658 -6704923 -2113479 -3102706 -6873527 -8709736 -7682466 -4975016
44258 -4975016 -740803 4080088 6451989 5466280 4722607 6882667 9427080 10002603 11688552
44249 11688552 17091335 21356126 18887315 13959679 15050643 19836705 16822588 3497162
44241 3497162 -8228763 -9081618 -4913617 -5772190 -11119386 -14037975 -13520507 -13553733 -14380194
44232 -14380194 -13401117 -11717526 -11531133 -9570814 -1571904 8364268 11530224 7198909
44224 7198909 3170847 3676958 5036757 4186382 3026699 2258689 -883881 -5664460 -6383224
44215 -6383224 -1951002 245595 -4947082 -12184122 -13637177 -9612775 -4988471 -328575
44207 -328575 5885880 10107627 7549049 1589194 856306 6626538 10943505 8916398
44199H916398l352526J555149M628770J994060j236126q28715O6673k194569m686398
44190D862716l046880K71263p00930n139798n259395J686396P443642L837084
44182C954098m366615n124097L435588R771388N561279k566502l533944K333373
44174I464568N638991K156617l504396o409662n500276o07855O539567R191046
44166A6968600K462733o682526o337770K397533N695944j768780q462412n006717
44158g33395J173055q04l908535j151777M206163K037404m108483k154165N967329
44149A326792N468612n943789j2395814n215446L469201J863510k552938J684744
44141a2295128Q773817O143648k383537k151270P213859J0352822R00073q769593
$$ plain form
44199 8916398 5563872 7119021 11747791 13741851 12505725 11677010 11743683 9549114 4862716
44190 4862716 1815836 2087099 1386169 -3753629 -9013024 -7326628 117014 3954098
44182 3954098 -412517 -5536614 -2101026 7670362 13231641 10665139 7131195 9464568
44174 9464568 15103559 17260176 13755780 7346118 1845842 1237987 7777554 16968600
44166 16968600 19431333 12748807 6411037 8808570 14504514 12735734 4273322 -733395
44158 -733395 439660 438856 -3469679 -4621456 -415293 1622111 -2486372 -4640537 1326792
44149 1326792 6795404 851615 -11544199 -16759645 -13290444 -11426934 -13979872 -12295128
44141 -12295128 -3521311 2622337 238800 -1912470 5301389 15654211 16554284 7784691
44133G784691p262131J00309K375866r22792l244971k739718j961895q83069K021121
44124d732589M919605N238842M373536M298379K580616l299968r309884q971287
44116d902750k668654L029994M286334K690525K42584k316669k799580M20958
44108b017258L591200J272923m358486m732546K665641R711298Q579151J295622
44100A6007545n228017p955794p152265k608684L819133O227059J557250m464003
44092B02224m317867Q31982L734716J957862m19676p10258m41529o72086q62635
44083f97267k245657n990817q317793m514347K116291L443890l17039J12496P550571
44074h859672J1759267M280915q259393j3193777q028382L2970N534579P512099
$$ plain form
44133 7784691 522560 622869 2998735 2075943 -1169028 -3908746 -5870641 -6753710 -4732589
44124 -4732589 187016 5425858 9799394 14097773 16678389 13378421 4068537 -4902750
44116 -4902750 -7571404 -4541410 -255076 2435449 2678033 361364 -2438216 -2017258
44108 -2017258 1573942 2846865 -1511621 -6244167 -3578526 6132772 14711923 16007545
44100 16007545 10779528 2823734 -4328531 -6937215 -3118082 3108977 4666227 202224
44092 202224 -4115643 -3283661 451055 2408917 1989241 1278983 837454 165368 -697267
44083 -697267 -2942924 -8933741 -17251534 -21765881 -19649590 -16205700 -16522739 -16410243 -8859672
44074 -8859672 2899595 7180510 -1078883 -14272660 -22301042 -22268072 -16733493 -9221394
44066i221394N044514j040675m662080j151315M568753M634244Q38827J273608
44058B84482N765558N359520k683322r813186r016801l386965J803576O620495
44050e066643J1116413J0718839L446815m516085o778204n087169m009021k768523
44042b943578R70791M123504K619421o83877k24468K615865J820295k815652n290873
44033A91428l089950J40816K135225M953776Q559068Q215357J868753m934464
44025A8040009n940896k952824l072688q101264j0994116m696009P732598J5204451
44017E219261J1377397J845518m164504n565869p134286q355897m040373L392187
44009g426566L635490m721113q493528M65528J0391027O674191m577666n877993
$$ plain form
44066 -9221394 -4176880 -5217555 -9879635 -11030950 -6462197 -1827953 -989126 284482
44058 284482 6050040 11409560 8726238 -1086948 -10103749 -13490714 -11687138 -5066643
44050 -5066643 6049770 16768609 20215424 15699339 8921135 3833966 -175055 -2943578
44042 -2943578 -1972787 2150717 4770138 4086261 3861793 6477658 8297953 5482301 191428
44033 191428 -2898522 -2757706 -622481 4331295 12890363 21105720 22974473 18040009
44025 18040009 12099113 9146289 6073601 -2027663 -13021779 -17717788 -9985190 5219261
44017 5219261 16596658 18442176 14277672 8711803 1577517 -6778380 -10818753 -7426566
44009 -7426566 -3791076 -8512189 -17005717 -16540189 -6149162 525029 -4052637 -9930630
44001i930630L563122P417166j08571n214960J519886R460881O052602l243409
43993I516087n588393j351137n41419m811183o265896j604848M040559O732143
43985A25913P617133P001612K767524m126229q819007q320156l873525J770987
43977e855748N311228L247117l338332o565136p76369P952660Q693209J214098
43969I882727l608645K28553N965372N171465q59756n644353p500888q852476
43961e218001r165849n337445J498244N236341K613554j722948o95272N916075
43953f875301J0530615O914095j928818p329657n340955l65846J603256l28062
43945c120673l221318m565825l165437R06093M760060M254150l16983l375997
$$ plain form
44001 -9930630 -6367508 1049658 941087 -4273873 -2753987 6706894 12759496 9516087
43993 9516087 3927694 2576557 2035138 -2776045 -9041941 -10646789 -6606230 125913
43985 125913 7743046 14744658 17512182 13385953 4566946 -3753210 -7626735 -5855748
43977 -5855748 -544520 2702597 -635735 -7200871 -7977240 -24580 8668629 9882727
43969 9882727 6274082 6502635 12468007 17639472 16779716 11135363 3634475 -5218001
43961 -5218001 -14383850 -19721295 -18223051 -12986710 -10373156 -12096104 -12791376 -6875301
43953 -6875301 3655314 10569409 8640591 1310934 -4030021 -4395867 -2792611 -3120673
43945 -3120673 -6341991 -10907816 -14073253 -13167160 -8407100 -4152950 -4469933 -7845930
43937g845930j518679K086245L698676M390992N124905K221236n562629j0486753
43929g891937n090820N240015Q486155L000644j713229o96463Q62607p47174j510912
43920f1114J005151J970008j533045m048742r04375L326331K616171k53126Q91403
43911C008662M329384K958037m071224r845627r372269m725587m77232J123798
43903a7072058K14363j438904j060250K193151N253493M876840K433071J770012
43895b830282L109472K823847n30632l585047l037574o19624p16911l747330m710461
43886a3844542j9194O184208O455209P06528l028487p43829J286442k226169n156375
43877a0386209k14548O139794K342917p423209p134285M989391J1929618N202723
$$ plain form
43937 -7845930 -9364609 -7278364 -3579688 811304 5936209 8157445 2594816 -7891937
43929 -7891937 -12982757 -7742742 743413 3744057 2030828 1334365 2196972 1449798 -61114
43920 -61114 944037 2914045 1381000 -2667742 -3572117 -245786 2370385 2117259 3008662
43911 3008662 7338046 10296083 6224859 -3620768 -12993037 -17718624 -18195856 -17072058
43903 -17072058 -16857695 -18296599 -19356849 -17163698 -11910205 -7033365 -4600294 -2830282
43895 -2830282 279190 3103037 2572405 -1012642 -4050216 -4669840 -5386751 -9134081 -13844542
43886 -13844542 -13863736 -7679528 -1224319 -517791 -3546278 -4290107 -3003665 -5229834 -10386209
43877 -10386209 -10600757 -4460963 -2118046 -9541255 -16675540 -11686149 243469 5446192
43869E446192j353639M128829J0656140L743710q503080q802162k89474J06743
43861E133259p345265n519538P757427J3015314P90228j2387351j0640121k251921
43853a1447968k245521p042635l701195O200795R970993N405709K291221M649580
43845D080979O324120M068695J954689J639028j15048k435815J06772O093670
43837B1717090N946412l358166j1532015r104545q54958K144335j483296l533265
43829e8408K04369M327118K379645m437730q995342n993254K929574J0278175
43821F34147R196995P28132o135275m034744L783277P219546K005930n283670
43813H114338o385444j540816K881419M034307M691027O303313N593405K28998
$$ plain form
43869 5446192 4092553 8221382 18877522 22621232 14118152 5315990 5026516 5133259
43861 5133259 -2212006 -7731544 25883 13041197 13831425 1444074 -9196047 -11447968
43853 -11447968 -13693489 -20736124 -24437319 -18236524 -8265531 -2859822 -568601 4080979
43845 4080979 10405099 14473794 16428483 18067511 17952463 15516648 15623420 21717090
43837 21717090 27663502 24305336 12773321 3668776 2813818 4958153 3474857 -58408
43829 -58408 145961 4473079 6852724 2414994 -6580348 -12573602 -9644028 634147
43821 634147 9831142 10559274 4423999 389255 4172532 11392078 13398008 8114338
43813 8114338 1728894 188078 3069497 7103804 11794831 18098144 23691549 23920547
43805B3920547o205949q263890n391809j694072o41388k696344o506176r461474
43797a6940555q430205l019195K955222N963385P007841Q212122P769574L319614
43789F837803j648098j410059K399504K092723m091637q831355p064175k889501
43781a4604795j076355P58763N365732P944394L251885l873350m173710K113608
43773d293828N952836L449787L31267J532192M453258M999612L354691P56292
43765B0536107l243261o918492n715076K98080L632555q06913p485135p700726
43757g402861j917899K126591J717089J849121M981990N656958p85655r305107
43749c079773j0556039l185692M566255N781308K707708J503789K767202J679376
$$ plain form
43805 23920547 17714598 9450708 4058899 2364827 1723439 -972905 -7479081 -16940555
43797 -16940555 -25370760 -28389955 -25434733 -19471348 -12463507 -4251385 3518189 6837803
43789 6837803 5189705 3779646 6179150 8271873 4180236 -4651119 -11715294 -14604795
43781 -14604795 -15681150 -14922387 -9556655 -1612261 1639624 -2233726 -6407436 -4293828
43773 -4293828 1659008 5108795 5440062 6972254 11425512 16425124 19779815 20536107
43765 20536107 17292846 10374354 4659278 4957358 8589913 7783000 297865 -7402861
43757 -7402861 -9320760 -7194169 -5477080 -3627959 1354031 7010989 6225334 -3079773
43749 -3079773 -13635812 -16821504 -12255249 -6473941 -3766233 -2262444 504758 2184134
43741B184134l403214p467896n804061o29824K716900L723292O130308J0091009
43733G540648J0219805L358273n714063r444440o185822r06823J347362J17604
43725C32544j580773r66530J566952K310465j609678p146659p171170L96383Q276835
43716e591631Q336492J937172l049823l710954m092816n864565m712857R61285
43708a5787697M823912J751865k927100o24598O825563Q794733J259624p101578
43700b985276o887636J0429M682401L497019R49215J589467L778325K653052k896403
43691D390593p882444o291462J426774P239365M077546m928389r069740k943713
43683a3981470O700043R414376L567876l114776m041477p54297J063380m85137
$$ plain form
43741 2184134 -1219080 -8686976 -14491037 -15120861 -12403961 -8680669 -2550361 7540648
43733 7540648 17760453 21118726 15404663 5960223 -225599 -1132422 214940 332544
43725 332544 -1248229 -2214759 -647807 1662658 52980 -7093679 -14264849 -13868466 -5591631
43716 -5591631 2744861 4682033 1632210 -2078744 -6171560 -12036125 -16748982 -15787697
43708 -15787697 -10963785 -9211920 -12139020 -12763618 -5938055 2856678 4116302 -2985276
43700 -2985276 -9872912 -9862483 -5180082 -1683063 -733848 855619 4633944 7286996 4390593
43691 4390593 -3491851 -9783313 -8356539 -1117174 2960372 -1968017 -11037757 -13981470
43683 -13981470 -7281427 2132949 5700825 2586049 -1455428 -2209725 -1146345 -1631482
43675a631482j671676J318819O666842Q390216L975149j691715k523416N13222
43667A3345959J611264m95932j436906k8008p62940m558341m901250J246983O130316
43658A0151145K589129l736250l506628L66564j747571p881416o331585L675494
43650f421118Q565384K054680m483365j103982M509329J018825o967665o782029
43642i609941J563667O422963K836160l153015o821968q985535q062559j63702
43634b5973930J0910353J4686121Q363251R76068n195K498497L180405K300857
43626A6936427J106589k261123o758028o210042M51039M105885j665722r136179
43618c431154p042401K434634P754855N864779M248123N606012K990392o084856
$$ plain form
43675 -1631482 -3303158 -1984339 4682503 13072719 17047868 15356153 12832737 13345959
43667 13345959 14957223 14461291 13024385 12996377 12233437 7675096 2773846 4020829 10151145
43658 10151145 12740274 9004024 5497396 5863960 4116389 -3765027 -10096612 -6421118
43650 -6421118 2144266 4198946 -284419 -1388401 3120928 4139753 -2827912 -9609941
43642 -9609941 -8046274 -1623311 1212849 -1940166 -8762134 -17747669 -25810228 -25973930
43634 -25973930 -15063577 -377456 7985795 8961863 8956668 11455165 14635570 16936427
43626 16936427 18043016 15781893 9023865 2813823 3264862 7370747 5705025 -3431154
43618 -3431154 -10473555 -8038921 -284066 5580713 9828836 15434848 18425240 12340384
43610A2340384j1758041n497814N808872Q424938N29472o681046n720642j740627
43602d294504k352623n950655n537126J81600N965756Q665995J0013458J0110000
43594A6801901N049439n036305j1121221n349141O374324R578491j96847j1220653
43586D879988j1087953k089844M313027L661596J620583K580420L294406j5498
43578G156725m559639n247491k327861j72961k98392j15563J678996K707131J175028
43569d027p02198Q4516K525464K747301m29747l569224k983741O62656L420064
43560A751064K930078P66919k91388j57137j288237m473710o312700k992330L560294
43551f507147O313080J833755m268727m227600J186152L921119O30905k659751
$$ plain form
43610 12340384 582343 -4915471 893401 9318339 9847811 3166765 -2553877 -4294504
43602 -4294504 -6647127 -12597782 -18134908 -17953308 -11987552 -3321557 6691901 16801901
43594 16801901 21851340 16815035 5693814 344673 6718997 16297488 16100641 4879988
43586 4879988 -6207965 -8297809 -3984782 -323186 1297397 3877817 7172223 7156725
43578 7156725 2597086 -2650405 -4978266 -5151227 -5449619 -5565182 -3886186 -1179055 -4027
43569 -4027 -706225 -621709 1903755 4651056 4221309 652085 -2331656 -1669000 1751064
43560 1751064 4681142 5448061 5156673 4999536 3711299 -762411 -7075111 -10067441 -6507147
43551 -6507147 -194067 1639688 -2629039 -6856639 -5670487 -1749368 -1118463 -3778214
43543c778214l21744M344597N148821K813451K054649J965241k387895r221584
43535F17322r731606j223962P054311O075097p11974l349676K78938L122807O84952
43526B816209k858024j861948K351746L401255j727583q580735r678571k604576
43518a8742227O658550R510374M163180k515586l566658K08253L196375L051207
43510A963468J872675J012080k88649j244399J96838K240504k49259p417523j1578256
43501a3492521p080773R41005L415079L46588q246N465451R793012O734562r8885
43492F015272l355235k065167j55143J354205M069084O196857L892811j476455
43484A4476229l994751k040283k67009j297110j943529k54292L63499j970914
$$ plain form
43543 -3778214 -4099958 244639 5393460 8206911 10261560 12226801 9838906 617322
43535 617322 -9114284 -10338246 -3283935 2791162 2079188 -1270488 -991550 2131257 2816209
43526 2816209 -41815 -1903763 447983 3849238 2121655 -6459080 -16137651 -18742227
43518 -18742227 -12083677 -2573303 1589877 -925709 -4492367 -4284114 -1087739 1963468
43510 1963468 3836143 4848223 4559574 3315175 3512013 5752517 5503258 -1914265 -13492521
43501 -13492521 -20573294 -19632289 -16217210 -15870622 -15878868 -10413417 -620405 6114157 6015272
43492 6015272 2660037 594870 439727 1793932 5863016 12059873 15952684 14476229
43484 14476229 10481478 8441195 8174186 6877076 4933547 4679255 5042754 3071840
43476C071840k995818R3374K296933j217671n824965m195569J427804K890767
43468d453305j52447k70053M164546N858419J388328k491528K96537N756075O469812
43459A6566384J768136l567780n875581l787048K276668P830085O516067j378071
43451B0348860p575828o870911l794874l715170l899953N2251M851806M618073
43443D014254R95903j6009J947816K759533J957971J752287P55797k867850m927874
43434F371828j210471K831707p55036p510108n472175M872127R371264J898979
43426A0398115o497454n762623j138391j190520l141893n70959L484499K728234
43418a690992J18693K325671O516569M584289k362186n166843q97267M440004
$$ plain form
43476 3071840 76022 169396 2466329 1248658 -4576307 -8771876 -7344072 -4453305
43468 -4453305 -4605752 -4875805 -711259 5147160 6535488 4043960 4340497 10096572 16566384
43459 16566384 18334520 14766740 8891159 5104111 7380779 15210864 21726931 20348860
43451 20348860 12773032 5902121 2107247 -1607923 -5507876 -5455625 -603819 4014254
43443 4014254 5010157 4994148 6941964 9701497 11659468 13411755 14167552 11299702 6371828
43434 6371828 5161357 7993064 7238028 -272080 -5744255 -872128 8499136 10398115
43426 10398115 3900661 -1861962 -3000353 -4190873 -7332766 -7903725 -4419226 -1690992
43418 -1690992 -1572299 753372 7269941 11854230 9492044 4325201 3427934 7867938
43410G867938O554096O389962L889038j595695n171716j451386M288259J823070
43402B2593566o206857n940034M568330Q826154l225970j7437580j4962859N34423
43394a1250827R836947O107764L02776R50093L784703L102329K04058l093681
43386I944162q081562j1888055p143387N229824J2455742O627502l040017l390263
43378G13946L809506O430740J159505l300077j384393J825520O34811k446700
43370G442858k098748J589199M556946M467250J610185k603422n303097l546878
43362F114293J172955K929015j036059n559286m113528K055408N713713L791736
43354A1068247J244180L511341Q451475Q718237J412662p512354j0076594n920585
$$ plain form
43410 7867938 14422034 20811996 24701034 23105339 17933623 16482237 20770496 22593566
43402 22593566 16386709 10446675 15015005 23841159 20615189 3177609 -11785250 -11250827
43394 -11250827 -1413880 4693884 4996660 5946753 9731456 12833785 13037843 9944162
43386 9944162 1862600 -10025455 -17168842 -11939018 516724 7144226 4104209 713946
43378 713946 4523452 10954192 12113697 8813620 7429227 9254747 9889558 7442858
43370 7442858 5344110 6933309 11490255 15957505 17567690 14964268 9661171 6114293
43362 6114293 7287248 10216263 9180204 3620918 -492610 1562798 7276511 11068247
43354 11068247 12312427 15823768 24275243 32993480 34406142 26893788 16817194 10896609
43346A0896609k069261k999851n041492k977589J890318M732715M923385M724067
43338A4078901K715468l553587r202987n810901M681919R694074L656743l841398
43330A2418232l623196n50656k323956l929451L421176J3640141J1782423k262559
43322B8572154j1519168o289179L112317L684453k297163m856811k451110p29252
43314G226241j128764l65854J659767J629970p15331k007375l75677L168938O872279
43305A5964194Q200889M495046k277953m813845M52386O763368N372035k277455
43297C1878665p325409o484698m740662n435268n365459j588693L178523M804650
43289H921649K946265l83709l729846n524652l840607Q21806M821232N282358
$$ plain form
43346 10896609 8827348 5827497 786005 -2191584 -301266 4431449 9354834 14078901
43338 14078901 16794369 13240782 4037795 -1773106 2908813 12602887 16259630 12418232
43330 12418232 8795036 8244380 5920424 1990973 5412149 19052290 30834713 28572154
43322 28572154 17052986 10763807 13876124 17560577 15263414 10406603 7955493 7226241
43314 7226241 6097477 5731623 7391390 9021360 8306029 6298654 5922977 9091915 15964194
43305 15964194 24165083 28660129 26382176 21568331 22020717 28784085 34156120 31878665
43297 31878665 24553256 18068558 13327896 7892628 2527169 938476 4116999 8921649
43289 8921649 11867914 11484205 7754359 2229707 -1610900 -789094 4032138 9314496
43281I314496L045341Q05806J17045P85296J469469O75332j357643k520420k360283
43272I974439l781975q121278j0899240p245321L06333N265670O918228R324246
43264A741102J1305838O770597l081041p764950k399557M475690M363102J453299
43256A6864080L203115N978428J496974p444880j0559238p241579o732087j0523666
43248a4958853q536497K838753J1736219P657410k718245o077055j389652K229555
43240i218365J517232J432735L474970K926242j037304k253518K087434N771373
43232D700799K728373l825553o301548k924641J663500L509308K831725J707403
43224D089366J645227K874478L859975K372725j394205m240839m058527k497410
$$ plain form
43281 9314496 12359837 13165643 13282688 14067984 15537453 16212785 14855142 12334722 9974439
43272 9974439 6192464 -1928814 -12828054 -20073375 -19767042 -14501372 -7583144 1741102
43264 1741102 13046940 19817537 16736496 8971546 6571989 11047679 15410781 16864080
43256 16864080 20067195 26045623 27542597 20097717 9538479 2296900 -4435187 -14958853
43248 -14958853 -23495350 -20656597 -8920378 -1262968 -3981213 -10058268 -11447920 -9218365
43240 -9218365 -7701133 -6268398 -2793428 132814 -904490 -3158008 -1070574 4700799
43232 4700799 7429172 3603619 -2697929 -5622570 -3959070 -449762 2381963 4089366
43224 4089366 5734593 8609071 12469046 14841771 13447566 9206727 5148200 2650790
43216B650790j549002q3339K850133L602487j956373j0100125j0818292m29645
43208a5833366J1631378J3107999M013283l645425j472824N199664N861726m79591
43200A8382844m878946j871896L227278L062466j127916k690725n5093K225283
43192A6273295J719578P81997L17800k516446p816933r973806n336930J530728
43184e020717L923732K032497R54770K113012K187657k44240k247657j430088
43176B268966N02387L47662k540911n415739m416060J430268P562275P486039
43168G224887Q04192n220864m728460m55461J832935K189667M073536O209537
43160A1929969M242092o53854k499489k61948N47154k410379m138571p65365M041861
$$ plain form
43216 2650790 1101788 1018449 3868582 7471069 5514696 -4585429 -15403721 -15833366
43208 -15833366 -4201988 8906011 12919294 9273869 7801045 13000709 18862435 18382844
43200 18382844 13503898 11632002 14859280 17921746 16793830 14103105 14048012 16273295
43192 16273295 17992873 18774870 19092670 16576224 8759291 -1214515 -6551445 -5020717
43184 -5020717 -1096985 935512 1890282 4003294 6190951 5946711 3699054 2268966
43176 2268966 2771353 3119015 578104 -4837635 -9253695 -7823427 -261152 7224887
43168 7224887 8029079 2808215 -1920245 -2375706 -542771 1646896 5720432 11929969
43160 11929969 16172061 15518207 13018718 12756770 13303924 10893545 6754974 5989609 10031470
43151A0031470M851738J794463j526382l390291l830497k658081p46252l36464
43143D189704j618325j941716k60811J014061K25149j188254j962389k472379
43135d014960j801766J629490N319279M614513R40387P96391M146544K747394
43127A4377272n399793r732540k884755O217097N272867k529290m682467N33411
43119A171802L603621J357994J021773N485602P541480K820679k376110j581483
43111A9045358K163410K911457J067588Q8779n07394k805535n122348m513668
43103A2327647k019230p59450o96563O98473L631973N042701K386216l134910
43095A7476857p077563n675442j31724M111966L932215K133946J862071Q11659
$$ plain form
43151 10031470 14883208 16677671 15151289 11760998 7930501 5272420 4526168 4189704
43143 4189704 2571379 629663 368852 1382913 1608062 419808 -1542581 -4014960
43135 -4014960 -5816726 -4187236 1132043 5746556 6686943 7483334 11629878 14377272
43127 14377272 8977479 -755061 -3639816 2577281 7850148 5320858 638391 1171802
43119 1171802 4775423 6133417 7155190 12640792 20182272 23002951 20626841 19045358
43111 19045358 21208768 24120225 25187813 25276592 24769198 21963663 16841315 12327647
43103 12327647 10308417 9548967 8852404 9550877 13182850 18225551 20611767 17476857
43095 17476857 10399294 4723852 4592128 8704094 12636309 14770255 16632326 17443985
43087A7443985l954260q449238o172746J316170N967515N042569L281931L093836
43079A7569762J581632j329167j502653R1489k980186r530176q437064L756612
43071g79751J3597670Q730312l631316p715638k028227J729390j391182m437028
43063D074230k895310j374155l369971m760624j567294L463766N857761N073200
43055D501603K276462k071626n791569n369779j541068J78996k675727n353928
43047a5846636k499728M415999R057784P376307J140996l734509k091030M663504
43039B482687Q232328K702758o722413r509990l917914J349134M53214k399042
43031g329238j991665l28294n77812J93909N129094R730530Q007836K841168J622084
$$ plain form
43087 17443985 13489725 5040487 -1132259 183911 6151426 11193995 14475926 17569762
43079 17569762 19151394 17822227 16319574 16411063 13430877 3900701 -4536363 -779751
43071 -779751 12817919 21548231 17916915 10201277 8173050 9902440 8511258 4074230
43063 4074230 1178920 -195235 -3565206 -8325830 -9893124 -6429358 -571597 4501603
43055 4501603 6778065 4706439 -1085130 -6454909 -7995977 -7816981 -10492708 -15846636
43047 -15846636 -18346364 -13930365 -4872581 2503726 3644722 -89787 -2180817 2482687
43039 2482687 10715015 13417773 6695360 -2814630 -6732544 -5383410 -4930196 -7329238
43031 -7329238 -9320903 -9649197 -10227009 -10033100 -4904006 4826524 12834360 15675528 17297612
43022A7297612L801770K103187m217347p097330k807587J796879O27984j940041
43014I565127P10357N452317L948577l666655q164922m499769J609171K662868
43006G617071o84722k370169r1840K438392J332207k572711n130137l834548o47633
42997c944090M25481j379899k260823N74282L795220K000657l733617o006870
42989a0529659r36392O612377R853654Q016862M543968J392292q94566q24256
42981A7234280J633210K700238n29933n189882o903147o373885o406369n127959
42973h963447Q13971P899374Q561850K468977k782686l120272k188330k433739
42965B55698o12800M250750O523406K720065k131901k489843p55085j719810l785423
$$ plain form
43022 17297612 21099382 23202569 18985222 11887892 9080305 10877184 11505168 9565127
43014 9565127 10275484 15727801 19676378 16009723 7844801 3345032 4954203 7617071
43006 7617071 6932349 4562180 4470340 6908732 8240939 5668228 538091 -3296457 -3944090
42997 -3944090 -3518609 -4898508 -7159331 -6585049 -2789829 -789172 -4522789 -10529659
42989 -10529659 -11466051 -4853674 4999980 13016842 17560810 18953102 18058536 17234280
42981 17234280 18867490 21567728 21037795 15847913 8944766 2570881 -3835488 -8963447
42973 -8963447 -8149476 -250102 8311748 10780725 7998039 4877767 2689437 255698
42965 255698 -357102 3893648 10417054 13137119 11005218 8515375 7760290 6040480 2255057
42956B255057k429012J453497L280925K175949Q32562K50664l48906m95901L89376
42947G364211J260068K104847M562547O821543L721223l640542n693296J354779
42939A7855380O628199l48109j2156373j3219246k829277N075271L532040q0098
42931D457787O60599K231345J126245O83521K783252K986694n75673k685761q99337
42922A0768672q73686n507501p483971o60276Q127636P653085j725340r038280
42914A260339p262273q8803M529920K624272k908908m781500J085018Q921695
42906C379760Q553974o54370p655436m901595J644543L137271J170096K601629
42898G275872O772843P245714L142420l19718j235090k741239n589103o226138
$$ plain form
42956 2255057 -173955 1279542 4560467 6736416 7568978 7819642 7470736 6974835 7364211
42947 7364211 8624279 10729126 15291673 22113216 25834439 22193897 16500601 17855380
42939 17855380 24483579 24135470 11979097 -1240149 -4069426 1005845 4537885 4457787
42931 4457787 5118386 7349731 8475976 9159497 11942749 14929443 14353770 11668009 10768672
42922 10768672 9894986 4387485 -3096486 -3756762 4370874 12023959 10298619 1260339
42914 1260339 -6001934 -6090737 -1560817 1063455 -1845453 -6626953 -5541935 3379760
42906 3379760 11933734 11279364 3623928 -1277667 366876 3504147 4674243 7275872
42898 7275872 14048715 21294429 24436849 24117131 22882041 20140802 14551699 8325561
42890H325561l049776J048309L096400K800983J084203n02277J3360J911811R41493
42881A5670067m431429q618853n737106J508167N152105K361954k615977n008546
42873a719618l103943K388483P589167O977858R38749k042105L118632R162347
42865B3309570P005246J15999j945341R0211j809858o290844m170524K934554
42857A9239013K129473q350516j2706109j883513J0350000P440425n253254r595599
42849A369920j000076Q448490R286540M175770o72979k724392j455495K226700
42841A9654478M603551L147290M08875j295058m835152j0762104j0544116J743363
42833B121127J5074442J2669244l075700j1469834k136848J1447067J2830237
$$ plain form
42890 8325561 5275785 6324094 9420494 12221477 13305680 12803403 12816763 14728574 15670067
42881 15670067 11238638 2619785 -3117321 -1609154 3542951 5904905 3288928 -1719618
42873 -1719618 -4823561 -2435078 5154089 12131947 13070696 11028591 14147223 23309570
42865 23309570 30314816 30430815 28485474 28575685 26765827 20474983 16304459 19239013
42857 19239013 21368486 13017970 311861 -1571652 8778348 16218773 10965519 1369920
42849 1369920 369844 8818334 18104874 22280644 21607665 18883273 17427778 19654478
42841 19654478 24258029 27405319 27814194 26519136 21683984 10921880 377764 2121127
42833 2121127 17195569 29864813 26789113 15319279 13182431 24629498 37459735
42826C7459735L866303l598208o058532o974816n240079K004822R383526Q676935
42818C9519686K540179J144101N173385L999046o524846j5543390j2381793j887142
42810A6039226L005315j152931o078682m770935M36463L054981M61243m489737
42802F504943o779594l520606K900874O287701L592147m85641P86948O419067
42794A5705839Q224878K215133n268733n952092n48665L265162J900578m51413
42786A9090687M86139K781419K362219k8590J85000M716570J0418766J4285699
42778E4297909J7280105K1607226K6451328K8994921K8790994K8108603K7091977
42771B32623063K1231535O449356j3875002k9928760l4831368l1222624k6883853
$$ plain form
42826 37459735 41326038 37727830 31669298 24694482 19454403 21459225 30842751 39519686
42818 39519686 42059865 43203966 48377351 52376397 45851551 30308161 17926368 16039226
42810 16039226 19044541 17891610 11812928 7041993 7478456 10533437 10994680 6504943
42802 6504943 -274651 -3795257 -894383 5393318 8985465 8499824 9286772 15705839
42794 15705839 23930717 26145850 20877117 14925025 14376360 17641522 19542100 19090687
42786 19090687 19576826 22358245 24720464 24691874 24876874 29593444 40012210 54297909
42778 54297909 71578014 93185240 119636568 148631489 177422483 205531086 232623063
42771 232623063 253854598 260303954 246428952 216500192 181668824 150446200 123562347
42764A23562347k5333263k3463618j8023019j0877490o116573m405523k979766
42757C2363095k54102K240944K381118l69183n275990j0356986j1811656o610052
42749B307188K663731Q303281N595699j208350l958785m79326L923225M284279
42741B1430942J490227q12551j349231j385606k092453l656794n544210o312683
42733A767641m570063j057664J809154L075570L821030M179161K824672L40140
42725A2189641o68513l85845k179230n609886m526001L236910R687842P089244
42717A8834162J25095j048509L067944K647465m671973r933819q049284n273609
42709d302528o556722o355944K59741O723067N053698k93401K36834N110312M947504
$$ plain form
42764 123562347 98229084 74765466 56742447 45864957 39748384 35342861 32363095
42757 32363095 32108993 34349937 36731055 36361872 31085882 20728896 8917240 2307188
42749 2307188 4970919 13274200 18869899 17661549 13702764 13223438 17146663 21430942
42741 21430942 22921169 22108618 20759387 19373781 17281328 13624534 8080324 1767641
42733 1767641 -2802422 -3860086 -2050932 1024638 4845668 9024829 11849501 12189641
42725 12189641 11521128 11135283 8956053 3346167 -1179834 2057076 11744918 18834162
42717 18834162 18959257 17910748 20978692 23626157 18954184 9020365 971081 -4302528
42709 -4302528 -10859250 -17215194 -16955453 -10232386 -5178688 -5472089 -5235255 -124943 4822561
42700D822561o14864k017796L838426Q454715O101030K621679M675919Q859308
42692C6740978Q085021K558933k251774m210542m847053m285040j752839P88434
42684C0826118O95755r31234j164501j64542J05047N81904L389964N945829K623638
42675D1907978o097672j1319014o084203N236731J2123920J0634932O102282L331668
42667E5836622L8943o655460j1923752p961741L954315J2847045J1329864M009532
42659F1475368l35147K61429K220280L966672N819557N099287j517376j1233490
42651F5756580j6875603j5680992j1128495o237079r41271L541575M195214J674346
42643B4304275N20650K095261K838396J292252P02481K175953J696849k554126
$$ plain form
42700 4822561 4207697 2189901 6028327 14483042 20584072 23205751 27881670 36740978
42692 36740978 44825999 47384932 45133158 40922616 36075563 31790523 30037684 30826118
42684 30826118 31521873 30590639 29426138 29261596 29366643 29948547 33338511 39284340 41907978
42675 41907978 35810306 24491292 18407089 23643820 35767740 46402672 52504954 55836622
42667 55836622 55875565 49220105 37296353 29334612 33288927 46135972 57465836 61475368
42659 61475368 61140221 61401650 63621930 67588602 73408159 78507446 76990070 65756580
42651 65756580 48880977 33199985 22071490 15834411 14893140 18434715 22629929 24304275
42643 24304275 24824925 26920186 29758582 31050834 31753315 33929268 35626117 33071991
42635C3071991o093022n485969l797847l976115l010879J283391L575804j161439
42627A4405915p566676o254702K242534Q309961O738777J370418l128331o010103
42619A0107793o488137l001509J765602K230553j340535k030491K782636O068070
42611A0093982J191763p702635j0766070n014276L141326O519120M106513k73292
42603A296431k795112k309251p1683J947932K512072J401250o39654j726414j37612
42594e22041K912240L657380J002170q39330J878039O060201N513019k66298n894453
42585A3500927p835128o861600l314037L326364R082060P037541k514366r807931
42577B613830p731223q10534K641759K183211K954449N636134N865194K255150
$$ plain form
42635 33071991 26978969 21493000 17695153 13719038 10708159 11991550 15567354 14405915
42627 14405915 6839239 584537 2827071 11137032 17875809 19246227 16117896 10107793
42619 10107793 3619656 618147 2383749 4614302 3273767 1243276 4025912 10093982
42611 10093982 11285745 3583110 -7182960 -12197236 -9055910 -2536790 1569723 1296431
42603 1296431 -1498681 -3807932 -3879615 -1931683 580389 1981639 1341985 -384429 -522041
42594 -522041 2390199 6047579 7049749 6210419 8088458 14148659 19661678 19395380 13500927
42585 13500927 5665799 -1195801 -4509838 -1183474 7898586 14936127 12421761 2613830
42577 2613830 -5117393 -5927927 -3286168 -1102957 1851492 7487626 13352820 15607970
42569A5607970j369259j948679p48804n34279k394530n155361n630502j009861
42561c183305O437921R663116N360278q40008k213370n25212j603540m498303
42553H597577l393845R91171J431939l325961n618246j476865K779519J406176
42545A391465j443845L21321M269576M502054J921462J370537K383392J070548
42537A5786510j504499j182926R23299L81050j489917M44095M302541K152037
42529A9812190o375266j1108026n896753K307752M048972j10476l382733l030243
42521c734583p13302K559125N793492O336630M237105M128302P505339Q047224
42513C4159332R59238p993217j0328058p153461m981481l505354J797346P460770
$$ plain form
42569 15607970 14238711 12290032 11541228 11006949 8612419 3457058 -2173444 -3183305
42561 -3183305 3254616 12917732 18278010 17438002 15224632 14699420 13095880 8597577
42553 8597577 5203732 6194903 7626842 4300881 -1317365 -2794230 -14711 1391465
42545 1391465 -52380 268941 4538517 9040571 10962033 12332570 14715962 15786510
42537 15786510 14282011 13099085 14022384 14403434 12913517 13357612 17660153 19812190
42529 19812190 13436924 2328898 -3567855 -1260103 2788869 2678393 -704340 -3734583
42521 -3734583 -4447885 -1888760 3904732 10241362 14478467 18606769 26112108 34159332
42513 34159332 35118570 27125353 16797295 9643834 4662353 1156999 2954345 10415115
42505A0415115M641936n743265j2267239r504489m159312j640170J785610Q055112
42497h416702R916885K838164m747153k925460M483164O364804J416224j628178
42489G301748J360569M940791L811096o46477m525400n736161l318530K110590
42481E298226O314843M562416k113266p243288o021938L79559O771303P793982
42473A5741837J820715n980826p222877n58190N180957K766164k945434l136126
42465E666220O51111p2918n175085n146500K798648Q900865N378351k366539m715453
42456E918700o82744M386288P785497R065872N384436m701102j4754896j5250601
42448b848550n336566N517645Q676253N103526J623149J733149K763512J101673
$$ plain form
42505 10415115 15057051 9313786 -2953453 -12457942 -16617254 -18257424 -16471814 -8416702
42497 -8416702 1500183 4338347 -408806 -3334266 1148898 7513702 8929926 7301748
42489 7301748 8662317 13603108 17414204 16767727 12242327 6506166 3187636 5298226
42481 5298226 11613069 16175485 14062219 6818931 796993 1176552 7947855 15741837
42473 15741837 17562552 11581726 4358849 3800659 8981616 11747780 8802346 5666220
42465 5666220 6317331 6244413 1069328 -4077172 -1278524 7622341 13000692 10634153 5918700
42456 5918700 5235956 9622244 17407741 26473613 31858049 27156947 12402051 -2848550
42448 -2848550 -8185116 -2667471 6008782 11112308 12735457 14468606 17232118 18333791
42440A8333791k369734l488874o08201L250064M875200M878445N005728M003678
42432C3880097j65199n619190q205634o916884l809429k3022L492642L280223
42424A5913604k153818o430091j867634P788837J0242915K357392m643931k112923
42416A9094351L480633K205657l337374l517615K062099M571743K78046n067280
42408A9770260o415379n338878m059284j020730M359396P983680N999221L78013
42400B1656299l514353l277771j281187r69542k798678m038172k604407m69575
42392B702614j386106m903941n558491J37051Q393232J2259598R131112K043166
42384B2818235m322937o660890m502347j256393j451151m581067m791207M63631
$$ plain form
42440 18333791 15964057 12475183 11866982 15117046 19992246 24870691 29876419 33880097
42432 33880097 33714898 28095708 19890074 12973190 9163761 9140739 12633381 15913604
42424 15913604 13759786 7329695 5462061 13250898 23493813 25851205 21207274 19094351
42416 19094351 22574984 24780641 21443267 17925652 19987751 24559494 24837540 19770260
42408 19770260 13354881 8016003 3956719 2935989 7295385 15279065 21278286 21656299
42400 21656299 18141946 14864175 13582988 12613446 9814768 5776596 3172189 2702614
42392 2702614 1316508 -3587433 -9145924 -9008873 -615641 11643957 20775069 22818235
42384 22818235 18495298 11834408 7332061 6075668 4624517 43450 -4747757 -4284126
42376d284126N385733L849567j161556j926020K600459O134853M820415J280916
42368A6700241j325074l452131n913384p014809m882876l4159N094850P289577
42360F462235M252381k080842n558592k798539J603523J157564l225996n456599
42352e644865m039361k854859k779878k22924M785589O657011L259207J46603
42344f93477J896136M911239L426517j829375n713472n934702l670340K93328
42336g314146N403807Q993947Q131342L168685k871502p003340o769369j098453
42328F40971O485398Q738780K888219m469313n217796n37982J531522j587565
42320H472234l518166Q88865P707086R621607N322562p78246n223128p336251
$$ plain form
42376 -4284126 1101607 4951174 3789618 1863598 4464057 10598910 15419325 16700241
42368 16700241 15375167 11923036 6009652 -1005157 -5888033 -5922192 -827342 6462235
42360 6462235 10714616 8633774 3075182 276643 1880166 3037730 -188266 -5644865
42352 -5644865 -9684226 -12539085 -15318963 -15541887 -10756298 -4099287 -840080 -693477
42344 -693477 1202659 6113898 9540415 7711040 1997568 -3937134 -7607474 -7314146
42336 -7314146 -1910339 7083608 15214950 18383635 15512133 8508793 1739424 640971
42328 640971 7126369 15865149 18753368 14284055 9066259 8528277 10059799 8472234
42320 8472234 4954068 5842933 13550019 23171626 28494188 27715942 22492814 15156563
42312A5156563o331203j905155K603930K891064J85618k92345J346335j301991
42304A2352816q908623j1049054n37856J2737471J3054824J119143p179787m322296
42296G266638P7075k347379n618782k717117N47495l349997q229593l721972O181532
42287a1912100Q814701L479104J325473N609325P187632J543830l872750l406413
42279H768802j759280l473810m898812k700568n83360j092249K77948N819029
42271C57700Q739513L408105m394487n625444j026550J875767O75383n27145J052943
42262D535785L915313N295141K994229l193034q974172q497091k430916K083408
42254d271337K007292J964886M049143K960857l197333o672061k418977K200448
$$ plain form
42312 15156563 8825360 6920205 9524135 12415199 12600817 12308472 13654807 12352816
42304 12352816 3444193 -7604861 -8142717 4594754 17649578 18768721 11588934 7266638
42296 7266638 7343713 4996334 -622448 -3339565 -2792070 -6142067 -14371660 -18093632 -11912100
42287 -11912100 -3097399 381705 1707178 7316503 14504135 16047965 12175215 8768802
42279 8768802 7009522 3535712 -1363100 -4063668 -4647028 -5739277 -5461329 357700
42271 357700 9097213 12505318 8110831 2485387 1458837 3334604 4009987 3482842 4535785
42262 4535785 8451098 13746239 16740468 13547434 4573262 -3923829 -6354745 -4271337
42254 -4271337 -2264045 -299159 3749984 6710841 3513508 -3158553 -5577530 -3377082
42246c377082l09456m030064j37449O243430L852778m600257n674972K610940
42238e422132P287142J397439n544604l213350M693860Q020300M585332K38910
42230A2042897p26165L70687L9475k815872n065705k745734K220731K404108m006453
42221A717969p678512q89750R290671J0455143L413958q23855L9284j826868o922440
42212F775600n609302L514642Q109025J749628n274857l643969n8550l410549
42204B151668p797545l189873N740794O466039j202348o408269n532846m860039
42196a4632419o088457l142543N112214J1274681J1268035R098876O850495O17719
42188B0358601r067869j2846221n368412N120974P515158K572172o77642Q30115
$$ plain form
42246 -3377082 -3686538 -7716602 -7854051 -1610621 2242157 -2358100 -8033072 -5422132
42238 -5422132 1865010 3262449 -2282155 -5495505 -801645 7218655 11803987 12042897
42230 12042897 11316732 11687419 11726894 8911022 3845317 1099583 3320314 5724422 1717969
42221 1717969 -5960543 -6850293 2440378 12895521 16309479 15485624 15524908 13698040 6775600
42212 6775600 1166298 4680940 12789965 14539593 9264736 5620767 5562217 2151668
42204 2151668 -5645877 -8835750 -3094956 3371083 2168735 -4239534 -9772380 -14632419
42196 -14632419 -20720876 -23863419 -18751205 -7476524 3791511 12890387 19740882 20358601
42188 20358601 11290732 -1555489 -6923901 -1802927 5712231 8284403 7606761 8436876
42180H436876J746530j502978n777698p246393o321148m566465j205059M278340
42172a2157995Q623130P230209j416p105221p199190O49474R745929J1666623
42164A1451543M656948m366813p229970l135666J945294L732196L894135M768795
42156A5716462M037622j378514q583505j1043406p192092j720196J993347N159174
42148c011108P825844O148061p07922o129972l846287L313445P578555O208282
42140A7378898K151041k225692o032952o890775l660348o08689k300400n684702
42132g873619m193989J472382M372874K495271M85399J31388j587458l679102
42124h376854m78744O938142Q676348O63960p493564n968137J413964M197858
$$ plain form
42180 8436876 10183406 8680428 2902730 -4343663 -10664811 -15231276 -16436335 -12157995
42172 -12157995 -3534865 3695344 3693928 -3411293 -10610483 -9961009 -215080 11451543
42164 11451543 16108491 11741678 4511708 1376042 3321336 7053532 10947667 15716462
42156 15716462 19754084 18375570 9792065 -1251341 -8443433 -10163629 -8170282 -3011108
42148 -3011108 4814736 10962797 10254875 4124903 278616 3592061 11170616 17378898
42140 17378898 19529939 17304247 11271295 4380520 720172 111483 -2188917 -7873619
42132 -7873619 -12067608 -10595226 -6222352 -3727081 -3241682 -3110294 -4697752 -8376854
42124 -8376854 -8855598 -1917456 6758892 7422852 -70712 -6038849 -4624885 -427027
42116d27027L06826l792390l844659j380792J067748K525212K965234L715262
42108A135414N911428O605116J290598p448998j0535125n120690Q35688J206017
42100f120552K48124K318141K462602l676179q916484m583503M714250P753485
42092e800116L345993p83609j406553q54129J187686N355145O058293o88676p048505
42083f34471l998426K393118M78254n496083j831233Q738700Q860840l584238
42075D926461r681501l04354Q749021L469596n922393l887291N102890O919001
42067I371430J345239j789656j042622j477906j451923K863275N628607l02599
42059A3143845q107392o042763K146324K642020m879453o771382J032101O618456
$$ plain form
42116 -427027 -120201 -3912591 -7757250 -9138042 -8070294 -5545082 -2579848 1135414
42108 1135414 7046842 13651958 14942556 7493558 -3041567 -8162257 -7326569 -6120552
42100 -6120552 -5872428 -3554287 -1091685 -4767864 -13684348 -18267851 -13553601 -5800116
42092 -5800116 -2454123 -3237732 -4644285 -5498414 -4310728 1044417 7102710 6414034 -634471
42083 -634471 -4632897 -2239779 -1761525 -7257608 -9088841 -350141 8510699 4926461
42075 4926461 -4755040 -5059394 3689627 7159223 1236830 -2650461 2452429 9371430
42067 9371430 10716669 8927013 7884391 6406485 4954562 7817837 13446444 13143845
42059 13143845 5036453 -1006310 1140014 3782034 -1097419 -7868801 -6836700 -218244
42051b18244K780792k222735o08985K583802Q92082j886720l08364K023669l69855
42042B665442m261521l200686J805615N074394N382786N085413L816660J5609
42034A6383712m107412n394027n014718n157221l244604L937440J2161264J2942050
42026B2506484M941667l894690o593492m270512j412228R59483M099935O641038
42018B2977685N045626j250510p872388r766387o388591j592759J164582J859084
42010D176342J649301j37403m191008p564305n717304Q53443N481465L144202
42002b305267k912596n135076q99281N069904P014721M057796o39463m094662
41994A56076n254097l980089p00908K572088K854053m24310l465733j898553L230030
$$ plain form
42051 -218244 2562548 339813 -269172 2314630 3206712 1319992 1011628 3035297 2665442
42042 2665442 -1596079 -4796765 -2991150 2083244 7466030 12551443 16368103 16383712
42034 16383712 12276300 6882273 1867555 -3289666 -6534270 -2596830 9564434 22506484
42026 22506484 27448151 23553461 16959969 12689457 11277229 12236712 16336647 22977685
42018 22977685 28023311 26772801 18900413 9134026 2745435 1152676 2317258 4176342
42010 4176342 5825643 5688240 1497232 -6067073 -11784377 -10930934 -5449469 -2305267
42002 -2305267 -5217863 -10352939 -11252220 -6182316 832405 4890201 4250738 156076
41994 156076 -5098021 -9078110 -9779018 -7206930 -4352877 -4777187 -8242920 -10141473 -6911443
41985f911443N881561K815625j682278j555447K533540M318581R30707l432590
41977B898256l822961q98600J136958M43532j161649j605202j006280q56896j951275
41968f824117l235999k631559M86752L964704N223924M544104M112537M017090
41960I657436J952301k345875n418068m713802k231448q28316P33680N017989
41952A823897R375907P518467q70663o994219l511706M722501O125374j956492
41944A6233066r435253p668482j311594l91496m884746n636621J60804L940199
41936h994123m59800o357257m224393L611039O653137J932565k639375o96988
41928a1175195M427851N892171J787426m821333r494785q235398o03438O933145
$$ plain form
41985 -6911443 -1029882 1785743 103465 -1451982 1081558 5400139 6330846 2898256
41977 2898256 -924705 -1823305 -686347 -242815 -1404464 -3009666 -4015946 -4872842 -6824117
41968 -6824117 -10060116 -12691675 -12204923 -8240219 -3016295 1527809 5640346 9657436
41960 9657436 11609737 9263862 3845794 -868008 -3099456 -3927772 -3194092 1823897
41952 1823897 11199804 18718271 17847608 10853389 7341683 12064184 18189558 16233066
41944 16233066 6797813 -870669 -2182263 -2573759 -7458505 -13095126 -12934322 -8994123
41936 -8994123 -9453923 -15811180 -20035573 -16424534 -9771397 -7838832 -10478207 -11175195
41928 -11175195 -6747344 -855173 932253 -3889080 -13383865 -21619263 -22222701 -15289556
41920a5289556N959189k735584q183214l222555N720692Q110223L901390J367445
41912d371970L087174L012964j813807n213942j588219M624847N095219m11289
41904B420977m582332l676154j515511j571473j417520J598886M201283J949770
41896b592074k843489m030957j207259J71877j430741q44225M282841P954951
41888e39076M578311k087603m507578j891121R83549K066454K369658P65917l880587
41879b142076p158352m023042J516564P34662n354293n957952K551449J0090986
41871i742054Q411358L447167M358193Q185801N498763l356362q234425m191301
41863D377140K512115M153962M01361l873990m482119n86824M646191N955233
$$ plain form
41920 -15289556 -9330367 -12065951 -20249165 -23471720 -17751028 -9640805 -5739415 -4371970
41912 -4371970 -1284796 1728168 -85639 -5299581 -6887800 -2262953 2832266 2420977
41904 2420977 -2161355 -5837509 -7353020 -8924493 -10342013 -8743127 -4541844 -2592074
41896 -2592074 -5435563 -9466520 -10673779 -10501902 -11932643 -12776868 -8494027 -539076
41888 -539076 4039235 1951632 -2555946 -4447067 -3463518 -1397064 972594 1738511 -2142076
41879 -2142076 -9300428 -13323470 -11806906 -11072244 -16426537 -22384489 -19833040 -9742054
41871 -9742054 -1330696 2116471 6474664 14660465 20159228 16802866 8568441 4377140
41863 4377140 6889255 11043217 11444578 7570588 3088469 2501645 7147836 13103069
41855A3103069J921607k034461n34860L637013L601871q33981l193745j244186
41847A4422327m91199m403990p903142n063179J474478M091977N91082m022326
41839a303972n144979l452272j631382K19176L832897Q734016J1091775P489551
41831A9834810o84019p876461r963858q059865n638611l312369Q87005O298500
41823h514868Q202191L670595l320005n818212k546508P14497m81038k910393
41815a1003741j083867L541987M444289R71364K86368N332498Q119050J572554
41807A2180502p770311q280238q93257L017732M06111K15783N781453P219829
41799A1877604j619198j0598185q086841O77368K139555m603476q157487l215604
$$ plain form
41855 13103069 15024676 12990215 12455355 16092368 19694239 18860258 15666513 14422327
41847 14422327 13931128 9527138 1623996 -3439183 -1964705 2127272 2718354 -1303972
41839 -1303972 -6448951 -9901223 -11532605 -11313429 -7480532 1253484 12345259 19834810
41831 19834810 19150791 11274330 1310472 -6749393 -12388004 -15700373 -14813368 -8514868
41823 -8514868 -312677 3357918 37913 -5780299 -8326807 -7612310 -8093348 -11003741
41815 -11003741 -12087608 -8545621 -4101332 -3129968 -2843600 2488898 10607948 12180502
41807 12180502 4410191 -3870047 -4763304 -1745572 -1339461 -1123678 4657775 11877604
41799 11877604 10258406 -339779 -8426620 -7749252 -5609697 -10213173 -18370660 -21586264
41791b1586264L704968O404520N872517M055054L97090l444025l389084N70002
41783g415222M037903N119784N398065M332851J7180m576109m115943j65401L48384
41774B981492l245724m095853J47281L193281R00711k545488k930776k252883
41766g847959k527123j253680K264983L519090O71533j229241R99942K880252
41758b522203R00256l00754L681581P893682N339779j399761m118317j355417
41750H118846R33595p88818l900627m765229k352813K307656O210182N437483
41742A1200275l14282o095457p355487m736203j165343J934916L221566J205159
41734b104856j553349L38739O086015P313254L36787p075909p180810l443796
$$ plain form
41791 -21586264 -17881296 -11476776 -5604259 -1549205 -1152115 -4596140 -7985224 -7415222
41783 -7415222 -3377319 1742465 7140530 11473381 11490561 6914452 2798509 2633108 2981492
41774 2981492 -264232 -4360085 -4212804 -1019523 -118812 -2664300 -5595076 -7847959
41766 -7847959 -10375082 -11628762 -9363779 -5844689 -5173156 -6402397 -5402455 -2522203
41758 -2522203 -1621947 -1922701 1758880 9652562 14992341 13592580 9474263 8118846
41750 8118846 9052441 8263623 4362996 -402233 -2755046 -447390 5762792 11200275
41742 11200275 10885993 4790536 -2564951 -7301154 -8466497 -6531581 -3310015 -2104856
41734 -2104856 -3658205 -3319466 2766549 10079803 10416590 3340681 -3840129 -7283925
41726g283925k727459l055478J232711P107039O332904j002687o202071m348463
41718i947429J094665N157610N676161K118150l104402m047452J370284O070609
41710D388196L096519l157957l411834K022201M884430K702456L82433o24465
41702A0281979l730365p684766o502282l27315L526301K091805L6328K8249o16723
41693b896789j967996j03178L828355L115034k609495m634375J437166Q485884
41685D654606Q736287L733407j158898m547939o555872n729425l071791k579104
41677f518729l775584p53554P236151J1678763O291679l906985r798017q478928
41669h025204k579097M140888O841934K434389l937353l010297M346856O208446
$$ plain form
41726 -7283925 -10011384 -13066862 -11834151 -4727112 1605792 603105 -5598966 -9947429
41718 -9947429 -8852764 -3695154 1981007 4099157 994755 -3052697 -1682413 4388196
41710 4388196 7484715 4326758 914924 2937125 7821555 10524011 10906444 10281979
41702 10281979 6551614 -1133152 -7635434 -7962749 -4436448 -2344643 -2308315 -2280066 -2896789
41693 -2896789 -4864785 -4967963 -1139608 1975426 -634069 -5268444 -3831278 4654606
41685 4654606 13390893 17124300 15965402 11417463 4861591 -867834 -3939625 -6518729
41677 -6518729 -10294313 -11047867 -3811716 7867047 14158726 10251741 453724 -8025204
41669 -8025204 -10604301 -6463413 378521 2812910 -1124443 -4134740 212116 6420562
41661F420562k255369r961269o319904L333089P498554M960270J563860j739685
41653C500108o536669q598044l432129L710160M122631r03660k791006O13598
41645a0315011L543440K665988L1856k807376n423883m897586M76446N471723
41637a1254403L609243k985319o587245m734856r58733K783772O705128Q644117
41629d778296O706208L976837L129734J62210p592064j1793573l308794J0666215
41621b831523J3287566K046674p428332m163015M298211N739889J2179m798269
41613F163380m852192k308490K12413J374535N93224r57455j473340j545408k556867
41604e350200k788017j85038K283769N99991k289210m09974M124068L281560l241020
$$ plain form
41661 6420562 4165193 -5796076 -12115980 -8782891 -1284337 3675933 5239793 3500108
41653 3500108 -3036561 -11634605 -15066734 -11356574 -7233943 -8137603 -10928609 -10315011
41645 -10315011 -6771571 -4105583 -4073727 -6881103 -12304986 -17202572 -16726126 -11254403
41637 -11254403 -7645160 -10630479 -17217724 -21952580 -22911313 -20127541 -13422413 -4778296
41629 -4778296 1927912 5904749 9034483 9196693 1604629 -10188944 -13497738 -2831523
41621 -2831523 10456043 12502717 5074385 911370 5209581 10949470 10961649 6163380
41613 6163380 1311188 -997302 -784889 589646 1182870 225415 -1247925 -2793333 -5350200
41604 -5350200 -8138217 -8323255 -6039486 -5439495 -7728705 -8138679 -4014611 -733051 -3974071
41595c974071o534673k301939L731744O467253P283307O440523P77863o562768
41587E327239n555787M962563J1585459M704024o655078p933210N57160O635651
41579A3628021M045578l087600r643811j3273227j1084489k047529P795519J0195129
41571c472409M836384j079809k409003J19080L886113O227470L722311m102373
41563G727764j1019956j0055870l108918J027939j374020m594382k472351L198087
41555b0671707O177981M539484K343363L174618M990204L343427j255113k713717
41547g1460K066649P497727O442325M41841l148760k655704l114029n733903n135371
41538c410685L53037M152346J593029k887210l885963l310730m386579m036550
$$ plain form
41595 -3974071 -10508744 -12810683 -9078939 -2611686 4671621 11112144 11890007 5327239
41587 5327239 -228548 4734015 16319474 21023498 14368420 6435210 6992370 13628021
41579 13628021 17673599 14585999 4942188 -8331039 -19415528 -21463057 -13667538 -3472409
41571 -3472409 1363975 284166 -2124837 -2005757 1880356 8107826 11830137 7727764
41563 7727764 -3292192 -13348062 -16456980 -15429041 -16803061 -21397443 -23869794 -20671707
41555 -20671707 -14493726 -9954242 -7610879 -4436261 553943 3897370 2642257 -71460
41547 -71460 1995189 9492916 15935241 16377082 13228322 10572618 7458589 1724686 -3410685
41538 -3410685 -3057648 1094698 2687727 -199483 -4085446 -7396176 -11782755 -15819305
41530a5819305J155192O495997M983552j607523n120172k521187J789805L761946
41522f881695L618887K762250J869242J659939J972050J194846q32821j733711
41514C628987o35700K06349k522Q37669K147785o7897m938845n124407J525451
41505b423130O598791L834204r64714o59738R50101k444083o695380m491108P18148
41496e576909Q23502k240175j451243M41462l791914r249705m612281O654147
41488a9003116Q918503l4532m481757L262458J0349401N382606l141189j968953
41480g16579N900515Q381166L749240O8468M45822L41514k831484o258838o803103
41471B276721l875313J092911M562680L367083l22453r92433J594699K084216
$$ plain form
41530 -15819305 -14664113 -8168116 -3184564 -4792087 -9912259 -12433446 -10643641 -6881695
41522 -6881695 -3262808 -500558 1368684 3028623 5000673 6195519 5362698 3628987
41514 3628987 2993287 3199636 3197114 4034783 6182568 6114671 1175826 -3948581 -2423130
41505 -2423130 4175661 8009865 7045151 6385413 7335514 4891431 -1803949 -6295057 -5576909
41496 -5576909 -4753407 -6993582 -8444825 -8003363 -11795277 -21044982 -25657263 -19003116
41488 -19003116 -10084613 -10119145 -14600902 -11338444 -989043 4393563 1252374 -716579
41480 -716579 5183936 13565102 17314342 17382810 17828632 18170146 15338662 9079824 2276721
41471 2276721 -1598592 -505681 4056999 7424082 7101629 6109196 7703895 9788111
41463I788111n42309j140923P66468j524622q838695j1447987m474243K876570
41455a4537630K487610J070474P196655J4194813J0321818p76547n289358r78088
41447A3689747J921557k54690n58007K683520J443993o686817j2461353r824161
41439a0046211m940304l867962k082193N323639J1906314Q545831j550954o594340
41431c306180k648987K516763J878970k063412k976798J24462K822345K127461
41423a525376k5575n53527k55801k485588o881133p965065k467050M826897O583792
41414a0748426K540741j105980r48930N16750J187049K644211N284257N877391
41406E247063L207756J201830K352266K457270k627768q196503n570946M727990
$$ plain form
41463 9788111 9245802 8104879 8871347 7346725 -1491970 -12939957 -17414200 -14537630
41455 -14537630 -12050020 -10979546 -3782891 10411922 20733740 19957193 14667835 13689747
41447 13689747 15611304 15356614 14798607 17482127 18926120 12239303 -222050 -10046211
41439 -10046211 -14986515 -18854477 -20936670 -15613031 -3706717 4839114 3288160 -3306180
41431 -3306180 -5955167 -3438404 -1559434 -3622846 -6599644 -6475182 -3652837 -1525376
41423 -1525376 -1550951 -2104478 -2360279 -4845867 -11727000 -19692065 -22159115 -17332218 -10748426
41414 -10748426 -8207685 -9313665 -10262595 -9745845 -8558796 -5914585 -630328 5247063
41406 5247063 8454819 9656649 12008915 14466185 11838417 3641914 -1929032 2798958
41398B798958J1476074O639475m284621r448712m966153K241636M451008J411632
41390A0319297j954404k252359N7493K551955K709022n03338m714024n344689
41382H68953j104902L310804K953411o00796k059901o26316k87825k218830k854740
41373b620142p76510N18621q16739j545311O7111K05695l062585m065812J908331
41364a0187341Q745930O670743k805834p985856l372067L381243L372740j722256
41356c902698l975555n84802L996749N212705L574341K676105M204578N754276
41348A6955699L729483j694861n980231n721471k898453j495707j716142o99979
41340D78338K182487M276708L509889L51736l568701o059021m687193J33497L494101
$$ plain form
41398 2798958 14275032 20914507 16629886 7181174 2215021 4456657 8907665 10319297
41390 10319297 8364893 6112534 6170027 8721982 11431004 10927666 6213642 868953
41382 868953 -235949 3074855 6028266 5427470 3367569 2741253 2453428 234598 -2620142
41373 -2620142 -3396652 -2878031 -3694770 -5240081 -5172970 -4967275 -8029860 -12095672 -10187341
41364 -10187341 -1441411 5229332 2423498 -5562358 -8934425 -5553182 -2180442 -3902698
41356 -3902698 -7878253 -8463055 -4466306 746399 4320740 6996845 11201423 16955699
41348 16955699 20685182 18990321 13010090 7288619 4390166 2894459 1178317 478338
41340 478338 2660825 6937533 10447422 10799158 7230457 1171436 -3515757 -3382260 111841
41331A11841J345010l350319m166416l59628K474756J067200j458837j463970
41323e800363J67808J074402J469121K482350L300844K365342l47270l517193
41315A195041n314038l861399P91357N315299O504663N454961M901252L585168
41307A8572304j517858p822869q669178l531848K72301j085898j963495K746957
41299b999584Q151421O721749N31887j847164J507864L880738J123777k582640
41291A4488048k399658l25294j183332m787406o483466m181112r42852n8413n06066
41282f379551P08561L332468M041546K022558J041592L845064P212815O058703
41274B1883756P96792l521742m614685m815879n389626m186063n54746K182123
$$ plain form
41331 111841 1456851 -1893468 -6059884 -6419512 -3944756 -2877556 -4336393 -5800363
41323 -5800363 -5632555 -4558153 -3089032 -606682 2694162 5059504 4712234 1195041
41315 1195041 -4118997 -7980396 -7189039 -1873740 4630923 10085884 14987136 18572304
41307 18572304 17054446 9231577 562399 -2969449 -2697148 -3783046 -5746541 -2999584
41299 -2999584 5151837 11873586 12405473 10558309 12066173 15946911 17070688 14488048
41291 14488048 12088390 11763096 10579764 5792358 -691108 -4872220 -5815072 -5873485 -6379551
41282 -6379551 -5670990 -2338522 1703024 3725582 4767174 8612238 15825053 21883756
41274 21883756 22680548 19158806 14544121 9728242 4338616 152553 -402193 1779930
41266A779930J728944K96255L23721M94081q25177j764615l78964J221440M18518
41257C294133q87190L91009K222739J12848m697674n729273j066640K925271O44971
41248b789806m274551m028692J919067N587685J352275o096820p419910o6762
41240a5817514R220809J2552613Q235427J02319o662343q094892l910939P02534
41232c671986j92787m523689l321911N673730J1771573N414507o954305j1389840
41224g194708o012357r16888m07483J532445O619478O926651n25504o013270j684189
41215g675825N981118O775351J576065k092634j956386K07200M507250Q673001
41207A5995140N344079o074221j2398052l893316Q141373N641846r050813j6586992
$$ plain form
41266 1779930 3508874 3805129 4128850 4622931 3797754 2033139 1654175 2875615 3294133
41257 3294133 2406943 2797952 5020691 5133539 435865 -5293408 -6360048 -3434777 -2789806
41248 -2789806 -7064357 -11093049 -9173982 -3586297 -2234022 -8330842 -15750752 -15817514
41240 -15817514 -6596705 5955908 14191335 14293654 7631311 -463581 -4374520 -3671986
41232 -3671986 -3864773 -8388462 -11710373 -6036643 5734930 11149437 4195132 -7194708
41224 -7194708 -13207065 -14123953 -14531436 -12998991 -6379513 547138 21634 -5991636 -7675825
41215 -7675825 -1694707 5080644 6656709 4564075 2607689 2814889 7322139 15995140
41207 15995140 21339219 15264998 2866946 -1026370 7115003 12756849 3706036 -12880956
41199a2880956r133071J661479N877206O798171P311289K354103p379839r720355
41191a5111973N69553J0353814O719864l550596n843054l62066J554229j767926
41183g438155q40320O623874J0206206K887575q074580j1314947n374227K163126
41175a1161448N033997L616733K044209K868319M437495L350037m21203k890929
41167F877210j891496n11867j913784l864950k531375Q83668K172542R80425M74764
41158F75137J336278J368593M80722O56404J046164j287457m981892m373111K140658
41149b938504Q486008Q265248K149849m355750p324726o316533k823451O12991
41141d244868J730809R20780N92897J301955J190798K51176J343960M775367N807086
$$ plain form
41199 -12880956 -22014027 -20352548 -14475342 -7677171 -365882 1988221 -5391618 -15111973
41191 -15111973 -14542420 -4188606 2531258 -1019338 -6862392 -7224458 -5670229 -7438155
41183 -7438155 -8278475 -1654601 8551605 11439180 3364600 -7950347 -13324574 -11161448
41175 -11161448 -6127451 -2510718 -466509 2401810 6839305 10189342 9768139 6877210
41167 6877210 4985714 4473847 2560063 -1304887 -3836262 -2952594 -780052 200373 675137
41158 675137 2011415 3380008 3860730 4517134 5563298 4275841 -706051 -5079162 -2938504
41149 -2938504 5547504 13812752 15962601 11606851 4282125 -2034408 -4857859 -4244868
41141 -4244868 -2514059 -1593279 -1000382 301573 1492371 1743547 3087507 7862874 13669960
41132A3669960J181698n072755o730874l754394o24217J576997N016916P773101
41124A3036432M419789l937332p785524k162470M818335L235970l669100m786118
41116C169982R52702K659156m968725j2573280r754498M72372P761699Q702040
41108c578552P129586N020295J974177P72160M126118P224259K649291p630540
41100A7686794j4155546j3648331j0909094o851771L108214J5690448J8048864
41093H969578O385360n514506n427139L32251R6824l114905P54904Q431328P584291
41084A8497986j549221n970157j685374R22178l502545o558425k568709J110525
41076a303742j335211k508183M555357J1892033Q221727k700436q060107m991054
$$ plain form
41132 13669960 14851658 9778903 3048029 -706365 -1330582 246415 5263331 13036432
41124 13036432 17456221 13518889 5733365 3570895 8389230 11625200 7956100 3169982
41116 3169982 4122684 6781840 1813115 -10760165 -20514663 -20042291 -12280592 -3578552
41108 -3578552 3551034 8571329 10545506 11317666 15443784 22668043 25317334 17686794
41100 17686794 3531248 -10117083 -21026177 -27877948 -24769734 -9079286 8969578
41093 8969578 15354938 9840432 4413293 4745544 4842368 1727463 2482367 10913695 18497986
41084 18497986 16948765 10978608 9293234 10215412 6712867 154442 -2414267 -1303742
41076 -1303742 -2638953 -5147136 -591779 11300254 19521981 16821545 8761438 3770384
41068C770384j247281o63368l54267k70818l172648n613192j139132O674579O713733
41059D697990j534743m863806L273481J1064119N586460p649206j3308185q209554
41051a0943444k583091k063339j119577L971889P133250L081695k438114q48002
41043e808733N658964P223338J207641m664110m967055l789835n275317m809072
41035a5224179K623746J0545907Q001414k768394p118095P80310Q685116M833571
41027A0359396m213976m836220J580227J663821p051368j1117881k333334R071903
41019f877432R627015J286820m338716l866727l724808o707758p447297k463135
41011b4512038L443986M216025O96856j948299j669204n18691K20953J881152
$$ plain form
41068 3770384 2523103 1859735 1505468 1234650 -1937998 -7551190 -8690322 -2015743 4697990
41059 4697990 3163247 -1700559 1572922 12637041 18223501 10574295 -2733890 -10943444
41051 -10943444 -13526535 -15589874 -16709451 -12737562 -5604312 -2522617 -4960731 -5808733
41043 -5808733 -149769 7073569 8281210 3617100 -1349955 -5139790 -10415107 -15224179
41035 -15224179 -12600433 -2054526 5946888 3178494 -3939601 -3159291 5525825 10359396
41027 10359396 6145420 1309200 2889427 4553248 -2498120 -13616001 -15949335 -6877432
41019 -6877432 2749583 4036403 -302313 -4169040 -7893848 -14601606 -22048903 -24512038
41011 -24512038 -21068052 -16852027 -16155171 -18103470 -19772674 -20291365 -20070412 -18189260
41003a8189260M705741N583436K341556j226619R34840P493226Q937936L46332
40995A0927188r594572q888899J358472R208859R318484P754399Q015548M265717
40987C2365196n722498j2101042p012841J494604J158481n242516n479747J141140
40979F00777L104321l198224p402770k774344L236761K298968j686356p42619
40971f563486L853723M910501R32444l139413l669164j093015K354128L593430
40963A179148Q06381k262753Q37249Q485550R833423K92235q855407n106577O340155
40954A1549404R238420m40604r487177o936062J854821M883333l42821o034095
40946D285219n404492K73368M490276K516067l915367q137210n572647J265580
$$ plain form
41003 -18189260 -13483519 -7900083 -5558527 -6785146 -5850306 1642920 10580856 10927188
40995 10927188 1332616 -7556283 -6197811 3011048 12329532 20083931 28099479 32365196
40987 32365196 26642698 14541656 7528815 9023419 10181900 4939384 -540363 600777
40979 600777 3705098 506874 -6895896 -9670240 -6433479 -4134511 -5820867 -6563486
40971 -6563486 -2709763 2200738 3133182 -6231 -3675395 -4768410 -2414282 1179148
40963 1179148 1985529 -277224 560025 9045575 18878998 19171233 10315826 5209249 11549404
40954 11549404 20787824 20347220 10860043 3923981 5778802 10662135 10319314 4285219
40946 4285219 -1119273 -845905 3644371 6160438 2245071 -5892139 -11464786 -10199206
40938a0199206O197339O328643L237771p04866l415083k222512L194396P758171
40930A0174653O049911L32987j825915J629375M622052K555301j409343k463652
40922A9665369j141733k96685M41929K368170K986750r92128p193177r160333
40914F678162m855105L66461Q20388k136122k284498K705063P456090N463807
40906A4214246j950822o481466l271143K966553M649459R88353k928388m240605
40898C946187m249194l353376j19325L860441L953431n37531m241754l197345
40890c938466j55316O25503r5210R78128L733272N320358M799429L342441J243385
40881A5853524j695043l834897l309310j527870j762916m036750m390529k57818
$$ plain form
40938 -10199206 -4001867 2326776 5564547 4859681 1444598 -777914 2416482 10174653
40930 10174653 16224564 16557551 14731636 16361011 20983063 23538364 22129021 19665369
40922 19665369 18523636 18226951 18668880 21037050 24023800 23031672 15838495 6678162
40914 6678162 1823057 2189518 3009906 873784 -1410714 1294349 8750439 14214246
40906 14214246 12263424 5781958 2510815 5477368 10126827 11115180 8186792 3946187
40898 3946187 -303007 -3656383 -3775708 84733 4038164 3500633 -741121 -3938466
40890 -3938466 -4093782 -3468279 -3563489 -2585361 1147911 6468269 11267698 14610139 15853524
40881 15853524 14158481 10323584 7014274 5486404 3723488 -313262 -4703791 -4961609
40873d961609N497848P338950L066240l851808p758077o059460q75308L944306
40865c658918O253703N849589L168520m82100k579795j588354R03371K157740
40857A0023756J712143P68965o18099k716006l446008m89351M007784N005185
40849A4248369J610875j458357q27256Q97447m87945m689739p452265n462482
40841c621353M84082N768938N506123M1247l931760j149058M307469L648265m357603
40832F696350j1411268j0744532m373796K014722N384543M672853J33273m022156
40824a1650011k570849K353326K666987k695682m366356K789705J0086103P750535
40816D363758r6323k696890O37765J663734k327710n913377n999716m795193k586278
$$ plain form
40873 -4961609 536239 7875189 10941429 7089621 -668456 -6727916 -7603224 -3658918
40865 -3658918 2594785 8444374 11612894 11130794 8550999 6962645 7866016 10023756
40857 10023756 11735899 12504864 11886765 9170759 5724751 5235400 9243184 14248369
40849 14248369 15859244 14400887 13573631 14471078 13983133 9293394 1841129 -3621353
40841 -3621353 -3137271 2631667 8137790 8179037 4247277 3098219 7405688 11053953 6696350
40832 6696350 -4714918 -15459450 -19833246 -17818524 -12433981 -7761128 -7627855 -11650011
40824 -11650011 -14220860 -11867534 -9200547 -11896229 -16262585 -13472880 -3386777 4363758
40816 4363758 4267435 1570545 2208310 3872044 1544334 -4369043 -10368759 -15163952 -17750230
40807a7750230K847570Q819171Q773657K493633k756249l094747k176278k385085
40799e228558k98434N126238P404755J304147q325071j2131072p519729K12897
40791a9454827N459429O802015N533129L371824J417312m55804k755174m537405
40783d619501m020226j429096Q16935J301369R16145O18127K66093K12808J542018
40774d395328L804262M659752K824864j41192j706773r96024O12877Q45638r66883
40765D541193k411453p12008K642441L118247K97163n00113L356784O506312L394800
40756B0233366k911709n615069m224140k926216k127200M08537K172420j306582
40748C703407o797679n675827K898787R562658P713235J353963k606479k962912
$$ plain form
40807 -17750230 -14902660 -6083489 2690168 5183801 2427552 -667195 -2843473 -5228558
40799 -5228558 -5526992 -400754 7004001 8308148 -16923 -12147995 -19667724 -19454827
40791 -19454827 -13995398 -7193383 -1660254 1711570 3128882 2673078 -82096 -4619501
40783 -4619501 -8639727 -10068823 -9251888 -7950519 -7034374 -6416247 -6150154 -5937346 -4395328
40774 -4395328 -591066 4068686 6893550 6752358 5045585 4049561 4662438 5508076 4541193
40765 4541193 2129740 1417732 4060173 7178420 7475583 6975470 10332254 16838566 20233366
40756 20233366 17321657 11706588 7482448 4556232 2429032 2837569 5009989 3703407
40748 3703407 -3094272 -8770099 -5871312 3691346 11404581 12758544 10152065 7189153
40740G189153k077855j128377n66452o16737M74087L976469O043847J669848o211066
40731H752917q826697m067425P38210L74590j978462k519651k458828k341052
40723a2326398R26326O794160Q483458K814524m065510n555542k841171j59924
40715e930077J248160N10844l772992p574958l405230O740024J0372233L036479
40707A224483l053118J987306Q986770M368772p492682j1356324m603021J920332
40699h017482L303982M968537Q024803N699364k744927p870576m588518M1456
40691a183361j143944m631491l469759J628907M555920K886280j54830l24639
40683a836917L731375R010350R624683K627390p210711j1536640p325021J237579
$$ plain form
40740 7189153 5111298 3982921 3416469 2799732 3273819 7250288 13294135 14963983 8752917
40731 8752917 -73780 -4141205 -3402995 -3028405 -5006867 -7526518 -9985346 -12326398
40723 -12326398 -11400072 -4605912 3877546 6692070 2626560 -2928982 -5770153 -5930077
40715 -5930077 -4681917 -4171073 -7944065 -15519023 -18924253 -12184229 -1811996 1224483
40707 1224483 -1828635 158671 9145441 13514213 6021531 -5334793 -9937814 -8017482
40699 -8017482 -4713500 255037 8279840 13979204 11234277 3363701 -1224817 -1183361
40691 -1183361 -2327305 -6958796 -10428555 -8799648 -4243728 -1357448 -1512278 -1836917
40683 -1836917 1894458 10904808 20529491 23156881 15946170 4409530 -2915491 -1677912
40675a677912Q529376J1236247P900817l6301p108751q394889n015758j428476
40667D004353J028870L324359L841306M94644l541050k679537K697415O307575
40659A5477935M218347j721892p550498r561429n280481K417550N107348p79623
40651B327257o847072l934615L379024L547251l540829o914435k430900K431361
40643a1982958K873205L031384M936865L740808j292741k666658K533801O325582
40635G499288L015727j120675J165128O240493O767140L081777n94014m245987
40627B1808877q173511p664820m40413O168477M520871j479736k771490P27326
40619A2695581J808129j136732k716838j033781m68894l195213n285479k991452
$$ plain form
40675 -1677912 6851464 18087711 25988528 25952227 18843476 10448587 5432829 4004353
40667 4004353 5033223 8357582 12198888 12693532 9152482 6472945 9170360 15477935
40659 15477935 19696282 17974390 10423892 862463 -4418018 -2000468 3106880 2327257
40651 2327257 -4519815 -8454430 -5075406 -1528155 -5068984 -11983419 -14414319 -11982958
40643 -11982958 -9109753 -6078369 -1141504 2599304 1306563 -1360095 1173706 7499288
40635 7499288 10515015 9394340 10559468 16799961 23567101 26648878 26054864 21808877
40627 21808877 13635366 5970546 5530133 11698610 16219481 14739745 11968255 12695581
40619 12695581 14503710 13366978 10650140 9616359 9147465 5952252 666773 -2324679
40611b324679K341461O979438Q630757O945566L124063p42962l585244n599796
40603A5768604n761226k073765M101873P791072O719813L812918J282212k437515
40595B9203986o933847p454932k930312O1029k738974n552922k108838K834887
40587D380077N54764o927119q948461j591108P644501J0358630N591147j864948
40579I197483n641582j677328O432305Q412873q4885r196027p062899K876492
40571C256432O734333O00589n209081l265487R77140K09962l222636k667963K441557
40562a45154P106140P590380L795699j809347m924032k480480K922096M895746
40554A6951048R34633n151925q947941r285955n983363R52564Q312385J0826502
$$ plain form
40611 -2324679 16782 6996220 15626977 22572543 25696606 24953644 21368400 15768604
40603 15768604 10007378 7933613 12035486 19826558 26546371 30359289 31641501 29203986
40595 29203986 22270139 14815207 11884895 11945924 9206950 3654028 1545190 4380077
40587 4380077 4934841 -1992278 -10940739 -12531847 -4887346 5471284 11062431 9197483
40579 9197483 3555901 1878573 8310878 16723751 16638866 7442839 379940 3256432
40571 3256432 9990765 10591354 5382273 2116786 3093926 3303888 81252 -2586711 -145154
40562 -145154 6960986 14551366 18347065 16537718 11613686 9133206 12055302 16951048
40554 16951048 17885681 12733756 3785815 -5500140 -11483503 -10530939 -2218554 8607948
40546H607948P438919K576504o3966r54722j377792j489599k524569n613574p451590
40537h52441l166611M833042P398126R80547o580992o414786L67444N977935N799549
40528H341813R75967m808793p153400k997676N341810J0920043R727893M561292
40520B4908949m37327m610792p679466p095632k446845K047074L504822M381803
40512A2572586O390141N666359l96740o301895n389293j73342J633356r40117
40504A3061055j919697Q78092K735755M96182k577200k380244N31629K852419
40496A3677991K317454j274978n522491n941223p87477N044470N288156R53208
40488A3755110j461428j33321L9705l458606o457922n470817k852142r22701K651378
$$ plain form
40546 8607948 16046867 18623371 18559405 17604683 16226891 14737292 12212723 6599149 -852441
40537 -852441 -4019052 813990 8212116 9192663 2611671 -3803115 -3435671 2542264 8341813
40528 8341813 9317780 4508987 -2644413 -5642089 -300279 10619764 20347657 24908949
40520 24908949 24471622 19860830 12181364 5085732 2638887 4685961 8190783 12572586
40512 12572586 18962727 24629086 24232346 17930451 12541158 12367816 14001172 13061055
40504 13061055 11141358 12019450 14755205 15251387 12674187 10293943 10825572 13677991
40496 13677991 15995445 14720467 9197976 3256753 2469276 7513746 12801902 13755110
40488 13755110 12293682 12160361 12200066 8741460 2283538 -3187279 -6039421 -6962122 -4310744
40479d310744Q373541R704763J713523q812909j0173671j360677O944791P075190
40471I153807K462083n11577j251683j875261j512021J109548L242598J530824
40463A2348318k256957l259862R5258N168396Q869017R077688M521568k762988
40455C1800438o846135m354787J24634k6794l890860n343063l505637l167397
40447D790399m598014j932988N381092Q380445J461924p800538r008488l643224
40439f969392j100772l636644m407313M44392O321981P993970O029083L420707
40431H096012J157945o85693j607996k171209l384510l664327l04959M959089
40423B394352O214033J313367m142027l577305K324604O842452M996138k208510
$$ plain form
40479 -4310744 4062797 13767560 15481083 6668174 -3505497 -4866174 2078617 9153807
40471 9153807 11615890 11104313 9852630 7977369 6465348 7574896 10817494 12348318
40463 12348318 10091361 6831499 6926757 12095153 20964170 30041858 34563426 31800438
40455 31800438 24954303 20599516 20724150 20697356 16806496 11463433 7957796 4790399
40447 4790399 192385 -1740603 3640489 12020934 13482858 5682320 -3326168 -6969392
40439 -6969392 -8070164 -11706808 -16114121 -15669729 -9347748 -1353778 4675305 8096012
40431 8096012 9253957 8568264 6960268 4789059 1404549 -2259778 -2564737 2394352
40423 2394352 8608385 9921752 5779725 2202420 4527024 11369476 16365614 14157104
40415A4157104j0062326j4233156j2800196o517238J453858O724795O774422M114763
40407a0387974M487166R360115J2019616N451064o835084j3701656j0521383l637064
40399a3765200Q04567M228818Q232481Q851445M513134J215351J897908o57942
40391A5320562j0227530j5418368n438842R483459J0549729o18530m697886L693872
40383B646466P916172j861256j1789813o981758N264122Q502748J610143m074560
40375A232264m077390l399264m292006l455875M17328M961699Q221961Q543618
40367H152335L887898l645895p403565n031578j767290o03818K423480P583863
40359C595430O656745k653502q378857j881338O288679K297489p812799p712722
$$ plain form
40415 14157104 4094778 -10138378 -22938574 -29455812 -28001954 -21277159 -14502737 -10387974
40407 -10387974 -5900808 3459307 15478923 20929987 14094903 393247 -10128136 -13765200
40399 -13765200 -12960633 -8731815 -499334 8352111 12865245 14080596 15978504 15320562
40391 15320562 5093032 -10325336 -15764178 -6280719 4269010 3650480 -1047406 2646466
40383 2646466 10562638 8701382 -3088431 -10070189 -4806067 3696681 5306824 1232264
40375 1232264 -2845126 -6244390 -10536396 -13992271 -13574943 -8613244 -391283 8152335
40367 8152335 12040233 8394338 990773 -4040805 -5808095 -6411913 -3988433 3595430
40359 3595430 10252175 7598673 -780184 -2661522 3627157 5924646 -1888153 -9600875
40351i600875K299558O670399R38815k181612M693445J2028390R609207Q26514
40343B5283841n369578o349081m454590k340206l290978q350588j1297865n153720
40335b1322765N358879Q055439J311006l581012m79890L432455J700383j377204
40327f902709o45880J174581J366244L394087P955666P889651K46361n839313
40319H638688k434061M329105M420812l77446j532311J326302J776729q36720
40311A5311098j174917J344498J302006l129988p114797o536297k995628q73066
40303c867091k738842o958867q082102k458250N294601O743887K302750J576583
40295h187331P543219J0440300M227465j724454J772688O300906j138801j4440271
$$ plain form
40351 -9600875 -7301317 -630918 307897 -1873715 2819730 14848120 24457327 25283841
40343 25283841 19914263 13565182 9110592 6770386 3479408 -4871180 -16169045 -21322765
40335 -21322765 -15963886 -7908447 -6597441 -10178453 -10658343 -7225888 -5525505 -6902709
40327 -6902709 -7548589 -6374008 -5007764 -1613677 6341989 14231640 14478001 8638688
40319 8638688 6204627 10533732 14954544 14577098 13044787 14371089 16147818 15311098
40311 15311098 14136181 15480679 16782685 13652697 6537900 1603 -2994025 -3867091
40303 -3867091 -6605933 -13564800 -21646902 -24105152 -18810551 -12066664 -9763914 -8187331
40295 -8187331 -644112 9796188 14023653 12299199 14071887 20372793 19233992 4793721
$$ [...]
##END NTUPLES=NMR SPECTRUM
##END=
