##TITLE=31Pdec_LR-688B-KF1-TFA
 CDCl3, 24 sc
 30.7.2019
##JCAMPDX= 6.0         $$ Bruker NMR JCAMP-DX V2.0
##DATA TYPE= NMR SPECTRUM
##DATA CLASS= NTUPLES
##ORIGIN= UXNMR, Bruker Analytische Messtechnik GmbH
##OWNER= root
$$ XWIN-NMR		Version 3.5
$$ Tue Jul 30 15:30:46 2019 Russian Standard Time (UT+4h)  she@DPX200
##.OBSERVE FREQUENCY= 81.013821
##.OBSERVE NUCLEUS= ^31P
##.ACQUISITION MODE= SIMULTANEOUS
##.ACQUISITION SCHEME= undefined
##.AVERAGES= 24
##.DIGITISER RES= 17
##SPECTROMETER/DATA SYSTEM= spect
##.PULSE SEQUENCE= zgpg30
##.SOLVENT NAME= CDCl3
##.SHIFT REFERENCE= (INTERNAL, CDCl3, 0, 182.463)
##AUDIT TRAIL= $$ (NUMBER, WHEN, WHO, WHERE, WHAT)
$$ ##TITLE= Audit trail, XWIN-NMR		Version 3.5
$$ ##JCAMPDX= 5.01
$$ ##ORIGIN= Bruker BioSpin GmbH
$$ ##OWNER= she
$$ F:/spectra/data/she/nmr/P31/1/pdata/1/auditp.txt
$$ ##AUDIT TRAIL=  $$ (NUMBER, WHEN, WHO, WHERE, WHAT)
(   1,<2019-07-30 15:29:56.54 +0400>,<she>,<DPX200>,
      <created by zg, POWCHK disabled, PULCHK disabled
       configuration hash MD5:
       00 E9 B6 7A A2 85 ED C7 34 08 36 98 17 FE 4E 26
       data hash MD5: 32K
       12 E1 93 58 19 45 24 C4 FD 03 F3 E3 87 E0 BF 0A>)
(   2,<2019-07-30 15:29:59.04 +0400>,<she>,<DPX200>,
      <Start of raw data processing
       efp BC_mod = 2 LB = 1 FT_mod = 6 PKNL = 1 PHC0 = -395.6978 PHC1 = 101.2 SI = 64K 
       data hash MD5: 64K
       0E CC 1B 80 F3 48 CF 83 4F 17 59 68 C9 76 AF 98>)
(   3,<2019-07-30 15:30:12.00 +0400>,<she>,<DPX200>,
      <pk PHC0 = 15.87124 PHC1 = 0 
       data hash MD5: 64K
       EC 22 BB 0A DF 96 44 09 83 98 42 86 65 13 2D 73>)
(   4,<2019-07-30 15:30:18.09 +0400>,<she>,<DPX200>,
      <abs ABSG = 5 
       data hash MD5: 64K
       BE 0C 9C E3 CC 35 E3 28 BB 85 55 78 8C 58 86 C6>)
$$ ##END=
$$ 
$$ hash MD5
$$ 0B 76 CF 88 2E 62 32 B9 EB B6 3F AD 4E 3E C9 E1
##$RELAX= 
##$RELAX= 
##$RELAX= 
##$RELAX= 
##$RELAX= 
##$RELAX= 
##$RELAX= 
##$RELAX= 
$$ Bruker specific parameters
$$ --------------------------
##$DU= <F:/spectra>
##$EXPNO= 1
##$NAME= <P31>
##$PROCNO= 1
##$TYPE= <nmr>
##$USER= <she>
##$AMP= (0..31)
100 100 100 100 100 100 100 100 100 100 100 100 100 100 100 100 100 100 
100 100 100 100 100 100 100 100 100 100 100 100 100 100 
##$AQSEQ= 0
##$AQ_mod= 1
##$AUNM= <au_zg>
##$AUTOPOS= <>
##$BF1= 81.014009
##$BF2= 200.13
##$BF3= 200.13
##$BF4= 200.13
##$BF5= 200.13
##$BF6= 200.13
##$BF7= 200.13
##$BF8= 200.13
##$BYTORDA= 1
##$CFDGTYP= 0
##$CFRGTYP= 5
##$CHEMSTR= <none>
##$CNST= (0..31)
1 1 145 1 1 1 1 1 1 1 1 1 1 1 1 1 1 1 1 1 1 1 1 1 1 1 1 1 1 1 1 1 
##$CPDPRG= <waltz16>
##$CPDPRG1= <>
##$CPDPRG2= <waltz16>
##$CPDPRG3= <>
##$CPDPRG4= <mlev>
##$CPDPRG5= <mlev>
##$CPDPRG6= <mlev>
##$CPDPRG7= <mlev>
##$CPDPRG8= <mlev>
##$CPDPRGB= <>
##$CPDPRGT= <>
##$D= (0..31)
0 1 0 0 0 0 0 0 0 0 0 0.03 2e-05 3e-06 0 0 0 0 0 0 0 0 0 0 0 0 0 0 0 0 
0 0 
##$DATE= 1564486195
##$DBL= (0..7)
120 120 120 11 120 120 24 19 
##$DBP= (0..7)
150 150 150 150 150 150 150 150 
##$DBP07= 0
##$DBPNAM0= <>
##$DBPNAM1= <>
##$DBPNAM2= <>
$$ [...]
##$SUBNAM3= <"">
##$SUBNAM4= <"">
##$SUBNAM5= <"">
##$SUBNAM6= <"">
##$SUBNAM7= <"">
##$SUBNAM8= <"">
##$SUBNAM9= <"">
##$SW= 369.568048894756
##$SWIBOX= (0..15)
0 1 3 0 0 0 0 0 0 0 0 0 0 0 0 0 
##$SW_h= 29940.119760479
##$TD= 32768
##$TD0= 1
##$TE= 0
##$TE2= 300
##$TE3= 300
##$TEG= 300
##$TL= (0..7)
0 120 53 12 22 120 120 120 
##$TP= (0..7)
150 150 150 150 150 150 150 150 
##$TP07= 0
##$TPNAME0= <>
##$TPNAME1= <>
##$TPNAME2= <>
##$TPNAME3= <>
##$TPNAME4= <>
##$TPNAME5= <>
##$TPNAME6= <>
##$TPNAME7= <>
##$TPOAL= (0..7)
0.5 0.5 0.5 0.5 0.5 0.5 0.5 0.5 
##$TPOFFS= (0..7)
0 0 0 0 0 0 0 0 
##$TUNHIN= 0
##$TUNHOUT= 0
##$TUNXOUT= 0
##$USERA1= <user>
##$USERA2= <user>
##$USERA3= <user>
##$USERA4= <user>
##$USERA5= <user>
##$V9= 5
##$VALIST= <valist>
##$VCLIST= <CCCCCCCCCCCCCCC>
##$VD= 0
##$VDLIST= <DDDDDDDDDDDDDDD>
##$VPLIST= <PPPPPPPPPPPPPPP>
##$VTLIST= <TTTTTTTTTTTTTTT>
##$WBST= 1024
##$WBSW= 4
##$XGAIN= (0..3)
0 0 0 0 
##$XL= 0
##$YL= 0
##$YMAX_a= 9631
##$YMIN_a= -14310
##$ZGOPTNS= <>
##$ZL1= 120
##$ZL2= 120
##$ZL3= 120
##$ZL4= 120
##$ABSF1= 182.463
##$ABSF2= -187.1042
##$ABSG= 5
##$ABSL= 3
##$ALPHA= 0
##$AQORDER= 0
##$ASSFAC= 0
##$ASSFACI= 0
##$ASSFACX= 0
##$ASSWID= 0
##$AUNMP= <proc_1d>
##$AZFE= 0.1
##$AZFW= 0.5
##$BCFW= 0
##$BC_mod= 2
##$BYTORDP= 0
##$COROFFS= 0
##$CY= -3
##$DATMOD= 1
##$DC= 0
##$DFILT= <>
##$DTYPP= 0
##$F1P= 0
##$F2P= 0
##$FCOR= 1
##$FTSIZE= 65536
##$FT_mod= 6
##$GAMMA= 0
##$GB= 0
##$INTBC= 1
##$INTSCL= 5.30512e-09
##$ISEN= 30
##$LB= 1
##$LEV0= 0
##$LPBIN= 0
##$MAXI= 10000
##$MC2= 0
##$MEAN= 0
##$ME_mod= 0
##$MI= 50
##$NCOEF= 0
##$NC_proc= -8
##$NLEV= 6
##$NOISF1= 182.463
##$NOISF2= 159.3651
##$NSP= 0
##$NTH_PI= 0
##$NZP= 0
##$OFFSET= 182.463
##$PC= 4
##$PHC0= -379.8266
##$PHC1= 101.2
##$PH_mod= 1
##$PKNL= yes
##$PPARMOD= 0
##$PSCAL= 0
##$PSIGN= 0
##$REVERSE= no
##$SF= 81.0140089999434
##$SI= 65536
##$SIGF1= 159.3651
##$SIGF2= -187.1042
##$SINO= 113.3802
##$SIOLD= 16384
##$SREGLST= <1H.CDCl3>
##$SSB= 0
##$STSI= 65536
##$STSR= 0
##$SW_p= 29940.119760479
##$SYMM= 0
##$S_DEV= 0
##$TDeff= 32768
##$TDoff= 0
##$TI= <>
##$TILT= no
##$TM1= 0
##$TM2= 0
##$TOPLEV= 0
##$USERP1= <user>
##$USERP2= <user>
##$USERP3= <user>
##$USERP4= <user>
##$USERP5= <user>
##$WDW= 1
##$XDIM= 65536
##$YMAX_p= 282752639
##$YMIN_p= -90217976
$$ End of Bruker specific parameters
$$ ---------------------------------
##NTUPLES= NMR SPECTRUM
##VAR_NAME=  FREQUENCY,     SPECTRUM/REAL,   SPECTRUM/IMAG
##SYMBOL=    X,             R,               I
##VAR_TYPE=  INDEPENDENT,   DEPENDENT,       DEPENDENT
##VAR_FORM=  AFFN,          ASDF,            ASDF
##VAR_DIM=   65536,         65536,           65536
##UNITS=     HZ,            ARBITRARY UNITS, ARBITRARY UNITS
##FACTOR=    0.456856943014862, 1,           1
##FIRST=     14782.0589164792, 0,            0
##LAST=      -15158.0608439998, 0,           0
##MIN=       -15158.0608439998, -90217976,   0
##MAX=       14782.0589164792, 282752639,    0
$$ Real data points
##PAGE= N=1
##DATA TABLE= (X++(R..R)), XYDATA
$$ [...]
46471C715367r904331o439814J614867P090731O668068K879608r92657m274694
$$ 3715367 -6188964 -12628778 -11013911 -3923180 2744888 5624496 4631839 357145
46463C57145o213863m339932J371345O039866N572150K405629J349878J951751
$$ 357145 -5856718 -10196650 -8825305 -2785439 2786711 5192340 6542218 8493969
46455H493969L12989k839252k273777K951004O853621M791916o09582m335674
$$ 8493969 8806958 5967706 3693929 6644933 13498554 18290470 17680888 13345214
46447A3345214n344768n028095l294584J3525K642709K614319J436498J485165
$$ 13345214 8000446 2972351 -322233 -308708 2334001 4948320 6384818 7869983
46439G869983K074085J176202p81906j972578k364500k800056k555501j063788
$$ 7869983 9944068 11120270 10338364 8365786 6001286 3201230 645729 -418059
46431d18059l80934k281589m353316l010508P21909K767715K475877K679061L687222
$$ -418059 -798993 -3080582 -7433898 -10444406 -9722497 -6954782 -4478905 -1799844 1887378
46422A887378K861162Q24578J891672O069322O815878P93500n545787m645993
$$ 1887378 4748540 5573118 7464790 13534112 20349990 21143490 15597703 10951710
46414A0951710R97328K967842m11444k981592j564100j74241k070488m615538
$$ 10951710 11949038 14916880 14505436 11523844 9959744 9785503 7715015 3099477
46406C099477m888193m306891m024752j423308M021827O480872J526058n600004
$$ 3099477 -1788716 -6095607 -10120359 -11543667 -7521840 -1040968 485090 -5114914
46398e114914o291051o61512L753088L627580K351835J537311j276276n096525
$$ -5114914 -11405965 -12067477 -8314389 -4686809 -2334974 -797663 -2073939 -7170464
46390g170464m337186J578985N329782K730469n85421J191224M582576L650902
$$ -7170464 -11507650 -9928665 -4598883 -1868414 -2453835 -1262611 3319965 6970867
46382F970867L13749r3889J005564j497418n970946n726871j79988M057570L497047
$$ 6970867 7284616 7190727 8196291 6698873 727927 -4998944 -5178932 -1121362 2375685
46373B375685J719697K083988L078674K328393q0126l089422m982282k809705
$$ 2375685 4095382 6179370 9258044 11586437 11506311 8416889 3434607 624902
46365F24902L374857P198885L317557l440500l995646J020179K351599k778693
$$ 624902 3999759 11198644 14516201 11075701 7080055 8100234 10451833 7673140
46357G673140o813620m932907j779516j826097k722933k342113l050096m402479
$$ 7673140 859520 -4073387 -5852903 -7679000 -10401933 -12744046 -15794142 -20196621
46349b0196621j163417O140720Q619093L157546j179173J669329M158459o02793
$$ -20196621 -21360038 -15219318 -6600225 -3442679 -4621852 -2952523 1205936 603143
46341F03143m977395J07618P577085M878832m538156o898782j099120J187208
$$ 603143 -4374252 -4266634 3310451 8189283 3651127 -3247655 -4346775 -3159567
46333c159567l143406m772978p53682K75728m070517l488589O207579J2607478
$$ -3159567 -6302973 -11075951 -11829633 -11553905 -15624422 -19113011 -12905432 -297954
46325b97954N343986o317971o465227M537195J1970630P489936k634924q622244
$$ -297954 5046032 -1271939 -7737166 -3199971 8770659 16260595 13625671 5003427
46317E003427p953107m239733r58806J679648N099149Q128555O154447k255523
$$ 5003427 -2949680 -7189413 -8148219 -6468571 -1369422 6759133 12913580 10658057
46309A0658057r810795p906831Q38956N214576J383364k796913j729154o3332
$$ 10658057 847262 -7059569 -6220613 -1006037 377327 -2419586 -4148740 -4212072
46301d212072j873601k203226K964596P236796L661937l033131m038039n32761
$$ -4212072 -6085673 -8288899 -5324303 1912493 5574430 2541299 -1496740 -2029501
46293b029501L11138j286460L73950M189389L449250j809037m475241k228506
$$ -2029501 -1718363 -3004823 -2630873 1558516 5007766 3198729 -1276512 -3505018
46285c505018M78019K296370O164175R702498N799107m341981r701396n511128
$$ -3505018 -3026999 -730629 5433546 15136044 20935151 16593170 6891774 1380646
46277A380646n73700k644537o302919l464959K335250K414157j772501j018711
$$ 1380646 806946 -1837591 -8140510 -11605469 -9270219 -6856062 -8628563 -9647274
46269i647274N968741R937033N180605k522075n085362k690518j143052k829388
$$ -9647274 -3678533 6258500 11439105 8917030 3831668 1141150 -1902 -2831290
46261b831290m536194k639485K436611O595459N897918P65656l581104k541539
$$ -2831290 -7367484 -10006969 -7570358 -974899 4923019 5688675 2107571 -433968
46253d33968J942068L296489j194939o731498p519291m003437n71641J473164
$$ -433968 1508100 4804589 3609650 -3121848 -10641139 -14644576 -15216217 -13743053
46245a3743053M001375O100809L904216k024249m750230l14662N418005M621174
$$ -13743053 -9741678 -3640869 263347 -1760902 -6511132 -6825794 -1407789 3213385
46237C213385j120052m102702l127832m214245q230797p510852J156652R024731
$$ 3213385 2093333 -2009369 -5137201 -9351446 -17582243 -25093095 -23936443 -14911712
46229a4911712P764572K232286J996319N355211K682814o473367j1230834n556776
$$ -14911712 -7147140 -4914854 -2918535 2436676 5119490 -1353877 -12584711 -18141487
46221a8141487L735244Q295422Q286056O737347K610158m086267p371569l249651
$$ -18141487 -14406243 -6110821 2175235 8912582 11522740 7436473 64904 -3184747
46213c184747K390918J656769l349012m515363q83915J149358l03575k7851L789605
$$ -3184747 -793829 862940 -2486072 -7001435 -7885350 -6735992 -7039567 -7067418 -3277813
46204c277813N458011J631822k417575j380557J380744q5037l830797k760546
$$ -3277813 2180198 3812020 1394445 13888 1394632 1309595 -2521202 -5281748
46196e281748L820853Q208246M643971l335235p763664n382783j03646K037585
$$ -5281748 -1460895 6747351 11391322 8056087 292423 -5090360 -5194006 -3156421
46188c156421q01769m436188l272710K739240P286444N343292m26785l774733
$$ -3156421 -3958190 -8394378 -11667088 -8927848 -1641404 3701888 3275103 -499630
46180d99630l372011k817646l181153j273032L605514O894322N610986L142765
$$ -499630 -3871641 -6689287 -9870440 -11143472 -7537958 -643636 4967350 8110115
46172H110115L316474L729893R747n974490p747368l191737K947429N399832L240681
$$ 8110115 11426589 15156482 15166229 9191739 1444371 -1747366 1200063 6599895 9840576
46163I840576j333682n213301n409989j545594K715660L922983L537388M387482
$$ 9840576 8506894 3293593 -2116396 -3661990 -946330 2976653 6514041 10901523
46155A0901523M138244j548935r732574j1429743l865685N390615R071567Q039549
$$ 10901523 15039767 13490832 3758258 -7671485 -11537170 -6146555 2925012 10964561
46147A0964561N254530p9997o689429p258254J234058Q836320M334017p567111
$$ 10964561 16219091 16139094 9449665 2191411 3425469 12261789 16595806 9028695
46139I028695j1510097l145696N478487M152297k273260l826697k17847J519733
$$ 9028695 -2481402 -5627098 -148611 4003686 1730426 -2096271 -2314118 -794385
46131g94385p33587j935226J380866N883682N825761k21722p678039j0026818
$$ -794385 -1527972 -3463198 -2082332 3801350 9627111 9405389 1727350 -8299468
46123h299468n083191K354747N394654K857816J78413J968383O267393P611648
$$ -8299468 -13382659 -11027912 -5633258 -2775442 -2597029 -628646 5638747 13250395
46115A3250395L679373k839487p495145p766364m715318k057525k573149m886289
$$ 13250395 16929768 14090281 6595136 -1171228 -5886546 -7944071 -10517220 -15403509
46107a5403509n025223j435632L126514N062131L795682J850334K135158M838511
$$ -15403509 -20428732 -21864364 -18737850 -13675719 -9880037 -8029703 -5894545 -1056034
46099a056034O181925J998414n677608q482715j988431O632929O907069o49127
$$ -1056034 5125891 7124305 1446697 -7036018 -9024449 -2391520 4515549 3866422
46091C866422n565281k468723K904167M254121K844360J510857j355260o245110
$$ 3866422 -1698859 -4167582 -1263415 2990706 5835066 7345923 5990663 -254447
46083b54447p800584k539254L900987M424146J154343R16068L480130K697773
$$ -254447 -8055031 -10594285 -6693298 -2269152 -1114809 -198741 3281389 5979162
46075E979162k330681n525971l372306Q40972L043641K791691J113616p35815
$$ 5979162 3648481 -1877490 -5249796 -4408824 -1365183 1426508 2540124 1804309
46067A804309j65916L871313O972966L837408l273734o623670l873905m07212
$$ 1804309 1638393 5509706 12482672 16320080 13046346 6422676 2548771 2141559
46059B141559J41496O46772L481231N472310L580096K41238r70969q20504j836729
$$ 2141559 2283055 2929827 6411058 11883368 15463464 15704702 14733733 13913229 12076500
46050A2076500l734077m618841l869354j598957J562966K828170k01774l955313
$$ 12076500 8342423 3723582 -145772 -1744729 -181763 2646407 2444633 -1510680
46042a510680j587767O394057J0770392O540556J52157j526569k124495p699142
$$ -1510680 -3098447 3295610 14066002 20606558 20758715 19232146 17107651 9408509
46034I408509j3762231j0696773O48509R013882P953501J950826l059172o426930
$$ 9408509 -4353722 -15050495 -14401986 -5388104 2565397 4516223 1457051 -4969879
46026d969879q315371o645337j704284K336997L243261K942543K525489R09810
$$ -4969879 -13285250 -19930587 -21634871 -19297874 -16054613 -13112070 -10586581 -9676771
46018i676771l15246K218123O009492L990175l294615n633211J411595P945105
$$ -9676771 -9992017 -7773894 -1764402 2225773 -1068842 -6702053 -5290458 2654647
46010B654647M519456k607048j700128M828719M168316n554182j1476332n823584
$$ 2654647 7174103 4567055 2866927 7695646 11863962 6309780 -5166552 -10990136
46002a0990136K758214L198406k393592m566945j138523K364873K990739K937789
$$ -10990136 -8231922 -5033516 -7427108 -11994053 -13132576 -10767703 -7776964 -4839175
45994d839175L139445J485032j705381k090008K423798P352989O550296Q5545
$$ -4839175 -1699730 -214698 -1920079 -4010087 -1586289 5766700 12316996 12402541
45986A2402541n419333m738522m12951Q61999k398600m236491j55476N517908
$$ 12402541 6983208 2244686 1831735 2693734 295134 -3941357 -4096833 1421075
45978A421075N596364P32470k192414j554024l110047q839132j1585807n541207
$$ 1421075 7017439 7749909 5557495 4003471 893424 -7945708 -19531515 -25072722
45970b5072722M223848Q680712O610305L237122J140550n05758o91187J867070
$$ -25072722 -20848874 -12168162 -5557857 -2320735 -1180185 -1685943 -2377130 -510060
45962e10060L788248J210889k463890j126890K543106l32089r473513j2838760
$$ -510060 3278188 4489077 2025187 898297 3441403 3109314 -6364199 -19202959
45954a9202959l722257Q380298J0570299L590999j517491N69442M772452N068099
$$ -19202959 -22925216 -14544918 -3974619 -383620 -1901111 -1331669 3440783 8508882
45946H508882J478884k502258m133470k427232J189644K822841p9630m623276
$$ 8508882 9987766 7485508 3352038 924806 2114450 4937291 4857661 234385
45938B34385n088586j88637M640881L178809m410692j0991907r349314k57463
$$ 234385 -4854201 -5042838 -401957 2776852 -1633840 -12625747 -21975061 -22232524
45930b2232524P318970O150173l49323k961630M67730L068412P35974j756536
$$ -22232524 -14913554 -8763381 -9112704 -12074334 -11606604 -8538192 -7802218 -9558754
45922i558754j89991J291555j555757l616711J661191R338559Q681536J04846
$$ -9558754 -9748745 -8457190 -10012947 -13629658 -11968467 -2629908 6051628 6156474
45914F156474m707839o16716L825958O38021n751283o807595k716904J66421j26103
$$ 6156474 1448635 831919 4657877 5295898 -455385 -7262980 -9979884 -9813463 -9939566
45905i939566m04779M36571R2711j716746j810573J503114N406668N830753K239494
$$ -9939566 -10344345 -9907774 -9815063 -11531809 -13342382 -11839268 -6432600 -601847 1637647
45896A637647j705419k149369L82838J442230j285629m357983l854336k053127
$$ 1637647 -67772 -2217141 -1834303 -392073 -1677702 -6035685 -9890021 -11943148
45888a1943148l634151o302566k439250Q337350J5757809J2098839K417518l665775
$$ -11943148 -15577299 -21879865 -24319115 -15981765 -223956 11874883 14292401 10626626
45880A0626626m665815m946750m548838k00507N449452M982542k113992o794173
$$ 10626626 5960811 1014061 -3534777 -3735284 1714168 6696710 4582718 -2211455
45872b211455k696408M937981O868027K278195j438292L62436L795011K777575
$$ -2211455 -4907863 30118 6898145 9176340 7738048 8100484 11895495 14673070
45864A4673070k131378m502520j356302K023128m91512o201154o807039j073702
$$ 14673070 12541692 8039172 6682870 8705998 8214486 2013332 -4793707 -5867409
45856e867409K747089l8299k468907K762634R878359P423288l535041r385814
$$ -5867409 -3120320 -3158619 -5627526 -2864892 7013467 14436755 10901714 1515900
45848A515900l271331N660005O339141O34274k230336j06501R76642k447432o523164
$$ 1515900 -1755431 3904574 10243715 10877989 8647653 8541152 9517794 7070362 547198
45839E47198o237213j585947L365702M917157K751476m2252k71175J450270J673096
$$ 547198 -5690015 -7275962 -3910260 1006897 3758373 3716121 3444946 4895216 6568312
45830F568312m92674j965885j103039o20611k194699k216451K301805O744217
$$ 6568312 6075638 4109753 3006714 2386103 191404 -2025047 276758 7020975
45822G020975M046658m431039r627957o768360o91598K202070J749586J188909
$$ 7020975 11067633 6636594 -2991363 -9759723 -10451321 -8249251 -6499665 -5310756
45814e310756J312831J125602J140565K306720L411122K477774k65805k632349
$$ -5310756 -3997925 -2872323 -1731758 574962 3986084 6463858 6198053 3565704
45806C565704k671279K4053L334981L012489k514517p588942m776446L738243
$$ 3565704 894425 918478 4253459 7265948 4751431 -2837511 -7613957 -3875714
45798c875714O827336M3392o775301l898257L346641L613480j825726k119409
$$ -3875714 2951622 2995014 -3780287 -7678544 -4331903 -718423 -2544149 -4663558
45790d663558L532288L802234m726944r726464k163979Q844293R891349K776588
$$ -4663558 -1131270 2670964 -2055980 -11782444 -13946423 -5102130 4789219 7565807
45782G565807j074756Q13373J159041k689078n340074l657589n50549J601343
$$ 7565807 6491051 7304424 8463465 5774387 434313 -3223276 -3773825 -2172482
45774b172482K835345J423428l638143o718378j556781P097610Q149864R75999
$$ -2172482 662863 2086291 -1551852 -8270230 -9827011 -2729401 5420463 6396462
45766F396462l711248j412853M63567j754159n67695P081206J0178743Q62706
$$ 6396462 2685214 1272361 1735928 -18231 -585926 6495280 16674023 17536729
45758A7536729r788875p164547L647367N689137l387261r307395m931045M78390
$$ 17536729 7747854 583307 4230674 9919811 6532550 -2774845 -7705890 -7227500
45750g227500q81798l105082Q27786O052822M715895k10434K0754N510585P714538
$$ -7227500 -8109298 -11214380 -10386594 -4333772 382123 171689 192443 5703028 13417566
45741A3417566K470367m711698p017601m231617o07521J099790J062744J05523
$$ 13417566 15887933 11176235 4158634 -72983 -680504 419286 1482030 1587553
45733A587553j261359j844175r4674L366451N053624K647155j089172j542325
$$ 1587553 326194 -1517981 -1612655 1753796 6807420 9454575 8365403 6823078
45725F823078P57861O92603k863802m413459q08409K721665N98342l902189m064320
$$ 6823078 7580939 8273542 5409740 996281 187872 2909537 3507879 -394310 -4458630
45716d458630n10720J104855M14610J790170M954438N155758K449336J599295
$$ -4458630 -4969350 -3864495 -3449885 -1659715 3294723 8450481 10899817 12499112
45708A2499112K152325j522954q295905q713751M14804R305476Q712925K012148
$$ 12499112 14651437 13128483 4832578 -3881173 -3466369 5839107 14552032 16564180
45700A6564180k393871l170324l455651k868696k04774J003055k208603n314343
$$ 16564180 14170309 10999985 7544334 4675638 4470864 5473919 3265316 -2049027
45692b049027k620029K841648L828621O69898m853L004392L649644q73862n413922
$$ -2049027 -4669056 -1827408 2001213 2671111 2666258 5670650 9320294 8446432 3032510
45683C032510m686527j76348L053821K548468l03028k574025k340388l83508R95748
$$ 3032510 -1654017 -1830365 1223456 3771924 3468896 894871 -1445517 -1829025 -833277
45674h33277J582499L170375M595557J407826o089067r619688l575506N327749
$$ -833277 749222 3919597 8515154 9922980 3833913 -5785775 -9361281 -4033532
45666d033532O338517k12270m240005j077971L256326K684411r54151k956706
$$ -4033532 2304985 2092715 -2147290 -3225261 31065 2715476 1761325 -1195381
45658a195381k579197j813521j639941j874052j830859j89480L145580N391283
$$ -1195381 -3774578 -5588099 -7228040 -9102092 -10932951 -11122431 -7976851 -2585568
45650b585568M184135J355614k02862j390254l890687m827891p52196M866195
$$ -2585568 1598567 2954181 2751319 1361065 -2529622 -7357513 -8109709 -3243514
45642c243514N356236J078445j514251l30405Q70257J029955K898591N143709
$$ -3243514 2112722 3191167 1676916 1346511 2216768 3246723 6145314 11289023
45634A1289023K885312k484107l839173o59486k02221l458709j955838O200531
$$ 11289023 14174335 11690228 7851055 7191569 6989348 3530639 1574801 7775332
45626G775332R653215J564718p366451m739554L981282M699909l054774p111353
$$ 7775332 17428547 18993265 11626814 6887260 10868542 15568451 12513677 5402324
45618E402324k601425K747060K816406K50039k113311o037733j0855872j0549676
$$ 5402324 2800899 5547959 8364365 8614404 6501093 463360 -10392512 -20942188
45610b0942188k456030P037498R720039N077161p6344N14895N985166Q694158
$$ -20942188 -23398218 -16360720 -6640681 -1563520 -1639864 -1124969 4860197 13554355
45602A3554355K611385p551826r858993q75883P946622N444741l723465p294451
$$ 13554355 16165740 8613914 -1245079 -2120962 5825660 11270401 7546936 252485
45594B52485l935090k195266l855651j610432N925000R864605N337552j075780
$$ 252485 -3682605 -5877871 -9733522 -11343954 -5418954 4445651 9783203 8707423
45586H707423k957729l044899n026594n661766j849689K285864K458416J576243
$$ 8707423 5749694 2704795 -2321799 -7983565 -9833254 -7547390 -5088974 -3512731
45578c512731L061561L415196p78179m370185r58311N826965P363109L084519
$$ -3512731 -451170 2964026 2185847 -2184338 -3142649 2684316 10047425 13131944
45570A3131944n14219j487671l575110o655331n617546J09354M231480L008056
$$ 13131944 12617725 11130054 7554944 899613 -4717933 -4608579 -377099 2630957
45562B630957Q5340m89340O0192p28449k198371l083682l790455l661431m96787
$$ 2630957 2716297 2226957 2287149 1558700 -639671 -3723353 -7513808 -11175239 -11672026
45553a1672026M603804O568538L611558N79081J330609K411820o65580m913926
$$ -11672026 -7068222 -499684 3111874 3690955 5021564 7433384 6767804 1853878
45545A853878m308201l77968n96995n968364p972816j020208Q248115R263220
$$ 1853878 -2454323 -2832291 -3429286 -9397650 -17370466 -18390674 -10142559 -879339
45537h79339J521757n314278l919079L149330Q399318P519524J584903n223327
$$ -879339 642418 -4671860 -8590939 -5441609 2957709 10477233 12062136 6838809
45529F838809q472470o596707k570034n69009n99520O93814L546432L791608o5119
$$ 6838809 -1633661 -8230368 -10800402 -11369411 -11968931 -11275117 -7728685 -3937077 -4002196
45520d002196l226231j630942J637284J775526L77945J884310M508178K327308
$$ -4002196 -7228427 -8859369 -7222085 -5446559 -5068614 -3184304 1323874 3651182
45512C651182m017085o509425j359977N293867O076984J279876l863523n870103
$$ 3651182 -365903 -6875328 -8235305 -2941438 3135546 4415422 551899 -5318204
45504e318204l868968J616825P212446P915237L202509j496505k242125j518587
$$ -5318204 -9187172 -7570347 -357901 7557336 10759845 9263340 7021215 5502628
45496E502628k679302l976890k276820J154559K989075K711183J291151j266384
$$ 5502628 2823326 -1153564 -3430384 -2275825 713250 3424433 4715584 3449200
45488C449200l122205m5447P220281R922329K271739q662976j1508759n643581
$$ 3449200 326995 281548 7501829 17424158 19695897 11032921 -475838 -6119419
45480f119419L48770K223012K767337K888438M08125k233450M46665O111984N575116
$$ -6119419 -5770649 -3547637 -780300 2108138 2516263 282813 729478 6841462 12416578
45471A2416578k443045p583965l386085K925799K318168k720018m271434j797625
$$ 12416578 9973533 2389568 -996517 1929282 4247450 1527432 -2744002 -4541627
45463d541627m31040r32580K34933L124689L979946J845865k11570j04240J187128
$$ -4541627 -4972667 -5905247 -5670314 -2545625 1434321 3280186 3068616 2964376 4151504
45454D151504J821077N93936k152836l304593O7022M779050L831967k554048n136348
$$ 4151504 5972581 6566517 4413681 1109088 1176110 5955160 9787127 7233079 2096731
45445B096731K26073M608614P8361o016089k206252P248746P809368k012321p844436
$$ 2096731 2322804 6931418 7009779 993690 -1212562 6036184 13845552 11833231 3988795
45436C988795j887378O166346N626511m71120m154162m992030n265123k191437
$$ 3988795 2101417 8267763 13894274 13423154 9268992 4276962 -988161 -3179598
45428c179598N003864P988647N94121q401333n919122N249603R637723J903485
$$ -3179598 1824266 9812913 10407034 2005701 -3913421 1336182 10973905 12877390
45420A2877390o255100m532089K131210L518710r97660m526832l636918m41434
$$ 12877390 6622290 2090201 4221411 7740121 6742461 2215629 -1421289 -1862723
45412a862723K488532L438090P86761l764152m175238J997384P390993L497381
$$ -1862723 625809 4063899 4850660 1086508 -3088730 -1091346 6299647 9797028
45404I797028o020033q864203j634529N000759K372640l290725j328846N931713
$$ 9797028 3776995 -5087208 -6721737 -1720978 651662 -2639063 -3967909 1963804
45396A963804O413814k712527j0009381o398215K396011N624628K669001P67890
$$ 1963804 8377618 5665091 -4344290 -10742505 -8346494 -2721866 -52865 715025
45388G15025K148053K336492k81569k037423j744279k661014m562310j909906
$$ 715025 2863078 5199570 4918001 2880578 1136299 -1524715 -6087025 -7996931
45380g996931N975800J0332663M736807m345632o349896j815233j9723l507673
$$ -7996931 -2021131 8311532 13048339 8702707 2352811 537578 517855 -2989818
45372b989818m922891n21104K729586j602906q066412o224205M318056J2572217
$$ -2989818 -7912709 -8433813 -5704227 -7307133 -15373545 -21597750 -17279694 -4707477
45364d707477R801464m28422p337406n173182J732286N247790K820006o81211
$$ -4707477 5093987 4665565 -2671841 -7845023 -6112737 -864947 1955059 1273848
45356A273848o4005L592890N251542L049646p3200j341027j193255r73957r64194
$$ 1273848 1209843 4802733 10054275 13103921 13030721 11689694 10496439 9522482 8558288
45347H558288j556883l138602l971455j846245J196476L63406l872498m693659
$$ 8558288 7001405 3862803 -108652 -1954897 -758421 -395015 -4267513 -8961172
45339h961172O15293M785016Q73548o206706o252196P28976M511176K58809m768619
$$ -8961172 -8345879 -3560863 -2687315 -8894021 -15146217 -14417241 -9906065 -9647256 -14415875
45330a4415875k992416K592545M282293J106988j481415n41272J377923J541184
$$ -14415875 -17408291 -14815746 -10533453 -9426465 -10907880 -11449152 -10071229 -8530045
45322h530045Q54284J483188L195909L462034P55236k837468l246615N21692M319497
$$ -8530045 -7675761 -6192573 -2996664 465370 1220606 -1616862 -4863477 -4341785 -22288
45313b2288L889130N54414j253548p94671q04901j236613P75923L952567K721147
$$ -22288 3866842 4421256 3167708 2373037 1568136 331523 1107446 5060013 7781160
45304G781160l268810o261894j510286M771337M349580j237034m551698l715132
$$ 7781160 4512350 -1749544 -3259830 1511507 5861087 4624053 72355 -3642777
45296c642777k351858j153740K039770N136663L340380j983103l935324p25645
$$ -3642777 -5994635 -7148375 -5108605 28058 3368438 1385335 -2549989 -3275634
45288c275634J741315k39657k732458j341834K329121M522259M406876K484059
$$ -3275634 -1534319 -1773976 -4506434 -5848268 -3519147 1003112 5409988 7894047
45280G894047j184061m493063l877045K7501K062859K13806j612739p57580L11904
$$ 7894047 6709986 2216923 -1660122 -1632621 430238 644044 -968695 -1726275 -1414371
45271a414371K37893K039737N869562N550448j708667q469633o993767o80956
$$ -1414371 -1176478 863259 6732821 12283269 10574602 2104969 -4888798 -5569754
45263e569754J949372j07363j942217k586304l936597l239321K997537R535414
$$ -5569754 -3620382 -3727745 -5669962 -8256266 -12192863 -15432184 -12434647 -2899233
45255b899233P789863K11573k055270L082262N198569j079788o980461m280127
$$ -2899233 4890630 5102203 3046933 6129195 11327764 10247976 3267515 -1012612
45247a012612J438485Q97926l613210l299009J952846M035348J95157l553541
$$ -1012612 425873 1323799 -2289411 -5588420 -3635574 399774 594931 -2958610
45239b958610k746168O4826J694970L172329N401399N449222R85957m843565o670499
$$ -2958610 -5704778 -5639952 -3944982 -772653 4628746 10077968 11063925 6220360 -450139
45230d50139l475111R78074L469171M307513M598549L045178k151414q704751
$$ -450139 -3925250 -2947176 521995 4829508 9428057 12473235 10321821 1617070
45222A617070j0525208m506832M599997Q756555N557871M4950k149738n77764
$$ 1617070 -8908138 -13414970 -8814973 -58418 5499453 5544403 3394665 2816901
45214B816901J471556J303882j288141m152108l972919M54084N569628O111464
$$ 2816901 4288457 5592339 4304198 152090 -3820829 -3366745 2202883 8314347
45206H314347J448858l656320n078419l227689m13407K281427M317483M919109
$$ 8314347 9763205 6106885 1028466 -2199223 -2612630 -331203 3986280 8905389
45198H905389M110438K078977k204974q052589r809810k742398P595222R656109
$$ 8905389 13015827 15094804 12889830 4837241 -4972569 -7714967 -119745 9536364
45190I536364J796335m572986j885047K624166p4701n355090k918714N504009
$$ 9536364 11332699 6759713 4874666 7498832 7424131 2069041 -849673 4654336
45182D654336Q539022K953277k801360l045220j801225l039511l918877j764890
$$ 4654336 13193358 16146635 13345275 10300055 8498830 5459319 1540442 -224448
45174b24448K23496j026237k821695j521919J727561L791466L958588K562895
$$ -224448 -952 -1027189 -3848884 -5370803 -3643242 148224 4106812 6669707
45166F669707o50589l992448l878606k58523K127072P28678q57588Q72272L343126
$$ 6669707 6019118 2026670 -1851936 -2110459 16613 745291 -112297 759975 4103101
45157D103101K095087k264055n144716l771568Q67181N491596O054525J068033
$$ 4103101 6198188 3934133 -1210583 -4982151 -4114970 1376626 7431151 8499184
45149H499184m795786m653097Q84536L263147j484005n980370k704265M040131
$$ 8499184 3703398 -949699 -65163 3197984 1713979 -4266391 -6970656 -2930525
45141b930525N208343J662366J853288O456075O176396k820344j0971022q413477
$$ -2930525 2277818 3940184 5793472 12249547 18425943 15605599 4634577 -3778900
45133c778900O84078M098923j544112p300895n119978K065331O091148M801937
$$ -3778900 -3094822 1004101 -540011 -7840906 -12960884 -10895553 -4804405 -2468
45125b468K882236L255895L078332l66146m294632m409978j369003R72226J912376
$$ -2468 2879768 6135663 9213995 8847849 4553217 143239 -1225764 -253538 1658838
45116A658838L555788N077441L168320j251580k736350M17165L228801J961640
$$ 1658838 5214626 10292067 13460387 12208807 9472457 9889622 13118423 15080063
45108A5080063n68332j043283j458916m198723o139364l318800K098658N060802
$$ 15080063 14511731 13468448 12009532 7810809 1671445 -1647355 451303 5512105
45100E512105M794474L471565R94341l051033n375377l446416j212420l228082
$$ 5512105 10306579 13778144 14772485 11721452 6346075 2899659 1687239 -1540843
45092a540843n544875q80131Q305830J1166883L853597n124105p245975l900078
$$ -1540843 -7085718 -7965849 339981 11506864 15360461 10236356 2990381 -909697
45084i09697p26864Q96585K290693K723665R15180j904897l679713l855790k529182
$$ -909697 -1636561 -739976 1550717 4274382 5189562 3284665 -395048 -4250838 -6780020
45075f780020j62497J378596J084062J553679M661227N902766L73601o535973
$$ -6780020 -6942517 -5563921 -4479859 -2926180 1735047 7637813 8011414 1475441
45067A475441m415295M945827P421650j908155r505960l946933N706739M206409
$$ 1475441 -2939854 2005973 9427623 7519468 -1986492 -5933425 -226686 3979723
45059C979723n781876q637121n02599O257807L186103l549274n329667k387564
$$ 3979723 -1802153 -10439274 -10941873 -4684066 -1497963 -5047237 -10376904 -12764468
45051a2764468J282698M763377P040972M758542j677482n790505l529198R50227
$$ -12764468 -11481770 -6718393 322579 5081121 3403639 -2386866 -5916064 -4965837
45043d965837J968357o0156j515427j343752L7397L114834O373389N295966j052342
$$ -4965837 -2997480 -3057636 -4573063 -5916815 -5879418 -2764584 3608805 8904771 7852429
45034G852429o147764l779934L134866O503579L555635j613566n248013p302277
$$ 7852429 1704665 -2075269 1059597 7563176 11118811 9505245 4257232 -3045045
45026c045045q068576o463459k689950Q96621K876047M501602P227437R673680
$$ -3045045 -11113621 -17577080 -20267030 -19370409 -16494362 -11992760 -4765323 4908357
45018D908357Q069799L06989r859854j4059877p715690L225915Q108947M508753
$$ 4908357 12978156 13285145 3425291 -10634586 -18350276 -15124361 -7015414 -2506661
45010b506661P6964J32640N78444k606473m361006J145740Q686867Q313849O30883
$$ -2506661 -2429697 -2297057 -1718613 -4325086 -8686092 -7540352 1146515 9460364 10091247
45001A0091247m683268m478663m937649p741731n694855L229531Q822638L452105
$$ 10091247 5407979 929316 -4008333 -11750064 -17444919 -14215388 -5392750 -1940645
44993a940645m974528m423648L353260O881293K805243j584863k173828k967095
$$ -1940645 -6915173 -11338821 -7985561 -1104268 1700975 116112 -2057716 -5024811
44985e024811n644946m509054L583733J1724367J1077631K220703o292741p986412
$$ -5024811 -10669757 -15178811 -11595078 129289 11206920 13427623 7134882 -851530
44977h51530l696229J025692J190025l112634o145605k879702L665316N459692
$$ -851530 -4547759 -3522067 -2332042 -5444676 -11590281 -14469983 -10804667 -5344975
44969e344975Q04754k802375J42872M853720L971790j214010l684227j711723
$$ -5344975 -4540221 -7342596 -7199724 -2346004 1625786 411776 -3272451 -4984174
44961d984174K06338J68119J293689M602604O007678K715568k333568m967192
$$ -4984174 -4777836 -4609717 -3316028 1286576 7294254 10009822 7676254 2709062
44953B709062m704981k758909Q92096N076136N347707j123803r705612j1550086
$$ 2709062 -1995919 -4754828 -3862732 1213404 6561111 5437308 -4268304 -15818390
44945a5818390l612791O957164R868029K479001p314671r251689j516966P520152
$$ -15818390 -19431181 -12474017 -2605988 -126987 -7441658 -16693347 -18210313 -10690161
44937a0690161Q858742K649744l410339m171531k094641j807655l231568k630015
$$ -10690161 -1831419 818325 -2592014 -6763545 -8858186 -10665841 -13897409 -16527424
44929a6527424J355884N525107N890741K118207k058074k483417J042992M106124
$$ -16527424 -15171540 -9646433 -3755692 -1637485 -3695559 -6178976 -5135984 -1029860
44921a029860K364897l096154o632860m713025L6640K569607J620162K74253J036993
$$ -1029860 1335037 -1761117 -8393977 -13107002 -13070362 -10500755 -8880593 -8606340 -7569347
44912g569347K536339J913622q65921k810931k092922n50946m38536k62290K832235
$$ -7569347 -5033008 -3119386 -3985307 -6796238 -8889160 -9440106 -9878642 -10140932 -7308697
44903g308697O891839O096854k68684m725943j590595M148819L872531j737459
$$ -7308697 -416858 5679996 5411312 685369 -905226 3243593 7116124 5378665
44895E378665m317556j296242P26437k477630o029380m511410n07455N00859j203957
$$ 5378665 1061109 -235133 491304 -1986326 -8015706 -12527116 -13034571 -12533712 -13737669
44886a3737669j335398J456542N126576P807162P699362K564753o107440j1228950
$$ -13737669 -15073067 -13616525 -8489949 -682787 7016575 9581328 3473888 -7755062
44878g755062p343884K120504R057389J0091089P640670M057690j25137l479337
$$ -7755062 -15098946 -12978442 -3921053 6170036 13810706 17868396 17743259 14263922
44870A4263922m251574l286901k651412k240440j043121n3828k80643K7436K081430
$$ 14263922 10012348 6725447 4074035 1833595 790474 736646 456003 483439 2564869
44861B564869K882861m24575m933802o031803m728676m834785m947335n30733
$$ 2564869 5447730 5023155 89353 -5942450 -10671126 -15505911 -20453246 -20983979
44853b0983979O890597J0209411O857729J565979j649039l400199l879571j075935
$$ -20983979 -14093382 -3883971 2973758 4539737 2890698 -509501 -4389072 -5465007
44845e465007L865833N883574L004956j274827m107162n918684n773069j126576
$$ -5465007 -1599174 4284400 7289356 6014529 1907367 -4011317 -9784386 -10910962
44837a0910962N609563P463343K936852j225856o33001O01646j532242l592676
$$ -10910962 -5301399 2161944 5098796 3872940 3239939 3841585 2309343 -1283333
44829a283333j636498R97501m47494l570831k878569J433922M965043N993604
$$ -1283333 -2919831 -1922330 -2369824 -5940655 -8819224 -7385302 -2420259 3573345
44821C573345N191483J912361l403192o284347l602393P74349J250493j188981
$$ 3573345 8764828 10677189 7273997 989650 -2612743 -1838394 -587901 -1776882
44813a776882j408216J674049M756154N722986M403650K37995n687911q822905
$$ -1776882 -3185098 -1511049 3245105 8968091 13371741 13609736 7921825 -901080
44805i01080o454343k241144p51573q63425M28713J927281J878174K917629O286617
$$ -901080 -7355423 -9596567 -10348140 -11211565 -10782852 -8855571 -6977397 -4059768 2226849
44796B226849O199069j247681q290183n195607L853282O465292J363090j219426
$$ 2226849 8425918 7178237 -1111946 -6307553 -2454271 4011021 5374111 4154685
44788D154685J975064K796407j824887l513034J878532N555010P55152n041168
$$ 4154685 6129749 8926156 7101269 3588235 5466767 11021777 11776929 6735761
44780F735761k713785L053222K230354l436543m058283J183610K746508l137424
$$ 6735761 4021976 7075198 9305552 5869009 1810726 2994336 5740844 2603420
44772B603420p571939j729752J0330564J6133919R309376l656818j0996830q469909
$$ 2603420 -4968519 -6698271 3632293 19766212 29075588 25418770 14421940 5952031
44764E952031k932114k271142m730147k851757L638605O414259J544749m017557
$$ 5952031 3019917 748775 -3981372 -6833129 -3194524 3219735 4764484 746927
44756G46927l302743L16936j3076k888295j660475L790774O337018K267694l790015
$$ 746927 -2555816 -2238880 -2251956 -5140251 -6800726 -3009952 3327066 5594760 1804745
44747A804745n476471j734493L475320N328011J920760l670166n762434k481021
$$ 1804745 -3671726 -5406219 -1930899 3397112 5317872 1647706 -4114728 -6595749
44739f595749J777574K305795p9789j877459k333167k112039K50715N266003Q154205
$$ -6595749 -4818175 -2512380 -2592169 -4469628 -6802795 -8914834 -8664119 -3398116 4756089
44730D756089L899260l993034o122156L99250P694865P454639J030290l919079
$$ 4756089 8655349 4662315 -1459841 -1060591 6634274 14088913 15119203 11200124
44722A1200124l792634k129703l118984n625778n414590j707324J424865J002739
$$ 11200124 7407490 5277787 2158803 -3466975 -8881565 -10588889 -9164024 -8161285
44714h161285m30763Q90237L436579K607068j426287l449629j337422J084735
$$ -8161285 -8592048 -7701811 -4265232 -1658164 -3084451 -6534080 -7871502 -6786767
44706f786767R00545K15712Q91448P79884j218429j531828K286271O525126O511227
$$ -6786767 -5886222 -5670510 -4779062 -3999178 -5217607 -6749435 -4463164 2061962 8573189
44697H573189K925949j104682m817518p239644m677121L431486J0101352Q443104
$$ 8573189 11499138 10394456 5576938 -1662706 -6339827 -2908341 7193011 15636115
44689A5636115R37371m333681l962144q51023J229558L3923m557504p987634l949889
$$ 15636115 16573486 12239805 8277661 7426638 8656196 8690119 4132615 -3855019 -7804908
44680g804908N468064R051617K011989n322248k718705L990884L210565l245194
$$ -7804908 -2336844 6714773 8726762 3404514 685809 4676693 7887258 4642064
44672D642064m797549p38997P68932q40395J062006M732646J442709o758613p432524
$$ 4642064 -155485 -894482 -125550 -965945 96061 4828707 6271416 -487197 -7919721
44663g919721J196725O021981N00732n698842m596163j735936k410586j312139
$$ -7919721 -6722996 -701015 -200283 -5899125 -10495288 -12231224 -14641810 -15953949
44655a5953949M453960O278799p87607o608932j981551N492261M717676k98702
$$ -15953949 -11499989 -5221190 -6008797 -12617729 -14599280 -9107019 -4389343 -4688045
44647d688045L44214L767234P57217n796142n302243J740891N104987K752800
$$ -4688045 -4343831 -576597 180620 -5615522 -10917765 -9176874 -4071887 -1319087
44639a319087K346169N527997N163104n09395m024332j612849J070013p96296
$$ -1319087 1027082 6555079 11718183 11208788 7184456 5571607 6641620 5845324
44631E845324m390728n528622m083319j008053L389621O812220O412129L212376
$$ 5845324 1454596 -4074026 -8157345 -9165398 -5775777 1036443 7448572 10660948
44623A0660948P2656l115751o571662o352901n01209M229134J070389m667678
$$ 10660948 10733604 7617853 1046191 -5306710 -5807919 -1578785 -508396 -5176074
44615e176074k965436M155268N628466j88861l631740j048292Q7746l520626m308428
$$ -5176074 -8141510 -3986242 1642224 1453363 -2178377 -3226669 -3138923 -6659549 -10967977
44606a0967977J992546P570811M928504j724583m501854l073396j274712L55190
$$ -10967977 -8975431 -1404620 3523884 1799301 -2702553 -5775949 -7050661 -6695471
44598f695471K456164L301629K418417K181297K401039j16636m045817l809509
$$ -6695471 -4239307 -937678 1480739 3662036 6063075 5946439 1900622 -1908887
44590a908887k57566j287173p677697r181635q31232P825731P649315L435360
$$ -1908887 -2166453 -3453626 -11131323 -20312958 -21144190 -13318459 -5669144 -2233784
44582b233784L008662L024959k471728p833430l866703N521983Q525462L846901
$$ -2233784 774878 3799837 1328109 -6505321 -10372024 -4850041 3675421 7522322
44574G522322O16435J919401J666615k201325m059075j910599j032361l399040
$$ 7522322 8138757 10058158 11724773 9523448 5464373 3553774 2521413 -877627
44566h77627l578384Q74363L717967k44198o448717o878518o53488O046398P624325
$$ -877627 -4456011 -3581648 136319 -107879 -6556596 -13435114 -14088602 -8042204 -417879
44557d17879L444737l047787p125369o247288k154646J355924K487592K005926
$$ -417879 3026858 -20929 -7146298 -13393586 -15548232 -14192308 -11704716 -9698790
44549i698790J130436R96231K620490N015030N276917K950987J438634K127796
$$ -9698790 -8568354 -7572123 -4951633 63397 5340314 8291301 9729935 11857731
44541A1857731J024129m401832r154118p453565k046108J59799j097875q70724
$$ 11857731 12881860 8480028 -674090 -8127655 -10173763 -10013964 -11111839 -11982563
44533a1982563Q10940p07220m358889k867585N134952J0794627O832955k395269
$$ -11982563 -11171623 -11878843 -16237732 -19105317 -13970365 -3175738 3657217 1261948
44525A261948o878612k982579L966311O569218K531673l603049n423092k321710
$$ 1261948 -5616664 -8599243 -4632932 1936286 4467959 864910 -4558182 -6879892
44517f879892p9498j687706k084158K902423P407836L745831l851294m480948
$$ -6879892 -6959390 -8647096 -10731254 -7828831 -420995 3324836 -526458 -5007406
44509e007406J714029L199910l957921r025220l228414P229259J1296530P608711
$$ -5007406 -3293377 -93467 -4051388 -13076608 -16305022 -9075763 2220767 9829478
44501I829478J940328k641947n787544n806962k694138o89096j779940j279693
$$ 9829478 11769806 9127859 3340315 -2466647 -5160785 -5849881 -7629821 -8909514
44493h909514M216433R371411P286183L9309m753578m607062k860864j593905
$$ -8909514 -4693081 4678330 11964513 12003822 7250244 2643182 -217682 -1811587
44485a811587k65988P61479J037170K177461M345510L769143j007820m437562
$$ -1811587 -2077575 -1316096 -278926 1898535 6244045 10013188 9005368 4567806
44477D567806j955176J507068j052083o241334m804045L031347O965572K038164
$$ 4567806 2612630 4119698 3067615 -3173719 -7977764 -4946417 2019155 4057319
44469D057319n030454p135333n563606l938766j370081L299409O519986M882493
$$ 4057319 -973135 -8108468 -13672074 -17610840 -18980921 -15681512 -9161526 -4279033
44461d279033Q35248j260281j431868j979085k036751Q19034N138520O340899
$$ -4279033 -3443785 -4704066 -6135934 -8115019 -10151770 -9332736 -4194216 2146683
44453B146683K712809k463261m784744k705262J872265N187440M456920P52415
$$ 2146683 4859492 2396231 -2388513 -5093775 -3221510 1965930 6422850 7175265
44445G175265j686460m59702J792669J056501k274889l813445j139903L124730
$$ 7175265 5488805 5029103 6821772 7878273 5603384 1789939 650036 3774766
44437C774766M758518K518609j463497m208318l925352j105999J296323L83353
$$ 3774766 8533284 11051893 9588396 5380078 1454726 348727 1645050 2028403
44429B028403k530935k205609L563594R022965O551557k728462r180228o630305
$$ 2028403 -502532 -2708141 855453 9878418 16429975 13701513 4521285 -2109020
44421b109020O11730M909775M543984K205745q78729l954980l722199J227237
$$ -2109020 -1497290 3412485 7956469 10162214 9283485 5328505 1606306 2833543
44413B833543N567673L591621j727797l337855j740048l161676p117084o356280
$$ 2833543 8401216 11992837 10265040 6927185 5187137 2025461 -5091623 -11447903
44405a1447903m45977J871440k432843m585288J146012O991753M475186j298470
$$ -11447903 -11893880 -10022440 -12455283 -17040571 -15894559 -8902806 -4427620 -5726090
44397e726090n07276M968621N560931M08268k061273J221126L505662l14908o260812
$$ -5726090 -6233366 -1264745 4296186 4704454 2643181 3864307 7369969 7055061 794249
44388G94249p630022l083857L309816O295392L528266j547506k365833K357882
$$ 794249 -6835773 -9919630 -6609814 -314422 3213844 1666338 -699495 1658387
44380A658387O043475L652237q51716j502572K63838j82338j890413j442554l76914
$$ 1658387 7701862 11354099 10502383 8999811 9263649 9081311 7190898 5748344 5371430
44371E371430j214494o33020M203769P316931K573196m026308l120265J241868
$$ 5371430 4156936 3523916 7727685 15044616 17617812 13591504 10471239 11713107
44363A1713107j684429q809978o655647M673215R505204K085080m453585j202534
$$ 11713107 10028678 1218700 -5436947 -763732 8741472 10826552 6372967 5170433
44355E170433K346919k863161q657402m489801L938225M886159n72800l487196
$$ 5170433 7517352 4654191 -4003211 -8493012 -4554787 331372 -241428 -3728624
44347c728624k665500k274879q43082M351086P760905L074268m706611o558835
$$ -3728624 -6394124 -8669003 -9512085 -5160999 2599906 5674174 967563 -5591272
44339e591272l751959k963916k682832K085115O379873J640749p324633p367437
$$ -5591272 -9343231 -12307147 -14989979 -12904864 -6524991 -4884242 -12208875 -19576312
44331a9576312J735597O628904K134171j784104J768953N941562L340138k404146
$$ -19576312 -17840715 -11211811 -9077640 -10861744 -9092791 -3151229 188909 -2215237
44323b215237m800900l997437j905803K758390Q252516P517095q82596p344426
$$ -2215237 -7016137 -11013574 -12919377 -10160987 -1908471 5608624 4726028 -2618398
44315b618398m112877L217527M630772J26995k879020j842883j71987J010012
$$ -2618398 -6731275 -3513748 1117024 1244019 -1635001 -3477884 -3649871 -2639859
44307b639859L627483O088646L693070l271111p734988m512206K782296N928464
$$ -2639859 987624 7076270 10769340 7498229 -236759 -4748965 -1966669 3961795
44299C961795J734558m477451n329418l74277L271841J68455o084273p652379
$$ 3961795 5696353 1218902 -4110516 -4484793 -1212952 -1044497 -7128770 -14781149
44291a4781149k741390L092874M868046K680857j278217m926184n126797J42817
$$ -14781149 -17522539 -14429665 -9561619 -6880762 -8158979 -13085163 -18211960 -18069143
44283a8069143P208981R451866O035426K682398K399361J543592k430805n678084
$$ -18069143 -10860162 -1408296 4627130 7309528 9708889 11252481 8821676 3143592
44275C143592m375566j036777J12386m36635k47457n1539j210884j569197J075737
$$ 3143592 -1231974 -2268751 -2156365 -2593000 -2840457 -2891996 -4102880 -5672077 -4596340
44266d596340M124560L791242J333604P80222K167820J926163r44345l585795
$$ -4596340 -471780 3319462 4653066 5433288 7601108 9527271 8582926 4997131
44258D997131l985445l299119l216662l519884k468198J466423P249657J0202069
$$ 4997131 1011686 -2287433 -5504095 -9023979 -11492177 -10025754 -2776097 7425972
44250G425972O057848k520133p070768l492824K576138L868661J192403L31467
$$ 7425972 13483820 10963687 3892919 400095 2976233 6844894 8037297 8368764
44242H368764K282116K557700p83197m099088l802807p87882J842425K465587
$$ 8368764 10650880 13208580 12425383 8326295 4523488 3735606 5578031 8043618
44234H043618J507584M45766O17000J548455R99334j794892m153910l404525j042555
$$ 8043618 9551202 9996968 10613968 12162423 13161757 11366865 7212955 3808430 2765875
44225B765875o81816k613644l458045j368977J133558O92996j950813k139530
$$ 2765875 2084059 -529585 -3987630 -5356607 -4223049 -3530053 -5480866 -7620396
44217g620396K991402R556683R875806J906847o773871p908318l264158j022956
$$ -7620396 -4628994 4927689 14803495 16710342 9936471 2028153 -1236005 -2258961
44209b258961k943704k786018J723518M255729Q84962k729318j059642J808939
$$ -2258961 -5202665 -7988683 -6265165 -2009436 -1124474 -3853792 -4913434 -3104495
44201c104495j32707l909033l082854O17585P66690j944759j384962K318035K971785
$$ -3104495 -3237202 -7146235 -10229089 -9611504 -8844814 -10789573 -12174535 -9856500 -6884715
44192f884715k5620l37359L624633N175952M46395n202250n596737j934039J163624
$$ -6884715 -6910335 -7247694 -3623061 1552891 1999286 -3202964 -8799701 -10733740 -9570116
44183i570116K158274J722070K12220r88133M2034J690412j58027n027063o883060
$$ -9570116 -7411842 -5689772 -5477552 -6465685 -6423651 -4733239 -4891266 -9918329 -16801389
44174a6801389k684765L120170N342436M472977L543374L273225L384799M376384
$$ -16801389 -19486154 -16365984 -11023548 -6550571 -3007197 266028 3650827 8027211
44166H027211N020002K342370l074834o158843m571296k299593k939777m163067
$$ 8027211 13047213 15389583 12314749 6155906 1584610 -714983 -3654760 -7817827
44158g817827k556265N14101J913763J669665J090867j76627j688078r83404J661466
$$ -7817827 -10374092 -9859991 -7946228 -6276563 -5185696 -5362323 -7050401 -8033805 -6372339
44149f372339K020713p77773j414920K289816L620702k449610q792615n495049
$$ -6372339 -4351626 -5129399 -6544319 -4254503 -633801 -3083411 -11876026 -17371075
44141a7371075M235492Q051161K881714j469812J623530O125829L874337l299112
$$ -17371075 -13135583 -5084422 -2202708 -3672520 -2048990 4076839 7951176 4652064
44133D652064p421663n332947n67868K851710M147787M472632M681162M169657
$$ 4652064 -2769599 -8102546 -8670414 -5818704 -1670917 2801715 7482877 11652534
44125A1652534J298113l904504p817832o602233j733414Q94041j477226m569615
$$ 11652534 12950647 9046143 1228311 -5373922 -7107336 -6213295 -7690521 -12260136
44117a2260136k651938L758089Q107539N684025k71052j906007L279166P972425
$$ -12260136 -14912074 -11153985 -3046446 2637579 2366527 460520 3739686 11712111
44109A1712111L807605o446660j0917879m284447M742070N528463n70423m393030
$$ 11712111 15519716 9073056 -1844823 -6129270 -1387200 4141263 3570840 -822190
44101h22190k542112O20472J666853R95224j313231m787562m876477J885128R627206
$$ -822190 -3364302 -2743830 -1076977 -81753 -1394984 -6182546 -11059023 -9173895 453311
44092D53311Q910911J016301l133624J89841K321606k363554o402271j475017
$$ 453311 9364222 10380523 7246899 7436740 9758346 7394792 992521 -482496
44084d82496P755519J0437598M541847k920265o729457p164763n693158l518702
$$ -482496 7273023 17710621 22252468 19332203 12602746 5437983 -255175 -3773877
44076c773877k640030l382302k927272K8780K566692K979152L975767O165202
$$ -3773877 -6413907 -9796209 -12723481 -12694701 -10128009 -7148857 -3173090 2992112
44068B992112M548278k452237p095835l463001J841606M2936m415367j057820
$$ 2992112 7540390 5088153 -2007682 -5470683 -3629077 -3586141 -8001508 -9059328
44060i059328P918281J0231451L738490p47572J384770J461067n567034j1037539
$$ -9059328 -1141047 9090404 12828894 12081322 13466092 14927159 9360125 -1677414
44052a677414p154146o4257Q73047k354735k313231R03524K576086L270178N805090
$$ -1677414 -8831560 -8895817 -8022770 -10377505 -12690736 -11787212 -9211126 -5940948 -135858
44043a35858P038151K812415k415838j131130M296579M412162k397145p602368
$$ -135858 6902293 9714708 7298870 6167740 10464319 14876481 12479336 4876968
44035D876968n733863p99711K150683L546589M522186K794876k545451o948139
$$ 4876968 -856895 -1656606 494077 4040666 8562852 11357728 8812277 1864138
44027A864138n173278K147500Q934070R349918K995173l956557m164073K093908
$$ 1864138 -3309140 -1161640 7772430 17122348 20117521 16160964 11996891 14090799
44019A4090799O142877K154030m633867n916335k248881J48184N88004K687697
$$ 14090799 20233676 22387706 17753839 11837504 9588623 9736807 10324811 13012508
44011A3012508M579634J144829m786357m908274K92807J772690j800745j260564
$$ 13012508 17592142 18736971 13950614 9042340 9335147 11107837 9307092 8046528
44003H046528N610254P904446M6699o887637k350676O620829P382158J369370
$$ 8046528 13656782 21561228 21607927 14720290 12369614 18990443 26372601 27741971
43995B7741971j041698K024338M925783P247254J2441658J8502160K2902142L1585569
$$ 27741971 26700273 28724611 33650394 40897648 53339306 71841466 94743608 126329177
43987A26329177M8097312N8106574M2770925P448651k0504518k5468462j8985022
$$ 126329177 174426489 232533063 275303988 282752639 262248121 236779659 217794637
43980B17794637j7617950k1963045k4715670k4601532k2659775j6436991p368610
$$ 217794637 200176687 178213642 153497972 128896440 106236665 89799674 82431064
43973H2431064l944952q762812j2054852o745039p6262r03599n449871o402282
$$ 82431064 78486112 69723300 57668448 50923409 50847147 49943548 44493677 38091395
43965C8091395o380383r917276j1049329l266680N552297L940903l039308j612997
$$ 38091395 31711012 21793736 10744407 7477727 13030024 16970927 13931619 12318622
43957A2318622O337795N520802o255594j3136261o723735J607498J136071j786745
$$ 12318622 18656417 24177219 17921625 4785364 -1938371 -330873 805198 -981547
43949i81547K104711Q112474P255717K554022K384676M707821J297425o561401
$$ -981547 1123164 9235638 16491355 19045377 21430053 26137874 27435299 20873898
43941B0873898r528935n580719j960458j729032K46391N571940P016812J6845
$$ 20873898 11344963 5764244 3803786 2074754 2321145 7893085 14909897 14926742
43933A4926742q243178p853663K20005O064794M235971q45539k912688j788440
$$ 14926742 6683564 -1170099 -950094 5114700 9350671 8505132 5592444 3804004
43925C804004r73564j191731m33452J093112P12800j391276j080835L142095O433644
$$ 3804004 2830440 1638709 1205257 2298369 3011169 1619893 539058 3681153 10114797
43916A0114797M337836q8369j001522Q88852K25773k937691k750723J813118L994361
$$ 10114797 14452633 14364264 13362742 14251594 14477367 11539676 8788953 10602071 14596432
43907A4596432J08189l971182k087391K616006L432264N53527q82914L76986J779869
$$ 14596432 14704621 10733439 8646048 11262054 14694318 15247845 14364931 14741917 16521786
43898A6521786L351298O847683R886541Q007598K415780o80673J493734O627271
$$ 16521786 19873084 26720767 36607308 44614906 47030686 46350013 47843747 54471018
43890E4471018J3812324K4097727L3081878L1096778J5370636l714011j3667849
$$ 54471018 68283342 92381069 125462947 156559725 171930361 168216350 154548501
43883A54548501j3328224j0645180j0725981j1829561j1436689j0418038j0527934
$$ 154548501 141220277 130575097 119849116 108019555 96582866 86164828 75636894
43876G5636894j1638873j2546477j2284584j0254702o831436l829026k726235
$$ 75636894 63998021 51451544 39166960 28912258 22080822 18251796 15525561
43869A5525561k593263j290161J544524M056692M318762J810413k309703n133319
$$ 15525561 12932298 11642137 13186661 17243353 21562115 23372528 21062825 15929506
43861A5929506l703489J152154M189418J774371k700470l067831O74275K374674
$$ 15929506 12226017 13378171 17567589 19341960 16641490 13573659 14247934 16622608
43853A6622608p06747l686161k068750R51470q4453l636867l482758R75844L280436
$$ 16622608 15915861 12229700 10160950 11112420 11027967 7391100 3908342 4884186 8164622
43844H164622k08167m943557n347037k313391K47537K174655N183834P050555
$$ 8164622 7956455 3012898 -2334139 -4647530 -4399993 -2225338 2958496 10009051
43836A0009051L997579j775617l425489L52706K532837j707010o952552n202682
$$ 10009051 14006630 12231013 8805524 9158230 11691067 9984057 3031505 -2171177
43828b171177J971103N485767K034644j525814J082551O256174O095536l40009
$$ -2171177 -200074 5285693 7320337 5794523 6877074 13133248 19228784 18888775
43820A8888775o442432p285737m452206j461540Q01780K173459P83498l781736
$$ 18888775 12446343 5160606 708400 -753140 48640 2222099 3005597 -776139
43812g76139p028484l524221N574811J2199032R785400L36085p738275p686495
$$ -776139 -7804623 -11328844 -5754033 6444999 16230399 16566484 8828209 1141714
43804A141714j56206P643126Q240083R22357p146998q251733k582883K591075
$$ 1141714 985508 8628634 16868717 17791074 10644076 2392343 -190540 2400535
43796B400535K241225r32652j535613J151534L552031L529184K454871K041570
$$ 2400535 4641760 3709108 2173495 3325029 6877060 10406244 12861115 14902685
43788A4902685J788094J03851l235247o024670n110982q9505M631333L937793
$$ 14902685 16690779 16794630 13559383 7534713 2423731 2334226 6965559 10903352
43780A0903352j270442m702749l239449p41638r03016j231657J340841L503010
$$ 10903352 9632910 4930161 1690712 949074 46058 -1185599 155242 3658252
43772C658252Q04202l522969k992103P07009j58599n685289o715384L56159O812622
$$ 3658252 4462454 939485 -2052618 -1345609 -1504208 -7189497 -13904881 -13548722 -6736100
43763f736100N024460K87773J735167P618577Q574626K186693m588530o561600
$$ -6736100 -1711640 -1423867 311300 7929877 16504503 18691196 14102666 7541066
43755G541066n973765o361988p316878o939727m465692R71077R500007J6769017
$$ 7541066 1567301 -4794687 -12111565 -19051292 -23516984 -22545907 -13045900 3723117
43747C723117J5737368N281237o253807r638028n184251j290374l268719p212740
$$ 3723117 19460485 24741722 18487915 8849887 3665636 2375262 -893457 -8106197
43739h106197o329532n80714L569281K654379R24783K936531N497874K632565
$$ -8106197 -14435729 -15016443 -11447162 -8792783 -7868000 -4931469 566405 3198970
43731C198970l469071m082126K505399P083864K991383l802541m280304r1729
$$ 3198970 -270101 -4352227 -1846828 5237036 8228419 4425878 145574 53845
43723E3845N63435k978239l422093J562452N269258K758280j927761k768862j81364
$$ 53845 617280 -2360959 -5783052 -4220600 1048658 3806938 1879177 -889685 -1071049
43714a071049J503276P83904o81209j663747j815260l00012L200691O991400Q549892
$$ -1071049 432227 1216131 534922 -1128825 -2944085 -3244097 -43406 6947994 15497886
43705A5497886O591030J603555m145569o975254m385557J878632O988413P708630
$$ 15497886 22088916 23692471 19546902 12571648 8186091 10064723 17053136 24761766
43697B4761766M608978J84455l042215l197590p56131O55423j846431n916099
$$ 24761766 29370744 29555199 26512984 23315394 22559263 23214686 21368255 15452156
43689A5452156o707116l899087k048389l518178n289331m041456n23166K705638
$$ 15452156 8745040 4845953 2797564 -720614 -6009945 -10051401 -10574567 -7868929
43681g868929M350838L662327K29319l653994l814617N20495N169718O361227
$$ -7868929 -3518091 144236 373555 -3280439 -7095056 -6574561 -1404843 4956384
43673D956384M575508J740026j463880l600519k222474J474576K021069k560442
$$ 4956384 9531892 11271918 9808038 6207519 3985045 5459621 7480690 4920248
43665D920248o340685l484303K697826M292062K22872k976021j267778K009414
$$ 4920248 -1420437 -4904740 -2206914 2085148 2308020 -668001 -1935779 73635
43657G3635K462758O99179m09169q70801k735315n761613o894465m155875P36413
$$ 73635 2536393 3235572 2826403 1955602 -779713 -6541326 -13435791 -17591666 -16855253
43648a6855253M507573O272570P801650R386454P517204n54133j0604349j3782890
$$ -16855253 -12347680 -6075110 1726540 11112994 18630198 18076065 7471716 -6311174
43640f311174o881990K893248O326799L228151J323726M842627Q613675N593390
$$ -6311174 -13193164 -10299916 -3973117 -744966 578760 5421387 14035062 19628452
43632A9628452k576679o627731j777377N000543L451875n867926j1454892o122988
$$ 19628452 17051773 10424042 8646665 13647208 17099083 11231157 -223735 -6346723
43624f346723L344541N990016J327389k259020p81950J521418J046678k65071
$$ -6346723 -3002182 2987834 4315223 2056203 1274253 2795671 3842349 3577278
43616C577278j43892N63219J337471K830672K977395j217136o698534o572650
$$ 3577278 3433386 3996605 5334076 8164748 11142143 9925007 3226473 -3346177
43608c346177j090968J919337R4018K01791M645895N468506j087384n365689Q373
$$ -3346177 -4437145 -2517808 -2423790 -2221999 2423896 7892402 6805018 1439329 1447702
43599A447702N592556r5718r547261o738376N962146R967808l67277r349182n309497
$$ 1447702 7040258 6944540 -2602721 -9341097 -3378951 6588857 6221580 -3127602 -8437099
43590h437099K743959K510204j939063P0302O504905O820129K64620l214594O27483
$$ -8437099 -5693140 -3182936 -5121999 -5051697 1453208 8273337 8537957 5323363 5950846
43581E950846M305367J156177m574867m563339J568811N985761L121131l428440
$$ 5950846 10256213 11412390 6837523 2274184 3842995 9828756 12949887 9521447
43573I521447n870338k083860K488846K925104Q64226N873m39898k894255m889111
$$ 9521447 3651109 1567249 4056095 6981199 7845425 7851298 7411400 4517145 -371966
43564c71966k095539L139767L638177j431977m476846q94125M101982L610760
$$ -371966 -2467505 672262 4310439 2878462 -1598384 -2492509 1609473 5220233
43556E220233j523549n407000m871781q80303M023676O317289L170391l271407
$$ 5220233 3696684 -1710316 -6582097 -7462400 -3438724 2878565 6048956 2777549
43548B777549o545503l498939K097252N560685O539148N867487K418416l199432
$$ 2777549 -3767954 -7266893 -5169641 391044 6930192 12797679 15216095 12016663
43540A2016663o486791m814238j429327l3261L21099J144976L69541k887546m270221
$$ 12016663 5529872 715634 -713693 -746954 -425855 719121 1088662 -1798884 -6069105
43531f069105n81380M003066M071000J348830O13930J116390p15226l132140j408131
$$ -6069105 -6650485 -2647419 1423581 2772411 3386341 4502731 3787505 655365 -752766
43522g52766L618717O704964O295793M464410R52101m741348p344123j401541
$$ -752766 2865951 9570915 15866708 20331118 21283219 16541871 9197748 7796207
43514G796207P717104Q627873P28790m438160j286185J527275l559718r835307
$$ 7796207 15513311 24141184 24869974 20431814 19145629 20672904 17113186 7277879
43506G277879p357101M01265J853621m306292p028419K38210R788403J0459604
$$ 7277879 -79222 322043 2175664 -2130628 -9159047 -8920837 867566 11327170
43498A1327170K326502m450557l161033J972952K890719j111247l130640O84153
$$ 11327170 13653672 9203115 6042082 8015034 10905753 9794506 6663866 7348019
43490G348019N173062M150892K75613P26316M867292M208454l982456j0906549
$$ 7348019 12521081 16671973 16947586 17673902 22541194 26749648 22767192 11860643
43482A1860643q215136M71801N458900L671985n41852l706038n652250n773923
$$ 11860643 3645507 4117308 9576208 13248193 12706341 9000303 3348053 -2425870
43474b425870l457940j344651k067225k530129J875923P590696N592442m013548
$$ -2425870 -5883810 -7228461 -9295686 -11825815 -9949892 -2359196 3233246 -780302
43466g80302q609116J17070J2563235J2539425j145717j3248746j2093594k659382
$$ -780302 -9389418 -9272348 3290887 15830312 14684595 1435849 -10657745 -13317127
43458a3317127L020445J542553j028651K31774L887550O414953O518498M526518
$$ -13317127 -10296682 -8754129 -9782780 -9551006 -5663456 751497 7269995 11796513
43450A1796513J040402k716639n351215o547683o226511l134739L098469R084591
$$ 11796513 12836915 10120276 4769061 -1778622 -8005133 -11139872 -8041403 1043188
43442A043188J0320021O872487K909465L22723k856077o746865p515337l612720
$$ 1043188 11363209 18235696 21145161 21467884 18611807 11864942 4349605 736885
43434G36885N94671J030323m61010p67456j437320m536333o430565k616872L632641
$$ 736885 1331556 2361879 1900869 1133413 -303907 -4840240 -11270805 -13887677 -10255036
43425a0255036M991648J378073l19978K091157L051816l77759l370339k142278
$$ -10255036 -5263388 -3885315 -4205293 -2114136 937680 559921 -2810418 -4952696
43417d952696l24392j421887j585143L330285Q441131N538379m172800j0564052
$$ -4952696 -5277088 -6698975 -8284118 -4953833 3487298 9025677 4852877 -5711175
43409e711175p602011K79265N415579N292568K395690j19125p21932N2950L83304
$$ -5711175 -13313186 -13033921 -7618342 -2325774 69916 -49209 -771141 -718191 -334887
43400c34887j71164N20997L350314M577703N24338n106497m313448L463516Q535682
$$ -334887 -506051 14946 3365260 7942963 8467301 3360804 -952644 2510872 11046554
43391A1046554L550229n743323p633448K27958Q532198Q765073K196065m710428
$$ 11046554 14596783 8853460 1220012 1447970 9980168 18745241 20941306 16230878
43383A6230878q477745r163374o874911k270249J462182J559537p1537N11543
$$ 16230878 7753133 -1410241 -8285152 -10555401 -9093219 -7533682 -7605219 -7093676
43375g093676K861282K742196m80634j945533J386068O000841P169756M936818
$$ -7093676 -4232394 -1490198 -1970832 -3916365 -2530297 3470544 10640300 15577118
43367A5577118J482748l177381q141347q290379p51914P502671O202034m007244
$$ 15577118 17059866 13882485 5741138 -2549241 -3301155 4201516 10403550 6396306
43359F396306j1145181p226802K584026Q500208P501892K805938k267993n244495
$$ 6396306 -4748875 -11975677 -9391651 -891443 6610449 9416387 7148394 1903899
43351A903899l708379J421893M846969L400476P04514J157445K518155k78514
$$ 1903899 -1804480 -382587 4464382 7864858 8569372 9726817 12244972 11966458
43343A1966458o224465q937707n509320L86970M202824N098816M507560L506660
$$ 11966458 5741993 -3195714 -8705034 -8318064 -4115240 983576 5491136 8997796
43335H997796K129053n73032m937402p883269m808085K922795O621830J423063
$$ 8997796 11126849 10553817 5616415 -2266854 -7074939 -4152144 2469686 3892749
43327C892749n321562l897114K781748L346314m033329q625822m001602K783527
$$ 3892749 -1428813 -5325927 -2544179 802135 -3231194 -11857016 -15858618 -13075091
43319a3075091L530103P96229P04229K054642J065086M63260M068555O906861
$$ -13075091 -9544988 -8748759 -8044530 -5989888 -4924802 -4461542 -392987 6513874
43311F513874J611122p592405q737664k90773N795162K111391l668278j929735
$$ 6513874 8124996 532591 -8205073 -8495846 -2700684 -589293 -4257571 -6187306
43303f187306L997209M155545k471157p419225n329015N02065M434070M228466
$$ -6187306 -2190097 1965448 -505709 -7924934 -13253949 -12751884 -8317814 -4089348
43295d089348P50082k773984j538831N525341J1483162Q211450k115716q574181
$$ -4089348 -3339266 -6113250 -7652081 -2126740 9356422 17567872 15452156 6877975
43287F877975n841564l06380Q65475l78225Q70348K742195N81301l203488j891066
$$ 6877975 1036411 730031 1595506 1217281 2087629 4829824 5411125 2207637 316571
43278C16571M145116P144101L869052K8175L15678J094271k650038q418259r670067
$$ 316571 4461687 11605788 15474840 15503015 15818693 16912964 14262926 5844667 -3825400
43269c825400n095964N52001L232699L131593K477585L157890N568789P240355
$$ -3825400 -8921364 -8369363 -5136664 -2005071 472514 3630404 9199193 16439548
43261A6439548M180417l569633r699830q613427k939128K71205n21935o96019
$$ 16439548 20619965 17050332 7350502 -1262925 -4202053 -3930848 -4452783 -5148802
43253e148802J425219J376415l106150o472946k970224L906030N555172N21156
$$ -5148802 -3723583 -2347168 -5453318 -11926264 -14896488 -10990458 -5435286 -4914130
43245d914130l511383r15500M241670M993388J861124J383713N742638R390910
$$ -4914130 -8425513 -9341013 -5099343 -105955 1755169 3138882 8881520 18272430
43237A8272430P204879J380536k632465l639417m272187n325683n208086m241388
$$ 18272430 25477309 26857845 24225380 20585963 16313776 10988093 5780007 1538619
43229A538619m603642n452742k896369L397443P833984N925924L68864l036920
$$ 1538619 -3065023 -8517765 -11414134 -8016691 -182707 5743217 6112081 3075161
43221C075161k815533j701568j228720l94630J146808K104833J788255Q33741
$$ 3075161 259628 -1441940 -2670660 -3065290 -1918482 186351 1974606 2808347
43213B808347k12135j107751j151541n0986R53155N31881p14497j119247j09772
$$ 2808347 2596212 1488461 336920 285934 1239089 1770970 1056473 -62774 -172546
43204a72546J594378K798583K010566j288491m565234m103552l77215J823256
$$ -172546 1421832 4220415 6230981 4942490 377256 -3726296 -4103511 -2280255
43196b280255O39497J56010K765082L565769j745352p501258m602030N268348
$$ -2280255 -1640758 -1484748 1280334 4846103 3100751 -4400507 -9002537 -3734189
43188c734189J0509566N385000k912151n249814j713892J779404K452503J700600
$$ -3734189 6775377 12160377 9248226 3998412 2284520 4063924 6516427 8217027
43180H217027O18277j174724l549268n258144m765980j356050L124757M499195
$$ 8217027 8835304 7660580 4111312 -1146832 -5912812 -7268862 -4144105 355090
43172C55090J134465k506052j277286K666028K700924j674219l580041N10974
$$ 355090 1489555 -1016497 -2293783 372245 3073169 1398950 -2181091 -1670117
43164a670117N200123M139836j718560o855780p708377m051925J696438M685313
$$ -1670117 3530006 7669842 5951282 -904498 -8612875 -12664800 -10968362 -6283049
43156f283049K032498j647546P63387P076999P209145o51157n055780J481140
$$ -6283049 -4250551 -5898097 -5134710 1942289 9151434 8500277 3444497 4925637
43148D925637R742716P278230l058685q892076p150459n050524n191535k318710
$$ 4925637 14668353 21946583 18887898 9995822 2845363 -2205161 -7396696 -9715406
43140i715406M596081Q360377M572023j943630m922983m178514k421689k12000
$$ -9715406 -5119325 3241052 7813075 5869445 946462 -3232052 -5653741 -5865741
43132e865741K909487O045069P592873N951785L08991o234944o974740m0033O505121
$$ -5865741 -2956254 3088815 10681688 16633473 16942464 10707520 3732780 3692747 10197868
43123A0197868M589108k005859m049714k024551l835241q746794o976968K629665
$$ 10197868 14786976 12781117 8731403 6706852 2871611 -5875183 -12852151 -10222486
43115a0222486Q270126L797953j266597J765891O063598J774751o329726o649487
$$ -10222486 -1952360 1845593 578996 2344887 8408485 10183236 3853510 -2795977
43107b795977p1255K120562l058405o756902l667695P68629J041389l51966M58984
$$ -2795977 -2867232 -746670 -3805075 -10561977 -14229672 -13461043 -12419654 -12771620 -12312636
43098a2312636J666875K63887j841589j172274J267749J853821M13672L43376
$$ -12312636 -10645761 -10381874 -12223463 -13395737 -12127988 -10274167 -9860495 -9517119
43090i517119K836132M273859J058087m379464n246694P66843P034381N879716
$$ -9517119 -6680987 -2407128 -1349041 -5728505 -10975199 -10208356 -3173975 2705741
43082B705741q09227m202133j434128J152585l85813q36583M127784Q450399M239225
$$ 2705741 1896514 -2305619 -3739747 -2587162 -2972975 -3809558 318226 8768625 13007850
43073A3007850n082332r064303m771743J664062N791446P754331N862782j997607
$$ 13007850 7925518 -1138785 -5910528 -4246466 1544980 9299311 15162093 13164486
43065A3164486r715797o918048M944910J0938028K738269q895341r437696p53750
$$ 13164486 3448689 -3469359 1475551 12413579 15151848 6256507 -3181189 -3934939
43057c934939L826654j72702l985364q29274M562369M645290J99772k078636M04892
$$ -3934939 -108285 -280987 -4266351 -5095625 -533256 4112034 4311806 2233170 2638062
43048B638062L297050K005822k051928l488045j79393L679943K812435k392336
$$ 2638062 5935112 7940934 5889006 2400961 2221568 5901511 8713946 6321610
43040F321610o567375o096762k513205O64584J655348Q16334J67546K478086P519354
$$ 6321610 -245765 -6342527 -8855732 -8191148 -6535800 -5719466 -5551920 -3073834 4445520
43031D445520R639175L813649n602408q181457j248747O090916N927689J634729
$$ 4445520 14084695 17898344 12295936 4114479 2865732 8956648 14884337 16519066
43023A6519066k5690Q3085k137066m281319j581337K739361J632650k870515k018080
$$ 16519066 16493376 16576461 14439395 10158076 8576739 11316100 12948750 10078235 8060155
43014H060155M007364M640520l549316r495218m343203M420452M737062j566874
$$ 8060155 12067519 16708039 13158723 3663505 -679698 3740754 8477816 6910942
43006F910942l186806J981287M566518k09979n400762m295234m50213n58787l678029
$$ 6910942 3724136 5705423 10271941 10061962 4661200 365966 -84247 -643034 -4321063
42997d321063l739872Q51902N996430Q434934Q238084N443604n55449p130904
$$ -4321063 -8060935 -7209033 -1212603 7222331 15460415 20904019 20348570 13217666
42989A3217666q343888j749303O924912R091823K816327n529228r180422p772489
$$ 13217666 4873778 3124475 10049387 19141210 21957537 16428309 7247887 -524602
42981e24602m967453k172253J873571O219639O868166K442239k669494l584117
$$ -524602 -5492055 -7664308 -5790737 428902 7297068 9739307 7069813 3485696
42973C485696j018010J027305J642080K787896L700014R17511m954491p719152
$$ 3485696 2467686 3494991 5137071 7924967 11624981 12542492 7588001 -131151
42965a31151l880386J593898J878865k322202m825221l406560j443044m92006
$$ -131151 -4011537 -2417639 -538774 -2860976 -7686197 -11092757 -12535801 -13027807
42957a3027807K448554Q241281J1599025P692809n62450n874732n233927j592331
$$ -13027807 -10579253 -2337972 9261053 16953862 16391412 10516680 5282753 3690422
42949C690422J458690K736657J937160j000220m539621o376614n998159m345313
$$ 3690422 5149112 7885769 9822929 8822709 4283088 -2093526 -8091685 -12436998
42941a2436998j470331K732158O012758N431425J711772j295773j686416p35756
$$ -12436998 -13907329 -11175171 -5162413 269012 1980784 685011 -1001405 -1737161
42933a737161P60431L103125M377904J710756k899039l629518R1848J704905j921550
$$ -1737161 -976730 2126395 6504299 8215055 5316016 1686498 1778346 3483251 1561701
42924A561701m764022j748482K139898M65178k703374O46755P716637Q248419
$$ 1561701 -3202321 -4950803 -2810905 -2345727 -5049101 -4402346 3314291 11562710
42916A1562710J553458j967232K044451N288699J564439l159795k192175J58839
$$ 11562710 13116168 11148936 13193387 18482086 20046525 16886730 14694555 14853394
42908A4853394k788022p240801m981586K349355N254074O26428n014480n908848
$$ 14853394 12065372 4824571 -157015 2192340 7446414 8072842 3058362 -2850486
42900b850486l032487K17821J847484Q97526j306805o13785L845065N382944j355624
$$ -2850486 -5882973 -5665152 -3817668 -2920142 -4226947 -4840732 -995667 4387277 3031653
42891C031653r606298p752738L282798J0179243O258752j50912k49725K527532
$$ 3031653 -6574645 -14327383 -11044585 -865342 5393410 5242498 4992773 7520305
42883G520305R76449l004355k670189J625218L498542R51629k027879l147396
$$ 7520305 8496754 5492399 2822210 4447428 7945970 8897599 6869720 3722324
42875C722324m249533o030281o154721l709929j104311q8876R13980L943094P940175
$$ 3722324 -527209 -6557490 -12712211 -16422140 -17526451 -17615327 -16701347 -12758253 -4818078
42866d818078R521566O731964J370770k709809l790961l762428m324650l630196
$$ -4818078 4703488 11435452 12806222 10096413 6305452 2543024 -1781626 -5411822
42858e411822L17255M643545M694756J472019L95853K488274L170786Q65415m63357
$$ -5411822 -5094567 -451022 4243734 5715753 6111606 8599880 11770666 12636081 12172724
42849A2172724N12457k34959l200603k504374K835284M051872l338445r669299
$$ 12172724 12685181 12450222 9249619 6745245 9580529 13632401 10293956 624657
42841F24657n398034K824974K950604k144884m22338O910509O210160m558624
$$ 624657 -4773377 -1948403 1002201 -1142683 -1565021 5345488 11555648 6997024
42833F997024j0058525j279329J0147157R680702r6970o677070n555054j284622
$$ 6997024 -3061501 -4340830 5806327 15487029 15390059 8712989 3157935 1873313
42825A873313K343155L963719J843227k525364k914049K406063N421793j03114
$$ 1873313 4216468 8180187 10023414 7498050 4584001 6990064 12411857 12308743
42817A2308743p757543p892749k405592O3431o91786K308940Q989411J1194019
$$ 12308743 4551200 -3341549 -5747141 -5683710 -6375496 -4066556 4922855 16116874
42809A6116874O149503P363l381210o714459r917367p175890K159306Q912919
$$ 16116874 22266377 22273740 18892530 12178071 2260704 -4915186 -2755880 6157039
42801F157039O273452o77284l685456k959368l153008l451827k29928L677824
$$ 6157039 12430491 11753207 8067751 5108383 1955375 -1496452 -1726380 1951444
42793A951444J486871n957689r134600k597451P094471R569596L128680m544180
$$ 1951444 3438315 -2519374 -11653974 -14251425 -7156954 2412642 5541322 997142
42785I97142o363023l065267k90766r91497k652163j634427J803041M292622M098739
$$ 997142 -5365881 -8431148 -8721914 -9713411 -12365574 -14000001 -12196960 -7904338 -3805599
42776c805599K782362K076298J580593O68083M53918J800332K773521P00660l482344
$$ -3805599 -1023237 1053061 2633654 3301737 3755655 5555987 8329508 9030168 5547824
42767E547824n447226k912627R65071J276766k442533n692056m770343r10962
$$ 5547824 100598 -2812029 -1846958 -570192 -3012725 -8704781 -13475124 -14386086
42759a4386086K504072M671066O602026P094691L751695j511163k740920J677051
$$ -14386086 -11882014 -7210948 -608922 6485769 10237464 8726301 5985381 7662432
42751G662432N089689J294763n849606p118439q88504M813397L927077M789n02780
$$ 7662432 12752121 14046884 8197278 1078839 190335 5003732 8930809 8935598 8432818
42742H432818K225519K946265j14889k934106j741167J965202L654985J440150
$$ 8432818 10658337 13604602 13489713 10555607 8814440 10779642 14434627 15874777
42734A5874777k013551l363405l124232m403818p064339o404449r3859O574291
$$ 15874777 13861226 10497821 7373589 2969771 -4094568 -10499017 -10592876 -4018585
42726d018585O806380J964598m28186K071534L934542J288167k125683j788837
$$ -4018585 2787795 4752393 4324207 6395741 10330283 11618450 9492767 7703930
42718G703930N80466J141657J70119o21017k532151o149886p224052k682303K559385
$$ 7703930 8284396 9426053 9596172 8975155 6443004 293118 -6930934 -9613237 -7053852
42709g053852J944475k158989k149251K360518M671059K936545K113992L026202
$$ -7053852 -5109377 -7268366 -9417617 -7057099 -2386040 550505 2664497 5690699
42701E690699K71719n688433n579382L345257R477254L347864o866898p471268
$$ 5690699 5962418 273985 -5305397 -1960140 7517114 10864978 3998080 -3473188
42693c473188J5665L365373L78151J11471M395071M007566l512206p277089j033956
$$ -3473188 -3457523 -92150 286001 397472 4792543 8800109 5287903 -1989186 -3023142
42684c023142N365025J842584n378734m459445L087871O597021L715322P25840
$$ -3023142 2341883 4184467 -1194267 -5653712 -2565841 4031180 7746502 8472342
42676H472342r28679m933575q379520l693384O469318R697054K694547k934016
$$ 8472342 7543663 2610088 -5769432 -9462816 -2993498 6703556 9398103 6464087
42668F464087Q08749N959143K571807n267161p331720l396842o76414n27558J153378
$$ 6464087 7272836 13231979 15803786 10536625 3204905 -191937 -868351 -1395909 -242531
42659b42531L466844J524506l102421l306484J490359L561635p92204n388875
$$ -242531 3224313 4748819 1646398 -1660086 -169727 3391908 2599704 -2789171
42651b789171l846785J613538M819530L910621J205121j269383k616672k156570
$$ -2789171 -6635956 -5022418 -202888 3707733 4912854 3643471 1026799 -1129771
42643a129771m33949O70771L76251j74261K5907J102281L244883N462965M341836
$$ -1129771 -1563720 -892949 -516698 -690959 -665052 437229 3682112 9145077 13486913
42634A3486913j663961p390097o026056O44676L455906j063376n654643l689251
$$ 13486913 11822952 4432855 -1593201 -948525 2507381 1444005 -4210638 -7899889
42626g899889J078581J398212k102481k961135Q62589N149064O173568L739731
$$ -7899889 -6821308 -5423096 -7525577 -10486712 -9624123 -4475059 1698509 5438240
42618E438240j258437o833220q223125j988028P593386J1316170N861717k096174
$$ 5438240 4179803 -2653417 -10876542 -12864570 -5271184 6044986 11906703 9810529
42610I810529m367816n72655L104406K034696k398575n465877m520596j732676
$$ 9810529 5442713 4870058 7974464 10009160 7610585 2144708 -2375888 -4108564
42602d108564j428867m281335n362614j33138Q365206J1681078O167189k271199
$$ -4108564 -5537431 -9818766 -15181380 -15314518 -6949312 4731766 10898955 8627756
42594H627756n752605l895414k213248k757953j402027M360294R442830O990778
$$ 8627756 2875151 -1020263 -3233511 -5991464 -7393491 -3033197 6409633 13400411
42586A3400411j701903p691689n384215Q00883K888281k89374k556879N62566
$$ 13400411 11698508 4006819 -1377396 -576513 2311768 2022394 -534485 28081
42578B8081N644971N621043j233251q559071q944195k648500L057904L834883
$$ 28081 5673052 11294095 10060844 1501773 -7442422 -10090922 -7033018 -3198135
42570c198135L788246P491075J0321269M435186o549074r112834L29702P532890
$$ -3198135 590111 8081186 18402455 22837641 16288567 7175733 7505435 15038325
42562A5038325K43819j2851253j4456904l967005L627858J829258J5867M444057
$$ 15038325 15282144 2430891 -12026013 -15993018 -12365160 -10535902 -10520035 -6075978
42554f075978P173055J040221o761994n927417J005215M403924K966756K661984
$$ -6075978 1097077 2137298 -4624696 -10552113 -9546898 -5142974 -2176218 485766
42546D85766M293695L046791q92059j334614L254372O372823L249863k187282
$$ 485766 4779461 7826252 6934193 5599579 8853951 15226774 18476637 16289355
42538A6289355l325381J64753K629220k6984n448634p631160m013254J308840
$$ 16289355 12963974 13128727 15757947 15730963 10282329 2651169 -1362085 -53245
42530e3245K739926K81759j576973j104422p60715j440009j126309l04026k036160
$$ -53245 2686681 2968440 1391467 287045 -473670 -1913679 -3039988 -3344014 -5380174
42521e380174m648756j982019N523025Q182466R86494p617606p702910j396733
$$ -5380174 -10028930 -12010949 -6487924 1694542 2681036 -4936570 -12639480 -14036213
42513a4036213L387040N691764Q593078R681146N268507l07245n23509J633701
$$ -14036213 -10649173 -4957409 3635669 13316815 18585322 18278077 17754568 19388269
42505A9388269j205553p012843p320318j809091J995637K198276L475035N446900
$$ 19388269 18182716 11169873 3849555 2040464 4036101 6234377 9709412 15156312
42497A5156312L009186j760214j483057J987656o93740q167992p621763L351066
$$ 15156312 18165498 16405284 14922227 16909883 16216143 8048151 426388 3777454
42489C777454J0193902M072428l987873j546594O068905O902235J647475j147927
$$ 3777454 13971356 18043784 14055911 12509317 18578222 25480457 27127932 25980005
42481B5980005o73425j690447l132877j185568J133698j146481m719312l338141
$$ 25980005 25306580 23616133 20483256 19297688 20431386 19284905 14565593 11227452
42473A1227452P06893R95192j192960l98542J378425j721337o883089n915180
$$ 11227452 11934345 12929537 11736577 11338035 12716460 10995123 4112034 -1803146
42465a803146J76924K075307k264047m643164o75508M026242M066594J111663
$$ -1803146 -1626222 449085 -1814962 -6458126 -7133634 -3107392 959202 2070865
42457B070865j841947m248736m103728Q92892O326900M470313l014396n570354
$$ 2070865 228918 -4019818 -8123546 -7230654 -903754 3566559 552163 -5018191
42449e018191l7796M068597L37979m198040j675575L307684K385877k031696j492083
$$ -5018191 -5055987 -987390 -649411 -4847451 -6523026 -3215342 -829465 -2861161 -4353244
42440d353244M059652P166755N428119K999794Q36167m399087j1000106j1411994
$$ -4353244 -293592 6873163 12301282 15301076 16137243 11738156 738050 -10673944
42432a0673944l581713M730488O603203M305367K984663K220291o74814l703165
$$ -10673944 -14255657 -9525169 -2921966 1383401 4368064 6588355 5913541 2210376
42424B210376k959012M01459K062850J673187K134797L066682J489991j295710
$$ 2210376 -748636 -347177 1715673 3388860 5523657 8590339 10080330 8784620
42416H784620o39821K704974K323061k873315n239052l91908M955427L417489
$$ 8784620 8144799 10849773 13172834 10299519 5060467 4668559 9623986 13041475
42408A3041475j699599l248715k112996k631286j789961N002629J1138670N868804
$$ 13041475 11341876 8093161 5980165 3348879 1558918 6561547 17700217 23569021
42400B3569021o865503j1513538m231843K253493N87793r05953L380161M531374
$$ 23569021 16703518 5189980 958137 3211630 3799423 2893470 6273631 10805005
42392A0805005l278415q671000j086533R656193Q474453l29712j879959L312908
$$ 10805005 7526590 -1144410 -2230943 7425250 15899703 15569991 13690032 17002940
42384A7002940K290501n550754p507958j119481J657086l431969n852612m90180
$$ 17002940 19293441 13742687 6234729 5115248 6772334 3340365 -2512247 -3002427
42376c002427L120318q21093l404914K092349P124886K879323m137677l692480
$$ -3002427 117891 -703202 -4108116 -2015767 5109119 7988442 3850765 158285
42368A58285J193427J440411j991954j858892J470986J943024n85784j618743
$$ 158285 1351712 2792123 800169 -1058723 412263 2355287 1769503 150760
42360A50760j434350l060237l929724M21737O655493P308667K645126j82216J371052
$$ 150760 -1283590 -4343827 -8273551 -7851814 -1196321 6112346 8757472 8575256 9946308
42351I946308L162458K829682J990612O56331k383072m078119l22512N398227
$$ 9946308 13108766 15938448 17929060 18585391 16202319 12124200 11801688 17199915
42343A7199915N010831j791761o609869n211615k909921m413419o351387m070336
$$ 17199915 22210746 20418985 13809116 8597501 5687580 1274161 -5077226 -9147562
42335i147562P70145M127148N731311O508887M521233j044897n242823k781599
$$ -9147562 -8377417 -4250269 1481042 7989929 12511162 11466265 6223442 3441843
42327C441843L356653M500555j958991q257736o159200J968346O013957J630429
$$ 3441843 6798496 11299051 9340060 1082324 -5076876 -3108530 2905427 4535856
42319D535856l732286j252714O285283P964097N32823o856915o467116k751386
$$ 4535856 803570 -449144 5836139 13800236 14333059 7476144 1009028 -1742358
42311a742358l064816m293353J341232J0523518J0766666p90538j1522355j0578709
$$ -1742358 -4807174 -9100527 -7759295 2764223 13530889 12740351 1217996 -9360713
42303i360713k833994O97149j103322j260413K211413M182803J983883q02734
$$ -9360713 -12194707 -11497558 -12600880 -13861293 -11649880 -7467077 -5483194 -6285928
42295f285928n91701K311360O568932J0732657J0649428K514448r243293j3597304
$$ -6285928 -6877629 -4566269 2002663 12735320 23384748 25899196 16655903 3058599
42287C058599o519960K570016L277127j682184k050608L571002O069177N97119
$$ 3058599 -3461361 -891345 2385782 703598 -1347010 2223992 8293169 8890288
42279H890288o211706o923864l385157j174669l43102J976753M319072L317030
$$ 8890288 2678582 -4245282 -7630439 -8805108 -9148210 -7171457 -2852385 464645
42271D64645O81524R45381L718190M429995J861477q88993k161631k837689k602688
$$ 464645 1146169 2091550 5809740 10239735 12101212 11212219 9050588 6212899 3610211
42262C610211q09607J19619j748389k647182J233968M849146M74154q064496q632970
$$ 3610211 2800604 2920223 1171834 -1475348 -241380 4607766 5081920 -2982576 -11615546
42253a1615546M14789O917724M098987M57267L976086Q536854N515824j141764
$$ -11615546 -11200757 -4283033 -184046 273221 4249307 12786161 18301985 17160221
42245A7160221k531042K96096N23573j447555q66114M31276k225437n508767k995888
$$ 17160221 14629179 14925275 15448848 14001293 13135179 13566455 11341018 5832251 2836363
42236B836363K107228J458270l376519l337324J607582K066765l607196n598065
$$ 2836363 4943591 6401861 3025342 -311982 1295600 3362365 -244831 -5842896
42228e842896N09877O080082M011213m38690j37034K303342J047231k416387l048083
$$ -5842896 -5333019 747063 4758276 4319586 4182552 6485894 7533125 5116738 2068655
42219B068655j054063P8485J39672Q86407J720748J529173J401798J512825q10241
$$ 2068655 1014592 1093077 1232749 2119156 3839904 5369077 6770875 8283700 7473459
42210G473459n964887r118184o550469j172870K292436L788626N359157N864658
$$ 7473459 1508572 -7609612 -14160081 -15332951 -13040515 -9251889 -3892732 1971926
42202A971926L177145q45331k034007Q30415N314970Q166458O972887J602714
$$ 1971926 5149071 4303740 2269733 3100148 8415118 16581576 23554463 25157177
42194B5157177m295834o259075m832267m699227o854660o626786j549648M116212
$$ 25157177 20861343 14602268 9770001 5070774 -1783886 -8410672 -9960320 -5844108
42186e844108N578975L221341o13574n011052p616392m637802K209100N092703
$$ -5844108 -265133 2956208 2342634 -2668418 -10284810 -14922612 -12713512 -7620809
42178g620809J236784j860145J739719O206662L458353k983102l349807K763489
$$ -7620809 -6384025 -8244170 -6504451 -297789 3160564 177462 -3172345 -408856
42170d08856O315754L029833j880545l602544l773750m794825n077176k658124
$$ -408856 5906898 8936731 7056186 3453642 -320108 -5114933 -10192109 -12850233
42162a2850233J242438M353275N637542M595953J414161j918969l306788k862017
$$ -12850233 -11607795 -7254520 -1616978 2978975 4393136 2474167 -832621 -3694638
42154c694638j360416J578220M942655N112069J247603j614912m1627J111478
$$ -3694638 -5055054 -3476834 1465821 6577890 7825493 6210581 6168954 7280432
42146G280432l589834r201757o113744M749862J2068064R987874M416503J452324
$$ 7280432 3690598 -5511159 -11624903 -6875041 5193023 15180897 19597400 21049724
42138B1049724j068670o197704j0032321p322964P0877N718720O400328L492097
$$ 21049724 19981054 13783350 3751029 -3571935 -3501058 2217662 8617990 12110087
42130A2110087l47523k617573j956726l29033j372217m652674n237475j172728
$$ 12110087 11762564 9144991 7188265 6859232 5487015 834341 -4403134 -5575862
42122e575862K791182K006439j344594k014532P09473K916272J831905j222349
$$ -5575862 -2784680 -778241 -2122835 -4137367 -3427894 -511622 1320283 97934
42114I7934k552511M99720O111586P889732J730380p092254q800065k078291M159439
$$ 97934 -2454577 -1954857 4156729 12046461 13776841 6684587 -2115478 -4193769 -34330
42105c4330M153468K655041M194424L363863n523711j5153001j2847154O44006
$$ -34330 4119138 6774179 10968603 14332466 8808755 -6344246 -19191400 -18547394
42097a8547394J1083302J0048418L938596J168612L94861l023327o832067n796835
$$ -18547394 -7464092 2584326 6522922 7691534 8086395 5063068 -1768999 -7565834
42089g565834j253588P00933j446503l298849j733519J735098M490038N343095
$$ -7565834 -8819422 -8118489 -9564992 -12863841 -14597360 -12862262 -8372224 -3029129
42081c029129L653492j35857l114199k757169r93903j506626l268011j686211
$$ -3029129 624363 488506 -2625693 -5382862 -6376765 -7883391 -11151402 -12837613
42073a2837613L255274N722683L048305K93941J985530M510728K335125k135801
$$ -12837613 -9582339 -3859656 -811351 -517410 1468120 5978848 8313973 6178172
42065F178172j864932L525990O990008M586439J08135j966978j939439j198807
$$ 6178172 4313240 7839230 14829238 19415677 19523812 17556834 15617395 14418588
42057A4418588J119647M479858M697364n80242p305461r609083o738903k587448
$$ 14418588 15538235 20018093 24715457 24135215 16829754 7220671 481768 -2105680
42049b105680l22555J41995R80412M004783P417645N555177l704092j1829661
$$ -2105680 -2428235 -2286240 -1305828 2698955 10116600 15671777 11967685 138024
42041A38024p416146P074104J5227677Q083245l506623n540269j064510k334723
$$ 138024 -7278122 -204018 15023659 23106904 19600281 14060012 12995502 10660779
42033A0660779r192518r720223q00285O342232L444014m068144p550733o010146
$$ 10660779 1468261 -8251962 -9052247 -2710015 733999 -3334145 -10884878 -16895024
42025a6895024j998330L904193R096012P816610R5333n241145k530398K389775
$$ -16895024 -18893354 -14989161 -5893149 1923461 2018794 -3222351 -5752749 -3362974
42017c362974K112965o56736R44028N595046O060338P55923m913605o979136n709545
$$ -3362974 -1250009 -1906745 -962717 4632329 10692667 11448590 6534985 -444151 -6153696
42008f153696j657887M162751P235258L648785k789842l972526J396439O076299
$$ -6153696 -7811583 -3648832 3586426 7235211 4445369 472843 1869282 7945581
42000G945581M885044J327168J167026L839044L745885j907654r265540j1591852
$$ 7945581 12830625 14157793 15324819 19163863 22909748 21002094 11736554 144702
41992A44702o245527K005294N484226K076558k522246k271896K032094N366364
$$ 144702 -6100825 -4095531 1388695 3465253 943007 -1328889 703205 6069569
41984F069569N465940L594014O23553l091555n137588k997942J678491M753226
$$ 6069569 11535509 15129523 15753076 12661521 7523933 4525991 6204482 10957708
41976A0957708N099105M441749K545756k405699q563784j0846841p709395k815306
$$ 10957708 16056813 20498562 23044318 20638619 12074835 1227994 -6481401 -9296707
41968i296707R20080L760183M524834J27689p080706q091954J036377J1243444
$$ -9296707 -8376627 -4616444 -91610 36079 -7044627 -15136581 -14100204 -2856760
41960b856760J1126401K171966m292276l328940o60453m27822J393790P162592
$$ -2856760 8269641 10441607 6149331 2820391 2159938 1732116 3125906 10288498
41952A0288498R874373L046618p133427q785073j406411L303670j589319r148633
$$ 10288498 20162871 23209489 16076062 7290989 5884578 9188248 7598929 -1549704
41944a549704r598730l191741K769264M242336K327077r80894l249572j102513
$$ -1549704 -11148434 -14340175 -11570911 -7328575 -5001498 -5982392 -9231964 -10334477
41936a0334477M990262Q169303L415158m146073n663231j089118K117621J226069
$$ -10334477 -5344215 2825088 6240246 2094173 -3569058 -4658176 -2540555 -1314486
41928a314486N62662J768885J037701k132430k371882K153061N786394M454398
$$ -1314486 -751824 1017061 2054762 -77668 -2449550 -296489 5489905 9944303
41920I944303J093758j514235n017057q305744n287089L976642Q975937L429245
$$ 9944303 11038061 9523826 4506769 -3798975 -9086064 -5109422 3866515 7295760
41912G295760m308530m533551j189108k306117l730091K933942J1709746Q619832
$$ 7295760 2987230 -1546321 -2735429 -5041546 -8771637 -5837695 5872051 14491883
41904A4491883m810049j1604537m908379K925760J649622k068844P82752N649654
$$ 14491883 9681834 -1922703 -6831082 -3905322 -2255700 -4324544 -3541792 2107862
41896B107862L905306j629942k328771J555845K834746q1213k402453k100650
$$ 2107862 6013168 4383226 2054455 3610300 6445046 6363833 3961380 1860730
41888A860730j269475k65833J846921K569790j098737o064969o195731j305192
$$ 1860730 591255 325422 2172343 4742133 3643396 -2421573 -8617304 -9922496
41880i922496L086392M265991M283586L753789N73139m002549m417807J167121
$$ -9922496 -6836104 -2570113 1713473 5467262 6040401 2037852 -2379955 -1212834
41872a212834O575083M858090k761314q289405o227717P93154N623936M490800
$$ -1212834 5362249 10220339 7459025 -830380 -7058097 -6264943 -641007 3849793
41864C849793K54726k159923j666248l72184J020540L005142L423537k40916m230562
$$ 3849793 4104519 1944596 278348 -93836 926704 3931846 7355383 7114467 2883905
41855B883905j576770N755197O477471k891317r556366k106248J1115115J3539168
$$ 2883905 1307135 7062332 13539803 10648486 1092120 -1014128 10100987 23640155
41847B3640155N023966K04540M002244N257087k353875r263452p225519l492325
$$ 23640155 28664121 28868661 32870905 38127992 35774117 26510665 19285146 15792821
41839A5792821p115274j2209773p852638K835772P202821K486868k376926k335557
$$ 15792821 8677547 -3532226 -11384864 -8549092 -1346271 1140597 -1236329 -3571886
41831c571886r77616p3652L179452O819161L897209m827828q728268k805357M284856
$$ -3571886 -4549502 -4623154 -1443702 5375459 9272668 4444840 -4283428 -7088785 -2803929
41822b803929L752848n76826n57979K694546K540699r75877k105880K6581M50829
$$ -2803929 948919 372093 -185886 2508660 5049359 4073482 1967602 1994183 2445012
41813B445012k875657o367922o625733l467569J859768O529422O205312Q06631
$$ 2445012 -430645 -6798567 -13424300 -16891869 -15032101 -8502679 -2297367 -1490736
41805a490736k400778J920234P663137N322087k712563n116091N44491M352650
$$ -1490736 -3891514 -1971280 5691857 11013944 8301381 3185290 3729781 8082431
41797H082431M50791m650229m571828k812088l454009k341008L755028P734022
$$ 8082431 8533222 3882993 -688835 -3500923 -6954932 -9295940 -5540912 2193110
41789B193110K335070o628324q211254k977016k00614j349440J215739R070360
$$ 2193110 4528180 -2100144 -10311398 -13288414 -13489028 -14838468 -13622729 -4552369
41781d552369J3311112Q354179L74728k442612n79634N69878o64649k152872k652720
$$ -4552369 8758743 17112922 17487650 15045038 14465404 15035282 14370633 12217761 9565041
41772I565041k511372k004207j493373j392464r81900M57656J339801k37723k524627
$$ 9565041 7053669 5049462 3556089 2163625 1181725 1639381 2979182 2741459 216832
41763B16832k114761L33692J011338l46708O7454L126738M566224J511674l357770
$$ 216832 -1897929 -1564237 -552899 -899607 -832153 2294585 6860809 8372483 5014713
41754E014713n896721m799313p97082M228288O551097L559389j824481m184335
$$ 5014713 -882008 -5681321 -6478403 -2250115 4300982 7860371 6035890 1851555
41746A851555l176529k831626l686745k341240R28276J847602M27663J137769
$$ 1851555 -1324974 -4156600 -7843345 -10184585 -9256309 -7408707 -6981044 -5843275
41738e843275L281163Q96859m947617m779241L269002P492681N33019p446674
$$ -5843275 -2562112 -1665253 -6612870 -11392111 -8123109 -630428 -97409 -7544083
41730g544083m047713N727396P607591k35555o545667m541494J988610P891459
$$ -7544083 -11591796 -5864400 1743191 1507636 -5038031 -9579525 -7590915 300544
41722C00544J0569687O561745m323468j2641532q723484K062434N398868o94429
$$ 300544 10870231 17431976 13108508 466976 -8256508 -6194074 -795206 -1489635
41714a489635l924836J278617N371863J329032l313732n05641M002343J279298
$$ -1489635 -5414471 -4135854 1236009 2565041 -748691 -1254332 2748011 4027309
41706D027309m632563l497100L521024N615333j42637m678366j551550L948854
$$ 4027309 -605254 -4102354 -581330 5034003 4891366 213000 -1338550 2610304
41698B610304L796017j758641o624869p668531o255602l560869O64452M783325
$$ 2610304 6406321 4647680 -1977189 -9645720 -15901322 -19462191 -18797739 -14014414
41690a4014414N116853J163782j960436K80789M814809M735515p7638k151765
$$ -14014414 -8897561 -7733779 -9694215 -9413426 -4598617 136898 59260 -2092505
41682b092505J582250L823433j594425q270628n896614L280870P011621J320194
$$ -2092505 -510255 3313178 1718753 -6551875 -12448489 -9167619 -2155998 -835804
41674h35804m628263l835601q48493j215035j475150K990433P823299O355992
$$ -835804 -5464067 -9299668 -10148161 -11363196 -12838346 -9847913 -2024614 4331378
41666D331378J428098J200592N733516O899424J480420l967673l365028L02791
$$ 4331378 5759476 6960068 12693584 19593008 21073428 17105755 13740727 14043518
41658A4043518K62976m143413o943597l819359K200437M475111J107832k644296
$$ 14043518 14306494 10163081 3219484 -599875 1600562 6075673 7183505 4539209
41650D539209j576719K046628J815667l110675o610601m644516l07317K274011
$$ 4539209 2962490 5009118 6824785 3714110 -2896491 -7541007 -7848324 -5574313
41642e574313L561293M638603L118982j772201m634280r85909M306437L095800
$$ -5574313 -2013020 2625583 5744565 3972364 -661916 -1647825 2658612 5754412
41634E754412l278675n306504M13263O260969N390982J206104M45055K244787
$$ 5754412 2475737 -2830767 -2417504 3843465 9234447 10440551 10885606 13130393
41626A3130393N17125n081838p196262r94085Q137125J0147069K030915q643211
$$ 13130393 13647518 8565680 1369418 375333 8512458 18659527 20690442 12047231
41618A2047231j2049578o237132J828049M219701j73553n419066n040048J195768
$$ 12047231 -2347 -6239479 -4411430 -191729 -365282 -5784348 -10824396 -9628628
41610i628628O663164M925697k297793o419469k774395K877052K315534l153456
$$ -9628628 -2965464 1960233 -337560 -6757029 -9531424 -6654372 -4338838 -7492294
41602g492294m483877J785634Q519757Q155209K086936l266845m887719l678186
$$ -7492294 -11976171 -10190537 -1670780 6484429 8571365 5304520 416801 -3261385
41594c261385n36918L433589N288324L166289m19466j401896Q63118L617864M075221
$$ -3261385 -3798303 -364714 4923610 8089899 7670433 6268537 7131655 10749519 14824740
41585A4824740J159615l787865o688770m308503M41507R80177l341577n442119
$$ 14824740 15984355 12196490 5507720 1199217 1640724 2620901 -720676 -6162795
41577f162795j273647L621127K836402j487450l661180l202321j949844J840631
$$ -6162795 -7436442 -3815315 -978913 -2466363 -6127543 -9329864 -11279708 -9439077
41569i439077Q266818R921293J451851q746856p803905K596115Q497244M645687
$$ -9439077 -1172259 8749034 10200885 1454029 -6349876 -3753761 4743483 9389170
41561I389170K42929J697416K916404j851203p220791o353430k186692p29713
$$ 9389170 9632099 11329515 14245919 12394716 5173925 -1179505 -3366197 -4095910
41553d095910o79113J602961L040993p30199n368839l180159L779515N531480
$$ -4095910 -4775023 -3172062 -131069 -861268 -6230107 -9410266 -5630751 -99271
41545i9271r87804p407937n914514R89489N361646L641819j229563m397469l304618
$$ -99271 -1087075 -8495012 -14409526 -13420037 -8058391 -4416572 -5646135 -10043604 -13348222
41536a3348222R89881M981971N884646M193529K631795K752480L239120J365550
$$ -13348222 -12358341 -7376370 -1491724 2701805 5333600 8086080 11325200 12690750
41528A2690750l894209r488300r801599k815800N708956P719545K910791j102849
$$ 12690750 8796541 -691759 -10493358 -13309158 -7600202 119343 3030134 1927285
41520A927285q2015P50351m288999j0992303j0066879l33044R017717R769324
$$ 1927285 1845270 2595621 -1693378 -12685681 -22752560 -23085604 -14067887 -4298563
41512d298563L688120j172966j19169L974238M920345O65302l999191l198939
$$ -4298563 -610443 -1783409 -1902578 2071660 6992005 7657307 3658116 459177
41504D59177K067897M722263J146936l854785m016025M2250K908336J967129j102082
$$ 459177 2527074 7249337 8396273 4541488 525463 567713 3476049 5443178 4341096
41495D341096m147480n561423l204013L043604Q443898P493316Q49067n202987
$$ 4341096 193616 -5367807 -8571820 -5528216 2915682 10408998 11258065 6055078
41487F055078n942799k087127K463424L680993k50695o113857p071481j122577
$$ 6055078 112279 -1974848 488576 4169569 3918874 -2194983 -9266464 -10389041
$$ [...]
##END NTUPLES=NMR SPECTRUM
##END=
