##TITLE=31Pdec_LR-688B-CKB
 CDCl3, 8 sc
 24.9.2019
##JCAMPDX= 6.0         $$ Bruker NMR JCAMP-DX V2.0
##DATA TYPE= NMR SPECTRUM
##DATA CLASS= NTUPLES
##ORIGIN= UXNMR, Bruker Analytische Messtechnik GmbH
##OWNER= root
$$ XWIN-NMR		Version 3.5
$$ Tue Sep 24 13:57:38 2019 Russian Standard Time (UT+4h)  she@DPX200
##.OBSERVE FREQUENCY= 81.013821
##.OBSERVE NUCLEUS= ^31P
##.ACQUISITION MODE= SIMULTANEOUS
##.ACQUISITION SCHEME= undefined
##.AVERAGES= 24
##.DIGITISER RES= 17
##SPECTROMETER/DATA SYSTEM= spect
##.PULSE SEQUENCE= zgpg30
##.SOLVENT NAME= DMSO
##.SHIFT REFERENCE= (INTERNAL, DMSO, 0, 182.463)
##AUDIT TRAIL= $$ (NUMBER, WHEN, WHO, WHERE, WHAT)
$$ ##TITLE= Audit trail, XWIN-NMR		Version 3.5
$$ ##JCAMPDX= 5.01
$$ ##ORIGIN= Bruker BioSpin GmbH
$$ ##OWNER= she
$$ F:/spectra/data/she/nmr/P31/1/pdata/1/auditp.txt
$$ ##AUDIT TRAIL=  $$ (NUMBER, WHEN, WHO, WHERE, WHAT)
(   1,<2019-09-24 13:56:29.00 +0400>,<she>,<DPX200>,
      <created by zg, POWCHK disabled, PULCHK disabled
       configuration hash MD5:
       00 E9 B6 7A A2 85 ED C7 34 08 36 98 17 FE 4E 26
       data hash MD5: 32K
       75 D0 07 05 B3 70 D6 B1 E6 74 AA 0B 1A ED CB D8>)
(   2,<2019-09-24 13:56:31.43 +0400>,<she>,<DPX200>,
      <Start of raw data processing
       efp BC_mod = 2 LB = 1 FT_mod = 6 PKNL = 1 PHC0 = -187.266 PHC1 = -497.1997 SI = 64K 
       data hash MD5: 64K
       AB 52 F6 6F 08 CF FF D9 7D E0 17 2A 2F D8 AB 99>)
(   3,<2019-09-24 13:57:10.43 +0400>,<she>,<DPX200>,
      <pk PHC0 = 33.58861 PHC1 = -85.99999 
       data hash MD5: 64K
       84 78 2F B3 4E 04 C1 4E E0 D5 41 D5 CC D2 A1 51>)
(   4,<2019-09-24 13:57:13.48 +0400>,<she>,<DPX200>,
      <abs ABSG = 5 
       data hash MD5: 64K
       DB D9 C8 C2 77 31 8B 9C AA FE 4C CD 4A 16 3F A4>)
$$ ##END=
$$ 
$$ hash MD5
$$ 42 11 77 9A 06 9C 05 BE 66 9C DA D4 DC 1C 18 FF
##$RELAX= 
##$RELAX= 
##$RELAX= 
##$RELAX= 
##$RELAX= 
##$RELAX= 
##$RELAX= 
##$RELAX= 
$$ Bruker specific parameters
$$ --------------------------
##$DU= <F:/spectra>
##$EXPNO= 1
##$NAME= <P31>
##$PROCNO= 1
##$TYPE= <nmr>
##$USER= <she>
##$AMP= (0..31)
100 100 100 100 100 100 100 100 100 100 100 100 100 100 100 100 100 100 
100 100 100 100 100 100 100 100 100 100 100 100 100 100 
##$AQSEQ= 0
##$AQ_mod= 1
##$AUNM= <au_zg>
##$AUTOPOS= <>
##$BF1= 81.014009
##$BF2= 200.13
##$BF3= 200.13
##$BF4= 200.13
##$BF5= 200.13
##$BF6= 200.13
##$BF7= 200.13
##$BF8= 200.13
##$BYTORDA= 1
##$CFDGTYP= 0
##$CFRGTYP= 5
##$CHEMSTR= <none>
##$CNST= (0..31)
1 1 145 1 1 1 1 1 1 1 1 1 1 1 1 1 1 1 1 1 1 1 1 1 1 1 1 1 1 1 1 1 
##$CPDPRG= <waltz16>
##$CPDPRG1= <>
##$CPDPRG2= <waltz16>
##$CPDPRG3= <>
##$CPDPRG4= <mlev>
##$CPDPRG5= <mlev>
##$CPDPRG6= <mlev>
##$CPDPRG7= <mlev>
##$CPDPRG8= <mlev>
##$CPDPRGB= <>
##$CPDPRGT= <>
##$D= (0..31)
0 1 0 0 0 0 0 0 0 0 0 0.03 2e-05 3e-06 0 0 0 0 0 0 0 0 0 0 0 0 0 0 0 0 
0 0 
##$DATE= 1569318988
##$DBL= (0..7)
120 120 120 11 120 120 24 19 
##$DBP= (0..7)
150 150 150 150 150 150 150 150 
##$DBP07= 0
##$DBPNAM0= <>
##$DBPNAM1= <>
##$DBPNAM2= <>
$$ [...]
##$SUBNAM3= <"">
##$SUBNAM4= <"">
##$SUBNAM5= <"">
##$SUBNAM6= <"">
##$SUBNAM7= <"">
##$SUBNAM8= <"">
##$SUBNAM9= <"">
##$SW= 369.568048894756
##$SWIBOX= (0..15)
0 1 3 0 0 0 0 0 0 0 0 0 0 0 0 0 
##$SW_h= 29940.119760479
##$TD= 32768
##$TD0= 1
##$TE= 0
##$TE2= 300
##$TE3= 300
##$TEG= 300
##$TL= (0..7)
0 120 53 12 22 120 120 120 
##$TP= (0..7)
150 150 150 150 150 150 150 150 
##$TP07= 0
##$TPNAME0= <>
##$TPNAME1= <>
##$TPNAME2= <>
##$TPNAME3= <>
##$TPNAME4= <>
##$TPNAME5= <>
##$TPNAME6= <>
##$TPNAME7= <>
##$TPOAL= (0..7)
0.5 0.5 0.5 0.5 0.5 0.5 0.5 0.5 
##$TPOFFS= (0..7)
0 0 0 0 0 0 0 0 
##$TUNHIN= 0
##$TUNHOUT= 0
##$TUNXOUT= 0
##$USERA1= <user>
##$USERA2= <user>
##$USERA3= <user>
##$USERA4= <user>
##$USERA5= <user>
##$V9= 5
##$VALIST= <valist>
##$VCLIST= <CCCCCCCCCCCCCCC>
##$VD= 0
##$VDLIST= <DDDDDDDDDDDDDDD>
##$VPLIST= <PPPPPPPPPPPPPPP>
##$VTLIST= <TTTTTTTTTTTTTTT>
##$WBST= 1024
##$WBSW= 4
##$XGAIN= (0..3)
0 0 0 0 
##$XL= 0
##$YL= 0
##$YMAX_a= 11072
##$YMIN_a= -12530
##$ZGOPTNS= <>
##$ZL1= 120
##$ZL2= 120
##$ZL3= 120
##$ZL4= 120
##$ABSF1= 182.463
##$ABSF2= -187.1042
##$ABSG= 5
##$ABSL= 3
##$ALPHA= 0
##$AQORDER= 0
##$ASSFAC= 0
##$ASSFACI= 0
##$ASSFACX= 0
##$ASSWID= 0
##$AUNMP= <proc_1d>
##$AZFE= 0.1
##$AZFW= 0.5
##$BCFW= 0
##$BC_mod= 2
##$BYTORDP= 0
##$COROFFS= 0
##$CY= -3
##$DATMOD= 1
##$DC= 0
##$DFILT= <>
##$DTYPP= 0
##$F1P= 0
##$F2P= 0
##$FCOR= 1
##$FTSIZE= 65536
##$FT_mod= 6
##$GAMMA= 0
##$GB= 0
##$INTBC= 1
##$INTSCL= 5.30512e-09
##$ISEN= 30
##$LB= 1
##$LEV0= 0
##$LPBIN= 0
##$MAXI= 10000
##$MC2= 0
##$MEAN= 0
##$ME_mod= 0
##$MI= 50
##$NCOEF= 0
##$NC_proc= -8
##$NLEV= 6
##$NOISF1= 182.463
##$NOISF2= 159.3651
##$NSP= 0
##$NTH_PI= 0
##$NZP= 0
##$OFFSET= 182.463
##$PC= 4
##$PHC0= -153.6774
##$PHC1= -583.1997
##$PH_mod= 1
##$PKNL= yes
##$PPARMOD= 0
##$PSCAL= 0
##$PSIGN= 0
##$REVERSE= no
##$SF= 81.0140089999434
##$SI= 65536
##$SIGF1= 159.3651
##$SIGF2= -187.1042
##$SINO= 113.3802
##$SIOLD= 16384
##$SREGLST= <1H.CDCl3>
##$SSB= 0
##$STSI= 65536
##$STSR= 0
##$SW_p= 29940.119760479
##$SYMM= 0
##$S_DEV= 0
##$TDeff= 32768
##$TDoff= 0
##$TI= <>
##$TILT= no
##$TM1= 0
##$TM2= 0
##$TOPLEV= 0
##$USERP1= <user>
##$USERP2= <user>
##$USERP3= <user>
##$USERP4= <user>
##$USERP5= <user>
##$WDW= 1
##$XDIM= 65536
##$YMAX_p= 364575100
##$YMIN_p= -91226407
$$ End of Bruker specific parameters
$$ ---------------------------------
##NTUPLES= NMR SPECTRUM
##VAR_NAME=  FREQUENCY,     SPECTRUM/REAL,   SPECTRUM/IMAG
##SYMBOL=    X,             R,               I
##VAR_TYPE=  INDEPENDENT,   DEPENDENT,       DEPENDENT
##VAR_FORM=  AFFN,          ASDF,            ASDF
##VAR_DIM=   65536,         65536,           65536
##UNITS=     HZ,            ARBITRARY UNITS, ARBITRARY UNITS
##FACTOR=    0.456856943014862, 1,           1
##FIRST=     14782.0589164792, 0,            0
##LAST=      -15158.0608439998, 0,           0
##MIN=       -15158.0608439998, -91226407,   0
##MAX=       14782.0589164792, 364575100,    0
$$ Real data points
##PAGE= N=1
##DATA TABLE= (X++(R..R)), XYDATA
$$ [...]
46183A4110778n674369m173126J719627M107989n72278n847170m208803K085254
$$ 14110778 8436409 4263283 5982910 10090899 9518621 3671451 -537352 1547902
46175A547902M718780J214147k998140l370912j229033L27069N82661L16100L90796
$$ 1547902 6266682 7480829 4482689 1111777 -117256 209813 792474 1108574 1499370
46166A499370J806529M155361M287269q4902n839453p327832l712808M45624J909457
$$ 1499370 3305899 7461260 11748529 11663627 5824174 -1503658 -5216466 -4770842 -2861385
46157b861385J872547K007944J789799P32641o53518k964435o859785r332322
$$ -2861385 -988838 1019106 2808905 3541546 2888028 -76407 -6936192 -16268514
46149a6268514o068472J139362N034919L363574K497073O561059R347487L789154
$$ -16268514 -22336986 -21197624 -16162705 -12799131 -10302058 -3740999 5606488 9395642
46141I395642n318085o806436N96435O536409M142216j704671l863356k893151
$$ 9395642 4077557 -2728879 -2132444 4403965 8546181 6841510 2978154 85003
46133H5003k747553k708365K3056L514960L521039Q83145M46697L214624N077645
$$ 85003 -2662550 -5370915 -5347859 -1832899 1688140 2571285 3017982 6232606 11310251
46124A1310251L490371M17313j938724l661467m520389l405674j519134j625882
$$ 11310251 14800622 15217935 13279211 9617744 5097355 1691681 172547 -1453335
46116a453335k788881o94956M860048P956741M899769k94810k284617j670910
$$ -1453335 -4242216 -4937172 -77124 7879617 12779386 12484576 10199959 8529049
46108H529049j841537k942700l602444m630467o113143m719370R83680O517420
$$ 8529049 6687512 3744812 142368 -4488099 -10601242 -15320612 -14336932 -7819512
46100g819512Q039662Q161940R208337O616466k515108j0091996p271738K66462
$$ -7819512 220150 8382090 17590427 24206893 21691785 11599789 4328051 4594513
46092D594513R7220o625833p187621P59943N212698N32548l767781o75329K846204
$$ 4594513 4691733 -1934100 -9121721 -8361778 -3149080 -2616532 -6384313 -7059642 -4213438
46083d213438L569l767220k346546k97089k328160k832228K672333O477519J803760
$$ -4213438 -4209869 -7977089 -10323635 -10620724 -12948884 -15781112 -13108779 -6631260 -4827500
46074d827500l058157J912458R734535P058823l167698o723569j411630K050690
$$ -4827500 -7885657 -5973199 3761336 10820159 7652461 928892 -482738 1567952
46066A567952K03332N02741M786016N754681J832185J52633K131096P63165m540605
$$ 1567952 1771284 2274025 7060041 12814722 14646907 14799540 16930636 17693801 13153196
46057A3153196n097296P92402L041382l147656q812359o410744j059046N79652
$$ 13153196 8055900 8848302 11889684 8742028 -70331 -6481075 -7540121 -6960469
46049f960469J023213L745654M864675J406394j457657M74660K656819O65801
$$ -6960469 -5937256 -2191602 2673073 4079467 2621810 3096470 5753289 6419090
46041F419090j736651q41038m41295l326375m426191p16950J507997j519684j897219
$$ 6419090 4682439 3841401 3400106 73731 -4352460 -5069410 -3561413 -5081097 -6978316
46032f978316O106733J2608969O027068p140302j1214016m602553J056824J334172
$$ -6978316 -871583 11737386 17764454 10624152 -589864 -5192417 -4135593 -2801421
46024b801421K538651N904645M347516k839552o369264k123886K163539J63288
$$ -2801421 -262770 5641875 9989391 7149839 780575 -1343311 820228 983516
46016I83516l594460k812128R35701L193339L932291M563148L617146J58070l306829
$$ 983516 -2610944 -5423072 -4487371 -1294032 2638259 7201407 10818553 10976623 7669794
46007G669794m825013n226500m045816Q91200P024576O847345j519254r352364
$$ 7669794 2844781 -2381719 -6427535 -5536335 1488241 8335586 6816332 -2536032
45999b536032q106996n63492M114042K765773J45380P98623M147516O652456N195513
$$ -2536032 -10643028 -11206520 -7092478 -4326705 -4181325 -3382702 764814 7417270 12612783
45990A2612783o56873p003230p899703k196356L715309L211702k038941m466657
$$ 12612783 11955910 4952680 -2947023 -5143379 -1428070 1783632 -255309 -4721966
45982d721966o72853M751423N924849K807533j83936o89878q10313k753343m452541
$$ -4721966 -5394819 -643396 5281453 8088986 7905050 7215172 6404859 3651516 -801025
45973h01025k104255L315887N629444J524249m085642m479469o35207Q31188j792211
$$ -801025 -2905280 410607 6040051 7564300 3478658 -1000811 -1636018 -804830 -2597041
45964b597041l316315j294916o06526m502497p283242k366034O353905R041208
$$ -2597041 -5913356 -7208272 -7814798 -12317295 -19600537 -21966571 -15612666 -6571458
45956f571458M266356M40404K045301L107701j548928o265613l059528M790824
$$ -6571458 -2305102 -1864698 180603 3288304 1739376 -4526237 -7585765 -2794941
45948b794941O827247J456371j721948K754713P643133M407228m081742q777331
$$ -2794941 4032306 5488677 3766729 6521442 14164575 18571803 14490061 5712730
45940E712730p189117l514958L39635N569303R743905P661167j76521o763957
$$ 5712730 -1476387 -4991345 -4651710 917593 10661498 18322665 18146144 11382187
45932A1382187p691952n294363k772069l23351J442697N40494j759071j222807
$$ 11382187 3690235 -1604128 -4376197 -4699548 -3256851 -2716357 -4475428 -5698235
45924e698235K119525L019325j75030k115511P52822M294390L779009J028325
$$ -5698235 -3578710 -559385 -734415 -2849926 -2097104 2197286 5976295 7004620
45916G004620j88352m67213j548182j875993m15623M0261j591892j094593L584554
$$ 7004620 6816268 6349055 4800873 2924880 2509257 2549518 957626 -136967 3447587
45907C447587O687357K802635m320745p693458o838109m773565q30184N253542
$$ 3447587 10134944 12937579 8616834 923376 -5914733 -10688298 -11518482 -6264940
45899f264940P352477R49594o793453n457191K760561O271256J593113l287160
$$ -6264940 1087537 2037131 -4756322 -10213513 -7452952 -1181696 411417 -2875743
45891b875743k703504K32216J824356K593523K507281L50230j104024J929901
$$ -2875743 -5579247 -5347031 -3522675 -929152 1578129 1928359 824335 2754236
45883B754236N601522K381089n544863p498214r79789L925485M77827m938260
$$ 2754236 8355758 10736847 5191984 -2306230 -3286019 639466 1117293 -3820967
45875c820967l999727J879223O447018O972064K800040o123712j4215848j2301751
$$ -3820967 -7820694 -5941471 505547 7477611 10277651 4153939 -10061909 -22363660
45867b2363660n81154Q571596O898394J146189R03341M095903L319716n64919
$$ -22363660 -22944814 -14373218 -7474824 -6328635 -5425294 -1329391 1990325 1425406
45859A425406j121708K176114M395955L677889J473179k176952o258456n777245
$$ 1425406 303698 2479812 6875767 10553656 12026835 9849883 3591427 -2185818
45851b185818J105073P076574N132834j16390N3570L474235P41174p920104j1588446
$$ -2185818 -1080745 5995829 11128663 11012273 11065843 14540078 15281252 7361148 -4227298
45842d227298n702118J081509P22701l059961k817095Q75280K202695J32886p59039
$$ -4227298 -9929416 -8847907 -8125206 -11185167 -14002262 -13126982 -10924287 -10791401 -11550440
45833a1550440K144766N923892O251655K503221j829527l019913j103034N05859
$$ -11550440 -9405674 -3481782 2769873 5273094 3443567 423654 -679380 -173521
45825a73521l36271j695730o71283K363895M667729M887242L609085J296493j950137
$$ -173521 -509792 -2205522 -2876805 -512910 4154819 9042061 12651146 13947639 11997502
45816A1997502n324589p829023q890249p330729j996503M762524P246427L277429
$$ 11997502 6672913 -1156110 -10046359 -17377088 -19373591 -14611067 -7364640 -4087211
45808d087211j512893k56821N739799Q244115K409758p474470j2793807r145721
$$ -4087211 -5600104 -5856925 -117126 8126989 10536747 3062277 -9731530 -18877251
45800a8877251k47741N589223L898358o28558K99486P302158J1902906Q191548
$$ -18877251 -19124992 -13535769 -9637411 -10265969 -9966483 -2664325 9238581 17430129
45792A7430129P67952k607354j326375K40152R02895K169176K586349l33810l975910
$$ 17430129 18198081 15590727 14264352 14504504 15407399 17576575 20162924 19829114 15853204
45783A5853204l293442P53315J979479j300964l575246q29120L408165L470267
$$ 15853204 12559762 13313077 15292556 13991592 10416346 9587226 12995391 16465658
45775A6465658o44983l909648l065011m76662r36989n074628p270686k397824
$$ 16465658 15820675 11911027 8846016 8369354 7432365 2357737 -4912949 -7310773
45767g310773O011058Q663535K612078m724214o111222l323223j408696j95053
$$ -7310773 -1299715 7363820 9975898 5251684 -859538 -4182761 -5591457 -5786510
45759e786510K445802M071963J804664r30326M95657L369138K292451o95760J16846
$$ -5786510 -3340708 731255 2535919 1605593 2101250 5470388 7762839 7067079 7183925
45750G183925K475516j117784r212703j0937698k172577P533939Q338907K508191
$$ 7183925 9659441 8541657 -671046 -11608744 -13781321 -6247382 2091525 4599716
45742D599716j388160n79117Q46830o31691l680771l917631J214326Q067691Q911803
$$ 4599716 3211556 2632439 3479269 2847578 -833193 -4750824 -3536498 4531193 13442996
45733A3442996J646024n464764m135639J905721K686987k603234n316028j752149
$$ 13442996 15089020 9624256 5488617 7394338 10081325 7478091 2162063 409914
45725D09914K229438K063677L0861k093636o087230r944575p219316K033099Q411712
$$ 409914 2639352 4703029 4733890 2640254 -3446976 -13391551 -20610867 -18577768 -10166056
45716a0166056N892480m34126l371862k320118Q23483N627203Q648644M343946
$$ -10166056 -4273576 -4707702 -8079564 -10399682 -9576199 -3948996 4699648 9043594
45708I043594m463149o746616K95247N426228J077663m340079j316338M438317
$$ 9043594 4580445 -2166171 -1870924 3555304 4632967 292888 -1023450 3414867
45700C414867K695996l422316m293217j551791l746537q584105n435062N476281
$$ 3414867 6110863 2688547 -1604670 -3156461 -6902998 -15487103 -20922165 -15445884
45692a5445884J1341988N807895l061548o445650n224693l541109j578912J405156
$$ -15445884 -4103896 1703999 -1357549 -7803199 -13027892 -16569001 -18147913 -16742757
45684a6742757M244666O782772R416709Q911875J773990p707515j0650786n780968
$$ -16742757 -12498091 -5715319 3701390 12613265 14387255 6679740 -3971046 -9752014
45676i752014o56991J27451k91153Q08200J582947J534490K993951M561537J728157
$$ -9752014 -10409005 -10281554 -10572707 -9764507 -8181560 -6647070 -3653119 908418 2636575
45667B636575l701084m120070J054515L072245j581768m819808j007749K961085
$$ 2636575 -1064509 -5184579 -4130064 -1057819 -2639587 -7459395 -8467144 -5506059
45659e506059m02598o276083n930863n95908L066358N019462Q565076J0041593
$$ -5506059 -5908657 -12184740 -18115603 -18711511 -15645153 -10625691 -2060615 7980978
45651G980978L770690n431251o713521L92509N296398K807516q05804n11053k67407
$$ 7980978 11751668 6320417 -393104 -595 5295803 8103319 7297515 6786462 6519055
45642F519055l282731m272566J221285O878226L665957n963978j0493169m943794
$$ 6519055 3236324 -1036242 185043 7063269 10729226 4765248 -5727921 -10671715
45634a0671715L375762N696470K143497j377192j937960j033416L54031L256498
$$ -10671715 -7295953 -1599483 544014 -833178 -2771138 -3804554 -3450523 -194025
45626a94025O836259O973614J305926o307404r406347o503739k180508m48582
$$ -194025 6642234 13615848 14921774 8614370 -791977 -7295716 -9476224 -9924806
45618i924806j66257J537466M100228M489117J943861r73291j931312j549148
$$ -9924806 -10091063 -8553597 -4453369 35748 1979609 1006318 -924994 -2474142
45610b474142k216901m949293p411614n401457K183828R889554J0104095K385713
$$ -2474142 -4691043 -9640336 -17051950 -22453407 -20269579 -10380025 -275930 2109783
45602B109783m589780l121429M028859P898719N044047J38665k434015l844932
$$ 2109783 -2479997 -5601426 -1572567 6326152 11370199 11508864 9074849 5229917
45594E229917o013126o637863k916042K603197M297640J040443k196997j193335
$$ 5229917 -783209 -7421072 -10337114 -7733917 -3436277 -2395834 -4592831 -5786166
45586e786166J794283J252034l842771q256821p246615k589710P14582K176344
$$ -5786166 -3991883 -2739849 -6582620 -14839441 -22086056 -24675766 -23961184 -21784840
45578b1784840N722628J1279691J2045511M152434n301256o232174M83253M414385
$$ -21784840 -16062212 -4782521 7262990 11415424 6114168 -118006 365247 4779632
45570D779632J000514k534252L97952N116513L500574k950023n665978k237239
$$ 4779632 5780146 3245894 3643846 8760359 12260933 9310910 3644932 1407693
45562A407693Q10665j251215m821162m533085j147226O41417p34791k311153j182426
$$ 1407693 2218358 967143 -3854019 -8387104 -9534330 -8892913 -9627704 -11938857 -13121283
45553a3121283J880067L505156J693617j447617j698325J956813N627962N659937
$$ -13121283 -11241216 -7736060 -6042443 -7490060 -9188385 -7231572 -1603610 4056327
45545D056327L255174J298995p50885m343573o456464l022758L054991M568893
$$ 4056327 7311501 8610496 7859611 3516038 -2940426 -5963184 -2908193 1660700
45537A660700J299814N73766M332173M754443k222119p964350l839238M317825
$$ 1660700 2960514 3534280 7866453 12620896 10398777 2434427 -1404811 2913014
45529B913014M728059k087325n178662j141980K049671j3947j458237J838022
$$ 2913014 7641073 5553748 375086 -766894 1282777 1268830 -189407 1648615
45521A648615M126272Q398n434451m280565J987643N375554L043319q74851l172050
$$ 1648615 5774887 5783285 348834 -3931731 -1944088 3431466 6474785 5599934 2427884
45512B427884m899335p037167p795095n154487N04728O575551R720123Q076133
$$ 2427884 -2471451 -9508618 -17303713 -22458200 -21953472 -15377921 -5657798 2418335
45504B418335L116882j764907m780636n927787m313801P38216N841459N996240
$$ 2418335 5535217 3770310 -1010326 -6938113 -11251914 -10513698 -4672239 1324001
45496A324001K040007m2858J113192J58829m240964m738362K739122R839087O838273
$$ 1324001 3364008 3321150 4434342 4593171 352207 -4386155 -1647033 8192054 15030327
45487A5030327k749890p777908n511177k241332p68005J907731N105197L526721
$$ 15030327 12280437 4502529 -1008648 -3249980 -4017985 -2110254 2994943 6521664
45479F521664k562628n666971k321844J981029K031808k49327j382427j978262
$$ 6521664 3959036 -1707935 -4029779 -2048750 -16942 -266269 -1648696 -3626958
45471c626958l133500k949160l79702K079366K466491J874058J040508p65776
$$ -3626958 -6760458 -9709618 -10089320 -8009954 -5543463 -3669405 -2628897 -3394673
45463c394673k041867J30096L987189M042364m4431k363398n92387P50605m35668
$$ -3394673 -5436540 -5306444 -1319255 2723109 2678678 315280 -277107 473498 37830
45454C7830j20984K331584O35208o360742q940288j335192O751061M048371m389596
$$ 37830 -83154 2248430 2883638 -3477104 -12417392 -13752584 -7001523 -2953152 -7342748
45445g342748n514109J151447M882141K313691L04377J139820o95923n367373
$$ -7342748 -12856857 -11705410 -6823269 -4509578 -4205201 -3065381 -3761304 -9128677
45437i128677n140093J286079M734469J189936o30648N289503J0203694L854336
$$ -9128677 -14268770 -12982691 -8248222 -7058286 -7688934 -2399431 7804263 11658599
45429A1658599q260552j1895509l757867O004067Q690967N375728J074588j534580
$$ 11658599 3398047 -8497462 -12255329 -6251262 2439705 7815433 8890021 7355441
45421G355441j780039j85177Q68111o84848l686007n631698n991181m848279q78039
$$ 7355441 5575402 5390225 6258336 5573488 1887481 -3744217 -9735398 -14583677 -15461716
45412a5461716N337702Q663369N133114j482413l904818p89229K862267L168549
$$ -15461716 -10124014 -1460645 3672469 2190056 -1714762 -2503991 358276 3526825
45404C526825K53450m475116q260991o224670K493660R369013N412644m996043
$$ 3526825 3780275 -694841 -8955832 -15180502 -12686842 -3317829 2094815 -2901228
45396b901228q384369j299754N031439K401084k632788j013501M254688M796196
$$ -2901228 -11285597 -12585351 -7553912 -5152828 -7785616 -8799117 -4544429 251767
45388B51767J082912l54587N92928j279731n114243m477319P28843K870549j076598
$$ 251767 1334679 980092 1573020 293289 -4820954 -9298273 -8569430 -5698881 -6775479
45379f775479m704255k720909J484206K743255J823708J602708J191899q70041
$$ -6775479 -11479734 -14200643 -12716437 -9973182 -8149474 -6546766 -5354867 -6224908
45371f224908j963184M91831L312184J548469l429558n019479l40218N953518
$$ -6224908 -8188092 -7696261 -4384077 -2835608 -6265166 -11284645 -11624863 -5671345
45363e671345P401444K633913m080945p555371o342860l107181n27624K045932
$$ -5671345 1730099 4364012 283067 -7272304 -13615164 -16722345 -17249969 -15204037
45355a5204037O180417R829622Q776922K814178l297482o010261o404164o229926
$$ -15204037 -9023620 806002 9582924 12397102 9099620 3089359 -3314805 -9544731
45347i544731m738464j522863J388666K714865L718683M785906M107760J778270
$$ -9544731 -14283195 -15806058 -14417392 -11702527 -7983844 -3197938 909822 2688092
45339B688092O61469J006843l22731k600970j54752P063408R479764J382816q534545
$$ 2688092 3349561 4356404 4033673 1432703 1277951 8341359 17821123 19203939 10669394
45330A0669394q819479j566695K910052K634591L410415N127081J938457m637429
$$ 10669394 1849915 283220 3193272 5827863 9238278 14365359 16303816 11666387
45322A1666387o188770k236259j503811n729030n576699K501083Q363820M267839
$$ 11666387 5477617 3241358 1737547 -3991483 -9568182 -7067099 1296721 5564560
45314E564560k783847l358467P1352Q68548J089199N244780Q448362L248430o190995
$$ 5564560 2780713 -577754 -506402 362146 1451345 6696125 15144487 18392917 12201922
45305A2201922q802892l033606K427152K689743R14577o14442l235238n328184
$$ 12201922 3399030 365424 2792576 5482319 6396896 5782454 2547216 -2780968
45297b780968k800846K430064L385123n70282j687517L945922R691022P626683
$$ -2780968 -5581814 -3151750 233373 -336909 -2024426 1921496 11612518 19239201
45289A9239201j224746r360592j1071301n969525J605927N252357K664149m61066
$$ 19239201 18014455 8653863 -2417438 -8386963 -6781036 -1528679 1135470 674404
45281F74404K521180Q760684R263405K781969k126361r13266L19653l599776p455518
$$ 674404 3195584 11956268 21219673 24001642 21875281 20962015 21281668 17681892 10226374
45272A0226374m466714K477141O150707N994635N400337K540748o283042j6302110
$$ 10226374 5759660 8236801 14387508 20382143 25782480 28323228 22040186 5738076
45264E738076j7478023q680897K44886K510850K128462M212913N630021J661308
$$ 5738076 -11739947 -20420844 -20175958 -17665108 -15536646 -11323733 -5693712 -4032404
45256d032404l658379k147860N467039R139723L451997m602147n342724P42249
$$ -4032404 -7690783 -9838643 -4371604 4768119 8220116 3617969 -1724755 -982506
45248i82506M962992K861327j188161j907140J5576J280409J572662K038845J521343
$$ -982506 3980486 6841813 5653652 3746512 3762088 5042497 6615159 8654004 10175347
45239A0175347j119330l136006j361532J809987J419164j600546j248608L314504
$$ 10175347 9056017 5920011 4558479 6368466 7787630 6187084 4938476 8252980
45231H252980N071140l01915p141803p670887k597911J485951J942453J454904
$$ 8252980 13324120 13022205 5880402 -1790485 -4388396 -2902445 -959992 494912
45223D94912J612296J178673K11547M28348J136694m17205l959885n828369m611088
$$ 494912 2107208 3285881 3497428 3925776 5062470 4645265 685380 -5142989 -9754077
45214i754077k996607k851633k603021j087428J50659N90645K700031P111036
$$ -9754077 -12750684 -15602317 -18205338 -19292766 -19142107 -18551462 -15851431 -8740395
45206h740395R394736N599236j387946n016881l083807J067316L937113M592025
$$ -8740395 654341 6253577 4865631 -151250 -3235057 -2167741 1769372 6361397
45198F361397L004629j65828k377654j630210K6565p92248k919222k108608J449882
$$ 6361397 9366026 9200198 6822544 5192334 5218899 4426651 1507429 -601179 848703
45189H48703K700374K37890q00461K590612N609766L312388j205053k261130j090011
$$ 848703 3549077 3786967 2986506 5577118 11186884 14499272 13294219 11033089 9943078
45180I943078k843124o948207q170274n783516l779507k590902R43864N055127
$$ 9943078 7099954 151747 -8018527 -13802043 -17581550 -20172452 -19228588 -14173461
45172a4173461L818395j558817k072561M355795P402446K89773p850449n043110
$$ -14173461 -10355066 -11913883 -13986444 -9630649 -2228203 -1938430 -9788879 -14831989
45164a4831989M927285Q368854K327554k739625l27498L845716L473721J435231
$$ -14831989 -9904704 -1535850 791704 -1947921 -2275419 1570297 5044018 6479249
45156F479249K872679N800885M707185n92675m925607m550882m53720L675229
$$ 6479249 9351928 15152813 19859998 19267323 14341716 9790834 9337114 13012343
45148A3012343M345116N06029n209919q257206o122762k03819N473904O412834
$$ 13012343 17357459 17863488 12653569 4396363 -1726399 -1930218 3543686 9956520
45140I956520O86291p541550r916259l260460N147773O513673K307106N16665
$$ 9956520 10642811 3101261 -6814998 -10075458 -4927685 1585988 3893094 4409759
45132D409759K168626O88482m893449o427803p8233O117524M154475k174593m530243
$$ 4409759 6578385 7266867 2373418 -4054385 -4132618 1984906 6139381 3964788 -565455
45123e65455k554230j054526l5143L073407M756425o92822r604760j1348140l638017
$$ -565455 -3119685 -4174211 -4209354 -1135947 3620478 2927656 -6677104 -18025244 -21663261
45114b1663261L658887K968912r35676j45172L749007K941091m090257r948603
$$ -21663261 -18004374 -15035462 -15971138 -16116310 -12367303 -9426212 -13516469 -23465072
45106b3465072p648073K006403J2480308J7520745J4890199P259563M04756j639697
$$ -23465072 -31113145 -29106742 -16626434 894311 15784510 23044073 23448829 21809132
45098B1809132o19219j635237o118595r514417p451347j833939K064031K888206
$$ 21809132 21189913 19554676 13436081 3921664 -3529683 -5363622 -3299591 -411385
45090d11385L431810L937517N59201p125430j1885214o929237M219618J1007912
$$ -411385 3020425 6957942 7517143 391713 -11493501 -18422738 -14203120 -3195208
45082c195208Q216668O16357m421937m550357k160691m01155p16621j894204j221454
$$ -3195208 5021460 5637817 1215880 -3334477 -5495168 -5896323 -6612944 -8507148 -9728602
45073i728602J552746K813759M62830j791968m1876K757041J808695j5366L394869
$$ -9728602 -8175856 -5362097 -4899267 -6691235 -6733111 -3976070 -2167375 -2182741 1212128
45064A212128Q583365N309829o107290j2212999o063544K099325J312622l648378
$$ 1212128 9795493 15105322 8998032 -3214967 -9278511 -7179186 -5866564 -9514942
45056i514942k341036L755119N846386L613008L410986M801188K063147l010307
$$ -9514942 -11855978 -8100859 -2254473 1358535 4769521 9570709 11633856 8623549
45048H623549k896105J721147K594923j119267j649808J958753R82486o433685
$$ 8623549 5727444 7448591 10043514 8924247 7274439 9233192 10215678 3781993
45040C781993r613579k944424L521139J83080o274237m307740L742507O839529
$$ 3781993 -5831586 -8776010 -5254871 -5071791 -11346028 -15653768 -11911261 -5071732
45032e071732L407917J268173K492394J311770l275747n016927k229785j043697
$$ -5071732 -1663815 -395642 2096752 3408522 132775 -4884152 -7113937 -8157634
45024h157634l618184l458591K554210O931091L482465j338813J878623R754102
$$ -8157634 -11775818 -15234409 -12680199 -5749108 -2266643 -3605456 -1726833 8027269
45016H027269J0569277K420160l903712j485217L255877J921070l291232m959429
$$ 8027269 18596546 21016706 17112994 15627777 18883654 20804724 17513492 12554063
45008A2554063k650145j915026m047178m612494j415459K870751O057220Q185816
$$ 12554063 9903918 7988892 3941714 -670780 -2086239 784512 6841732 15027548
45000A5027548P796737L131967k199085k078983J882959J018976o343698j0309587
$$ 15027548 22824285 25956252 23757167 21678184 23561143 24580119 18236421 7926834
44992G926834m472132L097155K268849l030504k001869M573617N762442r66582
$$ 7926834 3454702 6551857 8820706 5790202 3788333 8361950 14124392 13157810
44984A3157810n546974j945829K593866L7712n899478o482228j009044L864544
$$ 13157810 7610836 5665007 8258873 8296585 2397107 -4085121 -5094165 -1229621
44976a229621M292324K518978J540353J320042K89327k125751m712773n381602
$$ -1229621 3062703 5581681 7122034 8442076 8731403 6605652 1892879 -3488723
44968c488723l321123n8127K544100M055957L754876k8701n495764n782295K481228
$$ -3488723 -6809846 -6867973 -4323873 -267916 3486960 3458259 -2037505 -7819800 -5338572
44959e338572J1626846J1242729K598520l357052j932666N83288q55632k987772
$$ -5338572 6288274 17531003 20129523 16772471 14839805 15423093 14567461 11579689
44951A1579689k425422j562490k068796j079691J543359Q12249l430070l452793
$$ 11579689 9154267 7591777 5522981 4443290 5986649 6798898 3368828 -83965
44943h3965K951261N688416k187608j1168426q508943K232009P280309L504987
$$ -83965 2867296 8555712 6368104 -4800322 -13309265 -11077256 -3796947 -291960
44935b91960J13629J862544L566663J533243j133121k185607l294864l911870
$$ -291960 -178331 1684213 5250876 6784119 5650998 3465391 170527 -3741343
44927c741343j215803K423887J094885l888701m215751K109805P165679O001387
$$ -3741343 -4957146 -2533259 -1438374 -5327075 -9542826 -7433021 -267342 5734045
44919E734045L509205L922639K994033k823589p599924m442338L023817N779490
$$ 5734045 9243250 13165889 16159922 13336333 5736409 1294071 4317888 10097378
44911A0097378J944538l273189o731380q767136p820382j754666N764183P505829
$$ 10097378 12041916 8768727 2037347 -6729789 -14550171 -16304837 -10540654 -3034825
44903c034825K569386j766000r328M429964M738608J1676m069231k652162K519000
$$ -3034825 -465439 -2231439 -2240767 2189197 6927805 6939481 2870250 218088 2737088
44894B737088N056764J086514n881924q027282j800855P418136J0472527L875021
$$ 2737088 7793852 8880366 2998442 -5028840 -6829695 588441 11060968 14935989
44886A4935989o872000j2947675j0110450j375778O551170Q854401N633851Q22210
$$ 14935989 8063989 -4883686 -14994136 -16369914 -9818744 -964343 4669508 5491718
44878E491718j383590J55944K584747J686523l170513p041852m693883J941777
$$ 5491718 4108128 4264072 6848819 8535342 5364829 -1677023 -6370906 -4429129
44870d429129N142883J825266j650494J190954O755385O546963K70563l689996
$$ -4429129 713754 2539020 888526 2079480 8834865 15381828 15652391 11962395
44862A1962395j108622K344285P61369l270038m018916j776202j300171l822552
$$ 11962395 10853773 13198058 13959427 10689389 6670473 4894271 3594100 -228452
44854b28452n616369l604928J137530N002357M886472Q19966k924125j508576
$$ -228452 -5844821 -9449749 -8312219 -3309862 1576610 2396576 -527549 -2036125
44846b036125L920036O249816J461612n555335p712091n022236k460353j161141
$$ -2036125 1883911 8133727 9595339 4040004 -3672087 -8694323 -11154676 -12315817
44838a2315817J980297O647486P720910L136163k376348m035467l022822k542029
$$ -12315817 -10335520 -3688034 4032876 7169039 4792691 757224 -2265598 -4807627
44830d807627j775968J782199O358938P316451M069221R45661L36571o33750m209882
$$ -4807627 -6583595 -4801396 1557542 8873993 12943214 13888875 14225446 13591696 9381814
44821I381814o463178k041901O822806J0899016M864530n841767j1424941q658111
$$ 9381814 2918636 876735 7699541 18598557 23463087 17621320 6196379 -2461732
44813b461732k597883J034852J538826J179284Q79887r5977j776837k874889k475549
$$ -2461732 -5059615 -4024763 -2485937 -1306653 -426766 -522743 -2299580 -5174469 -7650018
44804g650018j187747k15770J98613O92051J122570K78516j583755j332145L066785
$$ -7650018 -8837765 -9053535 -8854922 -8162871 -7040301 -6761785 -8345540 -9677685 -6610900
44795f610900P614555N440073l658100j0932857q987081j005400M155835L336409
$$ -6610900 1003655 6443728 2785628 -8147229 -17134310 -18139710 -13983875 -10647466
44787a0647466Q65922Q48482K802299M457025M366254J842602j953734l520003
$$ -10647466 -9781544 -8933062 -6130763 -1673738 2692516 4535118 2581384 -938619
44779i38619j307734R39260m32050k290623O84184O365832P401611K550842j983826
$$ -938619 -2246353 -1307093 -1739143 -4029766 -3345582 3020250 10421861 12972703 10988877
44770A0988877k794795k510787k051279R11495L865050M42838o814901o202411
$$ 10988877 8194082 5683295 3632016 4543511 8408561 8851399 2036498 -4165913
44762d165913M438550J0547327J840908j0249061q746889L499832R404243L567656
$$ -4165913 272637 10819964 12660872 2411811 -6335078 -2835246 6568997 10136653
44754A0136653l161686l407790j746650j742066P94540O855100Q898272K816499
$$ 10136653 6974967 3567177 1820527 78461 873001 7728101 16626373 19442872
44746A9442872m475448n795667l724641l440437l150347Q46054N429272M894592
$$ 19442872 14967424 9171757 5447116 2006679 -1143668 -297614 5131658 10026250
44738A0026250K27941k871312k814336k854499m557174n790670m553821j051838
$$ 10026250 10254191 7382879 4568543 1714044 -2843130 -8633800 -13187621 -14239459
44730a4239459L256351O116013N564956K742592J350363K248533J750857j987690
$$ -14239459 -10983108 -4867095 697861 3440453 4790816 7039349 8790206 6802516
44722F802516m600138j653116L785634M756783J53757m028150l105048P58233
$$ 6802516 2202378 549262 4334896 9091679 9245436 5217286 2112238 2870471
44714B870471K421703L38125k426363k729764j393238j669822l862100l956328
$$ 2870471 5292174 5630299 3203936 474172 -919066 -2588888 -6450988 -10407316
44706a0407316L59704M992099M688989P41405j948694l414739o711891q640146
$$ -10407316 -10047612 -5055513 -366524 374881 -1573813 -4988552 -11700443 -20340589
44698b0340589k615859P595314Q817096j586948q531987r88493R787726O695673
$$ -20340589 -22956448 -15361134 -6544038 -8130986 -16662973 -17651466 -7863740 -1168067
44690a168067o357963r970908J488968J2633513J0634530J102822m474467m513846
$$ -1168067 -7526030 -17496938 -16007970 -3374457 7260073 8362895 3888428 -625418
44682f25418l402846j642531J691762L268057K04321l812600l582228j14730K108770
$$ -625418 -4028264 -5670795 -3979033 -710976 -506655 -4319255 -7901483 -8016213 -5907443
44673e907443K176875J854489Q83236j515111l109293j814385j17662j246748
$$ -5907443 -3730568 -1876079 -992843 -2507954 -5617247 -7431632 -7549294 -8796042
44665h796042k925339m84737M892655O764288K685513k039847j550830K971174
$$ -8796042 -11721381 -12206118 -7313463 -549175 2136338 96491 -1454339 1516835
44657A516835N123761J401996m185334m317413K493840Q405761M904846n268241
$$ 1516835 6640596 8042592 3857258 -460155 2033685 10439446 15344292 10076051
44649A0076051r678689j912485R146720J0301019P30428q245694q395658l020267
$$ 10076051 397362 -1515123 7631597 17932616 18663044 10417350 2021692 -998575
44641i98575M23742J32050n76593J78240O76814r04850l509024m368666k279140
$$ -998575 -574833 -442783 -1019376 -841136 -164322 -1069172 -4578196 -8946862 -11226002
44632a1226002J154141L740554N175236O012958N257462J765971k201211k655530
$$ -11226002 -10071861 -6331307 -1156071 4856887 10114349 11880320 9679109 7023579
44624G023579k8942O18526k476689m335433j160700K852314J709022k886051m228823
$$ 7023579 6994637 7613163 5136474 801041 -359659 2492655 4201677 1315626 -2913197
44615b913197o27755L410347M672250L795198J176625l226691o079240l304330
$$ -2913197 -3540952 -130605 4541645 8336843 9513468 6286777 207537 -3096793
44607c096793K499503L680542j668451o508414m777113J000129M738948M357325
$$ -3096793 -597290 3083252 1414801 -5093613 -9870726 -8870597 -4131649 225676
44599B25676J373904k258273l750951m90919N130840O312816R84878m009151k212726
$$ 225676 1599580 -658693 -4409644 -4900563 230277 6543093 7527971 3518820 1306094
44590A306094L065579L950246n70112m322713l510696r54194p12794k745619l793102
$$ 1306094 4371673 8321919 7751807 3429094 -81602 -1035796 -1748590 -4494209 -8287311
44581h287311j317587L549309O048670K323397n067671q863976n857118m25082
$$ -8287311 -9604898 -6055589 -6919 2316478 -2751193 -11615169 -17472287 -17897369
44573a7897369K713731M559099O956941O760070R32622n999152o614885j101546
$$ -17897369 -15183638 -10624539 -3667598 3092472 4025094 -1974058 -8588943 -9690489
44565i690489L452012L337552J390633K51216q96565k033877q50726K637000M814311
$$ -9690489 -6238477 -2900925 -1510292 -1259076 -2155641 -4189518 -5040244 -2403244 2411067
44556B411067L470875K44348k686051m398882l566700L44342L861587K570735
$$ 2411067 5881942 6126290 3440239 -958643 -4525343 -4181001 -319414 2251321
44548B251321j922905l429864m93413J619149r7900j698556M33893L401286K923481
$$ 2251321 328416 -3101448 -3594861 -1975712 -2073612 -3772168 -3338275 63011 2986492
44539B986492N9545j356537l70735J612605L539517L660040l27227o437812p741316
$$ 2986492 3046037 1689500 1318765 2931370 6470887 10130927 9803700 3365888 -4375428
44530d375428j049912P065646P783820J047415n532461o598757l244043R81821
$$ -4375428 -5425340 1640306 9424126 10471541 4939080 -1659677 -4903720 -3921899
44522c921899L593749L548366J901687J374937K504675J987305k143147o150393
$$ -3921899 -328150 3220216 5121903 6496840 9001515 10988820 8845673 2695280
44514B695280n371838j254315Q15536p72294k674278k086270N35601L166010L159572
$$ 2695280 -2676558 -3930873 -3115337 -3887631 -6561909 -8648179 -8112578 -4946568 -1786996
44505a786996j568323q400271r673908j658406Q446055J0573719M967580K90264
$$ -1786996 -3355319 -11755590 -21429498 -23087904 -14641849 -4068130 899450 1189714
44497A189714j0340q22397m335853n231906k89160N159563N234875J757676n28682
$$ 1189714 1179374 356977 -3978876 -9210782 -9499942 -4340379 894496 2652172 2123490
44488B123490j507175k965876l105081P08K984741J639506j715382j737078Q14482
$$ 2123490 616315 -2349561 -5454642 -5453934 -2469193 -829687 -2545069 -4282147 -3467665
44479c467665K74706m033693n985628k025081L609041N407941L505951J224308
$$ -3467665 -3192959 -7226652 -13212280 -15237361 -11628320 -6220379 -2714428 -1490120
44471a490120j71834q14052L06345L059434L668107p83069o328522n766692R89063
$$ -1490120 -1661954 -2476006 -2169661 889773 4557880 3774811 -2553711 -8320403 -7331340
44462g331340N334811J402343n340795n532320Q89185N159569K930919J9157K230201
$$ -7331340 -1996529 -594186 -5934981 -11467301 -10578116 -5418547 -2487628 -2468471 -238270
44453b38270N751928L379590l532234o465486k161105L196511L410933p5759k572521
$$ -238270 5513658 8893248 5361014 -1104472 -3265577 -69066 3341867 3266108 693587
44444F93587l160978l482898l124263p54085K026196K252094K83935p60026n1820
$$ 693587 -2467391 -5950289 -9074552 -9828637 -7802441 -5550347 -5266412 -6026438 -6078258
44435f078258l2028j818858k886268q71652K610461M012132K477229M19737j3264
$$ -6078258 -6110286 -7929144 -10815412 -11687064 -9076603 -5064471 -2587242 -2167505 -2180769
44426b180769R16356K068542L011268K930597j54867o583178j2139021j1075991
$$ -2180769 -1264413 804129 3815397 6745994 6591127 7949 -12131072 -23207063
44418b3207063k922495O213454J0303960Q873083M531822j339723p178926q644966
$$ -23207063 -26129558 -19916104 -9612144 -739061 3792761 2453038 -4725888 -13370854
44410a3370854k698377O495249J0629887O741191j42780l962572l270069J65346
$$ -13370854 -16069231 -9573982 1055905 7797096 7654316 3691744 421675 587021
44402E87021L689116L876438p34296n503231l433710M658815R146700M249910
$$ 587021 4276137 8152575 7418279 1915048 -1518662 3140153 12286853 16536763
44394A6536763l646904n342436j828737j254701n710762q719201n834900q43449
$$ 16536763 12889859 7547423 5718686 4463985 -1246777 -9965978 -15800878 -16644327
44386a6644327P01681q34980q86447K698361P279425Q601564N218509K53433j569591
$$ -16644327 -15942646 -16777626 -17664073 -14965712 -7686287 915277 6133786 6387219 4817628
44377D817628M93917J944839q74741n243032n664493j712562J666380J447364
$$ 4817628 5311545 7256384 6381643 1138611 -4525882 -6238444 -4572064 -3124700
44369c124700M1300O94667K991056M478827L998034J764003j629454m681757n228113
$$ -3124700 -3083400 -2388733 602323 5081150 9079184 10843187 9213733 4531976 -696137
44360f96137k801871K96043J309289l06550k745860l428089j020143K747872L988888
$$ -696137 -3498008 -3201965 -1892676 -2199226 -4945086 -8373175 -9393318 -6645446 -2656558
44351b656558J367839j071008J132648N630080N266223j758153q156566o632589
$$ -2656558 -1288719 -2359727 -1227079 4403001 9669224 7911071 -245495 -6878084
44343f878084P20145N618103M043417l19981k222235o75635J891299L379710L273600
$$ -6878084 -6157939 -539836 3503581 3183600 961365 285730 2177029 5556739 8830339
44334H830339J597811j398836m266128m402492o63478M032885M709613L86069
$$ 8830339 10428150 9029314 4763186 360694 -302784 3730101 8439714 8825783
44326H825783l643090k158810K650357L955201J66101k632473J75645M683232
$$ 8825783 5182693 3023883 5674240 9629441 9795542 7163069 7338714 12021946
44318A2021946M263507o44873l444965j118400J811051K06096m423727o129122
$$ 12021946 16285453 15640580 12195615 11077215 12888266 13094362 8670635 2541513
44310B541513k429036K525694K981448j687130o437433o465368k217993K220799
$$ 2541513 112477 2638171 5619619 3932489 -2504944 -8970312 -11188305 -8967506
44302h967506M249859M388343L818856L007082K570145K589436R70779l927905
$$ -8967506 -4717647 -329304 3489552 6496634 9066779 11656215 12626994 8699089
44294H699089q451709o144162K658995Q658525N157901k473325m576695j035468
$$ 8699089 247380 -5896782 -3237787 5420738 10578639 8105314 3528619 2493151
44286B493151J84578l144489m106525J042305N512735J930488o257473r540798
$$ 2493151 2677729 -466760 -4573285 -3530980 1981755 3912243 -2345230 -11886028
44278a1886028n094642J325559M446881M557617L756984K337400J45310j944868
$$ -11886028 -16980670 -15655111 -11208230 -6650613 -2893629 -556229 -410919 -2355787
44270b355787l145576l137304j204773K542205N342307M282186O89713j346161
$$ -2355787 -5501363 -8638667 -9843440 -7301235 -1958928 2323258 3012971 1666810
44262A666810j088883j739576l967018l702253Q53256M515271J990266l551943
$$ 1666810 577927 -1161649 -5128667 -8830920 -7977664 -3462393 -1472127 -5024070
44254e024070m340530P73503M804574L011961p32384n75730K642749L584161J087179
$$ -5024070 -9364600 -8591097 -3786523 -774562 -1506946 -2082676 560073 4144234 5231413
44245E231413j92094K742345O093148M242999j989232n593977k525087K478208
$$ 5231413 5039319 7781664 13874812 18117811 16128579 10534602 8009515 10487723
44237A0487723K023875l634657o697172k725660L168663L856656Q8498j678834
$$ 10487723 12511598 8876941 2179769 -545891 2622772 6479428 6567926 4889092
44229D889092R62235M151648M535294K788232L8972l686041o106563l425012K933067
$$ 4889092 5851327 10002975 14538269 17326501 17365473 13679432 7572869 4147857 7080924
44220G080924N533463N97704o070863p126533l419341m80753Q06961L156670M898873
$$ 7080924 12614387 13212091 7141228 14695 -3404646 -3885399 -3078438 78232 4977105
44211D977105J183413o538210r833146m563564L122396N350544K374571J37480
$$ 4977105 6160518 -377692 -10210838 -14774402 -11652006 -6301462 -3926891 -3789411
44203c789411J545026M301677N444464M361472K096305K05374k06498J12729r35959
$$ -3789411 -2244385 2057292 7501756 11863228 13959533 14164907 13958409 14071138 13135179
44194A3135179l598891m906171k149607L222782O636305M805556j432738p662964
$$ 13135179 9536288 4630117 2480510 5703292 12339597 17145153 15712415 8049451
44186H049451r039108m626721R48258K181485o18905k022996M94127K975771J523964
$$ 8049451 -989657 -5616378 -4668120 -2486635 -3105540 -5128536 -4634409 -1658638 -134674
44177a34674j435272j224567J519752K169082k43133j790472m80852M64300j760441
$$ -134674 -1569946 -2794513 -1274761 894321 651188 -1139284 -1620136 -1155836 -2916277
44168b916277m275374k288166L494294O884148M103641j231097l034757r05430
$$ -2916277 -7191651 -9479817 -5985523 898625 5002266 3771169 736412 -169018
44160a69018L8984k509557m202992j116849L251419L032483n14381j181522J432187
$$ -169018 -130034 -2639591 -6842583 -7959432 -4708013 -1675530 -2189911 -3371433 -1939246
44151a939246J448577j766513r29125N896466Q764762P18174q569655n333720
$$ -1939246 -490669 -2257182 -3186307 2710159 11474921 12193095 3623440 -1710280
44143a710280O784280J0934968J688004q217921q230551l800720l763009n578937
$$ -1710280 5074000 16008968 17696972 9479051 1248500 -2552220 -6315229 -11894166
44135a1894166k529307K866042L533218Q06846J771246O163334O330512p3305
$$ -11894166 -14423473 -11557431 -8024213 -7217367 -5446121 717213 7047725 6974420
44127F974420o539628p681923m763026k83350M949910P714970L705586l867843
$$ 6974420 434792 -7247131 -12010157 -12293507 -7343597 371373 4076959 209116
44119B09116n016705L100382J0395734P896249O44228j295709J012895j451322
$$ 209116 -4807589 -1707207 8688527 16584776 17229004 15933295 16946190 15494868
44111A5494868r045137j1577783m507920L413994L351207r53619m12630N018286
$$ 15494868 6449731 -5128052 -9635972 -6221978 -2870771 -3824390 -4237020 781266
44103G81266P098570K255734l725296m659807j853066o27792k462503l616870
$$ 781266 7879836 10135570 6410274 1750467 -102599 -730391 -3192894 -6809764
44095f809764o88942M470103O273235J993910m159910n693408k421448p17875
$$ -6809764 -7498706 -3028603 3244632 5238542 1078632 -4614776 -7036224 -7754099
44087g754099l539997m907551J103275R663953J0572701K987714l238309k103551
$$ -7754099 -11294096 -16201647 -15098372 -5434419 5138282 8125996 4887687 2784136
44079B784136P97084j196405m840325k862767M001142P984326N085895j247247
$$ 2784136 3581220 2384815 -2455510 -5318277 -1317135 6667191 11753086 10505839
44071A0505839n956657o539454k598343L378072N643478J067145n069513m617484
$$ 10505839 4549182 -1990272 -4588615 -1210543 4432935 5500080 430567 -4186917
44063d186917K304351P420237N714972P41655k206340k035724L32686L788374
$$ -4186917 -1882566 5537671 11252643 11994298 9787958 7752234 8084920 11873294
44055A1873294M882021L37807o039326n849844J612242O948958M332349m42403
$$ 11873294 16755315 17093122 11053796 5203952 6816194 13765152 18097501 17655098
44047A7655098p76654M28454j413244k860919j58916Q81790n417790j1156524
$$ 17655098 16878444 17306898 15893654 13032735 12873819 13755609 8337819 -2818705
44039b818705n281268O359773P478150k786075p584816R79458R950485P173294
$$ -2818705 -8099973 -1740200 5737950 2951875 -4632941 -3653483 6297002 13470296
44031A3470296q07545k711988j012288l623632p367553m105959L212813M764133
$$ 13470296 12662751 9950763 8938475 5314843 -2052710 -6158669 -2945856 1818277
44023A818277K19975k088990J55644J772048J613227L368900N406284K019874
$$ 1818277 2038252 -50738 104906 1876954 3490181 6859081 12265365 14285239
44015A4285239m359649m154641L813161Q871259M137624m288140p804063n915064
$$ 14285239 9925590 5770949 9584110 18455369 22592993 18304853 10500790 4585726
44007D585726j996255K983106P314816O487798k60193o932603q381495n585608
$$ 4585726 2589471 5572577 12887393 19375191 19114998 12182395 3800900 -1784708
43999a784708r38569M722457P855680L510162n253563q062627k043391L309335
$$ -1784708 -2723277 1999180 9854860 13365022 8111459 48832 -1994559 1314776
43991A314776J490498j202070J336635L149294k192882p866626m512182K925670
$$ 1314776 2805274 1603204 2939839 6089133 3896251 -3970375 -8482557 -5556887
43983e556887L158187k303446k945380J590397K010296k381789k106851M592126
$$ -5556887 -2398700 -4702146 -7647526 -6057129 -4046833 -6428622 -8535473 -3943347
43975c943347P737499K810752k277716j878690p96872k297246j046154M818338
$$ -3943347 3794152 6604904 4327188 2448498 1651626 -645620 -1691774 3126564
43967C126564O784640j15359p203478n660550o87868j524451n476792l854265
$$ 3126564 9911204 9795845 2592367 -3068183 -3756051 -5280502 -10757294 -14611559
43959a4611559K150109M049368J051623L68682L931658N956578M001228K447765
$$ -14611559 -12461450 -8412082 -7360459 -6991777 -3060119 2896459 6897687 9345452
43951I345452L514510L519462L88663k491779k610046k300975l515402l904107
$$ 9345452 12859962 16379424 16768087 14276308 11666262 9365287 5849885 1945778
43943A945778j360436J581162J190239k234019n225885n453859l124980O21337
$$ 1945778 585342 2166504 3356743 1122724 -4103161 -9557020 -12682000 -12060663
43935a2060663M827564Q321810R232236O007383n7022m171083k633642J655773
$$ -12060663 -7233099 1088711 10320947 16328330 16271308 12100225 9466583 11122356
43927A1122356J741657l876330q052157m138331M808225R566787N627343k556846
$$ 11122356 12864013 8987683 935526 -3202805 1605420 11172207 16799550 14242704
43919A4242704o925273l410295M295185P673798K689968l883259k346362N404679
$$ 14242704 7317431 3907136 8202321 15876119 18566087 14682828 12336466 17741145
43911A7741145O974788k095132j0220493o459959L375293O574843K356523o16355
$$ 17741145 24715933 22620801 12400308 5940349 9315642 15890485 18247008 17630653
43903A7630653m63154k641562o430268m505827L040166O760915K657550k169381
$$ 17630653 17167499 14525937 8095669 3589842 6630008 13390923 16048473 13879092
43895A3879092k055974m69540r98456p96971J559505R90544m788528q928243n522884
$$ 13879092 11823118 11353578 10355122 9558151 11117656 12108200 7319672 -1608571 -7131455
43886g131455Q04841K769478J919474M254798Q825415R076483L435516k478442
$$ -7131455 -6326614 -3557136 -1637662 2617136 11442551 20519034 23954550 21476108
43878B1476108l441968M38755N242736O205454J273973n443887o944749k692933
$$ 21476108 18034140 18472895 23715631 29921085 31195058 25751171 18806422 16113489
43870A6113489p4673l072502n559789j547144L916784K267741m331295n797317
$$ 16113489 16038816 12966314 7406525 5859381 9776165 12043906 7712611 1915294
43862A915294L95444N920313M487398k13915j759728M28208K904606L830431L445695
$$ 1915294 2310738 8231051 12718449 12504534 10744806 11173014 14077620 17908051 21353746
43853B1353746J769179j455561n554518q588155p904556k462564M009035M910021
$$ 21353746 23122925 21667364 16112846 7524691 -379865 -2842429 1166606 6076627
43845F076627j038373o202424l072547N259138Q978052M532383k160274n025149
$$ 6076627 5038254 -1164170 -4236717 1022421 10000473 14532856 12372582 7347433
43837G347433m081780j721047J034279K671717J188747j476507n0138N889880
$$ 7347433 3265653 1544606 2578885 5250602 6439349 4962842 4912704 10802584
43829A0802584Q985585L592860n304389p715695j491999N424586N700926J192296
$$ 10802584 19788169 23381029 18076640 10360945 8868946 14293532 19994458 21186754
43821B1186754j211455M70754J248975k607991o783600l983148N138744J1013716
$$ 21186754 19975299 20446053 21695028 19087037 12303437 8320289 13459033 24472749
43813B4472749P120667j409130n024847k158393J038807J240637J405728L432100
$$ 24472749 31593416 30184286 25159439 23001046 24039853 25280490 26686218 30118318
43805C0118318M176207J434510j514008j142855M24094r64722m367811m641850
$$ 30118318 34294525 35729035 34215027 33072172 33496266 32531544 28163733 23521883
43797B3521883K41399O287235Q238209M999668j50053l237973k856241n92894
$$ 23521883 23763282 30050517 38288726 43288394 43138341 39900368 37044127 36451233
43789C6451233R43312L27545j916725l714311k603393J736946N432156L420807
$$ 36451233 37394545 37722090 35805365 32091054 29487661 31224607 36656763 40077570
43781D0077570l465519p192626k004190O810684Q694346J771700m727150l179244
$$ 40077570 36612051 29419425 27415235 34225919 42920265 44691965 39964815 36785571
43773C6785571K929939N218571J575865l125546m673028l355489j188368Q46608
$$ 36785571 39715510 44934081 46509946 43384400 38711372 35355883 34167515 35014123
43765C5014123K400807K927430K008698r5509k040275j674605J784901N607560
$$ 35014123 37414930 40342360 42351058 42255549 40215274 38540669 40325570 45933130
43757D5933130N672383J602735k304131k361789M08246K643524K762802J220734
$$ 45933130 51605513 53208248 50904117 48542328 48950574 51594098 54356900 55577634
43749E5577634r01822j649498J005320N687244P197821K561848m112861n933314
$$ 55577634 54675812 53026314 54031634 59718878 66916699 69478547 65365686 59432372
43741E9432372j405589M510251O766813M887143J704090Q2472J013455L196374
$$ 59432372 58026783 62537034 69303847 74190990 75895080 75977552 76991007 80187381
43733H0187381M605060N309914P259086J0040987R675915M527639l84475N23246
$$ 80187381 84792441 90102355 97361441 107402428 117078343 121605982 121221507 121744753
43725A21744753M962039O091427L459492L774129R407743J3213308Q842225O64656
$$ 121744753 126706792 132798219 136257711 140031840 149439583 162652891 171495116 172159772
43717A72159772k166291K103869P599300J0479315J2227609J3712815J2629747
$$ 172159772 169993481 172097350 179696650 190175965 202403574 216116389 228746136
43710B28746136Q678672N925049P055244R324687R523568R525364J2638308J6710699
$$ 228746136 237424808 243349857 250405101 259729788 269253356 278778720 291417028 308127727
43702C08127727J6006067R757257M105137M013749O968241P302042M176497J639814
$$ 308127727 324133794 333891051 337996188 342009937 348978178 356280220 360456717 362096531
43694C62096531J616391Q62178l627576r128234j0201506o176264k198816k377933
$$ 362096531 363712922 364575100 360947524 351819290 341617784 335441520 333242704 330864771
43686C30864771n355216q359093j1788474j5888209j6134122q455054J660814
$$ 330864771 325509555 317150462 305361988 289473779 273339657 264884603 266545417
43679B66545417K906976o758753j5963673j5142323r153036q228801j2313629
$$ 266545417 269452393 262693640 246729967 231587644 222434608 214205807 201892178
43672B01892178j3556375j0676106r872860j2029376j0335084l048122J851065
$$ 201892178 188335803 177659697 167786837 155757461 145422377 142374255 144225320
43665A44225320q48669n845813p653294r540826j4596475j6235577p883762L629589
$$ 144225320 143376651 137530838 129877544 120336718 105740243 89504666 81620904 85250493
43657H5250493N783759j497301o716827m672995j907979l141805l699903K98913
$$ 85250493 91034252 89536951 82820124 78147129 76239150 73097345 69397442 69696355
43649F9696355L815484J312811l541034l580846P77187K906676J16910l678800
$$ 69696355 73511839 74824650 71283616 67702770 68479957 71386633 71503543 67824743
43641F7824743m878067m593315n015767n011744j920712L329382N660323K029359
$$ 67824743 62946676 58353361 53337594 48325850 46405138 49734520 55394843 57424202
43633E7424202l361963l572765J167137K916807k168480p052162m168831K328047
$$ 57424202 54062239 50489474 51656611 54573418 52404938 45352776 41183945 43511992
43625D3511992K716016k752197m191507K109553Q217321P354410K979266P86748
$$ 43511992 46228008 43475811 39284304 41393857 49611178 56965588 59944854 60731602
43617F0731602k93928l359823o185372n046436j501578M45191N97339J037546
$$ 60731602 60437674 57077851 50892479 45846043 44344465 44789656 45386995 46424541
43609D6424541J468349N73008q21373j684543k671296k946061L95902N962377
$$ 46424541 47892890 48465898 47644525 45959982 43288686 40342625 40738527 46700904
43601D6700904O541410o64303p403946m758479L851450P400732K155602n494970
$$ 46700904 53242314 52578011 45174065 40415586 44267036 51667768 53823370 48328400
43593D8328400q992119p157142j389015N445075Q292874M958865R24179K345009
$$ 48328400 39336281 32179139 30790124 36235199 44528073 49486938 50411117 52756126
43585E2756126N719413K686638n545718q089679l81027Q747315R570962L467834
$$ 52756126 58475539 61162177 55616459 47526780 47145753 55893068 65464030 68931864
43577F8931864j874143k778500l34687L846183P578040P709946M241548J679891
$$ 68931864 67057721 64279221 63944534 67790717 75368757 83078703 87320251 89000142
43569H9000142K765427M322277K827053K61162K56722J949816K436600K452935
$$ 89000142 91765569 96087846 98914899 99176061 99432783 101382599 103819199 106272134
43561A06272134M405710O860844O596325N137248P420886J3354987J6026724J0661114
$$ 106272134 110677844 117538688 124135013 129272261 136693147 150048134 166074858 176735972
43553A76735972J712358k076912K022837Q194206R508498N447549Q51535j063311
$$ 176735972 178448330 176371418 178394255 186588461 196096959 201544508 202396043 201332732
43545B01332732j898197l755832m900869k877851j09071j538601o340545p236642
$$ 201332732 199434535 195678703 190777834 187899983 187790912 186252311 179911766 172675124
43537A72675124p70486O174622M625796m377185j1105037r648758l981774r93889
$$ 172675124 171904638 178079260 182705056 178327871 167222834 157574076 153592302 152598413
43529A52598413k295676n001467o813716p253931o338031n272888o793556j1408170
$$ 152598413 150302737 145301270 138487554 131233623 124895592 119622704 112829148 101420978
43521A01420978j4455059j0874900k764197K147526N27038k627431k404321j512871
$$ 101420978 86965919 76091019 73326822 75474348 76001386 73373955 70969634 69456763
43513F9456763m750384r596454r010323k515970K481498J446551j759673k561400
$$ 69456763 64706379 55109925 46099602 43583632 46065130 47511681 45752008 43190608
43505D3190608k666884n064331o950105l463173L978740Q472374O063038m40817
$$ 43190608 40523724 35459393 28509288 25046115 29024855 37497229 43560267 43119450
43497D3119450n481261n674275j701831K170881J679547k328990m370084j780537
$$ 43119450 37638189 31963914 30262083 32432964 34112511 31783521 27413437 25632900
43489B5632900J512877J354453n81526j101819j489950l542113l616494J945074
$$ 25632900 27145777 28500230 27918704 26816885 25326935 21784822 18168328 20113402
43481B0113402Q102988O370400j969612o563363k788907K496595K345563q93504
$$ 20113402 28216390 34586790 32617178 26053815 23264908 25761503 28107066 27213562
43473B7213562j437735R61215K621577K283112J611235J973481L572314N743157
$$ 27213562 25775827 26737042 29358619 31641731 33252966 35226447 38798761 44541918
43465D4541918O754199N643608M380942N007611N430729K713590n51779L22920
$$ 44541918 51296117 56939725 61320667 66328278 71759007 74472597 73920818 74243738
43457G4243738K736724q73480r867564j3560512o309921L765256O235252J386821
$$ 74243738 76980462 76106982 66239418 52678906 46368985 50134241 56369493 57756314
43449E7756314l705595n477467m180470m4093M262210K807965n161852j1038183
$$ 57756314 54050719 48573252 44392782 44348689 48610899 51418864 46257012 35218829
43441C5218829p956944r36563J462488J31625J178860L562618J578465l169032
$$ 35218829 27261885 26325322 27787810 27919435 29098295 32660913 34239378 31070346
43433C1070346l395242J166419L379842J300134O52039L230761L245236j542900
$$ 31070346 27675104 28841523 32221365 33521499 34173538 37404299 40649535 39106635
43425C9106635m651301j619726K243128N51388m288680n962440l843822j518564
$$ 39106635 34455334 32835608 35078736 35630124 31341444 25379004 21535182 20016618
43417B0016618L94482L538988O109022L893738l115123r487637j0368137o244824
$$ 20016618 20411100 23950088 30059110 33952848 30837725 21350088 10981951 4737127
43409D737127j470192L28951p83507j854911p62070J238242J583421K09948o51031
$$ 4737127 3266935 3595886 2812379 957468 195398 1433640 3017061 3227009 2575978
43400B575978O9102J364461K305461K585117J427681j154236k582934n94629K562344
$$ 2575978 2645080 4009541 6315002 8900119 10327800 9173564 6590630 5996001 8558345
43391H558345K681852O2351j017122O74966J874513J084009P29883J455543K4491
$$ 8558345 11240197 11302548 10285426 10960392 12834905 13918914 14648797 16104340 16128831
43382A6128831m363221p168783n530157l088242l494920l906913l49584M395232
$$ 16128831 11765610 4596827 -933330 -4021572 -7516492 -11423405 -11772989 -7377757
43374g377757M610656Q52293j156114M26175J967990J606039J812902L612707
$$ -7377757 -2767101 -1914808 -3070922 -2644747 -676757 929282 2742184 6354891
43366F354891L861862P00931k566395j994546J367823L044855P42395l470593
$$ 6354891 10216753 10917684 8351289 6356743 7724566 10769421 11511816 8041223
43358H041223n514401k983393K153915M336056J18478o557750p843059j787019
$$ 8041223 2526822 -456571 1697344 6033400 6151878 -405872 -8248931 -10035950
43350a0035950M860063N720718K733621J228593P06832l176791q793447q323500
$$ -10035950 -5175887 544831 3278452 4507045 5213877 2037086 -6756361 -15079861
43342a5079861N89413R554124R983452L894106r77868k521929l898540m777545
$$ -15079861 -14490448 -4936324 5047128 8941234 7963366 5441437 1542897 -3234648
43334c234648j610355L373195K463129n294110j0153614n023952L815905N958174
$$ -3234648 -4845003 -1471808 991321 -4302789 -14456403 -19480355 -15664450 -9706276
43326i706276J810006K88733M333892P365770M280734j648820m794160m171276
$$ -9706276 -7896270 -7607537 -3273645 4092125 8372859 6724039 1929879 -2241397
43318b241397j905990O96224K849278L470834K971280L111221L467195J176158
$$ -2241397 -4147387 -3451163 -601885 2868949 5840229 8951450 12418645 13594803
43310A3594803l803408o369112k378436M651759O303309r45531j0535824j1897938
$$ 13594803 9791395 3422283 1043847 5695606 11998915 11053384 517560 -11380378
43302a1380378k157064R358246J0762931J808144n640861l208491L275757L642325
$$ -11380378 -13537442 -4179196 6583735 8391879 2751018 -457473 2818284 6460609
43294F460609j214243k379720J292865J337153n062586q773107k671311O805994
$$ 6460609 5246366 2866646 4159511 5496664 434078 -8339029 -11010340 -4204346
43286d204346Q966531L448965j785890k433366l82606K439458N224578N110082
$$ -4204346 4762185 8211150 6425260 3991894 3609288 6048746 11273324 16383406
43278A6383406o187o106876o816386k345609J069206M98703r13545r07416j349841
$$ 16383406 16377219 10270343 3453957 1108348 2177554 2676257 1762712 855296 -494545
43269d94545k641564j055122M667594Q783126N406402k725019p078981l968160
$$ -494545 -3136109 -4191231 476363 9259489 14665891 11940872 4861891 893731
43261H93731J793941L985820J851103j602445m856785q101212r640641o398462
$$ 893731 2687672 6673492 8524595 6922150 2065365 -6035847 -15676488 -22074950
43253b2074950Q17072O102016N303905J714305J415976M551376N619364K127689
$$ -22074950 -21257878 -15155862 -9851957 -8137652 -6721676 -2170300 3449064 5576753
43245E576753j785638j512536K226906N381417N106002R58039n130886q808163
$$ 5576753 3791115 2278579 4505485 9886902 14992904 15950943 10820057 2011894
43237B011894o763498j542412Q71714o62962j311545J237701L179746K229880
$$ 2011894 -4751604 -6294016 -5422302 -6085264 -7396809 -6159108 -2979362 -749482
43229g49482K122238M882141N210940q82408p382290o037120J185202N577194
$$ -749482 1372756 6254897 11465837 10583429 3201139 -2835981 -1650779 3926415
43221C926415M544095K422952P49068k979524p476909p687541l286284P72239
$$ 3926415 8470510 10893462 11642530 8663006 1186097 -6501444 -9787728 -9015489
43213i015489K585130M250612M568227J04305n518667l696109N106902R712658
$$ -9015489 -6430359 -2179747 2388480 2492785 -3025882 -6721991 -1615089 8097569
43205H097569M723730j738471k362719k004643o531560j0144019m924651M045701
$$ 8097569 12821299 11082828 8720109 6715466 183906 -9960113 -14884764 -10839063
43197a0839063N541646J3291j984549K557522N408948J804726k671949k870312
$$ -10839063 -5297417 -5284126 -7268675 -4711153 697795 2502521 -169428 -3039740
43189c039740j757137k816726k993745J126845O106183O419292K481403j017373
$$ -3039740 -4796877 -7613603 -10607348 -9480503 -3374320 3044972 5526375 4509002
43181D509002j822904r62730O03835K291039K649685R93625j234212k912785m897617
$$ 4509002 2686098 1723368 2327203 4618242 7267927 8261552 7027340 4114555 -783062
43172g83062p189394p429549m975767l237259m253805m124993J155178P688302
$$ -783062 -7972456 -15402005 -20377772 -23615031 -27868836 -31993829 -30838651 -23150349
43164b3150349P810584J694912j900553J924346P172057N894637n48219m083930
$$ -23150349 -15339765 -13644853 -15545406 -13621060 -6449003 -554366 -1102585 -5186515
43156e186515j098920M211934O891051O694554N576328L720660N34886k612514
$$ -5186515 -6285435 -2073501 4817550 11512104 17088432 20809092 21343978 18731464
43148A8731464l448293k185316j774950m093929o931923o037051m48022N281730
$$ 18731464 15283171 13097855 11322905 7228976 297053 -5739998 -6188020 -906290
43140i06290N696949J115103k536040j586032L24893k016178o541136n662058
$$ -906290 4790659 5905762 3369722 1783690 2108583 92405 -6448731 -12110789
43132a2110789K589856J0208824Q985503J087073m242678k572695J672623K610257
$$ -12110789 -9520933 687891 9673394 10760467 6517789 3945094 5617717 8227974
43124H227974j27300l002790l791255l180865k982177m234407o000573n553763
$$ 8227974 8100674 5097884 1306629 -1874236 -4856413 -9090820 -15091393 -20645156
43116b0645156j369864L806861N294766K704433R83530L422922O506468M926963
$$ -20645156 -22015020 -18208159 -12913393 -10208960 -9225430 -5802508 703960 5630923
43108E630923k71281k851851m16883K116462k88301n498892p087560k832253K892762
$$ 5630923 5359642 2507791 2090908 4207370 3919069 -1579823 -8667383 -11499636 -8606874
43099h606874N181781M199143L332790L584093K273492k572217q613791j1340592
$$ -8606874 -3425093 774050 4106840 7690933 9964425 7392208 -1221583 -12562175
43091a2562175q822963k838720L970734R820168J2657365J0341047L797839k156286
$$ -12562175 -21385138 -24223858 -20253124 -10432956 2224409 12565456 16363295 14207009
43083A4207009l818580l130086m244613o566089n288677O48960N591453M518845
$$ 14207009 10388429 7258343 3013730 -3552359 -8841036 -8192076 -2600623 1918222
43075A918222j36436k404544r94580M17287l65615j711675j976081j528678n25496
$$ 1918222 1781786 -622758 -1617338 -1200051 -1565666 -3277341 -5253422 -6782100 -7307596
43066g307596J536560L305317K478337L01633R24196M374997M782999r60531o814996
$$ -7307596 -5771036 -2465719 12618 314251 1238447 5613444 10396443 9435912 2620916
43057B620916m876281L236514P708110K935911n904341r531535m724295L166483
$$ 2620916 -2255365 981149 8689259 11625170 5720829 -3810706 -8535001 -5368518
43049e368518O197651K001289l530687l024703K693191N238141N48988n041856
$$ -5368518 829133 2830422 -700265 -3724968 -1031777 4206364 4755352 -286504
43041b86504m650425j251219j507753l803846j620211L680323M083185j055354
$$ -286504 -4936929 -6188148 -7695901 -11499747 -13119958 -9439635 -5356450 -6411804
43033f411804l100735J515290N502669L213783q10276j002082M86542K53722N00242
$$ -6411804 -9512539 -7997249 -2494580 719203 -91073 -1093155 -606613 -352891 147351
43024A47351K704317K448265k075644m317030l48766K546040j924609o369575
$$ 147351 2851668 5299933 3224289 -1092741 -1441507 1104533 -820076 -7189651
43016g189651j484780O322300L830635o567224r426852n18944P392999N291215
$$ -7189651 -8674431 -2352131 1478504 -5088720 -14515572 -15034516 -7641517 -2350302
43008b350302m20955j595340n26976k080972m380403m153285k916644k159767
$$ -2350302 -2771257 -4366597 -4893573 -6974545 -11354948 -15508233 -18424877 -20584644
43000b0584644j01494K328134Q28663k649407N41848J0966235J6220700Q343480
$$ -20584644 -20686138 -18358004 -17529341 -20178748 -19636900 -8670665 7550035 15893515
42992A5893515l654173p562388n102191m755940n724395j810502M271726M145428
$$ 15893515 12239342 4676954 -425237 -5181177 -10905572 -12716074 -8444348 -4298920
42984d298920j153775k260752K746416N602902K168541j472859k85040J671918
$$ -4298920 -5452695 -7713447 -4967031 635871 2804412 1331553 1046513 2718431
42976B718431r64481n796635o400885j299573M542090N422859O09466m515766
$$ 2718431 1753950 -4042685 -10443570 -11743143 -7201053 -1778194 -1168728 -5684494
42968e684494l723240K034911M445820j210092q417383p821097k31315N203455
$$ -5684494 -9407734 -7372823 -2927003 -4137095 -12554478 -20375575 -20606890 -15403435
42960a5403435L873708k00264k275244j997227o47560N00687q34284m762775n904041
$$ -15403435 -11529727 -11729991 -14005235 -16002462 -16650022 -16149335 -16983619 -21746394 -27650435
42951b7650435J04144P878290Q104734J711748j058452L138586N661138N41997
$$ -27650435 -27546291 -19668001 -11563267 -9851519 -10909971 -7771385 -2110247 -1568250
42943a568250n606883m398916J631880M554927L423445L256082N261625N580198
$$ -1568250 -7175133 -11574049 -9942169 -5387242 -1963797 1292285 6553910 12134108
42935A2134108K272983k347333n609335o279909l582234J433603M432087J693929
$$ 12134108 14407091 12059758 6450423 170514 -3411720 -1978117 2453970 4147899
42927D147899m590894p924382m599106K632477P765065P160650K440049j458682
$$ 4147899 -442995 -8367377 -12966483 -10334006 -2568941 4591709 7031758 5573076
42919E573076j517915M35841J097510L66360j10710j265036m778748p767288n129064
$$ 5573076 4055161 4491002 5588512 5954872 5844162 4579126 -199622 -7966910 -13095974
42910a3095974K208344P306540O774779M298692L027759J241040j711778k312060
$$ -13095974 -10887630 -3581090 3193689 7492381 10520140 11761180 10049402 7737342
42902G737342K52126R27339k652123n054783k023131K049319K012474O20292J645170
$$ 7737342 7989468 8916807 6264684 1209901 -813230 1236089 3248563 3868855 5514025
42893E514025J144956m622972q490414j705584R572367J0473415n59993r313242
$$ 5514025 6658981 2036009 -6454405 -8159989 1412378 11885793 11325800 2012558
42885B012558p065760j218585n20899k074936l6944L015035K173159N0229J356583
$$ 2012558 -5053202 -6271787 -6792686 -8867622 -8904566 -5889531 -3716372 -3666143 -2309560
42876b309560L174783L0227m982447l662261M062750R117157O136158P4295j931948
$$ -2309560 865223 895450 -4086997 -7749258 -3686508 5430649 11566807 11641102 9709154
42867I709154K91506J589819j307815o586540r610569p368193j712192K319731
$$ 9709154 10000660 11590479 10282664 3696124 -5914445 -13282638 -14994830 -12675099
42859a2675099K709847L102870O603954R365567N256668l943443q878961m520191
$$ -12675099 -9965252 -6862382 -258428 9107139 14363807 10420364 1541403 -2978788
42851b978788L351307O114824K529873k333607m786711m699722k167816K875874
$$ -2978788 372519 6487343 9017216 6683609 1896898 -2802824 -4970640 -2094766
42843b094766P723028P881258K435555m222413p232570n805005k123652J818979
$$ -2094766 5628262 13509520 15945075 11722662 4490092 -1314913 -3438565 -1619586
42835a619586M670467N030720K588218r67626l828256n820825o705702m480689
$$ -1619586 3050881 8081601 10669819 9702193 5873937 53112 -6652590 -11133279
42827a1133279J611996P405925P239812J738774j861710Q08938N118311M100792
$$ -11133279 -9521283 -2115358 5124454 6863228 5001518 5810456 10928767 15029559
42819A5029559j689870n734465n415974m490694n034623l104951L920395J0362290
$$ 15029559 13339689 7605224 2189250 -2301444 -7336067 -10441018 -6520623 3841667
42811C841667Q489658l6890n196957j788103M091183M352314j71908k755025j494881
$$ 3841667 12331325 12294435 7097478 5309375 9400558 13752872 13580964 10825939 9331058
42802I331058q26215k954616m205107j874664P09293l22742k835318k233711J102346
$$ 9331058 8504843 5550227 1345120 -529544 179749 -142993 -2978311 -5212022 -4109676
42793d109676K948617K190831J342036Q58436j312125m154304l570564M75752
$$ -4109676 -1161059 1029772 2371808 3230244 1918119 -2236185 -5806749 -5330997
42785e330997K744846J229651P51311M021751N300537p01102q483335q482956
$$ -5330997 -2586151 -1356500 -605189 3416562 8717099 8015997 -467338 -8950294
42777h950294j440452K850905N39286j822714N22665L035955R13723k199726r59676
$$ -8950294 -10390746 -7539841 -7000555 -8823269 -8300604 -5264649 -4350926 -6550652 -7510328
42768g510328J958445M98017l907976m233192N14863L459421O97947k983136k057181
$$ -7510328 -5551883 -5053866 -8961842 -13195034 -12680171 -9220750 -8522803 -11505939 -13563120
42759a3563120J614067K651844M36504r85269O37833L458248M927877M108748
$$ -13563120 -11949053 -9297209 -8860705 -9845974 -9208141 -5749893 -822016 3286732
42751C286732R23813l699016o749183n270118m19425L215989L350537K363923
$$ 3286732 4210545 511529 -6237654 -11507772 -11927197 -8711208 -5360671 -2996748
42743b996748K596345K493670K09922j793956n8096L451591L269861j231185m688314
$$ -2996748 -400403 2093267 2303189 509233 451137 3902728 7172589 5941404 1253090
42734A253090m131814k958772l748890k754776L414530J0054302R947564M104480
$$ 1253090 -2878724 -5837496 -9586386 -12341162 -8926632 1127670 11075234 15179714
42726A5179714j84675n90115j134318k483387j8896N812833O392754k274944j1246937
$$ 15179714 14995039 14404924 13270606 10787219 10768323 16581156 22973910 20698966 9452029
42717I452029j0521222l425110n17666l268065l734351J157702N318107M440636
$$ 9452029 -1069193 -4494303 -5011969 -8280034 -12014385 -10856683 -5538576 -1097940
42709a097940J888271J060797K53331j334856k99195L698118M721220L06619k547971
$$ -1097940 790331 1851128 2104459 769603 470408 4168526 8889746 9196365 6648394
42700F648394J681939O427263K557535o049456p473823m63342L659787p49565
$$ 6648394 8330333 14757596 17315131 11265675 3791852 3328510 6988297 6238732
42692F238732n010656o18846P188053P855312J027680m678416m806874k910165
$$ 6238732 1228076 609230 7797283 15652595 16680275 12001859 7194985 4284820
42684D284820k605936l045481k846831k712788k560217l87004M075153P597087
$$ 4284820 1678884 -1366597 -4213428 -6926216 -9486433 -9873437 -5798284 1798803
42676A798803P065812K835102k528158o765120q217687n871300j007389K445421
$$ 1798803 8864615 11699717 9171559 2406439 -5811248 -11682548 -12689937 -10244516
42668a0244516J444510k090629k460021L085108R475032Q360221j137228r102915
$$ -10244516 -8800006 -10890635 -13350656 -10265548 -790516 7569705 6432477 -2670438
42660b670438o007101M614885J0282020O265781R48231J826019M065462l86725
$$ -2670438 -8677539 -4062654 6219366 12485147 13433378 15259397 19324859 18938134
42652A8938134q351145r530572k517882L198200J611615k526825l128971j310629
$$ 18938134 10586989 1056417 -1461465 1736735 3348350 821525 -2307446 -3618075
42644c618075o03759l86371R86765J573632n74851k896241j882486J765412N149198
$$ -3618075 -4221834 -4608205 -3621440 -2047808 -2622659 -5518900 -7401386 -5635974 -486776
42635d86776P017617O187417M15368q434105j2266763o082184L417841N442287
$$ -486776 6530841 12718258 13133626 4699521 -7567242 -13649426 -10231585 -4789298
42627d789298k78462l923847n22087L498717J273392l830646l606454K726739
$$ -4789298 -5067760 -8991607 -9513694 -6014977 -4741585 -8572231 -12178685 -9451946
42619i451946P253371L804156m365365q613461m825281K359628N331208K273269
$$ -9451946 -2198575 1605581 -2759784 -11373245 -16198526 -13838898 -8507690 -6234421
42611f234421j527641j010910K632073M806761M023079K703211K717408L171595
$$ -6234421 -7762062 -8772972 -6140899 -1334138 2688941 5392152 8109560 11281155
42603A1281155K451985J57602k826785m462115k698509J464569L509789Q27420
$$ 11281155 13733140 13890742 11063957 6601842 3903333 5367902 8877691 9705111
42595I705111k914487k609344L54474J29849l646043m134146K026311P937180
$$ 9705111 6790624 4181280 4535754 4665603 1019560 -3114586 -1088275 6848905
42587F848905N133904m439930j0826779r043930l861585j018722N29728M262227
$$ 6848905 11982809 7542879 -3283900 -12327830 -16189415 -17208137 -16678409 -12416182
42579a2416182Q260025P386870K124919q83960J221158K688707j589502o657349
$$ -12416182 -4156157 3230713 5355632 4471672 5692830 8381537 6792035 134686
42571A34686m172235L723289N748320k113875r936520p650262J563365P625879
$$ 134686 -4037549 -314260 5434060 3320185 -6616335 -14266597 -12703232 -5077353
42563e077353P617021N980102M583183J293200k754475k872281J160160L591079
$$ -5077353 2539668 8519770 13102953 14396153 11641678 8769397 9929557 13520636
42555A3520636R53568l618617n830983m995085k081595J865202L788899L12805
$$ 13520636 14474204 10855587 5024604 29519 -2052076 -186874 3602025 3914830
42547C914830o327064q761085l646428L594621N800800K314763k138535l378533
$$ 3914830 -2412234 -11173319 -14819747 -11225126 -5424326 -3109563 -5248098 -8626631
42539h626631l00725N189087Q547396O037881k73141m142856l160968j159090
$$ -8626631 -8927356 -3738269 4809127 10847008 10573867 6431011 3270043 2110953
42531B110953j160948j055988R56094J945908m73255k906979j198478K676756
$$ 2110953 950005 -105983 850111 2796019 2322764 -584215 -1782693 894063
42523H94063L785207J702571j72109p66329j852151l580439l902112j940383J230893
$$ 894063 4679270 6381841 6209732 5443403 3591252 10813 -3891299 -5831682 -4600789
42514d600789M148551M845218J469281l926910n152050M06371O504992N434885
$$ -4600789 -452238 4392980 5862261 1935351 -3216699 -2810328 3694664 9129549
42506I129549j429426n947064m621600j722836j326171k153530j384114J179644
$$ 9129549 7700123 1753059 -2868541 -4591377 -5917548 -8071078 -9455192 -8275548
42498h275548M100382N794178M320344p76685n952801o544178k647302J086275
$$ -8275548 -4175166 1619012 5939356 5162671 -790130 -7334308 -9981610 -8895335
42490h895335J455777q98087m364635p145557n769577J451978R002562Q600033
$$ -8895335 -7439558 -8337645 -12702280 -19847837 -25617414 -24165436 -15162874 -6562841
42482f562841J026954k999207K556163R651453P099710l500353r905298n670826
$$ -6562841 -5535887 -8535094 -5978931 3672522 10772232 7271879 -2633419 -8304245
42474h304245K562694N205258J430040k214800j424894J568321K667781J591742
$$ -8304245 -5741551 -536293 893747 -1321053 -2745947 -1177626 1490155 3081897
42466C081897J224830K603134L111767N78505k907647l597333j413478L80620
$$ 3081897 4306727 6909861 10021628 10600133 7692486 4095153 2681675 3062295
42458C062295P14639K235185N976651Q104858M950327j081206m304371l366399
$$ 3062295 3776934 6012119 11988770 20093628 25043955 23962749 19658378 16291979
42450A6291979k202176l334550m217306j920461J783826K906290Q79765j538170
$$ 16291979 14089803 10755253 6537947 4617486 6401312 9307602 10187367 8649197
42442H649197k917766l944179l729000M3804N610048O428157j87843p271077o249383
$$ 8649197 5731431 1787252 -1941748 -1897944 3712104 10140261 9952418 2681341 -3568042
42433c568042J305032N903993L245246j495927k951072k027368r44430J036435
$$ -3568042 -2263010 3640983 6886229 5390302 2439230 411862 -532568 503867
42425E03867L046931N24275o819007j0839210n589122K727174M265615K10793
$$ 503867 3550798 4075073 -2743934 -13583144 -19172266 -16445092 -12179477 -11968684
42417a1968684j55026N052126P796011L610612j863689k463152K51257J743064
$$ -11968684 -12123710 -7071584 724427 4335039 2471350 8198 259455 2002519
42409B002519J037092q37702l221632l677448O63452O564605N971835k140583
$$ 2002519 3039611 2201909 -1019723 -4697171 -4033719 2530886 8502721 6362138
42401F362138p938654m240916K579044K487663k832865l750736J304797M015330
$$ 6362138 -1576516 -5817432 -3238388 -750725 -3583590 -7334326 -6029529 -2014199
42393b014199M53795k777125K06814N324716N568942J490450j217707r88875j136635
$$ -2014199 -1560404 -4337529 -4130715 1194001 6762943 8253393 7035686 6046811 4910176
42384D910176k919769l623447j857460j4748l5125m28292M98155J430229N74305
$$ 4910176 1990407 -1633040 -3490500 -3505248 -3540373 -3968665 -3470510 -2040281 -1465976
42375a465976q97966q51656K1126k98002r51820O93379L948711M817468J896666
$$ -1465976 -2363942 -3215598 -3194472 -3492474 -4444294 -3750915 197796 5015264 6911930
42366F911930j438397k013368n42617J072890K484196L177010J860856k87763
$$ 6911930 5473533 3460165 2917548 3990438 6474634 9651644 11512500 11224737
42358A1224737J44998K846994K665346k298468o529374n287072j680832l19691
$$ 11224737 11369735 14216729 16882075 14583607 8054233 2767161 1086329 766638
42350G66638L60838K562049J911669m805215r633750l030336R009769J0571359
$$ 766638 1127476 3689525 5601194 795979 -8837771 -11868107 -2858338 7713021
42342G713021r38215j0306183o371408L930082Q490025N933813J877593j360155
$$ 7713021 6774806 -3531377 -9902785 -5972703 2517322 8451135 10328728 8968573
42334H968573l616416k679061J408969L509649R37687j761493q55480J78888k070546
$$ 8968573 5352157 2673096 4082065 7591714 8529401 6767908 5912428 6091316 4020770
42325D020770m147473k636002j146305l289335n036252j696230L333510M493193
$$ 4020770 -126703 -2762705 -3909010 -7198345 -12234597 -13930827 -10597317 -6104124
42317f104124L073919K618897J310273k763330m811422q57998L764237K805517
$$ -6104124 -3030205 -411308 898965 -1864365 -6675787 -7533785 -3769548 -964031
42309i64031j19202P87452J809065k424009o013738p94660P199247O037099j304364
$$ -964031 -1083233 -295781 1513284 -910725 -6924463 -7719123 -519876 5517223 4212859
42300D212859j761861M287950L195151p485735j3938359r110630k142377O19779
$$ 4212859 2450998 6738948 9934099 2448364 -11489995 -20600625 -22743002 -22123223
42292b2123223N241319J3030826J2557473J55366q605097j892796Q543178O099443
$$ -22123223 -16881904 -3851078 8706395 8861761 256664 -1636132 6907046 13006489
42284A3006489m639113p980074l348497k357072n866136l631057M988817Q286730
$$ 13006489 8367376 387302 -2961195 -5318267 -11184403 -14815460 -9826643 -1539913
42276a539913J883619m422553l064173R83627R03467j443638r46924K357794M879953
$$ -1539913 343706 -4078847 -7143020 -6159393 -5255926 -6699564 -7646488 -5288694 -408741
42267d08741M443536J109184l009817m234507j518118J083440N01623J29196L253908
$$ -408741 4034795 5143979 2134162 -2100345 -3618463 -2535023 -2033400 -1904204 1349704
42258A349704N320268J293640l301438J76535P549440O423538l386429q176934
$$ 1349704 6669972 7963612 4662174 4838709 12388149 18811687 15425258 7248324
42250G248324j863847M937888K942482j885902o43056L615753L368948J44970
$$ 7248324 5384477 10322365 13264847 11378945 10735889 14351642 17720590 17865560
42242A7865560k77396N50608k005739m865074j928216L672386L279536k760052
$$ 17865560 17588164 18138772 16133033 11267959 9339743 13012129 16291665 13531613
42234A3531613n285647j480421O91995m133218r998225q774292j358137N210125
$$ 13531613 8245966 6765545 7457540 3324322 -6673903 -15448195 -16806332 -11596207
42226a1596207P148542N728325K913404k01480k150124j927326n82208J94755
$$ -11596207 -4447665 1280660 4194064 3992584 1842460 -84866 -667074 -472319
42218d72319L63182P47795J027716M84631J2980J107025K843599K258371j151644
$$ -472319 -109137 638658 1666374 2151005 2163985 3271010 6114609 8372980 7221336
42209G221336l340252n72217M540873N275098j87028n646659n192104j015369
$$ 7221336 3881084 3308867 7849740 13124838 12937810 7291151 2099047 1083678
42201A083678J245644J797759M847154Q908918P224176o31727n912798l526971
$$ 1083678 2329322 4127081 8974235 17883153 25107329 24475602 18562804 15035833
42193A5035833p0311k968878q240258p198033n50475L560274K852184K356236
$$ 15035833 14965522 11996644 3756386 -3441647 -3992122 -431848 2420336 4776572
42185D776572L441804J543827l844029o467110l536757j30701K51668J240531
$$ 4776572 8218376 9762203 5918174 -548936 -4085693 -4216394 -3964726 -2724195
42177b724195M989483O123829P37477n491694n680168k425123j849475k089277
$$ -2724195 2265288 8389117 9126594 3634900 -2045268 -4470391 -6319866 -8409143
42169h409143K363037Q138506O080818l429551r080039m702075K804957N107440
$$ -8409143 -6046106 2092400 8173218 4743667 -4336372 -9038447 -6233490 -1126050
42161a126050L337440K449607K161494j24407k763576k795971j739215k508970
$$ -1126050 2211390 4660997 6822491 6698084 3934508 1138537 -600678 -3109648
42153c109648l572628j897684R11969J313126M68070J952036M362179K983700
$$ -3109648 -6682276 -8579960 -7667991 -6354865 -5886795 -3934759 427420 3411120
42145C411120j559703l250769j68233K635770J780024P27030K892614N072968
$$ 3411120 1851417 -1399352 -1567585 1068185 2848209 3575239 6467853 11540821
42137A1540821K543812k977317n570961l378042j51916N66577p75235j445679
$$ 11540821 14084633 11107316 5536355 2158313 2006397 2572974 1797739 352060
42129C52060N76951M583626O339760J396389q073394j2403426n016341P627861
$$ 352060 929011 5512637 11852397 13248786 5175392 -7228034 -12244375 -4616514
42121d616514J2281766N185303l806640m936697k58907K132091K54474j527704
$$ -4616514 7665252 12850555 9043915 4107218 3848311 5980402 6234876 4707172
42113D707172j517329k693996n516837n228472R47034Q243674R381731K894952
$$ 4707172 3189843 495847 -5020990 -10249462 -9302428 -1058754 8322977 11217929
42105A1217929n995121j0912389q900859j937029L798147K704281l296056n242528
$$ 11217929 5222808 -5689581 -14590440 -16527469 -12729322 -10025041 -13321097 -18563625
42097a8563625J696444J0273355R785024R25954m891665j383149M925182N541848
$$ -18563625 -16867181 -6593826 3191198 4117152 -774513 -2157662 2767520 8309368
42089H309368J498850r45227n54988o75540j962813k116216j155160j081244j334885
$$ 8309368 9808218 8862991 8308003 7632463 5669650 3553434 2398274 1317030 -17855
42080a7855k1413J241012p93260m869593o539448n067170l117762j85638O295778
$$ -17855 -39268 1201744 408484 -4461109 -11000557 -16067727 -19185489 -19371127 -13075349
42071a3075349J2681354J0473328q64499j0134923q227593N76763O203266N711508
$$ -13075349 -393995 10079333 9214834 -920089 -9147682 -8570919 -2367653 3343855
42063C343855K645598r68092m461788m387261J234665O749453M958868j749802
$$ 3343855 5989453 5021361 559573 -3827688 -2593023 4156430 9115298 7365496
42055G365496m210015r2986L387600J386161k050151k073954l76928l53157r27512
$$ 7365496 3155481 3062495 6450095 7836256 5786105 3712151 3335223 2982066 2054554
42046B054554j06102Q6226k293160l600068P23071P770003R504771L475499l977712
$$ 2054554 1948452 2034678 -258482 -3858550 -3135479 4634524 14139295 17614794 13637082
42037A3637082o283804l934787j236353K18997J250803Q65012k718285o970124
$$ 13637082 7353278 3418491 2182138 2401135 3651938 4516950 1798665 -5171459
42029e171459o109299M55610N098507J692595m814975m647810K503027P192569
$$ -5171459 -11280758 -10825148 -5726641 -4034046 -8849021 -13496831 -10993804 -3801235
42021c801235N086460L045803O039962P151393p26004j0097982p740298M421629
$$ -3801235 1285225 4331028 10370990 17522383 16796379 6698397 -1041901 3379728
42013C379728J0258457K469072p707520q237548k586769q39732l404641l349575
$$ 3379728 13638185 16107257 8399737 162189 -2424580 -3264312 -6668953 -10018528
42005a0018528L68390K290246J082046J588070N829577R186106P171895R89436
$$ -10018528 -9650138 -7359892 -6277846 -4689776 1139801 10325907 17497802 18487238
41997A8487238n012012p751038o760075m242202l569720m916452l874007J933157
$$ 18487238 13475226 5724188 -1035887 -5278089 -8847809 -13764261 -17638268 -15705111
41989a5705111P266074N924003J073976J327475O592559O827738k146556j0364930
$$ -15705111 -8439037 -2515034 -1441058 -113583 6478976 13306714 11160158 795228
41981G95228p403709K295222N908440K14063n706730m767949l73096J198327p3964
$$ 795228 -6608481 -4313259 1595181 1809244 -3897486 -8665435 -9038531 -7840204 -7914168
41972g914168k68830J504686K837697K692311K793464M782747P821860Q734264
$$ -7914168 -8182998 -6678312 -3840615 -1148304 1645160 6427907 14249767 22984031
41964B2984031M280482m956108j2598920j1450581k249099N481399M195636k502342
$$ 22984031 27264513 22308405 9709485 -1741096 -3990195 1491204 5686840 3184498
41956C184498n088877n74108M949075N495523J745317k391092m766821m448658
$$ 3184498 -1904379 -2478487 2470588 7966111 9711428 7320336 2553515 -1895143
41948a895143o16376M738533O403177K016694l718309m510325l63612L547518
$$ -1895143 -2511519 2227014 8630191 10646885 6928576 2418251 2054639 5602157
41940E602157M176259K774042R57117j022289k386119k325390k412644m522756
$$ 5602157 9778416 12552458 13509575 12487286 10101167 7775777 5363133 840377
41932H40377o304420l329704L416178P113495M194862o99551j808108k15051o70994
$$ 840377 -5464043 -8793747 -5377569 1735926 5930788 5231237 3423129 3208078 2537084
41923B537084l405046l998922m05986M252007O132675M596056J078813l062677
$$ 2537084 -867962 -4866884 -5272870 -1020863 5111812 9707868 10786681 7724004
41915G724004o188202n900161j215941M957398P398144L969259j300045k599098
$$ 7724004 1535802 -4364359 -5580300 -622902 6775242 10744501 9444456 6845358
41907F845358O1397O38240l935112q247162n969082J44257K126936n97477l69039
$$ 6845358 6906755 7544995 3609883 -4637279 -10606361 -10462104 -8335168 -8932645 -9301684
41898i301684N582273R442590M637785l646306o180480k819033m68393j285560
$$ -9301684 -3719411 5723179 10360964 6714658 534178 -2284855 -2753248 -4038808
41890d038808j182721R31790P42103l033636m700812L16351P854220R642904L751306
$$ -4038808 -5221529 -4289739 -3547636 -6581272 -11282084 -10965733 -3111513 6531391 10282697
41881A0282697k996473l227754K296212N795034K356164l623412m617036p50370
$$ 10282697 7286224 4058470 6354682 12149716 14505880 10882468 6265432 5515062
41873E515062R75958j752227l055045K68351K277025j753283n691801j928546
$$ 5515062 6491020 4738793 1683748 1952099 4229124 2475841 -3215960 -5144506
41865e144506N031477M834735k100185n698232k867735j013442l701476m710665
$$ -5144506 -113029 4721706 2621521 -3076711 -5944446 -6957888 -10659364 -15370029
41857a5370029N6162N474223O810726O684563O981936L404786n012400r747269
$$ -15370029 -15313867 -9839644 -3028918 3655645 10637581 14042367 9029967 -717302
41849g17302m535396L864007N377141J012145j442773o38807p26735j424876O16396
$$ -717302 -5252698 -1388691 3988450 5000595 3557822 2919015 2192280 767404 1383800
41840A383800L247916J771799j410577k78933K919907J79887p537063r301747
$$ 1383800 4631716 6403515 4992938 4714005 7633912 7813799 276736 -9025011
41832i025011o24654R137808R897964L064864l678714o462663n468243j629782
$$ -9025011 -9649665 -511857 9386107 12450971 8772257 2309594 -3158649 -4788431
41824d788431J973375R15593l837970n120505K72388O009177N484300J136014
$$ -4788431 -2815056 -1899463 -5737433 -10857938 -10585550 -4576373 907927 2043941
41816B043941j071878j241416k765820m078289j032544M530378O129306K123630
$$ 2043941 972063 -269353 -3035173 -7113462 -8146006 -3615628 2513678 4637308
41808D637308k513734l893282k914905j050453J884241M688124M605776J856131
$$ 4637308 2123574 -1769708 -4684613 -5735066 -3850825 837299 5443075 7299206
41800G299206J13710Q21904R20215j823224m756136m120788l14347L090778L823217
$$ 7299206 7412916 8234820 9155035 7331811 2575675 -1545113 -1859460 1231318 5054535
41791E054535K301587j14830k274085l245124k608998o98205J709642L439007
$$ 5054535 7356122 7241292 4967207 1722083 -886915 -1585120 124522 3563529
41783C563529L017806J04694l214052m108320k190613L58627J710597J641647
$$ 3563529 6581335 6686029 3471977 -636343 -2826956 -2468329 -757732 883915
41775H83915J40531k557461m091416j321485M714980Q035454M713720j304152
$$ 883915 1024446 -1533015 -5624431 -6945916 -2230936 5804518 10518238 9214086
41767I214086k848195R61012L863902J609418k278615k399489K32173K69645k896217
$$ 9214086 6365891 7326903 11190805 12800223 10521608 8122119 8354292 8623937 5727720
41758E727720l683483N73909M217708J082575n714075p497562k301686K794334
$$ 5727720 2044237 2618146 6835854 7918429 2204354 -5293208 -7594894 -4800560
41750d800560K328893o74432j056626P83110J623681J463762J909721J779802
$$ -4800560 -2471667 -3146099 -4202725 -3419615 -1795934 -332172 1577549 3357351
41742C357351m82709k503929j394408P19800K30726j051852P83068L240112M10858
$$ 3357351 2874642 370713 -1023695 -303895 -73169 -1125021 -341953 2898159 3309017
41733C309017n739591o342135J32055M106002k29842n243737j912920N810950
$$ 3309017 -2430574 -8772709 -8640654 -4534652 -4764494 -10008231 -11921151 -6110201
41725f110201P387885J473762m046190n025998m596681m493054k077416K459794
$$ -6110201 1277684 2751446 -1294744 -6320742 -10917423 -15410477 -17487893 -15028099
41717a5028099L884216N4074l683911j806819L923806P611888O740949L618917
$$ -15028099 -11143883 -11089809 -14773720 -16580539 -12656733 -5044845 1696104 5315021
41709E315021J419031J113938J234029l60299l513629n008550k655540R18640
$$ 5315021 6734052 7847990 9082019 8721720 5208091 199541 -2455999 -1537359
41701a537359J634745N9483k3096J480270Q19007k221558k719974J176281L935560
$$ -1537359 97386 156869 133773 1614043 2433050 211492 -2508482 -1332201 2603359
41692B603359N76932n256120o172217j573740J936750L13891k373856J19255P235581
$$ 2603359 3180291 -2075829 -8248046 -9821786 -7885036 -7571145 -9945001 -9825746 -2590165
41683b590165J1349744O914411k105284o615575l852832j41594l98863n77116
$$ -2590165 8759579 15673990 13568706 6953131 3100299 2958705 2559842 1982726
41675A982726M045985Q279768L854306n650765p846372l26005N157817J010500
$$ 1982726 6028711 14308479 18162785 12512020 4665648 4339643 9497460 10507960
41667A0507960n113493m039930O01531Q67429j487817n35828J032538k807740
$$ 10507960 5394467 1354537 1956068 2823497 1335680 799852 1832390 -975350
41659i75350p598212l373006P766807J2283393M937080m062681m992341j023776
$$ -975350 -8573562 -11946568 -4179761 8103632 13040712 8978031 3985690 2961914
41651B961914K99754j023881n82268J686407K421130J001930k13902K58939J943490
$$ 2961914 3261668 2237787 1655519 3341926 5763056 6764986 6551084 6810023 8753513
41642H753513L323817K633086L7578j292016J80903J96172n089300j0326151o776311
$$ 8753513 12077330 14710416 14747994 13455978 13636881 13833053 8743753 -1582398 -8358709
41633h358709L055342O659657o5895o233737k914125L624112L470078r35890m99346
$$ -8358709 -5303367 1356290 1290395 -4943342 -7857467 -4233355 -763277 -1699167 -2198513
41624b198513M909319P431698M507645Q59105j337024m677134q875360r382428
$$ -2198513 2710806 10142504 14650149 15509254 14172230 9495096 619736 -8762692
41616h762692m917496M41900L896678O641603Q838473P699159K526155k884326
$$ -8762692 -13680188 -13238288 -9341610 -2700007 6138466 13837625 16363780 13479454
41608A3479454m813804l398388q94665R03940J069217o6800r91005j452619l321408
$$ 13479454 8665650 5267262 4372597 5276537 6345754 6278954 5287949 3835330 513922
41599E13922o543993o973681k169752L390050L906859O83710o82669P36017J585775
$$ 513922 -6030071 -13003752 -15173504 -11783454 -7876595 -7192885 -7875554 -7139537 -5553762
41590e553762J712352L695095N813349L639808j219739k437926M3553o61522n907881
$$ -5553762 -3841410 -146315 5667034 9306842 8087103 5649177 5692730 5031208 -876673
41581h76673p859842k395525L377989K323701k016538k870775j290286j504956
$$ -876673 -8736515 -11132040 -7754051 -5430350 -7446888 -10317663 -11607949 -13112905
41573a3112905j130732M215255J0175515P974496j469540p565423n213137r70732
$$ -13112905 -14243637 -10028382 147133 8121629 6652089 -913334 -6126471 -7097203
41565g097203j310395k895453K79650O005017O902322J778570k610352j468830
$$ -7097203 -8407598 -11303051 -11023401 -5018384 1883938 3662508 1052156 -416674
41557d16674J591551N08136m072303n538745p04159N460432O337440K149991j303115
$$ -416674 1174877 1683013 -2389290 -7928035 -8632194 -3171762 3165678 5315669 4012554
41548D012554r87993L52829k77579j744320j754947j006017j619161l239530l292418
$$ 4012554 3024561 3377390 3099811 1355491 -399456 -1405473 -3024634 -6264164 -9556582
41539i556582m91635L517359N664246M084279J25220k307912r41120J689280J544966
$$ -9556582 -10048217 -6530858 -866612 3217667 3342887 1034975 93855 1783135 3328101
41530C328101r56933j739209K52002J635199Q08282M90498J803879J037098l878643
$$ 3328101 2371168 631959 883961 2519160 3327442 3817940 5621819 6658917 2780274
41521B780274q155432o294026k15718L743934L477009J718771J39482j647413
$$ 2780274 -5375158 -11669184 -11884902 -8140968 -4663959 -2945188 -2805706 -4453119
41513d453119k257764O78344N563725P200593L093993l581885p643639o380752
$$ -4453119 -6710883 -6032539 -468814 6731779 9825772 6243887 -1399752 -7780504
41505g780504j157054L328736L003364j71501L12761N600662P585285N60701p756798
$$ -7780504 -8937558 -5608822 -2605458 -2776959 -2464198 3136464 10721749 11282450 3525652
41496C525652n646128M460904P926777q87978j0120240p574796K683245P732868
$$ 3525652 -2120476 2340428 10267205 9379227 -741013 -8315809 -5632564 2100304
41488B100304L426239l017118m474557j023048K921532L350863n43228m832544
$$ 2100304 5526543 2509425 -1965132 -2988180 -66648 3284215 2740987 -2091557
41480b091557l855696K335511O504312L767115j116273j038612K382164J874571
$$ -2091557 -5947253 -3611742 2892570 6659685 5543412 4504800 6886964 8761535
41472H761535l279987n979446k684748J374933Q15042k208976k504189M91030
$$ 8761535 5481548 -497898 -3182646 -1807713 -992671 -3201647 -5705836 -5214806
41464e214806L452821M438733L727374J656947r79140j970443j31030K419182
$$ -5214806 -1761985 2676748 6404122 8061069 7081929 5111486 4980456 7399638
41456G399638K791883Q56137j856480m794899p168208o320954j430791K633782
$$ 7399638 10191521 11047658 9191178 4396279 -2771929 -9092883 -10523674 -7889892
41448g889892L13875n786973o608572J157028R859044J0965920N566539M05556
$$ -7889892 -7576017 -13362990 -19971562 -18814534 -8955490 2010430 7576969 7982525
41440G982525k338511n057990p074064m655208J103923L710357Q38342j777829
$$ 7982525 5644014 586024 -6488040 -11143248 -10039325 -6328968 -5490626 -7268455
41432g268455O60944M743556N033597K678008K157212L043103J510278k046440
$$ -7268455 -6607511 -1863955 3169642 5847650 8004862 11047965 12558243 10511803
41424A0511803l669746l224753m252037o243081m252326J956095N322157J621717
$$ 10511803 6842057 3617304 -634733 -6877814 -11130140 -9174045 -3851888 -2230171
41416b230171l675224l352684J436054M430991M035191L527957L526906J044446
$$ -2230171 -5905395 -9258079 -7822025 -3391034 644157 4172114 7699020 8743466
41408H743466l730265n807481k469855K577656M495348L178440J265198n96487
$$ 8743466 5013201 -794280 -3264135 -686479 3808869 6987309 8252507 7656020
41400G656020l092743m869682l682209l97432J609801J380005J462219L005338
$$ 7656020 4563277 -306405 -3988614 -4386046 -2776245 -1396240 65979 3071317
41392C071317L029790q04555n101869m332659J042165M226459J033336m505760
$$ 3071317 6101107 5296552 194683 -4137976 -3095811 1130648 2163984 -2341776
41384b341776n954978k972578l34310j40810M53609L408980N952256M741640J081502
$$ -2341776 -8296754 -11269332 -11603642 -11744452 -11290843 -7881863 -1929607 2812033 3893535
41375C893535r96107o24850r51405l710303n635066k446920M524004Q532763N345887
$$ 3893535 2897428 2272578 1321173 -2389130 -8024196 -10471116 -5947112 2585651 7931538
41366G931538j228740m088265j618059J613074K186368J329231L74318k047461
$$ 7931538 6702798 2614533 996474 2609548 4795916 6125147 6499465 4452004
41358D452004n613980o038565j467950K846570J409887l253244m900836l175930
$$ 4452004 -1161976 -7200541 -8668491 -5821921 -4412034 -7665278 -12566114 -15742044
41350a5742044k160107j682601J847135O805617P262109L162179Q66980J962518
$$ -15742044 -17902151 -19584752 -17737617 -10932000 -3669891 -507712 359268 2321786
41342B321786Q72001l433044l529765L119465O739749m58733j0453929j0143213
$$ 2321786 3193787 -239257 -3769022 -649557 6090192 5631459 -4822470 -14965683
41334a4965683n16164N960519M146096J046654K196290M097441K652242J69922
$$ -14965683 -15481847 -9521328 -5375232 -4328578 -2132288 1965153 4617395 4787317
41326D787317n1804M19659r75352k645216j622550J366729K826267R92859k360281
$$ 4787317 4735513 5155172 4179820 1534604 -87946 1278783 4105050 5097909 2737628
41317B737628l668071q61915L893744N691300K938689m26Q07904K430590q7843
$$ 2737628 -930443 -1792358 2101386 7792686 10731375 10730949 11538853 13969443 13881600
41308A3881600m410832l218532L833865P422005P46001j0612007j4917138p765323
$$ 13881600 9470768 6252236 10086101 17508106 18254107 7642100 -7275038 -15040361
41300a5040361L753630R238667N441285j345410l127860K24691J916331q76813
$$ -15040361 -11286731 -2048064 3393221 2047811 -1080049 -855358 1060973 184160
41292A84160k520908J014158L950786N1098m930770q07012R317554J1232903P20223
$$ 184160 -2336748 -1322590 2628196 2679294 -2251476 -3058488 6259066 17491969 18212192
41283A8212192r773231r503335l110110J39819M73702K700285N349139M192212
$$ 18212192 8438961 -1064374 -4174484 -4034665 -3560963 -860678 4488461 8680673
41275H680673J146781P69322J893266Q48266o31453J234278M120865K930222j166227
$$ 8680673 9827454 10596776 12490042 13338308 12706855 13941133 18061998 20992220 19825993
41266A9825993l082813l185351n789134r391262p409285M90132N995985L472422
$$ 19825993 16743180 13557829 7768695 -1622567 -9031852 -8541720 -2545735 926687
41258I26687k733106n001064j541430L699657O462333N369344K228471K82845
$$ 926687 -1806419 -6807483 -8348913 -4649256 1813077 7182421 9410892 9693737
41250I693737N53381N51328j445080k943069j293102J227949O91231k237844l980439
$$ 9693737 10247118 10798446 9353366 6410297 5117195 6345144 7036375 4798531 818092
41241H18092l803504k910577l99355L915298N374566M19057n588157m813884L79037
$$ 818092 -2985412 -5895989 -6295344 -2380046 2994520 3413577 -2174580 -6988464 -6609427
41232f609427P66899m293650n678166k32046L841216J389045q95364L476762R429102
$$ -6609427 -5842528 -10136178 -15814344 -16046390 -12205174 -10816129 -11711493 -8234731 1194371
41223A194371R087538M425821K317684K559818N3623m631960n886287k768891
$$ 1194371 10281909 14707730 17025414 19585232 19638855 15006895 9120608 6351717
41215F351717l36728j405153l122508k193739R68533L657010L572755P05436j695282
$$ 6351717 6014989 4609836 1487328 -706411 262122 3919132 7491887 8197323 6502041
41206F502041n6321M067281M904273O36369m073758o061362p759449r390202m936558
$$ 6502041 6445720 10513001 15417274 16053643 11979885 5918523 -1840926 -11231128 -16167686
$$ [...]
##END NTUPLES=NMR SPECTRUM
##END=
