##TITLE=31Pdec_LR-688B-C4-EtOAc2S
 D2O, 24 sc
 3.3.2020
##JCAMPDX= 6.0         $$ Bruker NMR JCAMP-DX V2.0
##DATA TYPE= NMR SPECTRUM
##DATA CLASS= NTUPLES
##ORIGIN= UXNMR, Bruker Analytische Messtechnik GmbH
##OWNER= root
$$ XWIN-NMR		Version 3.5
$$ Tue Mar  3 14:44:41 2020 Russian Standard Time (UT+4h)  she@DPX200
##.OBSERVE FREQUENCY= 81.013821
##.OBSERVE NUCLEUS= ^31P
##.ACQUISITION MODE= SIMULTANEOUS
##.ACQUISITION SCHEME= undefined
##.AVERAGES= 24
##.DIGITISER RES= 17
##SPECTROMETER/DATA SYSTEM= spect
##.PULSE SEQUENCE= zgpg30
##.SOLVENT NAME= CDCl3
##.SHIFT REFERENCE= (INTERNAL, CDCl3, 0, 182.463)
##AUDIT TRAIL= $$ (NUMBER, WHEN, WHO, WHERE, WHAT)
$$ ##TITLE= Audit trail, XWIN-NMR		Version 3.5
$$ ##JCAMPDX= 5.01
$$ ##ORIGIN= Bruker BioSpin GmbH
$$ ##OWNER= she
$$ F:/spectra/data/she/nmr/P31/1/pdata/1/auditp.txt
$$ ##AUDIT TRAIL=  $$ (NUMBER, WHEN, WHO, WHERE, WHAT)
(   1,<2020-03-03 14:42:49.98 +0400>,<she>,<DPX200>,
      <created by zg, POWCHK disabled, PULCHK disabled
       configuration hash MD5:
       00 E9 B6 7A A2 85 ED C7 34 08 36 98 17 FE 4E 26
       data hash MD5: 32K
       36 07 DE 6C EF DD FD EF 4D EF 93 83 EA A1 CD 10>)
(   2,<2020-03-03 14:42:53.00 +0400>,<she>,<DPX200>,
      <Start of raw data processing
       efp BC_mod = 2 LB = 1 FT_mod = 6 PKNL = 1 PHC0 = -1347.006 PHC1 = 126.4017 SI = 64K 
       data hash MD5: 64K
       25 F3 93 62 90 BD 74 E3 23 FC 5A C1 F5 FA AD 7F>)
(   3,<2020-03-03 14:43:04.43 +0400>,<she>,<DPX200>,
      <pk PHC0 = 5.113173 PHC1 = 0 
       data hash MD5: 64K
       E7 BA 54 D2 B5 20 5C EE 2B 67 94 57 79 B0 84 03>)
$$ ##END=
$$ 
$$ hash MD5
$$ 39 DC 10 1F 22 AC 26 18 45 90 94 6F A2 0B 3C AB
##$RELAX= 
##$RELAX= 
##$RELAX= 
##$RELAX= 
##$RELAX= 
##$RELAX= 
##$RELAX= 
##$RELAX= 
$$ Bruker specific parameters
$$ --------------------------
##$DU= <F:/spectra>
##$EXPNO= 1
##$NAME= <P31>
##$PROCNO= 1
##$TYPE= <nmr>
##$USER= <she>
##$AMP= (0..31)
100 100 100 100 100 100 100 100 100 100 100 100 100 100 100 100 100 100 
100 100 100 100 100 100 100 100 100 100 100 100 100 100 
##$AQSEQ= 0
##$AQ_mod= 1
##$AUNM= <au_zg>
##$AUTOPOS= <>
##$BF1= 81.014009
##$BF2= 200.13
##$BF3= 200.13
##$BF4= 200.13
##$BF5= 200.13
##$BF6= 200.13
##$BF7= 200.13
##$BF8= 200.13
##$BYTORDA= 1
##$CFDGTYP= 0
##$CFRGTYP= 5
##$CHEMSTR= <none>
##$CNST= (0..31)
1 1 145 1 1 1 1 1 1 1 1 1 1 1 1 1 1 1 1 1 1 1 1 1 1 1 1 1 1 1 1 1 
##$CPDPRG= <waltz16>
##$CPDPRG1= <>
##$CPDPRG2= <waltz16>
##$CPDPRG3= <>
##$CPDPRG4= <mlev>
##$CPDPRG5= <mlev>
##$CPDPRG6= <mlev>
##$CPDPRG7= <mlev>
##$CPDPRG8= <mlev>
##$CPDPRGB= <>
##$CPDPRGT= <>
##$D= (0..31)
0 1 0 0 0 0 0 0 0 0 0 0.03 2e-05 3e-06 0 0 0 0 0 0 0 0 0 0 0 0 0 0 0 0 
0 0 
##$DATE= 1583232169
##$DBL= (0..7)
120 120 120 11 120 120 24 19 
##$DBP= (0..7)
150 150 150 150 150 150 150 150 
##$DBP07= 0
##$DBPNAM0= <>
##$DBPNAM1= <>
##$DBPNAM2= <>
##$DBPNAM3= <>
##$DBPNAM4= <>
##$DBPNAM5= <>
##$DBPNAM6= <>
##$DBPNAM7= <>
##$DBPOAL= (0..7)
0.5 0.5 0.5 0.5 0.5 0.5 0.5 0.5 
##$DBPOFFS= (0..7)
$$ [...]
##$SUBNAM2= <"">
##$SUBNAM3= <"">
##$SUBNAM4= <"">
##$SUBNAM5= <"">
##$SUBNAM6= <"">
##$SUBNAM7= <"">
##$SUBNAM8= <"">
##$SUBNAM9= <"">
##$SW= 369.568048894756
##$SWIBOX= (0..15)
0 1 3 0 0 0 0 0 0 0 0 0 0 0 0 0 
##$SW_h= 29940.119760479
##$TD= 32768
##$TD0= 1
##$TE= 0
##$TE2= 300
##$TE3= 300
##$TEG= 300
##$TL= (0..7)
0 120 53 12 22 120 120 120 
##$TP= (0..7)
150 150 150 150 150 150 150 150 
##$TP07= 0
##$TPNAME0= <>
##$TPNAME1= <>
##$TPNAME2= <>
##$TPNAME3= <>
##$TPNAME4= <>
##$TPNAME5= <>
##$TPNAME6= <>
##$TPNAME7= <>
##$TPOAL= (0..7)
0.5 0.5 0.5 0.5 0.5 0.5 0.5 0.5 
##$TPOFFS= (0..7)
0 0 0 0 0 0 0 0 
##$TUNHIN= 0
##$TUNHOUT= 0
##$TUNXOUT= 0
##$USERA1= <user>
##$USERA2= <user>
##$USERA3= <user>
##$USERA4= <user>
##$USERA5= <user>
##$V9= 5
##$VALIST= <valist>
##$VCLIST= <CCCCCCCCCCCCCCC>
##$VD= 0
##$VDLIST= <DDDDDDDDDDDDDDD>
##$VPLIST= <PPPPPPPPPPPPPPP>
##$VTLIST= <TTTTTTTTTTTTTTT>
##$WBST= 1024
##$WBSW= 4
##$XGAIN= (0..3)
0 0 0 0 
##$XL= 0
##$YL= 0
##$YMAX_a= 7882
##$YMIN_a= -10438
##$ZGOPTNS= <>
##$ZL1= 120
##$ZL2= 120
##$ZL3= 120
##$ZL4= 120
##$ABSF1= 0
##$ABSF2= 0
##$ABSG= 0
##$ABSL= 0
##$ALPHA= 0
##$AQORDER= 0
##$ASSFAC= 0
##$ASSFACI= 0
##$ASSFACX= 0
##$ASSWID= 0
##$AUNMP= <proc_1d>
##$AZFE= 0.1
##$AZFW= 0.5
##$BCFW= 0
##$BC_mod= 2
##$BYTORDP= 0
##$COROFFS= 0
##$CY= -3
##$DATMOD= 1
##$DC= 0
##$DFILT= <>
##$DTYPP= 0
##$F1P= 0
##$F2P= 0
##$FCOR= 1
##$FTSIZE= 65536
##$FT_mod= 6
##$GAMMA= 0
##$GB= 0
##$INTBC= 1
##$INTSCL= 5.30512e-09
##$ISEN= 30
##$LB= 1
##$LEV0= 0
##$LPBIN= 0
##$MAXI= 10000
##$MC2= 0
##$MEAN= 0
##$ME_mod= 0
##$MI= 50
##$NCOEF= 0
##$NC_proc= -6
##$NLEV= 6
##$NOISF1= 182.463
##$NOISF2= 159.3651
##$NSP= 0
##$NTH_PI= 0
##$NZP= 0
##$OFFSET= 182.463
##$PC= 4
##$PHC0= -1341.893
##$PHC1= 126.4017
##$PH_mod= 1
##$PKNL= yes
##$PPARMOD= 0
##$PSCAL= 0
##$PSIGN= 0
##$REVERSE= no
##$SF= 81.0140089999434
##$SI= 65536
##$SIGF1= 159.3651
##$SIGF2= -187.1042
##$SINO= 113.3802
##$SIOLD= 16384
##$SREGLST= <1H.CDCl3>
##$SSB= 0
##$STSI= 65536
##$STSR= 0
##$SW_p= 29940.119760479
##$SYMM= 0
##$S_DEV= 0
##$TDeff= 32768
##$TDoff= 0
##$TI= <>
##$TILT= no
##$TM1= 0
##$TM2= 0
##$TOPLEV= 0
##$USERP1= <user>
##$USERP2= <user>
##$USERP3= <user>
##$USERP4= <user>
##$USERP5= <user>
##$WDW= 1
##$XDIM= 65536
##$YMAX_p= 285863872
##$YMIN_p= -27020300
$$ End of Bruker specific parameters
$$ ---------------------------------
##NTUPLES= NMR SPECTRUM
##VAR_NAME=  FREQUENCY,     SPECTRUM/REAL,   SPECTRUM/IMAG
##SYMBOL=    X,             R,               I
##VAR_TYPE=  INDEPENDENT,   DEPENDENT,       DEPENDENT
##VAR_FORM=  AFFN,          ASDF,            ASDF
##VAR_DIM=   65536,         65536,           65536
##UNITS=     HZ,            ARBITRARY UNITS, ARBITRARY UNITS
##FACTOR=    0.456856943014862, 1,           1
##FIRST=     14782.0589164792, 0,            0
##LAST=      -15158.0608439998, 0,           0
##MIN=       -15158.0608439998, -27020300,   0
##MAX=       14782.0589164792, 285863872,    0
$$ Real data points
##PAGE= N=1
##DATA TABLE= (X++(R..R)), XYDATA
$$ [...]
44220e25786j815356N15654K125571J875190J017285J049029J294703K12789j662382
44211D086697k253445j269578o13714j018518q00571Q82766J986462P11341j299172
44202D12268j321118K98739J032044L00924j77066J67206q747r60123j033316
44193a289189K19936Q01495m01849j417833k63365J690680J760046M4998j023713
44184A21206n42649N089l17404n08821K79829J236458J364702R70907P06146L35457
44174C650920m72328j074593p44718k6778n7872q41270j232206n86859M34976
44165i50728Q20514L47065l39826m13440L17497R93665M47698j161901j993955
44156a933411p11009J401838J847086L89098n49159N01224J841445J336559j70418
$$ plain form
44220 -525786 -2341142 -1825488 300083 2175273 3192558 4241587 5536290 5749079 4086697
44211 4086697 1833252 563674 -50040 -1068558 -1869129 -986363 1000099 1711440 412268
44202 412268 -908850 -610111 421933 722857 545791 712997 704250 -255873 -1289189
44193 -1289189 -1069253 -267758 -669607 -2087440 -2350805 -660125 1099921 1144919 121206
44184 121206 -421443 -416354 -733758 -1242579 -962750 273708 1638410 2609317 3315463 3650920
44174 3650920 3178592 2103999 1359281 1332503 1274631 433361 -798845 -1385704 -950728
44165 -950728 -130214 216851 -122975 -536415 -218918 774747 1222445 60544 -1933411
44156 -1933411 -2644420 -1242582 604504 993602 444443 945667 2787112 4123671 3953253
44147C953253k97879Q35038O25047j731003l525801k343192L92743J457073J67063
44138d67658j282315j198052j27733P39291J153049J376360J476129J519404J561453
44129D749928J235964L00284m37927n5444N49863n72390l126080m027816j548022
44120b931640J741683K208439J46897r83630J89117J285900K58179j504493j594320
44111a183868j88843O80366L37059o1427J86731M27427J59642j05661K9089M6984
44101C27499n11956j131435j074925m85960o4406m8313j58592k58314l85261k79480
44091d071143L94599J286518J500042P65512r0057k40313N5714J5184m09054o00136
44081a393134m53574n37973q69823n09322R47850K221510J704676l22476j850631
$$ plain form
44147 3953253 3655374 4490412 5115459 3384456 -141345 -2484537 -2091794 -634721 -467658
44138 -467658 -1749973 -2948025 -3075758 -2336467 -1183418 192942 1669071 3188475 4749928
44129 4749928 5985892 6286176 5848249 5792805 6342668 5770278 2644198 -1383618 -2931640
44120 -2931640 -1189957 1018482 1165379 181749 370866 1656766 1914945 410452 -1183868
44111 -1183868 -1372711 -692345 -355286 -416713 -229982 197445 357087 251426 280515 327499
44101 327499 -184457 -1315892 -2390817 -2876777 -2941183 -2989496 -3148088 -3406402 -3791663 -4071143
44091 -4071143 -3676544 -2390026 -889984 -124472 -214529 -454842 -399128 -383944 -792998 -1393134
44081 -1393134 -1846708 -2384681 -3254504 -3763826 -2815976 -594466 1110210 787734 -1062897
44072a062897j535131n0237J081701J154747N03585j13171M2013J095749J974768
44063C091127J228428r57330k444749j731882n5897K86021q83474j621005q18598
44054c907359N03265J120011J205536J286585R70439j91128j495439j876136j303966
44045c688192m50588M32358J273718J440035N23875m74033j41710J231000J914900
44036B061363J235199L47889J24114j95692j312864k170242j367357M88158J403782
44027F14350P49582r2674p059L06176k67407j326992j494937m87654M25808K00547
44017a380260n83499o66989K4261L39060k20489n30224N53342K241668K562569
44008B339439R67756r35681j526976r50366k15671L59886Q44305P28563m12433
$$ plain form
44072 -1062897 -2598028 -2648265 -1566564 -411817 91768 -21403 20610 1116359 3091127
44063 3091127 4319555 3362225 917476 -814406 -870303 -584282 -1467756 -3088761 -3907359
44054 -3907359 -3404094 -2284083 -1078547 208038 1178477 987349 -508090 -2384226 -3688192
44045 -3688192 -4138780 -3706422 -2432704 -992669 -468794 -942827 -1084537 146463 2061363
44036 2061363 3296562 3644451 3768565 3572873 2260009 89767 -1277590 -789432 614350
44027 614350 1363932 1271258 1264199 1570375 1302968 -24024 -1518961 -2006615 -1580807 -1380260
44017 -1380260 -1963759 -2630748 -2606487 -2267427 -2487916 -3018140 -2464798 -223130 2339439
44008 2339439 3307195 2371514 844538 -105828 -321499 38387 882692 1611255 1198822
43999A198822j748184j968099j017695R6618R40378J705700J855986N04353j572226
43990d347k146493n55259J143588J077314Q6319j2417O94196Q17616J63253k78861
43980I84909k40283k06460L4133R45251J619648P12986r86137j198867K20387
43971A885567O92352j095812k913297k264210j0179J274857J109799R84339J343470
43962A006886J144452K18358j96705L49040O17556l76430j871074k441835j601383
43953c151135R7003J635916J947274P77106n55402l64215J039399J415442k86197
43944B555191k100606j497480J142322K847002J636977j319401l238724k631643
43936b606362m57046J150412J042903L4290k87568M21273R61317M52738l14798
$$ plain form
43999 1198822 -549362 -2517461 -3535156 -3438538 -2498160 -792460 1063526 1567879 -4347
43990 -4347 -2150840 -2706099 -1562511 -485197 -398878 -411295 282901 1100517 1263770 984909
43980 984909 744626 538166 572299 1517550 3137198 3850184 2864047 1665180 1885567
43971 1885567 2577919 1482107 -1431190 -3695400 -3705579 -2430722 -1320923 -336584 1006886
43962 1006886 2151338 2369696 2172991 2522031 3139587 2763157 892083 -1549752 -3151135
43953 -3151135 -3054132 -1418216 529058 1306164 750762 386547 1425946 2841388 2555191
43944 2555191 454585 -1042895 99427 2946429 4583406 3264005 25281 -2606362
43936 -2606362 -3063408 -1912996 -870093 -835803 -1123371 -702098 259219 711957 397159
43927C97159j22744O72354N34297q59715j812851q25029J186990J915214P12606
43918A798281n02708J03969J586306J309393j372073l813785l188101o7403K224345
43909a921776J618964m58668j124645N55766K756660L065374R44772j902812l336267
43900A97368k777528j308799J1355J188682K326713K592761J262328p05916j487303
43891A299661p14440K67727M84895L18024K43705Q5598n1051L82346R86031M66714
43881C769210j022087j310621O25721K504364J641143j086291k348499q98240
43873A874700J150291J517402K89323j042049j457509q57827J52782N42833j71329
43864A998617j136019j227543o74146m62732m81605J72956J165440J038953l39460
$$ plain form
43927 397159 274415 946769 1481066 621351 -1191500 -2016529 -829539 1085675 1798281
43918 1798281 1295573 1399542 2985848 4295241 2923168 -890617 -4078718 -4146121 -1921776
43909 -1921776 -302812 -761480 -1886125 -1330359 1426301 4491675 5436447 3533635 197368
43900 197368 -2580160 -3888959 -3877604 -2688922 -362209 2230552 3492880 2786964 1299661
43891 1299661 585221 852948 1337843 1655867 1899572 1985170 1934119 2316465 3302496 3769210
43881 3769210 2747123 1436502 2062223 4566587 6207730 5121439 2772940 1874700
43873 1874700 3024991 4542393 4831716 3789667 2332158 1474331 1627113 2169946 1998617
43864 1998617 862598 -364945 -1039091 -1501823 -1983428 -1810472 -645032 393921 54461
43855E4461j241018n83649O15396R84361N04724k35843r74187j132480J50867
43846a857368K242904K784310O50465k070087k553166p25474J186875J703010
43838A361469J105835J26913p01740p48231J26039Q45269L02745r31150j312797
43829A74352m89174M98854R26433R51951O38762j62344r32794q76168l28601m34579
43819c3308j186378j173123K26254J633604J371864m62700k227298k434831q99964
43810e185880J195012K181498J493157M05180M29099J146806Q32470p72306j846860
43801a21824j145833K14479M98207l28797j031775q86438j59J292035K292490
43792G82385J961004K00630j472587j629613p39826j97853j66936K59553J156371
$$ plain form
43855 54461 -1186557 -1770206 -1154810 -170449 334275 98432 -875755 -2008235 -1857368
43846 -1857368 385536 3169846 3820311 1750224 -802942 -1528416 -341541 1361469
43838 1361469 2467304 2594217 1892477 1144246 1270285 2115554 2418299 1487149 174352
43829 174352 -314822 184032 1110465 2062416 2701178 2538834 1606040 729872 401271 -33308
43819 -33308 -1219686 -2392809 -2166555 -532951 838913 376213 -1851085 -4285916 -5185880
43810 -5185880 -3990868 -1809370 -316213 88967 518066 1664872 2497342 1725036 -121824
43801 -121824 -1267657 -1053178 -554971 -883768 -1915543 -2801981 -2802140 -1510105 782385
43792 782385 2743389 2944019 1471432 -158181 -898007 -1095860 -1262796 -1003243 153128
43783A53128J531444R64453J49579l02122m05592o5841R05803J782050J260404
43774E973306o25065k074693j714157k89704N34391K22019n74808j234395j506374
43765a289480j146734j42220R32336J447733J366215Q94487N827j070853j463188
43756d65877n99420Q63430J836122K054601J732811O61668j114576k310886j702018
43747I55855j73188K61171n38384p62050J60347N59812m21437j105042j57115
43738a220031Q96914J80456j200703r28173O23882J171113N19509N87255J512285
43729B142507J144253q86411j947722o91027N42988l14065j462799l69590J703823
43720a38043J650731l53529j256759j63269O13634j59064o90631L60300J389107
$$ plain form
43783 153128 1684572 2649025 2798604 2496482 2090890 2025049 2930852 4712902 5973306
43774 5973306 5348241 3273548 1559391 1269687 1804078 2026097 1451289 216894 -1289480
43765 -1289480 -2436214 -2578434 -1646098 -198365 1167850 2062337 2068164 997311 -465877
43756 -465877 -1065297 -201867 1634255 3688856 5421667 6083335 4968759 2657873 955855
43747 955855 782667 1043838 505454 -256596 -96249 463563 42126 -1062916 -1220031
43738 -1220031 -323117 -142661 -1343364 -2271537 -1647655 -476542 42967 630222 2142507
43729 2142507 3286760 2400349 452627 -238400 304588 -9477 -1472276 -1841866 -138043
43720 -138043 1512688 1159159 -97600 -260869 352765 193701 -496930 -136630 1252477
43711A252477O00237r28616j025745J58128O26970k98256j200407q04954M40819
43702a179347J168239N76173r21801j956088j295876P53624K332642J994876L76492
43693A848934p39502o69525k89776l91569n54070J062J094117J721527J335335
43684C356533M84080j342j31072n88033j463406j833471j019053L07825R69379
43675H1440P93940M23813J1167p17847j242995n07728J289250K439279J814971
43666D385290J76618j086461j436694r52529J08998Q70540L36324q40894o39916
43657I21276J166389J911248j33651k521907j790185J264239K561407P28735j160856
43648B946695n24380J108736R78551p78953j942285j600191o87715l1998L44924
$$ plain form
43711 1252477 1852714 924098 -101647 56481 683451 385195 -815212 -1620166 -1179347
43702 -1179347 -11108 565065 -356736 -2312824 -3608700 -2855076 -522434 1472442 1848934
43693 1848934 1109432 439907 150131 -241438 -795508 -794446 299671 2021198 3356533
43684 3356533 3840613 3839271 3708199 3120166 1656760 -176711 -1195764 -887939 81440
43675 81440 875380 1299193 1310360 592513 -650482 -1158210 131040 2570319 4385290
43666 4385290 4561908 3475447 2038753 1086224 1195222 2065762 2402086 1561192 921276
43657 921276 2087665 3998913 3865262 1343355 -446830 817409 3378816 4107551 2946695
43648 2946695 2422315 3531051 4509602 3730649 1788364 188173 -499542 -531540 -186616
43639a86616N05928O14928J175785K059265K005426M27120j116251r32574L1215
43630D584226m35648j990448j898870M53197J859693k79137l814768m418654j284285
43621g224694K117251K775148J367275K52138K31167N32837O87915Q55073Q41999
43612B436109K45981n01849m25541M96587J116552O85553k48291q79457j187683
43603A737961j364149j041923K0204J063521J139300M79065P7691J16508j20629
43594B107549p77513j039980n00653J77382M43541O93012J231862J336359L19487
43585C991046j092407j537391q81349k91667n16141r92908q14844R4016R66506
43576a075139R77966N0766q55409n79991O80635J213319j252j498817j057709
$$ plain form
43639 -186616 319312 934240 2110025 4169290 6174716 6601836 5485585 4553011 4584226
43630 4584226 4148578 2158130 259260 712457 2572150 2293013 -1521755 -5940409 -7224694
43621 -7224694 -5107443 -2332295 -965020 -712882 -481715 51122 739037 1594110 2436109
43612 2436109 2682090 2180241 1754700 2251287 3367839 4053392 3805101 2925644 1737961
43603 1737961 373812 -668111 -647907 415614 1554914 2033979 2111670 2228178 2107549
43594 2107549 1330036 290056 -210597 -33215 410326 1103338 2335200 3671559 3991046
43585 3991046 2898639 1361248 479899 188232 -327909 -1320817 -2135661 -2041645 -1075139
43576 -1075139 -97173 -46407 -901816 -1481807 -801172 412147 410895 -1087922 -2145631
43567b145631J039026K111537P62568j210130j439802j16329P72667L03316p38534
43558f61312j450062j547699p92067Q25710K240150K012043K68282j123977q20525
43549a049457L98089Q20182o0825j193916j372231m93181M67053N46685r3331
43540b030932l50385K90986R08461N11624k44957Q0416J314325J636429L16966
43531B432933j016612p21509M86695P10752l99840j419818j266033l47164L40319
43522a200277L28325j99598p62024r54123p77052m93015p1282P06088J402304
43513b020654J035568m26497j524800j049695L79887J306033J311815J016747
43505B8404Q74028R43776J236593J363020O04031p19174r97325K92664J199858
$$ plain form
43567 -2145631 -1106605 1004932 1767500 557370 -882432 -998761 -226094 77222 -661312
43558 -661312 -2111374 -3659073 -4451140 -3625430 -1385280 626763 895045 -228932 -1049457
43549 -1049457 -651368 168814 107989 -1085927 -2458158 -2951339 -2484286 -1937601 -2030932
43540 -2030932 -2381317 -2090331 -1181870 -670246 -915203 -834787 479538 2115967 2432933
43531 2432933 1416321 694812 1181507 1892259 1492419 72601 -1193432 -1540596 -1200277
43522 -1200277 -871952 -1071550 -1833574 -2787697 -3564749 -4057764 -4129046 -3422958 -2020654
43513 -2020654 -985086 -1411583 -2936383 -3986078 -3606191 -2300158 -988343 28404
43505 28404 902432 1846208 3082801 4445821 5049852 4330678 3333353 3626017 4825875
43496D825875J7696j821122j819286l79746O0472p54142p45726M62812Q20169
43487F67002j95007m14093Q73992J080698j227942l142988j579673J744031K774140
43478E80160R61894p29545p20085l32274o01410o85393J1893N91836L44615j05639
43468f83948o2044J84120J18853j74406l03441L3732Q75815J568270J003284q02828
43458A757407k051218j271206N68608J388053P56361j50982o44533q41991m83060
43449i72561O59793J529421Q64318o34756j034275P0038J247755J467692R00066
43440D097491j57375j282475j312483J90768J360306K57128j824919j982560k07088
43431h61207Q43183L78332K43952R22895O40639p26035q38619O58075R08044j088569
$$ plain form
43496 4825875 4843571 3022449 1203163 823417 883889 129747 -615979 -153167 667002
43487 667002 471995 57902 931894 2012592 784650 -2358338 -3938011 -2193980 580160
43478 580160 1542054 812509 92424 -239850 -841260 -1526653 -1514760 -922924 -578309 -683948
43468 -683948 -745992 -561872 -443019 -617425 -920866 -887134 -11319 1556951 2560235 1757407
43458 1757407 -293811 -1565017 -996409 391644 1148005 997023 352490 -489501 -972561
43449 -972561 -312768 1216653 2080971 1446215 411940 481978 1729733 3197425 4097491
43440 4097491 3940116 2657641 1345158 1535926 2896232 3153360 1328441 -654119 -861207
43431 -861207 -18024 360308 604260 1527155 2167794 1441759 603140 1261215 2169259 1080690
43421A080690k258582p55003N92731o81738k038713l26655K476246K524760N29661
43412A143397m7242P05631m5229j921807j696165O08477J367175l20076j084045
43403a289884O72283K026249Q08019p14866k8146J366110Q55929r03153j558261
43394A234280r49067n54857n70618j87777K68635j71107j195845j637880j178895
43385d943131k09497J094229K200186J893786P3893j298022p58355L08688j47048
43376a785271j363781q78472J407163K840274J895147J48360l30450L02903O09527
43367B845400J62384l74396p03953j158658j643237j362188N657J453643J640851
43358H65503O22751j67541Q7229M85455l737p50143n42495K05076J02441o10717
$$ plain form
43421 1080690 -1177892 -1932895 -1340164 -2021902 -4060615 -4387270 -1911024 613736 1143397
43412 1143397 1096155 1801786 1756557 -165250 -1861415 -1252938 114237 -205839 -1289884
43403 -1289884 -617601 1408648 2216667 1501801 1473655 2839765 3695694 2792541 1234280
43394 1234280 285213 -269644 -840262 -1028039 -759404 -930511 -2126356 -3764236 -4943131
43385 -4943131 -5152628 -4058399 -1858213 35573 109466 -1188556 -1946911 -1638223 -1785271
43376 -1785271 -3149052 -4027524 -2620361 219913 2115060 2263420 1932970 2235873 2845400
43367 2845400 3007784 2633388 1929435 770777 -872460 -2234648 -2228991 -775348 865503
43358 865503 1488254 1320713 1407942 1893397 1889660 1139517 597022 802098 904539 293822
43348B93822k57587J165564J425716l89775k000486j251163O13802J068524J70969
43339H39386j26852M95445N74282j65487l67079K35901J45177j150961j914641
43330a434829p72855J059626J489386L58925p33970p48956j55288J84153J73844
43321e79964L87622J165183J978222J874981O89430o04674j160442j297436j514821
43312I38101j171863M68645K240004J927135n34683k426028j671858M75010J328422
43303A572885L01943q59477q62704m31071r02943k224060k895148j755749M81087
43294g575237J812401J289186L00934P43093K251603K584101R05216q72250q22060
43285F16987L36175O31064j44616m87196K14187Q50553M90806l10767n38825l9915
$$ plain form
43348 293822 36235 1201799 2627515 2237740 237254 -1013909 -400107 668417 839386
43339 839386 712534 1207979 1782261 1616774 1249695 1485596 1630773 479812 -1434829
43330 -1434829 -2207684 -1148058 341328 700253 -33717 -782673 -937961 -753808 -579964
43321 -579964 -192342 972841 2951063 4826044 5515474 4910800 3750358 2452922 938101
43312 938101 -233762 234883 2474887 4402022 3867339 1441311 -230547 244463 1572885
43303 1572885 1874828 1015351 152647 -278424 -1181367 -3405427 -6300575 -8056324 -7575237
43294 -7575237 -5762836 -4473650 -4172716 -3429623 -1178020 1406081 2311297 1439047 616987
43285 616987 953162 1584226 1439610 952414 1166601 2017154 2507960 2197193 1658368 1618453
43275A618453O25026R14297N52197l31874j048974q94525k3787P37196R69644
43266C117653Q90641N68083j46537p87499n05095M58522O64291m69947j610374
43257B179738j446715o39226n17427p04006J90331J834223K126750K82799j759683
43248A546784j898269n17811N04184M60467K18857N22604J128193J469698J193172
43239D627879J19338j436347k358373j669456P6836J140395N94150o62604j162016
43230g30198n60404K73194M16877k29114r65446r26766J17937J426838J898048
43221G20966J115399k85650j190343q38434N66516J749968J313681o12832k097938
43212D41333j615614j20539K43101p49323j158597K6621J300304J005459k37958
$$ plain form
43275 1618453 2243479 3157776 3709973 3378099 2329125 1434600 1410813 2148009 3117653
43266 3117653 4008294 4576377 4429840 3642341 3137246 3595768 4260059 3790112 2179738
43257 2179738 733023 93797 -423630 -1127636 -937305 896918 3023668 3306467 1546784
43248 1546784 -351485 -869296 -365112 95355 314212 836816 1965009 3434707 4627879
43239 4627879 4747217 3310870 952497 -716959 -640123 500272 1094422 431818 -730198
43230 -730198 -1290602 -1017408 -600531 -829645 -1795091 -2721857 -2603920 -1177082 720966
43221 720966 1836365 1550715 360372 -478062 88454 1838422 3152103 2539271 441333
43212 441333 -1174281 -1294820 -1051719 -1801042 -2959639 -2933018 -1632714 -627255 -865213
43203h65213p69674l71595K7035K72063Q78992J452203R82318l12691j051612
43194B41826p51625l24384k59493J09895R77177J236474K12968j037286j254395
43185h48843p88938o94313q53236m03519M96407Q16772M29191L32791R48079J409738
43175H44129R36465q1856p86242q12373j99518P94975J378733O81803q50211j472898
43165D33007l86784R62736R25497Q6325J27932R03915O71981p89933j525391n26623
43155H82662N80938K23819o25756l98069K02070m41374j658465j317380N03530
43146b048025J409204N17725l00424J74142M84790o73850j912303j435511r7390
43137c881642J37568m76129j53089J147999J681209R46362L46029N92904P06558
$$ plain form
43203 -865213 -1634887 -2006482 -1979447 -1707384 -828392 623811 1606129 1293438 241826
43194 241826 -509799 -834183 -1093676 -983781 -6604 1229870 1442838 405552 -848843
43185 -848843 -1637781 -2332094 -3185330 -3588849 -3092442 -2275670 -1846479 -1513688 -565609 844129
43175 844129 1780594 1698738 912496 100123 -99395 695580 2074313 2756116 1905905 433007
43165 433007 46223 1008959 1934456 2020781 2148713 3052628 3724609 2934676 1409285 882662
43155 882662 1463600 1687419 1061663 663594 865664 424290 -1234175 -2551555 -2048025
43146 -2048025 -638821 -121096 -421520 -247378 237412 -436438 -2348741 -3784252 -3881642
43137 -3881642 -3744074 -4220203 -4373292 -3225293 -1544084 -597722 -251693 341211 1047769
43128A047769J48585j20243M04884O16784k21524r06877j75354J023434Q13109
43119B630567o90415j438914l47270J329983J845126J051271M1059n25435q53290
43110C042682j041860o56112L56325J031375N01842n50653o15477L88931Q08649
43101C265702k68938j545960j554188r12229r66025j180731k7744J960855K439981
43092A210723P90624r18314j176002r58352j307019j216435L15748J934002J778282
43083D53257M78232P0456P25570Q31795o3705o97619n07881m30802q68140q37274
43073h46111J09792Q15337L13912o73288j034933q70107p41692m24169L48944
43064c002315P53437o7935j318309j380533j53721Q65828Q96700P97137J236536
$$ plain form
43128 1047769 1196354 1076111 1480995 2097779 1876255 969378 794024 1817458 2630567
43119 2630567 1940152 501238 153968 1483951 3329077 4380348 4421407 3895972 3042682
43110 3042682 2000822 1344710 1701035 2732410 3234252 2683599 2068122 2457053 3265702
43101 3265702 2996764 1450804 -103384 -1015613 -1981638 -3162369 -3190113 -1229258 1210723
43092 1210723 2001347 1083033 -92969 -1051321 -2358340 -3574775 -3259027 -1325025 453257
43083 453257 931489 1001945 1727515 2559310 2495605 1797986 1290105 859303 -8837 -846111
43073 -846111 -736319 79018 392930 -280358 -1315291 -2185398 -2927090 -3351259 -3002315
43064 -3002315 -2248878 -2316813 -3635122 -5015655 -5169376 -4303548 -3406848 -2609711 -1373175
43055a373175J362897K73449j197214j415705j59585J322316K146609K380457
43047C340049J888760J76132k140197l181069k096710l60417L41659M18538J099848
43038e13407J818868R45856j156958k072664p86210P84465O26624o54034j158060
43029b165520m34763M70769Q46660Q64545P90323O93888O07269L00024n54816
43020A418379j472132j314821n0307P53080J39859o88749k82690P48488Q75501
43011A26608J15726l68842l14914j54567M55403J808878K505153J044299j276609
43002C941135j705107k62798K47279j086586j727915n3074J696697Q93708j355380
42993E87959k038736o25002Q71473J218373R65336O04531j06323j010351j386952
$$ plain form
43055 -1373175 -10278 263171 -934043 -2349748 -2509333 -1187017 959592 3340049
43047 3340049 5228809 5404941 3264744 83675 -2013035 -2373452 -2031793 -1613255 -513407
43038 -513407 1305461 2251317 1094359 -978305 -1764515 -980050 -353426 -1007460 -2165520
43029 -2165520 -2600283 -2129514 -1282854 -418309 372014 1065902 1673171 1973195 1418379
43020 1418379 -53753 -1368574 -1418881 -665801 -525942 -1214691 -1497381 -748893 126608
43011 126608 242334 -126508 -441422 -595989 -140586 1668292 4173445 5217744 3941135
43002 3941135 2236028 1973230 2220509 1133923 -593992 -647066 1049631 1943339 587959
42993 587959 -1450777 -2075779 -1204306 14067 979403 1583934 1477611 467260 -919692
42984i19692r88325j34433R25594J726897J328270l49863j595961q52993R44190
42975H3684J608895P94892J7998p5817l53337j015591r31331K55486J219180R94982
42965B599041L66448L06422M29187K9874n06405m54468m0622L4300l09478p46496
42955A707803j190317j472765j103984j40171M41320R9437k36638N31252J908263
42946E44200K384275J386160k88628j617800j999507j161883M55909J441886O88812
42937A833424j033966j806049r32443M04569R91629R56092Q81516O42268o3980
42928A873060p24108m99948N22451J312086J104540J57041o80148p84501k15530
42919B064943L27746R5165q42711j458443r46536R7733L51931l10136m71104O92590
$$ plain form
42984 -919692 -1908017 -2042450 -1116856 610041 1938311 1588448 -7513 -860506 83684
42975 83684 1692579 2487471 2505469 2429652 2076315 1060724 129393 384879 1604059 2599041
42965 2599041 2965489 3271911 3701098 3730972 3224567 2770099 2729477 2763777 2454299 1707803
42955 1707803 517486 -955279 -2059263 -2199434 -1758114 -1658677 -1895315 -1364063 544200
42946 544200 2928475 4314635 4026007 2408207 408700 -753183 -297274 1144612 1833424
42937 1833424 799458 -1006591 -1939034 -1534465 -542836 413256 1294772 1937040 1873060
42928 1873060 1148952 649004 1171455 2483541 3588081 3745122 3064974 2280473 2064943
42919 2064943 2392689 2487854 1645143 186700 -759836 -662103 -310172 -620308 -1091412 -398822
42909c98822J802145J005679j082785j794304j22033J611577R63517j030721j280120
42900c25867Q91607K767073K005465m49288k073691j948096j087183n51014m51867
42891a222861l84878O9847R67259J589273J001909m97324j373489r45739l68850
42882a164853n84137o27869N03879J566578Q01509q33764p27331J239080K250142
42873B423234P35987j500475k241589j643000q20522K20432J595513K233412J394361
42864B397353J52121l49783p66799j842096k270372o22917J678308J989222M55720
42855H20757l68582L15524P21668P2223p8915Q81886R84802r36356k671856j757645
42845b016494O15583J397777K68863k87520Q83448K054393J577811J50511p89568
$$ plain form
42909 -398822 1403323 2409002 1326217 -468087 -590120 1021457 1984974 954253 -325867
42900 -325867 565740 3332813 5338278 4888990 2815299 867203 -219980 -770994 -1222861
42891 -1222861 -1607739 -1537892 -570633 1018640 2020549 1523225 149736 -796003 -1164853
42882 -1164853 -1748990 -2376859 -1872980 -306402 495107 -338657 -1065988 173092 2423234
42873 2423234 3159221 1658746 -582843 -2225843 -3046365 -2825933 -1230420 1002992 2397353
42864 2397353 2549474 2199691 1432892 -409204 -2679576 -3302493 -1624185 365037 820757
42855 820757 452175 767699 1489367 1561590 1482675 2364561 3349363 2413007 -258849 -2016494
42845 -2016494 -1400911 -3134 265729 -21791 861657 2916050 4493861 4644372 3854804
42836C854804j170350j537544j461762k55692J279887J416412n0351j223524o39086
42827B12794N99382L53131j344804k122729o42392J346255J431856p2381q36056
42818a074944q4887N42669o2206o90572M0433J342907J506411N11325j17033M11076
42808B325179J331797J565354P05993r88913k582942k689779q59967J316974J626087
42799A749783r3357j668280j266614N25993J725736J359408K79236j52010K69947
42790B729842M10630o29794j991051j842117M4174J512823P11898j310278k051944
42781b415817j031575o9865j82307j71373J028877K362995K238934Q97593j78035
42772B479427m42128m86523n42409k27752K80681J58771o87408j215467o90345
$$ plain form
42836 3854804 2684454 1146910 -314852 -570544 709343 2125755 2075404 851880 212794
42827 212794 812176 1165307 -179497 -2302226 -2944618 -1598363 -166507 -238888 -1074944
42818 -1074944 -1159831 -617162 -679368 -1369940 -1329507 13400 1519811 2031136 1914103 2325179
42808 2325179 3656976 5222330 5928323 4939410 2356468 -333311 -1193278 123696 1749783
42799 1749783 1656426 -11854 -1278468 -752475 973261 2332669 2611905 2459895 2729842
42790 2729842 3140472 2510678 519627 -1322490 -1278316 234507 946405 -363873 -2415817
42781 -2415817 -3447392 -3517257 -3699564 -3870937 -2842060 -479065 1759869 2657462 2479427
42772 2479427 2037299 1550776 1008367 780615 1061296 1220067 532659 -682808 -1373153
42763a373153K76715O84997M96880L67152M68763L83867K6562j07680K37902O46253
42753B108258O91756N02640K98920r1135p19089j021718n85610k0557j36461n15596
42743E11408q7544R05824R47520l65089j432208r62243J56366L98138j57047m76753
42733e61628m65222n99584m49451O24457J732395J314666l53362j316583o94048
42724g68360M22951R55470R53733M95809o34243j683239j253631L92545J220180
42715A01215M69671j36133O15845J260596J72452j495993j514718k0117R29049
42706C81867N02092k54421m56320j76210M65939J215306R87391r00703k974591
42697a209650k960976r29596P69075Q56923M93386Q57158J300399Q28697j28344
$$ plain form
42763 -1373153 -1096438 -411441 85439 452591 921354 1305221 1331783 1224103 1462005 2108258
42753 2108258 2800014 3302654 3601574 3510439 2791350 1769632 1184022 1163465 1027004 511408
42743 511408 423864 1329688 2277208 1912119 479911 -482332 -325966 72172 -84875 -561628
42733 -561628 -1026850 -1626434 -2075885 -1451428 280967 1595633 1242271 -74312 -768360
42724 -768360 -345409 610061 1563794 2059603 1425360 -257879 -1511510 -1118965 101215
42715 101215 570886 434753 1050598 2311194 2483646 987653 -527065 -547182 381867
42706 381867 883959 629538 173218 -2992 462947 1678253 2665644 1764941 -1209650
42697 -1209650 -4170626 -5100222 -4331147 -3474224 -2980838 -2123680 -823281 5416 -122928
42688a22928n44161l33084q6224n0065j17413j71185N7321P29489J194271N61304
42678A117325o56574p70516N43029J336510J45290j617187j574191J58726J235074
42669h2514M83322p46258q58879n7442N39309O09924N45311M11448m780m35927
42659D03514l33485J63235K23414m54744j041926o96580J43051L41717j64644
42650a416448j33445J046111K049819J193645j094045k492825j588494M96327
42642a939355J645305J180753K00422n5743M31425O60598j22376j400441j761509
42633a160921n50910J114860J580765P21123q3306k1060K22073n2538l76892j95543
42623A197651j4375l72418o05339j7104M76034l81041j684560j249281Q57006
$$ plain form
42688 -122928 -667089 -1000173 -1086397 -1136462 -1253875 -1425060 -1367739 -638250 556021 1117325
42678 1117325 460751 -309765 233264 1569774 1715064 97877 -1476314 -1317588 -82514
42669 -82514 400808 -345450 -1204329 -1261771 -722462 -112538 432773 844221 839441 403514
42659 403514 70029 233264 456678 1934 -1039992 -1736572 -1593521 -1251804 -1416448
42650 -1416448 -1549893 -503782 1546037 2739682 1645637 -847188 -2435682 -1939355
42642 -1939355 -294050 886703 1087125 1031382 1462807 2123405 2001029 600588 -1160921
42633 -1160921 -1711831 -596971 983794 1704917 1621611 1600551 1822624 1770086 1393194 1197651
42623 1197651 1183276 810858 205519 188415 664449 283408 -1401152 -2650433 -1793427
42614a793427J936876O96273n98101K98030J795766Q70155j814207k430278J66265
42605h72648K376603J108565j605120j702416R12180K487603J009951j334593
42597B380125j801025o41923K18987J76131j6650k0055r3438j09475K11379L95562
42587F99618k39261j251320j345253q8268J393094J625912L42837j203575j403827
42578a470043m4959J203544P56476o01568p17431N37812Q51736p02083j719884
42569a906400k19310J767275J144386j211592j798789j01874R78404L39607K22362
42560g85931J576191J994766K36073j016023K66487J482124l43781l039480k448259
42551b077833N98556J379679j127575k726118q36488J729124J680588J07545j58641
$$ plain form
42614 -1793427 143449 839722 241621 539651 2335417 3205572 1391365 -1038913 -872648
42605 -872648 1503955 2612520 1007400 -695016 217164 2704767 3714718 2380125
42597 2380125 579100 -62823 156164 332295 315645 295590 202152 92677 304056 699618
42587 699618 460357 -790963 -2136216 -2224484 -831390 794522 1137359 -66216 -1470043
42578 -1470043 -1515002 -311458 445018 -156550 -873981 -336169 515567 -186516 -1906400
42569 -1906400 -2125710 -358435 785951 -425641 -2224430 -2326304 -1347900 -1008293 -785931
42560 -785931 790260 2785026 3021099 2005076 2271563 3753687 3409906 370426 -2077833
42551 -2077833 -1479277 -99598 -1227173 -3953291 -4789779 -3060655 -1380067 -1272522 -1431163
42542a431163Q51917J191846N79017J77720N1409n59450j224676r28206j22271
42533a413857o7488o02643o06239k24989m87238r95162l37533J158156J486876
42524b090117K14104o56395J64123J410701J609456J169917Q31809N8814j321736
42515A390676j747039l08567J036816J08744j825555j811630Q3296R31273k37572
42506b379558j019145J83985J572278J050137n14124j004138k04789O68423J138440
42497e08491J285517O36596q21159j532400k92119J493561J499737j06230j004116
42488F50896j77255J011955J183539M57046n82555j688514k374784k007433p99443
42479d326548M47528J518939K409440K198800J93537k015517j914847K62859J564811
$$ plain form
42542 -1431163 -579246 612600 1191617 1369337 1420746 861296 -363380 -1291586 -1413857
42533 -1413857 -1481345 -2083988 -2690227 -2915216 -3402454 -4397616 -4735149 -3576993 -2090117
42524 -2090117 -1876013 -2532408 -2368285 -957584 651872 1821789 2653598 2712412 1390676
42515 1390676 -356363 -664930 371886 480630 -1344925 -3156555 -3073259 -2141986 -2379558
42506 -2379558 -3398703 -3214718 -1642440 -592303 -1106427 -2110565 -2315354 -1646931 -508491
42497 -508491 777026 1413622 592463 -939937 -1232056 261505 1761242 1655012 650896
42488 650896 473641 1485596 2669135 3126181 2543626 855112 -1519672 -3527105 -4326548
42479 -4326548 -3879020 -2360081 49359 2248159 2441696 426179 -1488668 -1225809 339002
42470C39002N62699q63235r08114m78154r05378j311615l43512J152461J425130
42461a330716O23828J89110L32591K01663r3239L06356J099035J081030K39503
42452B649161j71922K54882N05639l5731o14350m71543r8450m41648j426431j874371
42442a724764q91274Q40063J508230L54565j004954n10768J305583J869436L66758
42433B112875j077433q66161k79484p51276j013951O07890K720317K589494M16175
42424D458446j057852q07791n26713j340919k210370k019280r81346M50373K000826
42415b034626K627625J314975q39468j484198l27821O15260M27149M05298J133691
42406A837885J161130j98262j281728q43515j37732n08891j005609l88396L45343
$$ plain form
42470 339002 901701 38466 -869648 -1347802 -2253180 -3564795 -3908307 -2755846 -1330716
42461 -1330716 -706888 -517778 -185187 16476 -76763 229593 1328628 2409658 2649161
42452 2649161 2477239 2732121 3237760 3202029 2587679 2116136 2017686 1576038 149607 -1724764
42442 -1724764 -2616038 -1775975 -267745 86820 -918134 -1428902 -123319 1746117 2112875
42433 2112875 1035442 169281 -110203 -861479 -1875430 -1267540 1452777 4042271 4458446
42424 4458446 3400594 2592803 2066090 725171 -1485199 -3504479 -4485825 -4035452 -2034626
42415 -2034626 592999 1907974 1068506 -415692 -743513 -128253 298896 704194 1837885
42406 1837885 2999015 2800753 1519025 675510 537778 28887 -976722 -1365118 -1019775
42397a019775k76609j339579q35870J070520K282385J748199L24254r04048j479988
42388d30511j150046j35759M96279R0693l98148K30938J397655J492554K16983
42379A810638j224670j872194j600877m40912J203855K032274J126211m18682
42371F15643o59289M87056J200239M33232q71160j434486j127679m64848K04828
42362a616464O29303P17773Q62924J320189J333001L5787j767460k128458n89431
42353a202836J061159J229081M41770M0286Q8099k70806j076351j427346r07624
42344b024568j13811L36065N16662O45478M88118j23359n59006J535J153210J363411
42334A683735Q4320j038604k03234J771016K244367M03185j582402j646457m40136
$$ plain form
42397 -1019775 -1296384 -2635963 -3471833 -2401313 -118928 1629271 1953525 1049477 -430511
42388 -430511 -1580557 -1716316 -1220037 -1129344 -1527492 -1296554 101101 1593655 1810638
42379 1810638 585968 -1286226 -2887103 -3328015 -2124160 -91886 1034325 615643
42371 615643 -43646 443410 1643649 2076881 1205721 -228765 -1356444 -1821292 -1616464
42362 -1616464 -987161 -269388 593536 1913725 3246726 3282513 1515053 -613405 -1202836
42353 -1202836 -141677 1087404 1529174 1569460 1657559 1386753 310402 -1116944 -2024568
42344 -2024568 -2138379 -1802314 -1285652 -640174 -152056 -275415 -834421 -832886 320324 1683735
42334 1683735 1768055 729451 526217 2297233 4541600 4944785 3362383 1715926 1275790
42325A275790J91215j21244n45930q10032j019585o20283O56311J466249M38348
42316I10839j270313j102836J140374K727648J694577o73052j855120j165539
42308D06578J02697N40099k07613j374292j599458k02745J731685K350051J331456
42299C078458J66008j61493m58273j566895k550702j869838K51841J857482J594238
42290C40826J93645n53954J14995J136786R59861m47493j446131q67364M17350
42281a51479Q29383K70435k31673n01077j174053j827176j059167J114424K699513
42272c0870K328028R16233j23457q13402j633346j994684j153289K63236J015177
42263a226374Q98233N04317N4004l83278k55103N97913J083782K51188j003971
$$ plain form
42325 1275790 1467005 1345761 799831 -10201 -1029786 -1650069 -993758 472491 910839
42316 910839 -359474 -1462310 -321936 2405712 4100289 3427237 1572117 406578
42308 406578 509275 1049374 841761 -532531 -2131989 -2334734 -603049 1747002 3078458
42299 3078458 3244466 3082973 2624700 1057805 -1492897 -3362735 -3110894 -1253412 340826
42290 340826 534471 -19483 95512 1232298 2192159 1744666 298535 -568829 -151479
42281 -151479 677904 948339 716666 215589 -958464 -2785640 -3844807 -2730383 -30870
42272 -30870 2297158 3213391 3089934 2276532 643186 -1351498 -2504787 -2241551 -1226374
42263 -1226374 -328141 176176 230180 -153098 -408201 189712 1273494 1524682 520711
42254E20711j070588m855P94353R49522J309025J781504J009563j116597k439954
42245A732684j292739R70148J666340L19914r96762o39625P33490J548940J341366
42236E383756O70857q7308q06959r16614Q2758J337893J203948l32371j036548
42227E499412O58127L125456L534666J777630M30275P92185J166135j28406k062592
42218A4792888k707928k212926k069914k316960j564887L52240J646676R37670
42210F856859r66664k195433j853723n12384O53521Q24319J00557o20100o09004
42201A677948j49147p3329o06435j153664j128756m72489N51165J507856J783470
42192A936619J009160l88149j447500j560632q87282j6398N35003O63354P25646
$$ plain form
42254 520711 -549877 -554732 239621 1189143 2498168 4279672 5289235 4172638 1732684
42245 1732684 439945 1410093 3076433 3396347 2399585 1759960 2493450 4042390 5383756
42236 5383756 6054613 5967305 5160346 4243732 4326490 5664383 6868331 6535960 5499412
42227 5499412 6157539 9282995 12817661 14595291 15025566 15817751 16983886 16855480 14792888
42218 14792888 12084960 9872034 7802120 5485160 3920273 4272513 5919189 6856859
42210 6856859 5890195 3694762 1841039 1328655 1982176 2806495 2907052 2286952 1677948
42201 1677948 1528801 1455472 849037 -304627 -1433383 -1905872 -1354707 153149 1936619
42192 1936619 2945779 2557630 1110130 -450502 -1337784 -1354182 -819179 -155825 569821
42183E69821J006736J115341M98558l63507k69881P71800J132296n6418j335051
42174C069695j048911O1176J43833p19982q56576M0939N86693L39951L76753Q00232
42164B793803J66212j604432k125344k980K531325K478064J82715j561505j561171
42155A296687j045546q54829k12985J282153K370021J752622j09700j620358j803781
42146A054284r20709J54051P19320O55325K62854k88618j027088j517318q71271
42137a779170Q62081J995224J029312j162336k207536j173071N99083J554980
42129b81433J454522O59473o00386j669065j506459j12378J132237J288578R66399
42120A331488Q56158M32636p26296j527543q30516N32963R22781M51745M78091
$$ plain form
42183 569821 1576557 2691898 3190456 2826949 2557068 3328868 4461164 4404746 3069695
42174 3069695 2020784 2081960 2225793 1505811 649235 690174 1276867 1616818 1993571 2793803
42164 2793803 2960015 1355583 -769761 -772741 1758584 4236648 4419363 2857858 1296687
42155 1296687 251141 -603688 -816673 465480 2835501 4588123 4478423 2858065 1054284
42146 1054284 133575 287626 1006946 1662271 1925125 1636507 609419 -907899 -1779170
42137 -1779170 -917089 1078135 2107447 945111 -1262425 -2435496 -1836413 -281433
42129 -281433 1173089 1832562 1232176 -436889 -1943348 -2055726 -923489 365089 1331488
42120 1331488 2187646 2620282 1893986 366443 -464073 68890 991671 1443416 1921507
42111A921507R06375K16191j595442k353399q76763J066990J245227m3653q64228
42102c77195m42438M17331R79175J192091J063777O45308L70703M53010L54588
42093D656350k40295n58161N9235P78262M60885l94716m96840m4389l11847j208211
42083B700273j311916m18245Q8275k30288j59008O89443R61121J33145k90620
42074B162180M54210P11859o46912j767194p08364J055978R32162m08169k55318
42065A530432J332244J569940k28033j477905o74358M76825M85019M34317J172968
42056D621449J106633q40261k542055j769863n3814k98386j875418j602200Q80969
42047b372946K322473R45654r36326p04918P98215J156567J76270l40758L39927
$$ plain form
42111 1921507 2827882 3044073 1448631 -904768 -1781531 -714541 530686 487033 -377195
42102 -377195 -819633 -402302 576873 1768964 2832741 3478049 3848752 4301762 4656350
42093 4656350 4416055 3857894 3917129 4695391 5156276 4761560 4264720 4220331 3908484 2700273
42083 2700273 1388357 970112 1058387 828099 669091 1358534 2319655 2452800 2162180
42074 2162180 2616390 3328249 2681337 914143 205779 1261757 2193919 1785750 1530432
42065 1530432 2862676 4432616 4204583 2726678 2052320 2529145 3014164 3448481 4621449
42056 4621449 5728082 4887821 2345766 575903 522089 223703 -1651715 -3253915 -2372946
42047 -2372946 -50473 895181 -41145 -746063 52152 1208719 1384989 1044231 1384158
42038A384158J031999O09445o36993j700890j916592j223425j02859O56323O12933
42029a285901R8662k87753l57773j72059L62405J146924J480305P33803o54985
42020A063628j499961j167238o0765J058286J643343J387970M20535m94218o49055
42011A702525l42438m07238q01962o74855j9148Q006r18874j256834K38141K265713
42001b06964K474637P02357r62569j216783q51312p60461n03813L03299P90964
41992b30645L05122j57776N12603J450532R34807q68743k002858j497414m28414
41983a982786M7569J81606N69455R33316Q39990O33043O82668M91707l69716j025490
41973A001362k96219J219504J451385l43370k251485k066527k24808Q62974K00233
$$ plain form
42038 1384158 2416157 3025602 2388609 687719 -1228873 -2452298 -2555157 -1898834 -1285901
42029 -1285901 -1187239 -1474992 -1832765 -2004824 -1642419 -495495 984810 1718613 1063628
42020 1063628 -436333 -1603571 -1664336 -606050 1037293 2425263 2845798 2351580 1702525
42011 1702525 1360087 952849 150887 -523968 -543116 -535110 -1453984 -2710818 -2472677 -206964
42001 -206964 2267673 2970030 2007461 790678 -60634 -821095 -1324908 -1021609 -230645
41992 -230645 74477 -83299 429304 1879836 2814643 1945900 -56958 -1554372 -1982786
41983 -1982786 -1935217 -1753611 -1184156 -250840 589150 1222193 1904861 2396568 2026852 1001362
41973 1001362 705143 1924647 3376032 3032662 781177 -1285350 -1510158 -647184 -446951
41964d46951n56474J94933J439748J124024m53890q17842Q89633K264982R65359
41955D603522j774390k663371p04162J746108K180882O64213r43468j250463l47340
41946A511531O24612N72218l39352o56994M49863J622819R29679j149353k069612
41937A495411q54594N09508K01205p26015k87795J150436J501664J97598j160347
41928B027071j301222p08153k55954J10674P23183J253754J161643N07045k05519
41919C312522o29287o96868m79520j88003n8802p9752m1639J01983J91566J69633
41909A601833J17561n126k95360n45974l48503K81939P03141L41898n25898r62159
41899C63352m37723M38774N74463j55874n91060J24733J096411P56616p46435
$$ plain form
41964 -446951 -1003425 -808492 631256 1755280 1301390 483548 1373181 3638163 4603522
41955 4603522 2829132 165761 -538401 1207707 3388589 4052802 3109334 1858871 1511531
41946 1511531 2136143 2708361 2369009 1712015 2161878 3784697 4714376 3565023 1495411
41937 1495411 640817 1150325 1351530 625515 337720 1488156 2989820 3187418 2027071
41928 2027071 725849 17696 -238258 -127584 595599 1849353 3010996 3518041 3312522
41919 3312522 2683235 1986367 1506847 1318844 1260042 1180290 1138651 1240634 1432200 1601833
41909 1601833 1719394 1714268 1418908 872934 524431 806370 1509511 1851409 1325511 363352
41899 363352 -74371 364403 938866 782992 191932 316665 1413076 2169692 1423257
41890A423257j475312l96124J094773J189573J77516k79393L11486Q69048O22228
41881C537052M0208j95244O60N08140J178922J411263N56525r32698j698806j204822
41871C201200l76856j17505j44501P6280J89584l31343j000203r05113j09968
41862D81575N54863Q91992J424842K035631J705733J69951j112698n93196J228962
41853F787655K370486K015580J468017K023817K997931K967635K334090L089278
41845B6054489N902694Q896739R919729Q713718N916027J381179m685114r789971
41837E2309490j0800958p863862m643334l835803m202435l265077j314702p62483
41829A5620836k278775l720920l080154q77551Q94211J066591l2660j332168j849840
$$ plain form
41890 1423257 -52055 -448179 646594 1836167 2013683 1734290 2045776 2914824 3537052
41881 3537052 3577260 3382016 3382676 3890816 5069738 6481001 7037526 6104828 4406022 3201200
41871 3201200 2824344 2706839 2562338 2638618 2828202 2496859 1496656 591543 481575
41862 481575 1036438 1928430 3353272 5388903 7094636 7264587 6151889 5558693 6787655
41853 6787655 9158141 11173721 12641738 14665555 17663486 20631121 22965211 26054489
41845 26054489 31957183 40853922 50773651 59487369 65403396 66784575 62099461 52309490
41837 52309490 41508532 33644670 29001336 25165533 20963098 17698021 16383319 15620836
41829 15620836 13342061 9621141 6540987 5663436 6557647 7624238 7591578 6259410 4409570
41820D409570j341209n45305l80133p88162r77320p46999n56413j82090J222385
41811A14324L089305L110079L53554k633449k796817p54082L18683m79247q46944
41802e24594M76341J542714O32493p91284o86102J08752l72090j519259j183235
41793b316264M30945J019293J11950l45281L80500O90618m3874j13417J211406
41784A025876J841100L11644j401905r40410N75880N35900p46933o77182J240874
41775A764844K647150J952987J61749j215215j818608j626017n71216M46523O8059
41766A810256j316756j589827Q5612J884182J868999M82551n63626o52750l43019
41757A665622k5114L05863N09665M92504N17206O39789L77918l95095q45692k95307
$$ plain form
41820 4409570 3068361 2523056 2142923 1354761 377441 -369558 -925971 -1108061 114324
41811 114324 3203629 6313708 6667262 4033813 1236996 482914 801597 322350 -524594
41802 -524594 -48253 1494461 2126954 1335670 649568 758320 386230 -1133029 -2316264
41793 -2316264 -1885319 -866026 -754076 -1099357 -718857 -28239 -72113 -185530 1025876
41784 1025876 2866976 3178620 1776715 836305 1412185 1948085 1201152 523970 1764844
41775 1764844 4411994 6364981 6526730 5311515 3492907 1866890 1295674 1742197 1810256
41766 1810256 493500 -1096327 -1010715 873467 2742466 3225017 2661391 2008641 1665622
41757 1665622 1640508 1946371 2456036 2948540 3465746 4105535 4483453 4088358 3242666 2947359
41747B947359N23927K42815j266512k555995k245361n37459J073477J428522Q65798
41738D76571N89901R32476Q49712l65044j554137j009275R14400J863291N09387
41729C207282j659408k247588q19886R14039J293938L70924m80334j74606R12664
41720A317025J399845N88918o53365j063424n27580K01517P84807J297269J390978
41711D735990P13240o0895N0570O79574N69471l51269r11820p89459r13773j467259
41701B254370j340116k19313N89111L07469o4366K90102M63648m17485j364957
41692D98463j015968J55867O62696K36212j48922J05093P00305J028816N27663
41683B750225q07331j742523q30067J256744J943826K44218j657367j546006j69637
$$ plain form
41747 2947359 3471286 3714101 2447589 -108406 -2353767 -2891226 -1817749 -389227 476571
41738 476571 1066472 1998948 2848660 2483616 929479 -79796 834604 2697895 3207282
41729 3207282 1547874 -699714 -1519600 -605561 688377 1059301 578967 404361 1317025
41720 1317025 2716870 3305788 2652423 1588999 1061419 1262936 2047743 3345012 4735990
41711 4735990 5449230 5388335 5438905 6118479 6687950 6336681 5424861 4635402 3721629 2254370
41701 2254370 914254 694941 1284052 1591521 1527155 1817257 2280905 1863420 498463
41692 498463 -517505 -361638 301058 537270 388348 493441 1193746 2222562 2750225
41683 2750225 1942894 200371 -629696 627048 2570874 2815092 1157725 -388281 -557918
41674e57918M49427Q500n59133r76267j102256r6702J806471K334246L84083j448676
41664B41775l55741K191486K651642Q25581n76375q15693j469085k272880j061706
41655f40996J682282K542591N26556j307756r80783l72689j027733j124574P78460
41646G5358K450293J523671m89065q90911j12477q6248m33216K76114J179825
41637C493344O16204l91640K00994J340811L01639k257129k664940M7652K547132
41628C234067K172091K24324r02853r73972p92559k74899O75524J207752R17342
41619E486817O84947R81684R45022K26460l6514N93771N56834j109183k563577
41610E766261j680213N07986J248431J63231n72762J13458Q29070L49161n72482
$$ plain form
41674 -557918 -108491 -99991 -659124 -1635391 -2737647 -2834349 -1027878 1306368 1690451 241775
41664 241775 -113966 2077520 4729162 5554743 4978368 4162675 2693590 420710 -640996
41655 -640996 1041286 3583877 4110433 2802677 1821894 1449205 421472 -703102 75358
41646 75358 2525651 4049322 3560257 2669346 2556869 2470621 2037405 2313519 3493344
41637 3493344 4109548 3717908 3918902 5259713 5561352 3304223 639283 686935 3234067
41628 3234067 5406158 5630482 4727629 3753657 2961098 2686199 3361723 4569475 5486817
41619 5486817 6171764 7153448 8098470 8324930 8288416 8882187 9439021 8329838 5766261
41610 5766261 4086048 4594034 5842465 6005696 5432934 5546392 6375462 6724623 6152141
41601F152141q19212n85538m62451k69221J38833R7358o45472r45168J19270J379295
41591D159835R21003j006926k060320r28413J085567K067664J718434Q32866j90539
41582F599171j162302j329563k37661J019766Q26450o90338j693229j129807K1548
41573B224035M41055K77685N03618J252335J700598J260741K30251n66974m57430
41564F865914M08787Q39990l02328k385417l158483j357561J481941K722776J650303
41555F765922k01871j322350j506212r30621N45283K510545L534197K595798N52128
41546A2542819o67702k12533R46792J365069O55250m42478j065840r53954l10618
41537A1856805O52737J773139K642042K668720J740573O41146L90149J111434
$$ plain form
41601 6152141 5332929 4747391 4284940 4015719 4154552 4251910 3606438 2661270 2780540 4159835
41591 4159835 5080838 4073912 2013592 1085179 2170746 4238410 5956844 6789710 6599171
41582 6599171 5436869 4107306 3869645 4889411 5715861 5025523 3332294 2202487 2224035
41573 2224035 2665090 2942775 3446393 4698728 6399326 7660067 7890318 7323344 6865914
41564 6865914 7274701 8114691 7812363 5426946 2268463 910902 2392843 5115619 6765922
41555 6765922 6564051 5241701 3735489 2804868 3350151 5860696 9394893 11990691 12542819
41546 12542819 11875117 11662584 12609376 13974445 14629695 14187217 13121377 12167423 11856805
41537 11856805 12509542 14282681 16924723 19593443 21334016 21975162 22365311 23476745
41529B3476745J920762K091294J945440K230044K907382L202867K912421K985145
41521D3672100M326375O455280Q080075Q931733J0265469J3292309J7738866K2373015
41513A35135222K6396835K9610329L1342290K9852505K3113694J0412997o273651
41506B79590221k2303266l2593995l4896065l1070578k4988483j9505368j5561246
41499I8671220j3072925j1501047j0017024q333966p207536p121528o901755n047506
41491B9467933k263540r91056k118079l728751l719519k256405q66890l50984
41483A3172709n31883j058248j469661j224959m86579j77290o05613q81024l93400
41474F344052P7213l81798j298200j544312r29665j61932K16608R3365m09176
$$ plain form
41529 23476745 25397507 27488801 29434241 31664285 34571667 37774534 40686955 43672100
41521 43672100 47998475 54453755 62533830 71465563 81731032 95023341 112762207 135135222
41513 135135222 161532057 191142386 222484676 252337181 275450875 285863872 279590221
41506 279590221 257286955 224692960 189796895 158726317 133737834 114232466 98671220
41499 98671220 85598295 74097248 64080224 55746258 48538722 41417194 34515439 29467933
41491 29467933 27204393 26213337 24095258 20366507 16646988 14390583 13523693 13172709
41483 13172709 12640826 11582578 10112917 8887958 8401379 8224089 7618476 6737452 6344052
41474 6344052 6421265 6039467 4741267 3196955 2267290 2105358 2321966 2415331 2006155
41465B006155p45323k90773N36345M43407p55030j437395l84947J408077K212567
41456B993083J804562J069918M03454k40220o41181q55633j456989k146546j493034
41447e62586O12479J906015R47935l82202J05308J141468K09871j869090k123402
41438a4204m49459L60253n14711r01831Q0534N79980j57072k37953J099093J671582
41428A516212K41362j014895j97719J094510Q04561j8800L67860P86179o80710
41419B898560k612618j988028Q94127K641749J650852k14328q42267j59164J005761
41410C274644K052884K298133J415407L68901K70307M83785l21287j548961j312064
41401F981749L61808J364238R08429O74121J719457K523639J480699m44530j220573
$$ plain form
41465 2006155 1260832 970059 1506404 1949811 1194781 -242614 -627561 780516 2993083
41456 2993083 4797645 5867563 6271017 6030797 5389616 4533983 3076994 930448 -562586
41447 -562586 49893 1955908 2903843 2521641 2626949 3768417 3978288 2109198 -14204
41438 -14204 -463663 -103410 -618121 -1519952 -1439418 -859438 -1016510 -1254463 -155370 1516212
41428 1516212 1757574 742679 544960 1639470 2444031 2425231 2793091 3579270 2898560
41419 2898560 285942 -1702086 -807959 1833790 3484642 3270314 2428047 2268883 3274644
41410 3274644 5327528 7625661 9041068 9409969 9680276 10164061 9842774 8293813 6981749
41401 6981749 7343557 8707795 9616224 10290345 12009802 14533441 16014140 15569610 14349037
41392A4349037p29190n31991j232905j661004p97987N47543N62062j291006l258950
41383E955609l036452n68108J602923J299741p31170k099330j858598j014313
41375d49698m51639k125M22028L63148j02617j01622P12339J548845J582733Q29280
41365D350672k62574j204483j398924o83974L0090k27627q95100o11093N04269
41356c98744R20178K04611l73278k07081l40588j238118j549269m02373Q31044
41347b553618O57896j55979r3121N52502O10852M23786J008520J560463L40210
41338B351511k054886k840263j008715J055306R29363o22910j088790L00493J903884
41329a075007J989242O36403o01399m00361R28747J690943P86701p75267j123625
$$ plain form
41392 14349037 13619847 13087856 11854951 10193947 9395960 9943503 10505565 9214559 5955609
41383 5955609 2919157 2351049 3953972 5253713 4522543 2423213 564615 -449698
41375 -449698 -901337 -903462 -481434 -118286 -220903 -322525 389814 1938659 3521392 4350672
41365 4350672 4088098 2883615 1484691 800717 830807 603180 -291920 -903013 -398744
41356 -398744 521434 726045 352767 145686 -194902 -1433020 -2982289 -3384662 -2553618
41347 -2553618 -1895722 -2051701 -2144822 -1592320 -981468 -557682 450838 2011301 2351511
41338 2351511 296625 -2543638 -3552353 -2497047 -1567684 -2190594 -3279384 -2978891 -1075007
41329 -1075007 914235 1550638 949239 548878 1477625 3168568 3955269 3180002 2056377
41320B056377j13189N53756l6933p48981m58509J29737k7591k94529M26016J319098
41310B805252O43465j147759j584068N0351J357682M14516j229774r87116P33167
41301A055716J285982M39r29751p8960J054476O31210o41260q33757J48992O51139
41291B344226o1509q93180p51745N6366O23359O50740L93757L3436m40050j003812
41281I51588j486974j574661j041977j67208L99306M69679N60958R12067R55969
41272b1253M56871L25838J155300J700180M44157j723091k305564p38211Q35838
41263A30065P55279j53345n31929n09866n91325k99302N66111Q34753j92831j159079
41253a151469p28178M0456m56651j290400m01996J593418J958914J93009j112339
$$ plain form
41320 2056377 1943188 2496944 2460011 1711030 1252521 1382258 1354667 1060138 1486154 2805252
41310 2805252 3448717 2300958 716890 767241 2124923 2539439 1309665 322549 1055716
41301 1055716 2341698 2342137 1412386 1333426 2387902 3019112 2377852 1544095 1693087 2344226
41291 2344226 2282717 1389537 637792 694158 1317517 1968257 2362014 2395450 1955400 951588
41281 951588 -535386 -2110047 -3152024 -3319232 -2919926 -2450247 -1889289 -977222 -21253
41272 -21253 435618 761456 1916756 3616936 4061093 2338002 32438 -705773 130065
41263 130065 885344 731999 200070 -309796 -901121 -1200423 -634312 200441 7610 -1151469
41253 -1151469 -1879647 -1839191 -2295842 -3586242 -3988238 -2394820 -435906 -242897 -1355236
41244a355236l55999R15113R76641M64583M78147M70130j49943l28099O24590
41235A739927J094135l45934j934088j007079J598442K466911P17666q60578k81868
41226C187534Q99153N09270r56920j641687j259391r78037j346789j783335j524396
41217d894598j72503J935035L250635K131607o75092k116351o92035J277399R87607
41208A031704p23189r97755L49980P86934n05925j326495k79569R77806O91599
41199E090k10884r7091N36536K69988n86515o74729m017L50117L10343N70320
41189D69158P73704N881j045305n67645J414059K520749J188593j235023k439569
41180A084602j896689p00174K58072Q14702Q85802L80011m16666j032339j262776
$$ plain form
41244 -1355236 -1711235 -796122 180519 645102 1123249 1593379 1443436 1115337 1739927
41235 1739927 2834062 2488128 554040 -453039 1145403 3612314 4329980 3469402 3187534
41226 3187534 4086687 4595957 3639037 1997350 737959 -240078 -1586867 -3370202 -4894598
41217 -4894598 -5067101 -3132066 118569 2250176 1575084 -541267 -1233302 44097 1031704
41208 1031704 308515 -689240 -339260 447674 -58251 -1384746 -1664315 -686509 5090
41199 5090 -205794 -302885 233651 503639 -82876 -757605 -761622 -411505 -101162 469158
41189 469158 1242862 1248743 203438 -364207 1049852 3570601 4759194 3524171 1084602
41180 1084602 -812087 -1512261 -1254189 -439487 446315 826326 409660 -622679 -1885455
41171a885455j097809n16337K85046P61817M81143m24801j361468j613489p16942
41162f088295R93798K268553K034231O89325l27072l11193Q6674Q4039k76095
41153h46035o20121p98991n96731K48585J326680J730826J388814J261628J680642
41144D775297J598780L48752r40867r15440j62429l28032j472427j873329n84440
41135D45865J138398J446933O9538j610701k100631j065516N50339J384735Q63843
41126A122803l05699r45201o09250J74205O36382M42403j79465o85672p36631
41117a086125o17995q43154j242695j034390p5568P04689O70465M86934R20551
41108b117288J362276P59153m10067n48240O04899J345616L90549j216076j469828
$$ plain form
41171 -1885455 -2983264 -3499601 -3214555 -2452738 -1971595 -2396396 -3757864 -5371353 -6088295
41162 -6088295 -5094497 -2825944 -791713 -102388 -429460 -740653 -653979 -569940 -846035
41153 -846035 -1466156 -2265147 -2861878 -2613293 -1286613 444213 1833027 3094655 4775297
41144 4775297 6374077 6722829 5781962 4866522 4704093 4376061 2903634 1030305 445865
41135 445865 1584263 3031196 3100734 1490033 -610598 -1676114 -1125775 258960 1122803
41126 1122803 817104 -128097 -737347 -563142 73240 515643 336178 -349494 -1086125
41117 -1086125 -1704120 -2547274 -3789969 -4824359 -4899927 -4195238 -3524773 -3037839 -2117288
41108 -2117288 -755012 4141 -405926 -954166 -349267 996349 1386898 170822 -1299006
41099a299006o7122J275329J078595j27193o62517R5242J029316R11506O648n85216
41089A655582o50521q17715r76243k07243J333268J984264R11701m85800o68459
41080B078834j76953k77386n76471N4425J002023O39274p85839j342646o11059
41071D202l10044j177034j548280j74426J533090J584131K70530o65334o72705
41062a155870n61021o43262k94759P05568J558478J395589K90838p89047r12260
41053d05746k10193J67478m03710q91473M705J650164K121539J033392l1754j92678
41043B841724l40713q46509m29346J347260K523884J511971l17353q36200l97564
41034E057154n85989j111539o12363M05139K66223p74984r68210k86286k92590
$$ plain form
41099 -1299006 -1366128 -90799 987796 860603 198086 293328 1322644 2234150 2240798 1655582
41089 1655582 1005061 187346 -788897 -996140 337128 2321392 3233093 2747293 2078834
41080 2078834 1901881 1624495 1048024 1102449 2104472 2743746 1957907 615261 4202
41071 4202 -305842 -1482876 -3031156 -3205582 -1672492 -88361 182169 -483165 -1155870
41062 -1155870 -1716891 -2360153 -2654912 -1949344 -390866 1004723 1295561 506514 -405746
41053 -405746 -615939 -448461 -852171 -1743644 -1738939 -88775 2032764 3066156 3034402 2841724
41043 2841724 2501011 1654502 1225156 2572416 5096300 6608271 6290918 5454718 5057154
41034 5057154 4471165 3359626 2747263 3152402 3418625 2643641 1675431 1389145 1096555
41025A096555r00705m35976Q01134M80091j369344j490742J343928L557640J816778
41016D899359j856405l110412j411669K13736K96669J81624N62076K60627r96788
41007i61183j508846l49475J038754J138708M61016K05002L18111J28604k30960
40998B39731k48877o2152n873J74035O75030Q23595l0751j177074j150788L29039
40988d34085J803529J645076j71286j964293j963627j82244J418176J075501n75185
40979F51562j256029p3502J329993J170613r9321q03480m62717J54089P49803
40970A361011J618460K196275J232211j119048k790529k224338l56409O76121
40962E93754J80372n67020j23921J426230K519028J658424q32618k712442k141355
$$ plain form
41025 1096555 195850 -240126 561008 1041099 -328245 -1818987 -475059 3082581 4899359
41016 4899359 3042954 -67458 -1479127 -1265391 -968722 -787098 -225022 35605 -961183
41007 -961183 -2470029 -2819504 -1780750 -642042 -181026 23976 342087 470691 239731
40998 239731 -9146 -71298 -77171 96864 771894 1595489 1564738 387664 -763124 -434085
40988 -434085 1369444 3014520 2843234 878941 -1084686 -1266930 151246 1226747 651562
40979 651562 -604467 -677969 652024 1822637 1723316 919836 457119 611208 1361011
40970 1361011 2979471 5175746 6407957 5288909 2498380 274042 -82367 593754
40962 593754 774126 207106 83185 1509415 4028443 5686867 4854249 2141807 452
40953D52l9366R41155k8332q72985J91568J958448K160076Q49456j00998j52599
40943D906875n04270j438835j551996k08570J172239J197405L15791l64460o29192
40934B894987n38159K94079J568004J804688M37118q25578l89967N97889M5752
40925E888813j546415j788918l34581N24087m08872j381442o07161J029855J597610
40916B972976R09356J72954n5834q6722k8910J24936r6306r35376j572527j128051
40906B76496o4250N10039M80547M82496M30839k94418j317645j388975k95353
40897a180224O18555L26674m93550n45950L63558J302168J429365P44720r4604
40888B470712l90792l7760L63256K37769k13498l70686j32278K7734j74116n55833
$$ plain form
40953 452 -38914 902241 873909 924 192492 2150940 4311016 5160472 5059474 4906875
40943 4906875 4402605 2963770 1411774 1203204 2375443 3572848 3888639 3524179 2894987
40934 2894987 2356828 2650907 4218911 6023599 6460717 5635139 5245172 5843061 5888813
40925 5888813 4342398 2553480 2218899 2742986 2334114 952672 345511 1375366 2972976
40916 2972976 3882332 4055286 3999452 3912730 3883820 4008756 3912450 2977074 1404547 276496
40906 276496 212246 722285 1202832 1685328 2116167 1821749 504104 -884871 -1180224
40897 -1180224 -561669 -234995 -728545 -1274495 -910937 391231 1820596 2565316 2470712
40888 2470712 2079920 2042160 2405416 2643185 2429687 2059001 1926723 1954457 1780341 1224508
40878A224508q38361p63982j27431O66341N45907p44682j603420m28905J745157
40869c24868K245412N14941j096673q73453O051j32814p73175o04905k4580k02632
40859a266696p47083m08211O01917J043484Q64231R22580R32488p8066j424131
40850D40513j246839M36685J451879P23682l72517n79769m97945q21759r30247
40841a396317m27166j95287o15441n31874O09597J380125O98599k29757j09324
40832h16845Q9925q36998j598820m15605J443748J193916r28693j751206R1404
40823c529174K326082K538530J079692l25820q50289n73475J35120M93837j00661
40814A193842r57673q72452m6045L71011M75092J242379K009584R34032j567390
$$ plain form
40878 1224508 386147 -377835 -505266 161075 706982 -37700 -1641120 -2070025 -324868
40869 -324868 1920544 2435485 1338812 465359 471410 338596 -434579 -1039484 -1064064 -1266696
40859 -1266696 -2013779 -2421990 -1820073 -776589 87642 1010222 1942710 1864644 440513
40850 440513 -806326 -369641 1082238 1805920 1433403 853634 355689 -466070 -1396317
40841 -1396317 -1823483 -2018770 -2634211 -3166085 -2556488 -1176363 -477764 -707521 -816845
40832 -816845 -726920 -1563918 -3162738 -3578343 -2134595 -940679 -1869372 -3620578 -3529174
40823 -3529174 -1203092 1335438 2415130 2089310 1239021 665546 800666 1294503 1193842
40814 1193842 236169 -636283 -682328 -311317 163775 1406154 3415738 4349770 2782380
40805B782380k616186j079086P18279P59476J12643K84862M83670l20141j002134
40796A23763m58847p3918j267628k410564j208604J262135K075437R75445J84322
40787g98459M33515M61177R3669N31417J502591J239429l69859j442300j260341
40778C90839j011575j051540l52091P92685N49476j102676j768548m76557P76708
40769c253279N81858K63455R02704J167207J00360p03320l1856M20810q96701
40760a448762k193143j192852Q38680J257582N93858J271308K836418K403494
40752D366583l17460k182446j368334K56041M84185k11274k58297N17409J234647
40743B521054J314212O05890o05236j231940l29055J309733J914917J231239N91752
$$ plain form
40805 2782380 166194 -912892 -194613 564863 677506 962368 1446038 1125897 123763
40796 123763 -335084 -409002 -1676630 -4087194 -5295798 -4033663 -1958226 -982781 -798459
40787 -798459 -364944 96233 189902 721319 2223910 3463339 3093480 1651180 390839
40778 390839 -620736 -1672276 -2024367 -1231682 -682206 -1784882 -3553430 -4029987 -3253279
40769 -3253279 -2671421 -2407966 -1505262 -338055 -237695 -941015 -972871 -552061 -1448762
40760 -1448762 -3641905 -4834757 -3996077 -2738495 -2144637 -873329 1963089 4366583
40752 4366583 4049123 1866677 498343 754384 1238569 1027295 768998 1286407 2521054
40743 2521054 3835266 4441156 3835920 2603980 2274925 3584658 5499575 6730814 7322566
40734G322566M04865l80396j828757k222894p15075J069750J246767l602j322619
40725C570605j909676j434210J84525J821004J597264m43022j735147p09860P58176
40716A699659K20326j588419k120015r78052M0870K30644O22267J381641J147075
40707F55996m40517j703460j342335k07038L06331K15181K57928L98323J93750
40698a665841j02232R8473O75163R60916O46033r8609j029446j768688j731271
40689d015502p84116L01060O93546N52105N56947O60833K39059n12342m65559
40680b773969O07217J136061j55688j875064j345337J452139L154209J380300
40672A579868j675503j990512P21998K686090J485439p93942j061502L79845J006930
$$ plain form
40734 7322566 7727431 7347035 5518278 3295384 2580309 3650059 4896826 4893224 3570605
40725 3570605 1660929 226719 411244 2232248 3829512 3386490 1651343 941483 1699659
40716 1699659 1919985 331566 -1788449 -2766501 -2725631 -2494987 -1872720 -491079 655996
40707 655996 215479 -1487981 -2830316 -3037354 -2731023 -2515842 -2257914 -1859591 -1665841
40698 -1665841 -1768073 -1669600 -994437 -33521 612512 513903 -515543 -2284231 -4015502
40689 -4015502 -4799618 -4498558 -3805012 -3252907 -2695960 -2035127 -1796068 -2308410 -2773969
40680 -2773969 -2166752 -1030691 -1186379 -3061443 -4406780 -2954641 199568 1579868
40672 1579868 -95635 -2086147 -1364149 1321941 2807380 2013438 951936 1331781 2338711
40663B338711J63838n38856l18561j99055p13168q20841J56519J188855J027801
40654B285243j21861j176877j472621r08813K45609J134847Q34842l71453j142584
40645f93668r21960n20950l70997L81266K059254L073282J787694j065262l214847
40636E13812l484408k364618o65278R33897J492846N99206n70662m02938R63931
40627b984212J875974J488696M96280l96576j210380j732035j341589k13248O16148
40618c400942P50021P38157O46272j30818j202090j084743M12263J431856Q12866
40609a027158o1316M15882J443137J300386K16614l32844l22944r13841j920810
40600a202894j855984n57654L46969m318n61954l10295L39569P56183J100376
$$ plain form
40663 2338711 2502549 1963693 1645132 1446077 732909 -87932 68587 1257442 2285243
40654 2285243 2163382 986505 -486116 -1394929 -1149320 -14473 820369 448916 -693668
40645 -693668 -1615628 -2136578 -2507575 -2126309 -67055 3006227 4793921 3728659 513812
40636 513812 -2970596 -5335214 -6000492 -5066595 -3573749 -2974543 -3545205 -3948143 -2984212
40627 -2984212 -1108238 380458 876738 480162 -730218 -2462253 -3803842 -4017090 -3400942
40618 -3400942 -2650921 -1912764 -1266492 -1397310 -2599400 -3684143 -3271880 -1840024 -1027158
40609 -1027158 -1088474 -672592 770545 2070931 2287545 1954701 1631757 717916 -1202894
40600 -1202894 -3058878 -3616532 -3269563 -3273881 -3835835 -4146130 -3806561 -3050378 -1950002
40591a950002J339050P30835p04464j472477n09357J155996J757794J054178J65736
40582A567289k29159m33523p66562r71426n67479N98581J934154K177424O09953
40573C919252j613159k335025j031682N09867P34661K66470L79241Q60089Q28639
40564B518353O07675R89575J311019K38205j699793k316486q39811Q84859R10184
40555B603780l84993j180367o38606L75153N91505k00187r47313n87755M56493
40546H7710O21900n20960j266006j54902J490533J173637r96120k203115q92667
40537b659990J182724J680118O40290m03294p75150o74391J5693J291770K052082
40528B349852J160745o94142j546485o15312Q35208J241311M55284n59442j064631
$$ plain form
40591 -1950002 -610952 119883 -584581 -2057058 -2566415 -1410419 347375 1401553 1567289
40582 1567289 1338130 904607 138045 -833381 -1400860 -802279 1131875 3309299 3919252
40573 3919252 2306093 -28932 -1060614 -550747 183914 450384 829625 1689714 2518353
40564 2518353 3126028 4115603 5426622 5664827 3965034 1648548 808737 1693596 2603780
40555 2603780 2218787 1038420 399814 774967 1366472 1166285 218972 -368783 87710
40546 87710 709610 188650 -1077356 -1232258 258275 1431912 435792 -1767323 -2659990
40537 -2659990 -1477266 202852 843142 439848 -335302 -1009693 -994000 297770 2349852
40528 2349852 3510597 2816455 1269970 654658 1489866 2731177 3186461 2627019 1562388
40519A562388j129995j148114j151652p78745Q6307R14772J103242P36266L03499
40510D97968j13857o73171r86236m83079M35160P12329K85774K19055Q46367J113514
40500A853824L89671m00572l53044n7200l81842q63255n76413K26855O17079M33322
40490H88425O7127m65167j045544q56758L88569J381727Q58099l88316o99861
40481A28301p4735K79019K73434P32105J213151L88599j285072j627806n0122
40472b3126J328418P68629p35777j284743o97684j01310o4058k88380l56649M1767
40462a412913R11639J503326R66595k25136o66873j62500k8922p58378j049322
40453i22484o2331R80803O79163m17459q57301l27353N58755J384720J664919
$$ plain form
40519 1562388 432393 -715721 -1867373 -2646118 -2559811 -1645039 -541797 194469 497968
40510 497968 384111 -289060 -1275296 -1758375 -1323215 -610886 -325112 -106057 740310 1853824
40500 1853824 2243495 1842923 1489879 1432679 1050837 187582 -388831 -161976 455103 888425
40490 888425 955552 490385 -555159 -1411917 -1023348 358379 1216478 828162 128301
40481 128301 53566 332585 606019 1338124 2551275 2939874 1654802 26996 -23126
40472 -23126 1305292 2073921 1338144 53401 -644283 -745593 -809651 -1098031 -1454680 -1412913
40462 -1412913 -501274 1002052 1968647 1743511 1076638 914138 885216 126838 -922484
40453 -922484 -984815 -4012 675151 257692 -599609 -926962 -368207 1016513 2681432
40444B681432O66900j219494k185648j457013o79156j232857j658218M8110K744422
40435b291522L382316J402276o90134j052560l87990J02884L68770N76487M58337
40426A868864J83634K94867M28028k79455j309519j185807q9606J00469r53813
40417i42338j075814R22310K861593K112797o16287k346695j752596k16462N21992
40408e31500J77616m73391o11864J8872Q68715J117005P40279M40696K97661m17874
40398A626215j600578j853718n80498Q27356J081459R14476J377990J554483M8711
40389C395896k117405k483298p72075P46924O68772P2793K36838P29378O61888
40380A139711K13687j33456n96427j269393j355036l19191R50752J178216L73170
$$ plain form
40444 2681432 3348332 2128838 -56810 -1513823 -2192979 -3425836 -5084054 -5035944 -2291522
40435 -2291522 1090794 2493070 1802936 750376 362386 465270 834040 1410527 1868864
40426 1868864 2052498 2347365 2775393 2495938 1186419 612 -88994 11475 -942338
40417 -942338 -2018152 -1095842 1765751 3878548 3262261 915566 -837030 -1053492 -531500
40408 -531500 -353884 -827275 -1439139 -1420267 -551552 565453 1305732 1746428 2044089 1626215
40398 1626215 25637 -1828081 -2408579 -1581223 -499764 414712 1792702 3347185 3395896
40389 3395896 1278491 -1204807 -1976882 -1229958 -561186 -488393 -251555 477823 1139711
40380 1139711 1353398 1219942 623515 -645878 -2000914 -2320105 -1369353 -191137 182033
40371A82033l83651m16867J4756L23323J36199m42572p09959N524J186403J289655
40361A184844k80064k009991j982316l19134J045938Q68714j09278m90894o596
40352b098777M65798K04312n19317q56711l88149M18931P70949M38537r0470k50867
40342a905764R1744P04934J187884J143260N98960K29606O04784J228184J029374
40333D912966j20056j220799j617665j612245j309357k14797J255912J360611
40325A434570m60896j908765o27923K060227K572968J13572k167955j678471K90144
40316c72529J033747K90324k35519Q6763L43629R4093p6587L8593o9603m05086
40306G27825l09384J95995J86140o25646j266117r82342l50983k27969m14299
$$ plain form
40371 182033 -201618 -618485 -603729 -280406 -144207 -586779 -1296738 -1291214 -104811 1184844
40361 1184844 904780 -1105211 -3087527 -3406661 -2360723 -1492009 -1601287 -2092181 -2098777
40352 -2098777 -1632979 -1428667 -1947984 -2804695 -3192844 -2773913 -2002964 -1564427 -1654897 -1905764
40342 -1905764 -1814020 -1109086 78798 1222058 1821018 2050624 2655408 3883592 4912966
40333 4912966 4792910 3572111 1954446 342201 -967156 -1181953 73959 1434570
40325 1434570 973674 -935091 -1563014 497213 3070181 3183753 1015798 -662673 -372529
40316 -372529 661218 951542 716023 802786 1146415 1240508 1163921 1202514 1132911 727825
40306 727825 418441 614436 800576 174930 -1091187 -2073529 -2424512 -2652481 -3066780
40297c066780j70702M99735Q80033N63262j40003o03884l29610O52249J476805
40288b38895J059411n04869j717712j481615n41383k61206m97287N8542J529249
40279b595765K254838J052099r93274j814793q39134O49781J324864J189988J051050
40270A279654J176869R01289m15296k232225l019804j895039J78067J323554Q21737
40261a881194l05260p74718m20899J24624M35366N06146M51286M77822Q25305
40252e61522J316613J284259L66290q50565j327186n78927Q87978J839468J139100
40243C515508r74007k480023j559849Q01262J646687J29355j030259L97484K413369
40234B859527J567185j611396l085786j214803J015945P00141q84485p77349J107799
$$ plain form
40297 -3066780 -3237482 -2737747 -1857714 -1294452 -1434455 -2038339 -2367949 -1715700 -238895
40288 -238895 820516 315647 -1402065 -2883680 -3425063 -3686269 -4183556 -4125014 -2595765
40279 -2595765 -340927 711172 -282102 -2096895 -2936029 -2286248 -961384 228604 1279654
40270 1279654 2456523 3357812 2942516 710291 -2309513 -4204552 -4026485 -2702931 -1881194
40261 -1881194 -2186454 -2961172 -3382071 -3257447 -2822081 -2315935 -1864649 -1386827 -561522
40252 -561522 755091 2039350 2405640 1555075 227889 -351038 536940 2376408 3515508
40243 3515508 2541501 61478 -1498371 -697109 949578 1078933 48674 446158 2859527
40234 2859527 4426712 2815316 -270470 -1485273 -469328 230813 -653672 -1431021 -323222
40225c23222K244709J226600q52178k232036k080884o84152N93082P6236k114290
40216d146135l332402j341352K463943M422915K966859n079j933787k025739q20925
40207c751702P77022J524531N33486j297824j836481l91251J335298J606869P28926
40198g71126k2279l16438n31544n56396p3358M97889M49092p3709k26075L74320
40188a249624J233220J573935R76750l09731j442580j715292j313726q60270l45111
40179c452429N63975J254330O60549o75873p68978P62409J617237K01023j579653
40170a417410r45466J538355K786392J620555j52814r86144j309851j513979p30264
40161a110626J152999K273011J226707o34495j016833J17233Q36819K21940o27868
$$ plain form
40225 -323222 1921487 3148087 2295909 63873 -2017011 -2701163 -2108081 -2031845 -4146135
40216 -4146135 -7478537 -8819889 -6355946 -1933031 1033828 1028749 -905038 -2930777 -3751702
40207 -3751702 -2974680 -1450149 -916663 -2214487 -4050968 -4442219 -3106921 -1500052 -771126
40198 -771126 -793405 -1109843 -1641387 -2197783 -2271141 -1773252 -1324160 -1397869 -1623944 -1249624
40188 -1249624 -16404 1557531 2534281 2224550 781970 -933322 -2247048 -3107318 -3452429
40179 -3452429 -2888454 -1634124 -973575 -1649448 -2418426 -1656017 -38780 162243 -1417410
40170 -1417410 -2362876 -824521 1961871 3582426 3429612 2443468 1133617 -380362 -1110626
40161 -1110626 42373 2315384 3542091 2907596 1890763 2007996 2844815 3066755 2438887
40152B438887n91240q9044j61379r23205j574360j486256p58584J02911O55069
40143b387201P05707L73625Q5804K85350R13118J312210R22165m4277r34537j424986
40133a93022j381682l02579J916010L629686K549811r60949l342397k126745N71354
40124C59487R36058j135951k160879m27240J663707J438423l64376j236022m27035
40115a353828Q21187J390848J129614L50942l44489l88269j29473m94722j207461
40106b25651p88585P85919J234904o51626k483971j359534J688784K916304J036388
40097B152932j420080j966951r43735J06466O76232R18006O50859j11218o50309
40088e87798m58634M2620K60275K18442J83619J74868J59899J33261j08397n93528
$$ plain form
40152 2438887 1847647 1758603 1597224 674019 -900341 -2386597 -3145181 -3042270 -2387201
40143 -2387201 -1681494 -1307869 -1222065 -936715 -23597 1288613 2210778 2166501 1231964 -193022
40133 -193022 -1574704 -1877283 38727 3668413 6218224 5257275 1914878 -211867 359487
40124 359487 1295545 159594 -2001285 -2428525 -764818 673605 309229 -926793 -1353828
40115 -1353828 -532641 858207 1987821 2338763 1994274 1606005 1476532 981810 -225651
40106 -225651 -1014236 -228317 1006587 354961 -2129010 -3488544 -1799760 1116544 2152932
40097 2152932 732852 -1234099 -2177834 -2071368 -1395136 -477130 173729 62511 -587798
40088 -587798 -1046432 -1003812 -743537 -525095 -341476 -166608 -6709 126552 18155 -575373
40078e75373o62146K63960J477239J657342P75858J05219J68456J0275j072917
40069B147913k299899k472554j328814N40145K147559K290072N26200j673855
40061a23233k095677n72834P53960M62284m54767o51209m35676n22734l91397
40052d031283N32044J321685R15557R6162L62802J498239J962780J246325J97905
40043D102216o52805j490976k083038j781211p52049L6551J31958j01063l53887
40034b944304n01244q5239J128001K176894J700030k04165j892489k010882o61364
40025c294762J058168J894794J198326k93611r12893j70532L82735m93035j612938
40016b243748j248337k3152K95905O1200J045871K810421K825073N64412j512135
$$ plain form
40078 -575373 -1237519 -973559 503680 2161022 2936880 3042099 3210555 3220830 2147913
40069 2147913 -151986 -2624540 -3953354 -3413209 -1265650 1024422 1550622 -123233
40061 -123233 -2218910 -2791744 -2037784 -1575500 -2030267 -2681476 -3117152 -3639886 -4031283
40052 -4031283 -3499239 -2177554 -1261997 -1165835 -803033 695206 2657986 3904311 4102216
40043 4102216 3449411 1958435 -124603 -1905814 -2657863 -2621312 -2489354 -2590417 -2944304
40034 -2944304 -3445548 -3530787 -2402786 -225892 1474138 1269973 -622516 -2633398 -3294762
40025 -3294762 -2236594 -341800 856526 562915 -349978 -520510 -137775 -630810 -2243748
40016 -2243748 -3492085 -3515237 -3219332 -3158132 -2112261 698160 3523233 4087645 2575510
40007B575510j835930j638328j867477j235956Q65639K267576J189031o80028
39999c59963p91440L44779N04608m14445p05705o7104K47183j7367N8920M59074
39989g41460K79030k54555j1220Q48297R89094K29652k45094m2891K8778k01379
39979H78252L839N54862M62332k67998n41290j68040l3037j36420L95165J103884
39969B251549M06646j449982k152191r27350J33698m11414j044972j55380J148081
39960b201315J199266P45387J321565K204192J586297k23591j297386j156166
39952B178249j007577j309904j304103q17288n30961m72969q436P13713R50489
39943a608787Q66190J178918J481572P23491o81292j134072m14939p7355q78289
$$ plain form
40007 2575510 739580 -898748 -2766225 -4002181 -3136542 -868966 320065 -359963
39999 -359963 -1151403 -806624 -302016 -716461 -1422166 -1489270 -1242087 -1259454 -1200534 -741460
39989 -741460 -462430 -716985 -728205 120092 1109186 1338838 1093744 1050853 1079631 878252
39979 878252 882091 1436953 1899285 1631287 1089997 921957 888920 752500 1147665 2251549
39969 2251549 2658195 1208213 -943978 -1871328 -1737630 -2149044 -3194016 -3349396 -2201315
39960 -2201315 -1002049 -256662 1064903 3269095 4855392 4631801 3334415 2178249
39952 2178249 1170672 -139232 -1443335 -2260623 -2791584 -3264553 -3272989 -2559276 -1608787
39943 -1608787 -742597 436321 1917893 2641384 1960092 826020 411081 333726 -544563
39934e44563j609263j123382L9328P68381P91114L08328n42462j214979q90460
39925d017958K64945R81767N77604j78140l35833N7824M58042N57565K04679m76191
39915a905696p14094R6744J153871J088283R7680k78107L54179P38311K74263
39906I05434j18490k279k08694q04923m78185Q71719J182489n10906k018910j252006
39896b434751L75853K57273j180708j308769M91292K113963J944625N41363p97166
39887B975j316768q34664J0134j8103r45621r78774P20141K053646R99325q50131
39877a157840o37363J059971J328985k1876m19307N80241N66656r06398j057996
39868f64927J102443K541928J137485q09402o51290K65713m86800j862970j303635
$$ plain form
39934 -544563 -2153826 -3277208 -3237880 -2469499 -1678385 -1370057 -1912519 -3127498 -4017958
39925 -4017958 -3753013 -2771246 -2193642 -2371782 -2707615 -2649791 -2191749 -1634184 -1429505 -1905696
39915 -1905696 -2619790 -2523046 -1369175 -280892 -183212 -461319 -107140 631171 905434
39906 905434 786944 784665 575971 -228952 -707137 164582 1347071 836165 -1182745 -2434751
39896 -2434751 -2058898 -1801625 -2982333 -4291102 -3799810 -1685847 258778 800141 2975
39887 2975 -1313793 -2148457 -2138323 -2156426 -3102047 -4080821 -3360680 -1307034 -307709 -1157840
39877 -1157840 -1795203 -735232 593753 571877 152570 732811 1299467 393069 -664927
39868 -664927 437516 2979444 4116929 3307527 2656237 2921950 2435150 572180 -731455
39859g31455O19125J165525q4944j078502r33137o18854l67298O48044K026147
39850F44651K138301P06209p11920j040230p33021m52863l01512l11390l18596
39841c80371K96693J414751J523137r7197j567144r10122O47089M59606j228271
39832A58171j757227m77383N36378L41272M09563J398215J790487Q27700r4519
39823C132657j95970o96004k003785k290263o69619P54025J48242r97077m46359
39814c264153J072069J302114J57879n69803j74573O35657J485514K182012J662357
39805D489073n90027k715059k409640l03460Q90648L66562k5601Q38052J603764
39796B144312Q36273o94365j204714k62907R42459J125500J94880p06176m56277
$$ plain form
39859 -731455 -112330 1053195 968251 -110251 -1043388 -1662242 -2029540 -1381496 644651
39850 644651 2782952 3489161 2777241 1737011 1003990 551127 249615 -61775 -380371
39841 -380371 -83678 1331073 2854210 2757013 1189869 279747 926836 1386442 158171
39832 158171 -1599056 -2076439 -1540061 -1198789 -789226 608989 2399476 3227176 3132657
39823 3132657 2936687 2240683 236898 -2053365 -2722984 -1968959 -1820717 -2817794 -3264153
39814 -3264153 -2192084 -889970 -732091 -1301894 -1476467 -840810 644704 2826716 4489073
39805 4489073 3899046 1183987 -1225653 -1529113 -638465 -271903 -297504 540548 2144312
39796 2144312 2980585 2286220 1081506 818599 1761058 2886558 3081438 2375262 1918985
39787A918985N33201O00964q97171k458187k408727j069177J81847R86748J658253
39778i53264J698966N69479o58695m20326Q73925J401011O96756j18265o34307
39769B455280j437256k110324j369079M24338J229137M31436k85894N4305J89074
39760d18983q10502j683013j170652j24612K03871K79133R82692J686172J389871
39751C33977N41763L7838l94010j124711j193840J23232J410312Q95435o68790
39742c8794j080984o0350O80180L85980L6956K22432M08450N09040J131716J908362
39732D102988J563461J55272o83122m21253n90481k011220k886090j256013J834273
39723a92185L328579J824343j046102k636283j743300O81674K457902J990743
$$ plain form
39787 1918985 2452186 3053150 2155979 -302208 -2710935 -3780112 -3598265 -2611517 -953264
39778 -953264 745702 1315181 656486 236160 1110085 2511096 3207852 3089587 2455280
39769 2455280 1018024 -1092300 -2461379 -2037041 -807904 -376468 -662362 -608057 -418983
39760 -418983 -1229485 -2912498 -4083150 -4207762 -4003891 -3724758 -2742066 -1055894 333977
39751 333977 875740 913578 519568 -605143 -1798983 -1675751 -265439 629996 -38794
39742 -38794 -1119778 -1180128 -499948 -113968 -77012 145420 553870 1062910 2194626 4102988
39732 4102988 5666449 5821721 5138599 4717346 4126865 2115645 -770445 -2026458 -192185
39723 -192185 3136394 4960737 3914635 1278352 -464948 216726 2674628 4665371
39715D665371k25451k098398k249295j316403n72314j23401N82284J154584N71180
39706C88157r66408j811675r72578N36575J142566Q44168R54245J917989K429931
39697D462970J186748j128421k405650j537559M21860J664000J521981O06005
39689D791934l20420r23328j096366r24199q04474j025866j229059q02306J86099
39680b147985R59721R87613N11098O6363q9490l074J54737K18280K10769L15260
39670A183292M65140K94105j50223j48978N82320J049993K17934j261030j740514
39661D92039q98983n6890m2318j35878L79123R40728P87466K57267P9373J62945
39651A964872J0194k75551k62239j312J72261K21587J81119j23374n23371l13257
$$ plain form
39715 4665371 4439920 2341522 92227 -1224176 -1796490 -1919891 -1337607 -183023 388157
39706 388157 -578251 -2389926 -3362504 -2825929 -1683363 -839195 115050 2033039 4462970
39697 4462970 5649718 4521297 2115647 578088 999948 2663948 4185929 4791934
39689 4791934 4471514 3548186 2451820 1527621 723147 -302719 -1531778 -2334084 -2147985
39680 -2147985 -1188264 -200651 310447 376810 287320 284246 438983 657263 868032 1183292
39670 1183292 1648432 1942537 1792314 1643336 2225656 3275649 3493583 2232553 492039
39661 492039 -406944 -463834 -506152 -642030 -262907 677821 1465287 1722554 1801927 1964872
39651 1964872 1975066 1699515 1437276 1435964 1608225 1829812 2010931 1887557 1364186 1050929
39641A050929O52508J276896M96917j204897k351580k119579p70971R65209K142379
39632A37811J865167K98704j068658j097269m09760k18673m60403k94665K21319
39623a026427M10041L96976O84443P55470j29354j079923n61184Q57159J011104
39614A318305l32947r44842J20226Q33018l07711j501924n32012J455367J689702
39605A797182J71557m84332P19280J740742P29212j450090k727686k366748j161061
39596c031944j26990K93487L39138N86007J056553Q71730m16016j555549j000505
39587b984089N93922R83625k77251r46177N02070K311453J838206o42282k348207
39578i68730j727945k9831R00012Q21927N76680N08833K73653k76585p22791n53475
$$ plain form
39641 1050929 1703437 2980333 3477250 2272353 -79227 -2198806 -2969777 -2004568 137811
39632 137811 2002978 2301682 1233024 135755 -274005 -492678 -953081 -1247746 -1026427
39623 -1026427 -616386 -219410 465033 1220503 1091149 11226 -549958 307201 1318305
39614 1318305 985358 40516 160742 993760 686049 -815875 -1347887 107480 1797182
39605 1797182 1968739 1484407 2203687 3944429 4673641 3223551 495865 -1870883 -3031944
39596 -3031944 -3158934 -2865447 -2526309 -1940302 -883749 -12019 -428035 -1983584 -2984089
39587 -2984089 -2390167 -1406542 -1683793 -2629970 -2127900 183553 2021759 1379477 -968730
39578 -968730 -2696675 -2726506 -1826494 -1004567 -427887 80946 354599 78014 -644777 -1198252
39568a198252K61128J116760J176628J79617j060438j253245L0894J737715K261063
39559C251870J050398p81863j541177o61983P80288J378934R81047N45586N57725
39550E560825L69307n46014j476031j427618p12222m94750q85082p14262M56325
39541A30478J328675P18108n24219o44486M67665J230155P72127l1310k70240
39532C176953l97682j119625j940589j892112j052288k58966K40115P75633J234534
39523a234027J174674P63539M92915J40102p69881j623440j281609k397P84351
39514a555773P68263R93556J469948Q06762q69011j129576R27932K456222R01185
39505D769508j761885j936887l6914M79562j079245j875927p17242J93235l06471
$$ plain form
39568 -1198252 -937124 179636 1356264 1535881 475443 -777802 -746908 990807 3251870
39559 3251870 4302268 3520405 1979228 1317245 2097533 3476467 4457514 5003100 5560825
39550 5560825 5930132 5384118 3908087 2480469 1768247 1273497 388415 -325847 130478
39541 130478 1459153 2177261 1653042 1008556 1476221 2706376 3478503 3447193 3176953
39532 3176953 2779271 1659646 -280943 -2173055 -3225343 -3484309 -3244194 -2468561 -1234027
39523 -1234027 -59353 704186 1197101 1337203 567322 -1056118 -2337727 -2340124 -1555773
39514 -1555773 -787510 206046 1675994 2482756 1613745 484169 1412101 3868323 4769508
39505 4769508 3007623 1070736 1033822 1513384 434139 -1441788 -2159030 -1965795 -2272266
39496b272266k07534J486292K191654O4915k239937j415780J266953K127311P67528
39487A769136j24856L57301M56149n26997j132224o79795k80273m08788j78437
39478g48784M32131K34945o53167n37564P87289J238940j87338j636812j298188
39469b368548O9158R12874J144475J096479K23688j360770j844696k32128J569796
39460g89672J261593m72955j231802n20511J33186J8403o0984L13237N68947M50704
39450c29854L29926K51972J6963n9702K05078l4368j328592k258374j007534J647963
39440b566522K969600J934410K90953l01150j68037j41691j37831m5327l42216
39431A492189q91855o60893L67715N30177r90840k325984j255326J450973K779457
$$ plain form
39496 -2272266 -2479800 -993508 1198146 1263061 -976876 -2392656 -1125703 1001608 1769136
39487 1769136 1644280 2001581 2457730 1930733 798509 118714 -161559 -570347 -748784
39478 -748784 -316653 -81708 -734875 -1272439 -485150 753790 566452 -1070360 -2368548
39469 -2368548 -2299390 -1386516 -242041 854438 1078126 -282644 -2127340 -2359468 -789672
39460 -789672 471921 -1034 -1232836 -1753347 -1620161 -1601758 -1662742 -1349505 -780558 -329854
39450 -329854 72 252044 269007 209305 414383 380015 -948577 -3206951 -4214485 -2566522
39440 -2566522 403078 2337488 2628441 2327291 2159254 2017563 1879732 1834405 1492189
39431 1492189 600334 -60559 307156 837333 -153507 -2479491 -3734817 -2283844 495613
39422D95613J347656r78148j599051k32141J115585O98345j048874k215859j707541
39413d124415l39512M69236M45772L05953L97692M64561M99667P67440J017787
39404i5819P15695Q2190j32729N0347j07119o27201o70903m3272M17421K65058
39394a46332P692p2030l18144n61835n9647R36626J130833L40314J632O87809
39384A946918R68530p1247j043053n64849L62098K02085l92075O0879R45138M46325
39374B860749j289563k304658j821193q37138Q6405J356339K563632K380422P18231
39365C713226q38613j245318j050747q73746m43566L42897Q44513O62730M5989
39356A157365q49218j828890j900664l40584J447243J139033j070675k313122
$$ plain form
39422 495613 1843269 865121 -733930 -966071 149514 847859 -201015 -2416874 -4124415
39413 -4124415 -4463927 -3994691 -3548919 -3242966 -2845274 -2380713 -1881046 -1113606 -95819
39404 -95819 619876 702066 569337 619684 512565 -114636 -785539 -828811 -411390 -146332
39394 -146332 -138640 -210670 -528814 -1090649 -1150296 -213670 917163 1257477 1259109 1946918
39384 1946918 2915448 2844201 1801148 1236299 1598397 1800482 1408407 1469286 2414424 2860749
39374 2860749 1571186 -733472 -2554665 -3391803 -3305398 -1949059 614573 2994995 3713226
39365 3713226 2874613 1629295 578548 -295198 -738764 -395867 448646 1111376 1157365
39356 1157365 308147 -1520743 -3421407 -3761991 -2314748 -1175715 -2246390 -4559512
39348d559512j006381J072043J621083P54614j10558m84257m64813K51241J428627
39339a497913J675880L84446q38738l06468J153664J414417Q4245j349238j840105
39330a119810j600345r41268J25407J164981J461098R80531L80470J55329L52412
39321I58805P35963P04240k89353j653878j912983p52111L13963K36343M3040
39312a615971Q49661J679128J090760j82872l99714J99101o9734j198396j350277
39303i98314M5799J320728J128348Q7885o36807p55500l88692L36584Q44481N79700
39293A564212O3094J39811L44700k85232j025041l06168J236843J186179o55585
39284B262813j476009J75418J940125J340485m82469r82313k30976q6924o15349
$$ plain form
39348 -4559512 -5565893 -4493850 -2872767 -2118153 -2228711 -2712968 -3177781 -2926540 -1497913
39339 -1497913 177967 562413 -276325 -582793 570871 1985288 2069533 720295 -1119810
39330 -1119810 -2720155 -3661423 -3536016 -2371035 -909937 70594 451064 606393 958805
39321 958805 1694768 2399008 2109655 455777 -1457206 -2209317 -1895354 -1659011 -1615971
39312 -1615971 -766310 912818 2003578 1820706 1420992 1620093 1550359 351963 -998314
39303 -998314 -952515 368213 1496561 1584446 947639 192139 -196553 140031 984512 1564212
39293 1564212 1627306 1767117 2111817 1826585 801544 495376 1732219 2918398 2262813
39284 2262813 786804 962222 2902347 4242832 3760363 2778050 2547074 2460150 1844801
39275A844801j69638J360226J925145K86588k144337k967053j357840J194916
39267b7192K235290P59216j379052j381688P44427J893496K94434j684619j065293
39258C89019J133118J576457j03271r66918K93930J313828k3621k254298k609082
39249a250838r04312O09412L77751r34863j645882p79280J192749K733448K565579
39240A963764R03879q71813j729987j670268j066245j87714N46998O84095K98114
39231a129177j82240o43963j042386p84927M70975J563994Q70592j180470k185656
39222d243258r11006J105164J867211J424882R93888Q40760M65505N0002J97547
39213A790695O19638M63351j86461l82896M5954J12335p19594j502985j040213
$$ plain form
39275 1844801 1675163 3035389 4960534 5247122 3102785 135732 -1222108 -27192
39267 -27192 2208098 2967314 1588262 206574 951001 2844497 3138931 1454312 389019
39258 389019 1522137 3098594 2995323 2028405 2322335 3636163 3612542 1358244 -1250838
39249 -1250838 -2155150 -1545738 -1167987 -2102850 -3748732 -4528012 -3335263 -601815 1963764
39240 1963764 2867643 1995830 265843 -1404425 -2470670 -2658384 -2111386 -1427291 -1129177
39231 -1129177 -1311417 -1955380 -2997766 -3782693 -3311718 -1747724 -877132 -2057602 -4243258
39222 -4243258 -5154264 -4049100 -2181889 -757007 236881 1077641 1543146 1593148 1790695
39213 1790695 2410333 2873684 2687223 2304327 2350281 2462616 1743022 240037 -800176
39204h00176M08559J368307R39264k83960j172820j345779j083089m81166M72713
39195a978147J159682P60541l21311o20876K42757Q34194K45076k09568Q19364
39186I31712K045798J249192j034865k025982q16415N78897O70151M02462P21137
39177B722087P11513l74683j313754q66364Q9617J24358m16507l84468N9651M6360
39167C97810k91335l70737m92450j002507j062765N2580J305591J261192K84623
39158H2002l37926n69977j035091j167471j10753J231094J306460N41542N16439
39149D56319J010517M94016o70176m39463J203379J702196o2362j908113j740983
39140D5330m47163J13338n539L04565R56072J014631L61963l43814o48427l36729
$$ plain form
39204 -800176 -391617 976690 1915954 1631994 459174 -886605 -1969694 -2450860 -1978147
39195 -1978147 -818465 -57924 -379235 -1000111 -757354 76840 321916 112348 931712
39186 931712 2977510 4226702 3191837 1165855 349440 928337 1598488 2000950 2722087
39177 2722087 3433600 3058917 1745163 878799 968416 1092774 676267 291799 351450 397810
39167 397810 106475 -264262 -756712 -1759219 -2821984 -2769404 -1463813 -202621 82002
39158 82002 -255924 -825901 -1860992 -3028463 -3139216 -1908122 -601662 -60120 456319
39149 456319 1466836 1960852 1290676 851213 2054592 3756788 3694426 1786313 45330
39140 45330 -401833 -288495 -294034 10531 966603 1981234 2343197 1999383 1350956 1014227
39130A014227O28815J461138R19508q65415k042866j364953K09218J028561P46806
39121A735039o031p63479j119017o07769L68631N41680m51271j371663j213299
39112b887179m87761J08858Q58264J832821K042064J032321J699K5987M55238
39103B982312L24699n1654k33205q10634j826387j717418K04882J810260R82791
39094A665646r94273j438417m46508j90527q77126n72018J140823K326120J767220
39085B380940K99307j108014k126816j879901K81273K531046K007130q69755k395797
39076h80587q06167J407945J638794O93400M49246O92713M98022M61968J105416
39067E260750R65068j059771k992105k261005J56809J012264l56869j385042m96711
$$ plain form
39130 1014227 1643042 3104180 4023688 3158273 1115407 -249546 -40328 988233 1735039
39121 1735039 1729008 965529 -153488 -761257 -392626 149054 -302217 -1673880 -2887179
39112 -2887179 -3374940 -3266082 -2407818 -574997 1467067 2499388 2501087 2527074 2982312
39103 2982312 3307011 3255357 3022152 2211518 385131 -1332287 -1127405 682855 1665646
39094 1665646 671373 -767044 -1213552 -1404079 -2281205 -2853223 -1712400 613720 2380940
39085 2380940 2680247 1572233 -554583 -2434484 -2153211 377835 2384965 1515210 -880587
39076 -880587 -1686754 -278809 1359985 2053385 2502631 3195344 3693366 4155334 5260750
39067 5260750 6225818 5166047 2173942 -87063 69746 1082010 725141 -659901 -1156612
39058a156612Q68231J079171P02635Q90850J219004N86526q02765j698237j530062
39049A58741q71348m01690j66129J23618N10085O64745K50917o25880j388933
39040a745874j479806q30670J41739Q59534R48410N61988L13953N49315P91483
39031A10072M20941k34667k52725M29155Q05989K47644p36635j396508j452071
39022b058805p27082P09123J716892R38497q47360r69559J322900L059350J445624
39013D589580j875225k917969q78906J207938J208604L79977L93313N44220m54738
39004B196794j804222j743332l22565Q02470Q61844O05648N88787L53731l80098
38995A159057r38850p12184j48916n7467l84209l78887K00549O90152M39689l08942
$$ plain form
39058 -1156612 -288381 790790 1493425 2384275 3603279 4189805 3387040 1688803 158741
39049 158741 -712607 -1114297 -1280426 -1156808 -646723 18022 268939 -356941 -1745874
39040 -1745874 -3225680 -4056350 -3914611 -3055077 -2106667 -1544679 -1230726 -681411 110072
39031 110072 531013 296346 43621 472776 1278765 1526409 789774 -606734 -2058805
39022 -2058805 -2785887 -2076764 -359872 578625 -268735 -1238294 84606 3143956 4589580
39013 4589580 2714355 -203614 -1082520 125418 1334022 1713999 2107312 2651532 2196794
39004 2196794 392572 -1350760 -1673325 -870855 -9011 596637 1185424 1539155 1159057
38995 1159057 220207 -491977 -640893 -698360 -1082569 -1461456 -1260907 -570755 -131066 -440008
38985d40008p11169k84568O07288J139278Q11533m0576n44431l06690j1616n23632
38975c04591j437402j341185J41675J482988J179890j69619p12996K14605J504541
38966E57906J776586N62203j504582k721029j371522J868313L545477J428874
38958D142226j925655k181783P00514K566509J334298n14536o85038m43651j237359
38949A755525j549956l1964J242311M6261j895444j701150j60955J52363j94749
38940b337758J061831K729270J435967k148055l397277p86955J818860J350532
38932b73585k96919k79063Q07498J046879O72942Q05597J034786O02057Q9959
38923D210151J4200l87721j315470j433616l68228R5954r16106j517817k94951
$$ plain form
38985 -440008 -1151177 -1435745 -828457 310821 1122354 1081778 537347 230657 219041 -304591
38975 -304591 -1741993 -3083178 -2941503 -1458515 -278625 -448244 -1161240 -946635 557906
38966 557906 2334492 2896695 1392113 -1328916 -2700438 -832125 2713352 4142226
38958 4142226 2216571 34788 735302 3301811 4636109 4121573 3436535 2992884 1755525
38949 1755525 205569 173605 1415916 1462177 -433267 -2134417 -2295372 -2143009 -2337758
38940 -2337758 -1275927 1453343 2889310 741255 -2656022 -3442977 -1624117 -273585
38932 -273585 -570504 -849567 -42069 1004810 1677752 2483349 3518135 4120192 4210151
38923 4210151 4224351 3836630 2521160 1087544 719316 815270 -100836 -1618653 -1913604
38914a913604J091744Q77156K93384R85193J687472O29093q29669m62742O44153
38905C002180l0629j694119j405313P53336J785055Q54475J84901O16864L19396
38896D386146j210254j729860k97219P18525m14220j763623q96640J254337K056304
38887B103496J021186k83882r86883j456048j783012j508462n89252N34572J497423
38878a450862J867198J127429l74501j220056o14770L38555L9406j387189k208709
38869c883499j240760Q33972K289269K098467Q31428r9413o6259K29244L2717
38860A025166l46073l47619k82995n42198m47053O04066J455528N43527j357872
38851C04477j853496m90206N87684J1781r50710p42616K61755R50543J169427
$$ plain form
38914 -1913604 -821860 55296 348680 1333873 3021345 3650438 2820769 2358027 3002180
38905 3002180 2971551 1277432 -127881 625455 2410510 3264985 3449886 4066750 4386146
38896 4386146 3175892 1446032 1148813 1867338 1453118 -310505 -1207145 47192 2103496
38887 2103496 3124682 2840800 1853917 397869 -1385143 -2893605 -3482857 -2948285 -1450862
38878 -1450862 416336 1543765 1169264 -50792 -665562 -327007 -287601 -1674790 -3883499
38869 -3883499 -5124259 -4290287 -2001018 97449 928877 829464 763205 992449 1025166
38860 1025166 679093 331474 48479 -493719 -940772 -336706 1118822 1662349 304477
38851 304477 -1549019 -2039225 -1451541 -1439760 -2390470 -3133086 -2871331 -1920788 -751361
38842g51361J109123N44980k32862k12062N87214O92599m03316j054222R188J553457
38832A842738J734033O61474m61227j331271j982260j612350O8290J423193Q40195
38823A182815p58294j303059o88662m55486r63271j015067q7813R72395J472075
38814a644367J521462J243682O79438K48686J15589l77412j412523j723715m97091
38805a846251P87668M41697m75383K09496J867664J746433n03033k043080j173857
38796i88646M11204O96352Q2086k71941n44540j078002r96357K40105J330916
38787a118823Q83445m18381r24138m01449J16621J56898J40050L44194O26472
$$ plain form
38842 -751361 357762 902742 669880 457818 1045032 1737631 1334315 280093 289281 1842738
38832 1842738 3576771 4238245 3777018 2445747 463487 -1148863 -1080573 342620 1182815
38823 1182815 424521 -878538 -1567200 -2022686 -2985957 -4001024 -4088837 -3116442 -1644367
38814 -1644367 -122905 1120777 1800215 2048901 2164490 1787078 374555 -1349160 -1846251
38805 -1846251 -1058583 -616886 -1092269 -882773 984891 2731324 2228291 185211 -988646
38796 -988646 -577442 118910 200996 -70945 -615485 -1693487 -2689844 -2449739 -1118823
38787 -1118823 -235378 -653759 -1577897 -1979346 -1862725 -1705827 -1565777 -1221583 -595111
$$ [...]
##END NTUPLES=NMR SPECTRUM
##END=
