##TITLE=31Pdec_LR-688B-C4-EtOAc2
 CDCl3, 24 sc
 16.10.2019
##JCAMPDX= 6.0         $$ Bruker NMR JCAMP-DX V2.0
##DATA TYPE= NMR SPECTRUM
##DATA CLASS= NTUPLES
##ORIGIN= UXNMR, Bruker Analytische Messtechnik GmbH
##OWNER= root
$$ XWIN-NMR		Version 3.5
$$ Wed Oct 16 15:33:24 2019 Russian Standard Time (UT+4h)  she@DPX200
##.OBSERVE FREQUENCY= 81.013821
##.OBSERVE NUCLEUS= ^31P
##.ACQUISITION MODE= SIMULTANEOUS
##.ACQUISITION SCHEME= undefined
##.AVERAGES= 24
##.DIGITISER RES= 17
##SPECTROMETER/DATA SYSTEM= spect
##.PULSE SEQUENCE= zgpg30
##.SOLVENT NAME= DMSO
##.SHIFT REFERENCE= (INTERNAL, DMSO, 0, 182.463)
##AUDIT TRAIL= $$ (NUMBER, WHEN, WHO, WHERE, WHAT)
$$ ##TITLE= Audit trail, XWIN-NMR		Version 3.5
$$ ##JCAMPDX= 5.01
$$ ##ORIGIN= Bruker BioSpin GmbH
$$ ##OWNER= she
$$ F:/spectra/data/she/nmr/P31/1/pdata/1/auditp.txt
$$ ##AUDIT TRAIL=  $$ (NUMBER, WHEN, WHO, WHERE, WHAT)
(   1,<2019-10-16 15:32:33.53 +0400>,<she>,<DPX200>,
      <created by zg, POWCHK disabled, PULCHK disabled
       configuration hash MD5:
       00 E9 B6 7A A2 85 ED C7 34 08 36 98 17 FE 4E 26
       data hash MD5: 32K
       5B 9D BF FA D3 C3 33 0C BE 4A DD 1C EE 42 33 4C>)
(   2,<2019-10-16 15:32:36.26 +0400>,<she>,<DPX200>,
      <Start of raw data processing
       efp BC_mod = 2 LB = 1 FT_mod = 6 PKNL = 1 PHC0 = -250.7701 PHC1 = -227.5996 SI = 64K 
       data hash MD5: 64K
       A4 F3 14 AA CA 3B E6 48 4C BF 05 FA DC 51 97 FA>)
(   3,<2019-10-16 15:32:48.92 +0400>,<she>,<DPX200>,
      <pk PHC0 = -16.98119 PHC1 = 0 
       data hash MD5: 64K
       E4 04 19 68 10 7E A4 EE 22 0A 97 4F 77 FA 3C 4A>)
(   4,<2019-10-16 15:32:53.67 +0400>,<she>,<DPX200>,
      <abs ABSG = 5 
       data hash MD5: 64K
       17 C3 96 5B 82 E6 29 1A 2F B7 53 A2 2A 56 81 67>)
$$ ##END=
$$ 
$$ hash MD5
$$ 50 96 77 34 B4 43 84 0A 01 67 0A D7 2C FC 12 2D
##$RELAX= 
##$RELAX= 
##$RELAX= 
##$RELAX= 
##$RELAX= 
##$RELAX= 
##$RELAX= 
##$RELAX= 
$$ Bruker specific parameters
$$ --------------------------
##$DU= <F:/spectra>
##$EXPNO= 1
##$NAME= <P31>
##$PROCNO= 1
##$TYPE= <nmr>
##$USER= <she>
##$AMP= (0..31)
100 100 100 100 100 100 100 100 100 100 100 100 100 100 100 100 100 100 
100 100 100 100 100 100 100 100 100 100 100 100 100 100 
##$AQSEQ= 0
##$AQ_mod= 1
##$AUNM= <au_zg>
##$AUTOPOS= <>
##$BF1= 81.014009
##$BF2= 200.13
##$BF3= 200.13
##$BF4= 200.13
##$BF5= 200.13
##$BF6= 200.13
##$BF7= 200.13
##$BF8= 200.13
##$BYTORDA= 1
##$CFDGTYP= 0
##$CFRGTYP= 5
##$CHEMSTR= <none>
##$CNST= (0..31)
1 1 145 1 1 1 1 1 1 1 1 1 1 1 1 1 1 1 1 1 1 1 1 1 1 1 1 1 1 1 1 1 
##$CPDPRG= <waltz16>
##$CPDPRG1= <>
##$CPDPRG2= <waltz16>
##$CPDPRG3= <>
##$CPDPRG4= <mlev>
##$CPDPRG5= <mlev>
##$CPDPRG6= <mlev>
##$CPDPRG7= <mlev>
##$CPDPRG8= <mlev>
##$CPDPRGB= <>
##$CPDPRGT= <>
##$D= (0..31)
0 1 0 0 0 0 0 0 0 0 0 0.03 2e-05 3e-06 0 0 0 0 0 0 0 0 0 0 0 0 0 0 0 0 
0 0 
##$DATE= 1571225552
##$DBL= (0..7)
120 120 120 11 120 120 24 19 
##$DBP= (0..7)
150 150 150 150 150 150 150 150 
##$DBP07= 0
##$DBPNAM0= <>
##$DBPNAM1= <>
$$ [...]
##$SUBNAM3= <"">
##$SUBNAM4= <"">
##$SUBNAM5= <"">
##$SUBNAM6= <"">
##$SUBNAM7= <"">
##$SUBNAM8= <"">
##$SUBNAM9= <"">
##$SW= 369.568048894756
##$SWIBOX= (0..15)
0 1 3 0 0 0 0 0 0 0 0 0 0 0 0 0 
##$SW_h= 29940.119760479
##$TD= 32768
##$TD0= 1
##$TE= 0
##$TE2= 300
##$TE3= 300
##$TEG= 300
##$TL= (0..7)
0 120 53 12 22 120 120 120 
##$TP= (0..7)
150 150 150 150 150 150 150 150 
##$TP07= 0
##$TPNAME0= <>
##$TPNAME1= <>
##$TPNAME2= <>
##$TPNAME3= <>
##$TPNAME4= <>
##$TPNAME5= <>
##$TPNAME6= <>
##$TPNAME7= <>
##$TPOAL= (0..7)
0.5 0.5 0.5 0.5 0.5 0.5 0.5 0.5 
##$TPOFFS= (0..7)
0 0 0 0 0 0 0 0 
##$TUNHIN= 0
##$TUNHOUT= 0
##$TUNXOUT= 0
##$USERA1= <user>
##$USERA2= <user>
##$USERA3= <user>
##$USERA4= <user>
##$USERA5= <user>
##$V9= 5
##$VALIST= <valist>
##$VCLIST= <CCCCCCCCCCCCCCC>
##$VD= 0
##$VDLIST= <DDDDDDDDDDDDDDD>
##$VPLIST= <PPPPPPPPPPPPPPP>
##$VTLIST= <TTTTTTTTTTTTTTT>
##$WBST= 1024
##$WBSW= 4
##$XGAIN= (0..3)
0 0 0 0 
##$XL= 0
##$YL= 0
##$YMAX_a= 8257
##$YMIN_a= -9145
##$ZGOPTNS= <>
##$ZL1= 120
##$ZL2= 120
##$ZL3= 120
##$ZL4= 120
##$ABSF1= 182.463
##$ABSF2= -187.1042
##$ABSG= 5
##$ABSL= 3
##$ALPHA= 0
##$AQORDER= 0
##$ASSFAC= 0
##$ASSFACI= 0
##$ASSFACX= 0
##$ASSWID= 0
##$AUNMP= <proc_1d>
##$AZFE= 0.1
##$AZFW= 0.5
##$BCFW= 0
##$BC_mod= 2
##$BYTORDP= 0
##$COROFFS= 0
##$CY= -3
##$DATMOD= 1
##$DC= 0
##$DFILT= <>
##$DTYPP= 0
##$F1P= 0
##$F2P= 0
##$FCOR= 1
##$FTSIZE= 65536
##$FT_mod= 6
##$GAMMA= 0
##$GB= 0
##$INTBC= 1
##$INTSCL= 5.30512e-09
##$ISEN= 30
##$LB= 1
##$LEV0= 0
##$LPBIN= 0
##$MAXI= 10000
##$MC2= 0
##$MEAN= 0
##$ME_mod= 0
##$MI= 50
##$NCOEF= 0
##$NC_proc= -10
##$NLEV= 6
##$NOISF1= 182.463
##$NOISF2= 159.3651
##$NSP= 0
##$NTH_PI= 0
##$NZP= 0
##$OFFSET= 182.463
##$PC= 4
##$PHC0= -267.7513
##$PHC1= -227.5996
##$PH_mod= 1
##$PKNL= yes
##$PPARMOD= 0
##$PSCAL= 0
##$PSIGN= 0
##$REVERSE= no
##$SF= 81.0140089999434
##$SI= 65536
##$SIGF1= 159.3651
##$SIGF2= -187.1042
##$SINO= 113.3802
##$SIOLD= 16384
##$SREGLST= <1H.CDCl3>
##$SSB= 0
##$STSI= 65536
##$STSR= 0
##$SW_p= 29940.119760479
##$SYMM= 0
##$S_DEV= 0
##$TDeff= 32768
##$TDoff= 0
##$TI= <>
##$TILT= no
##$TM1= 0
##$TM2= 0
##$TOPLEV= 0
##$USERP1= <user>
##$USERP2= <user>
##$USERP3= <user>
##$USERP4= <user>
##$USERP5= <user>
##$WDW= 1
##$XDIM= 65536
##$YMAX_p= 510296769
##$YMIN_p= -394279148
$$ End of Bruker specific parameters
$$ ---------------------------------
##NTUPLES= NMR SPECTRUM
##VAR_NAME=  FREQUENCY,     SPECTRUM/REAL,   SPECTRUM/IMAG
##SYMBOL=    X,             R,               I
##VAR_TYPE=  INDEPENDENT,   DEPENDENT,       DEPENDENT
##VAR_FORM=  AFFN,          ASDF,            ASDF
##VAR_DIM=   65536,         65536,           65536
##UNITS=     HZ,            ARBITRARY UNITS, ARBITRARY UNITS
##FACTOR=    0.456856943014862, 1,           1
##FIRST=     14782.0589164792, 0,            0
##LAST=      -15158.0608439998, 0,           0
##MIN=       -15158.0608439998, -394279148,  0
##MAX=       14782.0589164792, 510296769,    0
$$ Real data points
##PAGE= N=1
##DATA TABLE= (X++(R..R)), XYDATA
$$ [...]
46157e1603890J2519864N043279j6914368j7488265J0708364L1394757J9046653
46150g293606n648776j2463363l886725J420583L522674J3726167K6476512K3182086
46142C9035552o6644k4760528k9901317j3181799O218795O570486j0161701j8123255
46134d4370411l440739J3068094Q797894l92908J4793759M2131732M0469961O993668
46126G8051050j5300043p108129o99000j8327964l1693714j4578488P701445K148331
46118A93488j4468005q143599J0538398P503414j1247785r810579J3195841K1460826
46110I221999J594733j9667490k3339021k0557796j8788846n485788K0836443
46103e6185766L6881707K7835500P813135n884953j4139398j9929939j6109398
$$ plain form
46157 -51603890 -39084026 -34040747 -50955115 -68443380 -57735016 -26340259 -7293606
46150 -7293606 -12942382 -25405745 -29292470 -27871887 -24349213 -10623046 15853466 39035552
46142 39035552 38968908 14208380 -15692937 -28874736 -22655941 -16085455 -26247156 -44370411
46134 -44370411 -47811150 -34743056 -25945162 -26338070 -11544311 30587421 71057382 78051050
46126 78051050 62751007 55642878 54943878 36615914 4922200 -9656288 -1954843 193488
46118 193488 -14274517 -22418116 -11879718 -4376304 -15624089 -25434668 -12238827 9221999
46110 9221999 10816732 -8850758 -32189779 -52747575 -71536421 -77022209 -56185766
46103 -56185766 -19304059 8531441 16344576 10459623 -3679775 -23609714 -39719112
46096c9719112l300070K718482l561832n086525R245869K3180363J8012415K673239
46088D162829r92820Q068548J1417185J211487r149665n910347O047162J0305557
46080B5159936r4912j4155879j7056851r443746n022617q219024o725284O253160
46072b9305217J6307820Q963245n231234o199665L442672M433801n294766p883774
46064b0767118K427158R119387J031129j1155650j3953197q689188k177765M647619
46056c9517625J1155804J3109454J0279267P131684L974356q67302j727867O257701
46048I795472J2532052L603816j2386583j5982369r650732j4044642k9226842
46041e5359828k9238503k917585K7823886M0130307L4004068J5443509j3748013
$$ plain form
46096 -39719112 -43019182 -40300700 -43862532 -48949057 -39703188 -16522825 1489590 4162829
46088 4162829 3170009 11238557 22655742 23867229 14717564 8807217 14854379 25159936
46080 25159936 25065024 10909145 -6147706 -15591452 -20614069 -28833093 -35558377 -29305217
46072 -29305217 -12997397 -4034152 -9265386 -15465051 -12022379 -7588578 -12883344 -20767118
46064 -20767118 -18339960 -9220573 -8189444 -19345094 -33298291 -41987479 -44165244 -39517625
46056 -39517625 -28361821 -15252367 -4973100 2158584 6132940 5265638 3537771 9795472
46048 9795472 22327524 25931340 13544757 -2437612 -12088344 -26132986 -55359828
46041 -55359828 -84598331 -87515916 -59692030 -19561723 14442345 29885854 16137841
46034A6137841l7159856k8023597Q788208L0188018J2925087j1852055q506445
46027a7502799Q680720N209645j4262221j6627032M214952K2357402K3603107
46020A5673774J8430927J4006739N378670n461247r585668r953065j5474283j9478958
46012f463111j0355802O33020p203106k3730275j5241887K1645787M6249778K8007431
46004C3541835j2397367l3520784k4020346m176112Q081120J1866552J0770271
45997i854831M130542o642931j2993894o477488R301526J8078869Q328330r423275
45989e553152j3020860R73571J1600861N068329n460409m388635N86910l855752
45981a4049137j0882937r159905p735051j6430936j6850013J0720512M2082853
$$ plain form
46034 16137841 -21022015 -49045612 -40257404 -10069386 2855701 -8996354 -17502799
46027 -17502799 -8822079 -3612434 -17874655 -34501687 -30286735 -7929333 15673774
46020 15673774 34104701 48111440 53490110 48028863 38443195 28490130 13015847 -6463111
46012 -6463111 -16818913 -16185893 -23388999 -47119274 -62361161 -40715374 5534404 33541835
46004 33541835 21144468 -12376316 -36396662 -40572774 -32491654 -20625102 -9854831
45997 -9854831 -5724289 -12367220 -25361114 -31838602 -22537076 -4458207 3870123 -5553152
45989 -5553152 -18574012 -17600441 -5999580 -931251 -6391660 -10780295 -10193385 -14049137
45981 -14049137 -24932074 -34091979 -41827030 -58257966 -75107979 -64387467 -22304614
45974b2304614L3929162p784503k9731669q727573J7916274J5110100p81683n89848
45966b964354Q000550K593744j0479413j0494209j221222j597993r647137o579375
45958c2389409R879498K2316219J9675302O412036q658409j6022947p183375J0976340
45950E005255J5821703M65445j0332036K328201J6461264K057565k6143764k6950362
45942b1286729K798390K3489649J5387282M589833J3465490K3095254Q216051
45935F9755220j9044123k8297364j5887149l826771l993442p941914q156703p847065
45927b5239311q463781m442768M826440R289937J439268r703255m997524K0997691
45919a6293303M4912612L3266716j5514816n6706208m4420621J0582118M8933410
$$ plain form
45974 -22304614 11624548 3840045 -25891624 -34619197 -16702923 -1592823 -2374506 -2964354
45966 -2964354 5036196 7629940 -2849473 -13343682 -14564904 -16162897 -25810034 -32389409
45958 -32389409 -22509911 -193692 19481610 25893646 17235237 1212290 -5971085 5005255
45950 5005255 20826958 21292403 10960367 13288568 29749832 31807397 5663633 -21286729
45942 -21286729 -18488339 5001310 20388592 24978425 38443915 61539169 69755220
45935 69755220 50711097 22413733 6526584 2699813 -1293629 -9235543 -17392246 -25239311
45927 -25239311 -33703092 -38145860 -33319420 -24029483 -22590215 -32293470 -37290994 -16293303
45919 -16293303 28619309 61886025 46371209 -10334999 -54755620 -44173502 4759908
45912D759908L3188738j1389688l6764061k9463830q806033J1314734K9124348
45905h035884L4083630J3398707j8421409k6766361l574484J7924635Q567762
45898A7176596j7874782k8562257j6999909k816073L016252Q435264J7854363
45891a9770546K1428795J1912772l066670j2094123j2675211p576007J749779
45884b0091211J1337274J2087320k08978j5321079j7174967l398140R000624K360053
45876b1409104j8079322k6527215q115047J8762111K4306683Q193555j329662
45869b4198001O802032P412321j7350210m0173820k4773938J5710270L4214145
45862d2357201J8335705K722962Q804622J4684175P07748j4582269r372242L164566
$$ plain form
45912 4759908 37948646 26558958 -10205103 -39668933 -48474966 -37160232 -8035884
45905 -8035884 26047746 39446453 21025044 -5741317 -9315801 8608834 17176596
45898 17176596 -698186 -29260443 -46260352 -49076425 -46060173 -37624909 -19770546
45891 -19770546 1658249 13571021 10504351 -1589772 -14264983 -21840990 -20091211
45884 -20091211 -8753937 3333383 3124405 -12196674 -29371641 -32769781 -23769157 -21409104
45876 -21409104 -39488426 -66015641 -74130688 -55368577 -31061894 -22868339 -24198001
45869 -24198001 -17395969 -9983648 -27333858 -67507678 -92281616 -76571346 -42357201
45862 -42357201 -24021496 -21298534 -12493912 2190263 2898011 -11684258 -21056500 -17891934
45854a7891934J457672o377505l308323R69400r238812j8549395l597618K0476708
45846c6059807J8509475p024653j8913672l812901J3294284J4991756J0719472
45839h296046N218938j0067413k4483352j0538482K4816105L3863525l020927
45832G492348m1039712l3704529J861441J8024182P776708J916101J2051223J8355610
45824g266628R604245j90214J645657Q932279J0101987J927633j1638824k2053847
45816h937712k0050351o662864N346754Q232832O842871L903881m220210r157630
45808b4702429O489278L3278852L3000884l118766k7397694l469179K9421409
45801D3502355J0231146m6054590o4725729k1267510K7035372L0561875J0043636
$$ plain form
45854 -17891934 -16434262 -22811767 -26120090 -25150690 -34389502 -52938897 -56536515 -36059807
45846 -36059807 -17550332 -24574985 -43488657 -47301558 -34007274 -19015518 -8296046
45839 -8296046 -3077108 -13144521 -37627873 -48166355 -23350250 10513275 7492348
45832 7492348 -33547364 -67251893 -65390452 -47366270 -39589562 -37673461 -25622238 -7266628
45824 -7266628 2337617 2147403 3793060 12725339 22827326 24754959 13116135 -8937712
45816 -8937712 -28988063 -35650927 -30304173 -22071341 -15228470 -11324589 -15544799 -24702429
45808 -24702429 -18213151 15065701 48066585 44947819 17550125 14080946 43502355
45801 43502355 53733501 7678911 -57046818 -78314328 -51278956 -20717081 -10673445
45794a0673445N071752J0679585K426885j1634320o170191J4569942K3002862
45787B7273070J1552515j079527k202472J493709J386396k226095p493601j4740649
45779A3963346k1228337k1108970j1504028M338247J7002885J4921988k719094
45772f333963j7884951j1663794R012143J8728407R648425N30500M423215R717954
45764A6177936M376648k410506J429223Q525038N661007l873006q016997m735848
45756A7133495R48732O828460P697500o036797k9581872l8691833j9860967Q621681
45748e2941601K2366706K2077992K0946005J8644110J0900786Q114672J6927458
45741F7036128J7921740o599981l4162953k7985961M086933J5791948r738064
$$ plain form
45794 -10673445 -5601693 5077892 7504777 -4129543 -10299734 4270208 27273070
45787 27273070 38825585 37746058 35543586 37037295 38423691 36197596 28703995 13963346
45779 13963346 -7264991 -28373961 -39877989 -35539742 -18536857 -3614869 -6333963
45772 -6333963 -24218914 -35882708 -26870565 -8142158 1506267 2036767 6459982 16177936
45764 16177936 20554584 18144078 19573301 28098339 33759346 29886340 21869343 17133495
45756 17133495 18082227 24910687 32608187 26571390 -3010482 -41702315 -61563282 -52941601
45748 -52941601 -30574895 -8496903 12449102 31093212 41993998 50108670 67036128
45741 67036128 84957868 78357887 44194934 16208973 20295906 36087854 26349790
45734B6349790l6733136l1208915l562446J8254436K6823748K7062279J6409892
45727D3395648l933338j7601799j4748483r274845j4311401j6549191J562637
45720c1460772K6558422K7615488Q20650k4517760k4567598n944681J1019373
45713b0476878J6469998J2115171J422162j1787910k0347266j6496682J208492
45706c7892913K3609068L4794354K5689050N381978q132135j0533606j3597791
45699A9318005k0457316j4697360J1944744L5488952K5943532q806618l0410020
45692A8323919k1988245p131500r385812j7645506q787462J3476076K4672981
45685h465549J5671938J215375n212776n814750n843494l373665K426291N491289
$$ plain form
45734 26349790 -10383346 -41592261 -45154707 -26900271 -76523 26985756 43395648
45727 43395648 39462310 21860511 7112028 -2162817 -16474218 -33023409 -31460772
45720 -31460772 -4902350 22713138 23533788 -983972 -25551570 -31496251 -20476878
45713 -20476878 -4006880 8108291 9530453 -2257457 -22604723 -39101405 -37892913
45706 -37892913 -14283845 20510509 46199559 51581537 43449402 32915796 19318005
45699 19318005 -1139311 -15836671 -3891927 31597025 57540557 48733939 18323919
45692 18323919 -3664326 -10795826 -20181638 -37827144 -46614606 -33138530 -8465549
45685 -8465549 7206389 8421764 3208988 -2605762 -8449256 -11822921 -9396630 -3905341
45677c905341K458990j015749K44783L018681K932227J623446M54554m297760
45669A513831j1800680j1107285K937714J5147934O709517j6190426k7304077
45662d0093472j5788878M25243L219540q38077K943763R942739M746977r173652
45654d4615817j0179864Q034428K2493248J0670086j8256474l4715743k4990250
45647i1560386l323231J0621177J4044601J6592429K2141326K3274687J2992121
45640D782724l880236j4188392j0504186N94530N487275k153130j5590560k3108208
45632e8560183j9375809p984042M761561J5957342K6195234L4771662L5781550
45625C1547315K1999517l415465k1500501j3497989J3432264K6669805N565679
$$ plain form
45677 -3905341 -1446351 -2462100 -2217317 801364 3733591 5357037 5811591 1513831
45669 1513831 -10286849 -21394134 -18456420 -3308486 3401031 -12789395 -40093472
45662 -40093472 -55882350 -55457107 -52237567 -53075644 -50131881 -40189142 -35442165 -44615817
45654 -44615817 -54795681 -46761253 -24268005 -13597919 -31854393 -66570136 -91560386
45647 -91560386 -94883617 -84262440 -70217839 -53625410 -31484084 -8209397 4782724
45640 4782724 902488 -13285904 -23790090 -23195560 -17708285 -19861415 -35451975 -58560183
45632 -58560183 -77935992 -85920034 -81158473 -65201131 -39005897 -4234235 31547315
45625 31547315 53546832 50131367 28630866 15132877 28565141 55234946 60800625
45618F0800625k8074650l3266537l097332K4414454J5832661j6063592l4965533
45611a4419904k9743162j8307239j1724624j957301J2761678J6389087j57702
45604d7159167k1309705k6161431j1948420J0746262L0792743L5022000J3148489
45597a6869229k0506733k9159409J310844L5313739L0998167k475394k1439960
45590b2827975j2432350l847975j2726835j8733790l505019J7524256K2156973
45583c4392715J4608373J0446340Q962507K494196l459960j817139k048594j4286829
45575a9493821k6175196j8270288N301679K3165271K7025179K4430700J7845390
45568C3828914M870818m166035N248089K3609427K1948171q960315m4074815n5710448
$$ plain form
45618 60800625 32725975 -540562 -3637894 20776560 36609221 20545629 -14419904
45611 -14419904 -44163066 -62470305 -74194929 -76152230 -63390552 -47001465 -47159167
45604 -47159167 -68468872 -94630303 -106578723 -95832461 -65039718 -30017718 -16869229
45597 -16869229 -37375962 -66535371 -65224527 -29910788 1087379 -1388015 -22827975
45590 -22827975 -35260325 -39108300 -51835135 -70568925 -74073944 -56549688 -34392715
45583 -34392715 -19784342 -9338002 -375495 2118701 -1341259 -3158398 -5206992 -19493821
45575 -19493821 -45669017 -63939305 -58637626 -35472355 -8447176 15983524 33828914
45568 33828914 38699732 34533697 39781786 63391213 85339384 76379069 32304254 -23406194
45560b3406194m1313685j3156673J9093329M4020782M5803526K3205179j159590
45553E3086674p496869n110562j4027201k8460379k2541083O326731K4822335
45546F599646P945437k1964413k2422273R816897L2107541J4529930j8581309
45539H031456k4047401p11010J2654400l194424k0889046r429322K0483726L4147321
45531A7045700K0996904K269007l593728j696765m915173j3398757j6025974m716611
45523d035397J5820755K9085861J9835253q338396l1702749k9505163o409465
45516a5249301J3518832J2694287m280392j7370129j0704083J0541429K3337921
45509A2488564J4279219m26715K186925J3641023N267082k0338008k5278199J225609
$$ plain form
45560 -23406194 -64719879 -77876552 -58783223 -14762441 31041085 54246264 53086674
45553 53086674 45589805 40479243 26452042 -2008337 -24549420 -18222689 6599646
45546 6599646 14545083 -7419330 -29841603 -20024706 12082835 26612765 8031456
45539 8031456 -16015945 -16726955 -4072555 -7266979 -28156025 -37585347 -17101621 17045700
45531 17045700 38042604 40311611 36717883 35021118 30105945 16707188 681214 -4035397
45523 -4035397 11785358 40871219 60706472 52368076 20665327 -8839836 -15249301
45516 -15249301 -1730469 10963818 6683426 -10686703 -21390786 -10849357 12488564
45509 12488564 26767783 26341068 28527993 42169016 47436098 27098090 1819891 3045500
45501C045500J6016041j2103548m5672008l1540611J6425948M0008371K5174131
45494A1353824R970372J0491188J930678j9342875j8079519J3936938L1318363
45487D1578969N785728k5888836k2085716j437750l987202k2340086k0816414
45480d9191307M31965R966787K76034o916403l303365j207584k135560M821947
45472d7257486J5352606J4609629P118089Q980586J3488053K81316k2000619k1024567
45464c0452393O347939K5420740J8609384J0539348K0235843K4597841k063076
45457G3235626l8911578m3367470j1706084J7457718J7300569K602425j38442
45450A6472764Q659505O352021j6928530m1237605l8499548o313784K7013466
$$ plain form
45501 3045500 19061541 6957993 -38714015 -70254626 -53828678 -13820307 11353824
45494 11353824 21324196 31815384 33746062 14403187 -3676332 10260606 41578969
45487 41578969 47364697 21475861 -609855 -2047605 -6034807 -28374893 -49191307
45480 -49191307 -48759342 -38792555 -38516521 -45432924 -48736289 -49943873 -52079433 -47257486
45472 -47257486 -31904880 -17295251 -10177162 -1196576 12291477 12572793 -9427826 -30452393
45464 -30452393 -24104454 1316286 19925670 30465018 50700861 75298702 73235626
45457 73235626 34324048 -9043422 -20749506 -3291788 14008781 16611206 16472764
45450 16472764 25132269 31484290 14555760 -26681845 -65181393 -71495177 -44481711
45443d4481711L3203045J3391716q659593j6320608j2653039o056284L060109
45436c8516365J6117125K5463066J8551800o067794l0754185l2542248r262325
45429e7010926J3005470Q931422j2331651j8464278k90940J5083252O753987q319619
45421e2643283n092812R205301J1302377L497116P289620K2296208K4234089N170814
45413B5259430j3355305j3304652k190097M509964K864013l312815q765774o656522
45405a4951758K250783L103829j1274920j9271329J757547L2611176L2166326
45398B6391654m09927k3447295j8287387j2015565k0276863j6152594J5187392
45391d9010585L5660007J0018118l1148446l2130060N981494L2877628K5759319
$$ plain form
45443 -44481711 -11278666 2113050 -6546543 -22867151 -35520190 -41576474 -38516365
45436 -38516365 -22399240 3063826 21615626 15547832 -15206353 -47748601 -57010926
45429 -57010926 -44005456 -35074034 -47405685 -65869963 -66160903 -51077651 -44323664 -52643283
45421 -52643283 -57736095 -48530794 -37228417 -33731301 -26441681 -4145473 20088616 25259430
45413 25259430 11904125 -1400527 -3590624 919340 3783353 470538 -8295236 -14951758
45405 -14951758 -12700975 -9597146 -20872066 -40143395 -38385848 -5774672 26391654
45398 26391654 25981727 2534432 -15752955 -27768520 -48045383 -64197977 -49010585
45391 -49010585 -13350578 -3332460 -34480906 -66610966 -60629472 -27751844 -1992525
45384a992525R768111N591821L448037n224384j0392266p843488q074710j1367088
45376b6086492l841864J3009424J8581010Q420886K860578Q718533M687847j7325111
45368I024811k7968651l574040L1775315L7776615J3626975r213859j6821213
45361C4625953k0978695k3501668r033821K0859386L7874495K4763282K82037
45354F4890969q182332O55136R415538R658039N806001J815308n70720J904579
45346H5392518N520791l749627k8959616m6578855l2991781q81349J5201750P881492
45338H35323L324413J4227083J8428243m80293k1081871j7305648l24902K398956
45330B1304p369335p175460L840508O958496J942625N246841J1083759m914782
$$ plain form
45384 -1992525 7775586 13367407 16815444 11591060 1198794 -6644694 -14719404 -26086492
45376 -26086492 -29928356 -16918932 1662078 10082964 12943542 21662075 26349922 9024811
45368 9024811 -18943840 -22517880 9257435 47034050 60661025 51447166 34625953
45361 34625953 13647258 -9854410 -18888231 1971155 39845650 64608932 64890969
45354 64890969 56708637 57363773 66779311 76437350 82243351 84058659 83487939 85392518
45346 85392518 90913309 87163682 58204066 11625211 -21366570 -22247919 -7046169 835323
45338 835323 4159736 18386819 36815062 36334769 15252898 -2052750 -2377652 21304
45330 21304 -7348031 -14523491 -10682983 -3724487 -1781862 3464979 14548738 9633956
45322I633956l6035225m0036341j499181L8053445L5781644K961614k0637879
45315a1777967k1279353j2275251k606674O323148R167168P299549J4286158K8523167
45307A7659945K3743605o258241k1939579N100668L6973890K1144515k3513117
45300E2911686l2962884r97768J2953135j3879609k9186240L661127M1625339
45293C4124786L2258403m199709j6048931m786429r233108k8919487k5298799
45286b2103274P326173K8687885J6031411o303303j1830824o440103l319324K027807
45278D076448J2989613J5699131K135802j1225780p272334N190175O980637j903098
45270B6670594o268193j152052L272444r45342r464399j2531331n713996M805734
$$ plain form
45322 9633956 -26401269 -66437610 -67936791 -29883346 5898298 8859912 -11777967
45315 -11777967 -33057320 -45332571 -47939245 -41616097 -32448929 -25149380 -10863222 17659945
45307 17659945 41403550 35145309 13205730 18306398 55280288 76424803 52911686
45300 52911686 19948802 18951034 31904169 18024560 -11161680 -7500553 34124786
45293 34124786 66383189 62183480 46134549 41348120 32115012 3195525 -22103274
45286 -22103274 -14777101 13910784 29942195 23638892 11808068 5367965 2048641 4076448
45278 4076448 17066061 32765192 34900994 23675214 16402880 21593055 28573692 26670594
45270 26670594 20402401 19250349 22522793 21577451 12113052 -418279 -6132275 -1326541
45262a326541O279459o019121j8885502j5573439J73946Q309365K493538j753613
45254b6301908M959191R810306K197874m868295L576236J6807909J5074872K817177
45246B4073362m08986M153545l583400k3597993k7954635k292308K8685624L2898776
45238C1973985J1482282q707030j1341001k635404N314133O327225k230759j8387979
45230A1795452k9842028k1035881P705484L3833805L2699317M845317k1502874
45223A8498592j9962066M104685K1303172J6015193K919947o67832j116574j0250585
45215C0844532j7631607q523786J807936j1963403l3995873j9553701L1944527
45208b7071375O2091512L4975921r232437j6486524L188897M798655j4415187
$$ plain form
45262 -1326541 4952918 -1066203 -19951705 -35525144 -35351198 -27041833 -24548295 -26301908
45254 -26301908 -21342717 -11532411 -9334537 -14202832 -10626596 6181313 21256185 24073362
45246 24073362 23664376 27817921 24234521 636528 -27318107 -29610415 -924791 31973985
45238 31973985 43456267 34749237 23408236 20772832 26086965 32414190 30183431 11795452
45230 11795452 -18046576 -39082457 -31376973 2456832 35156149 40001466 18498592
45223 18498592 -1463474 2641211 23944383 39959576 42879523 42211691 41095117 30844532
45215 30844532 13212925 4689139 6497075 -5466328 -39462201 -59015902 -27071375
45208 -27071375 35020137 69996058 60763621 44277097 47465994 52264649 37849462
45201C7849462k0839293j0251216j0733196k5072871k5042509n828811N522271
45194e4396163K556199Q956488K5389450K0219673r430982k1121096L426280K4559442
45186A59291J2459744k453265J2146580K9658447J3321543j4517495j1269166
45179C9505679Q254681j884034l3945906l6280685j958137J9334346M075330j2764599
45171a5663325l845505Q516123O98106r777637m27525J4822366J2127037j918622
45163D531018n954331M61351L012079m86707j297133K897162P735320R770079
45155B0668838N100022p231295j5514402o452480J0157552J0599263l525368l523492
45147A0278638J8337772L0534568J0745460j7111543j9827469m138130O58599
$$ plain form
45201 37849462 17010169 6758953 -3974243 -29047114 -54089623 -59918434 -54396163
45194 -54396163 -51839964 -42883476 -17494026 2725647 -6705335 -27826431 -24400151 159291
45186 159291 12619035 10165770 22312350 51970797 65292340 50774845 39505679
45179 39505679 47760360 45876326 11930420 -24350265 -26308402 -6974056 -2898726 -15663325
45171 -15663325 -19508830 -10992707 -10294601 -20072238 -20499763 -5677397 6449640 4531018
45163 4531018 -1423313 -961962 2050117 1563410 266277 3163439 10898759 20668838
45155 20668838 25768860 18537565 3023163 -3429317 6728235 17327498 13802130 10278638
45147 10278638 28616410 59150978 69896438 52784895 32957426 28819296 29477895
45140B9477895r432207j4539693q774782n770734j0943049j4223039r318617k41500
45132d3765726R045773J4773638Q444966j0645199k3495433j0942610J7929552
45125c8655039L4446607K5746628O368916l543206K174857J5648608K2312771
45118F4500142J1624696r102670j7883201o199381N402328n341382k8895277l6386028
45110b2280773j8974490N253612J9741486K3789200J9109654L408957j7596390
45103A2451256k8285406k0332826j967999J2993567J7012767R834960l048532
45096a342213j3083076j7096678j9944831k2005482j2723395J1183617L0462214
45089d4549844K4356117J579558r504188M48831J3351193J4385571R321985O087396
$$ plain form
45140 29477895 20045688 5505995 -3268787 -9039521 -19982570 -34205609 -43524226 -43765726
45132 -43765726 -34719953 -19946315 -11501349 -22146548 -45641981 -56584591 -38655039
45125 -38655039 -4208432 21538196 27907112 24363906 26538763 42187371 64500142
45118 64500142 76124838 67022168 49138967 42939586 48341914 43000532 14105255 -22280773
45110 -22280773 -41255263 -36001651 -16260165 7529035 26638689 30047646 12451256
45103 12451256 -15834150 -36166976 -38134975 -25141408 -8128641 1706319 -1342213
45096 -1342213 -14425289 -31521967 -51466798 -73472280 -86195675 -75012058 -44549844
45089 -44549844 -20193727 -18614169 -28118357 -27669526 -14318333 67238 9389223 15476619
45081A5476619K73641j0193772j3118158L77073J6871350J4858183n631192k0886338
45073a972594j3334724N491514R196222q413212k2938687j1667338J2360083J5778434
45065a5500302p079513k4851266j6138185p20373m631119j6259334o727317J9678056
45057g2229353L0287460J5915022L141282R279535J7144944P879171p685599r118824
45049e386362O97835K839625p593772j5953485q923884J0111833K4924073K1030008
45041B1745871M62604j6637435j2443436N985883J4787014N160929o147058l019941
45033I894431P178354O663920o618434j7828029j6420670q197347m671943o505011
45025c6504729l282876Q986824J6918734O546491j1449485j0584105J2129587
$$ plain form
45081 15476619 15750260 5556488 -7561670 -7184597 9686753 24544936 18913744 -1972594
45073 -1972594 -15307318 -9815804 -619582 -9032794 -31971481 -43638819 -31278736 -15500302
45065 -15500302 -22579815 -47431081 -63569266 -64289639 -68920758 -85180092 -91907409 -72229353
45057 -72229353 -41941893 -26026871 -22885589 -13606054 3538890 11418061 3732462 -5386362
45049 -5386362 -4688527 -1848902 -9442674 -25396159 -34320043 -24208210 715863 21745871
45041 21745871 22208475 5571040 -6872396 -886513 13900501 19061430 12914372 9894431
45033 9894431 17072785 23736705 17118271 -709758 -17130428 -25327775 -29999718 -36504729
45025 -36504729 -39787605 -30800781 -13882047 -7335556 -18785041 -29369146 -17239559
45018a7239559K5968031R150742j8166825k4418988j2345503o375394p926532
45011e1354028K429701K3735283L1638964J8903374N586516K921696j389721j3616385
45003A8855400k0375968j5276171j0463792j0487199l554043R215573O814169
44996b5272031j3645786k2946121l619529K1316340K5602925J7352005J4271620
44989A3059423R194194r004367k3749258j4405233N732912R102511j647124k119759
44981a3836701J0900040J7833512J1432669K965669k721930j0373748j5922725
44974B76786j0940827k002955j256472k839815O335578J8620133J5595679M89970
44966B4278077p594244o495189q022618p984679N983835J9589551M739378k9036210
$$ plain form
45018 -17239559 8728472 17879214 -287611 -24706599 -37052102 -43427496 -51354028
45011 -51354028 -48924327 -25189044 6449920 25353294 30939810 33861506 32471785 18855400
45003 18855400 -1520568 -16796739 -27260531 -37747730 -41301773 -32086200 -25272031
44996 -25272031 -38917817 -61863938 -65483467 -44167127 -18564202 -1212197 13059423
44989 13059423 22253617 13249250 -10500008 -24905241 -19172329 -10069818 -11716942 -13836701
44981 -13836701 -2936661 14896851 26329520 29295189 26573259 16199511 276786
44974 276786 -10664041 -12666996 -13923468 -16763283 -10427705 8192428 23788107 24278077
44966 24278077 16683833 10188644 2166026 -5818653 165182 19754733 24494111 -4542099
44958d542099l7805416r065587J7115748J1207133k290126P276245K1567644N629290
44950I092832k8613014l6663825j0832315Q432037m178244k2049610j0537084
44943i5349223J9515591K8132069M379607j8421758q643916K2441233L7267036
44936a0679361J8703415j4532324l4272862k8730889k963369K7778940M0580953
44929d115497K0756989j3734602k2338058P957915L9468147L0688134q562377
44922E0120651l3051045k1944641M300399J9732683J7193310j07342k3057377
44915A3186638l2679288j8278092O80226j911503j5494615o623961K2617684L0590530
44907g912381K122151k3038073j0963340J3882581R206168j9531620l1609684
$$ plain form
44958 -4542099 -42347515 -51413102 -34297354 -23090221 -25380347 -18104102 3463542 9092832
44950 9092832 -19520182 -56184007 -67016322 -58584285 -62762529 -84812139 -95349223
44943 -95349223 -75833632 -47701563 -43321956 -61743714 -70387630 -47946397 -10679361
44936 -10679361 8024054 -6508270 -40781132 -69512021 -72475390 -44696450 -4115497
44929 -4115497 16641492 2906890 -19431168 -11473253 27994894 58683028 50120651
44922 50120651 17069606 -4875035 -574636 19158047 36351357 36244015 13186638
44915 13186638 -19492650 -37770742 -37090516 -39002019 -54496634 -61120595 -38502911 -7912381
44907 -7912381 -5790230 -28828303 -39791643 -25909062 -16702894 -36234514 -67844198
44900f7844198j2870687J1983083K2143798K2096577J9445357R954069p397595
44893b489596j9740822j4720641L315403J7230683J4169497j462647j1442630
44886a5140753m149175J0100084J3179537N430250J792134L554110k544139j3764535
44878a542487r034412J1799161J7851530l980950k1076557m468641K1393163J5182211
44870B6123018j5389029k6754343p761126R241037M094678o226931m445743K419934
44862a8698505N670673R739843J2377219j56250k3895346l0734687q433383J6741631
44854c7388805J6661847R11165j260523J5805876L0184941K4193164L050697j5402492
44846C6755870j8967920j1128681o838813j3503405j7870786l645665K0575060
$$ plain form
44900 -67844198 -80714885 -68731802 -46588004 -24491427 -5046070 4907999 -2489596
44893 -2489596 -22230418 -36951059 -33635656 -16404973 -2235476 -3698123 -15140753
44886 -15140753 -19289928 -9189844 3989693 9419943 11212077 14766187 12222048 -1542487
44878 -1542487 -10576899 1222262 19073792 15092842 -5983715 -10452356 10940807 26123018
44870 26123018 10733989 -16020354 -23781480 -14540443 -10445765 -16672696 -21118439 -18698505
44862 -18698505 -13027832 -3287989 9089230 8932980 -14962366 -45697053 -54130436 -37388805
44854 -37388805 -20726958 -19815793 -21076316 -5270440 24914501 49107665 52158362 36755870
44846 36755870 17787950 6659269 -179544 -13682949 -31553735 -35199400 -14624340
44839a4624340L0138312K1375021J4862531J6232562M025537k7904108m6250395
44832b144880k3214351J7378943L0874246J3277879j992514Q56223N062068m2371
44824D0055243k515034K318803j304055j8199980k5479519p060547J6076770J3227050
44816A7118731j1498588k5144871j0959268J2935908K0452751P737023p558699
44809C082987q300472M638510J4150812O876971q272466q912067R716201K3488365
44801C6468841J0037907j8337744k8781759j1937657O177204N69980k0033262
44794b5836490k7004769r027043J6372929K6048454J6365703K431810k873617
44787c523023l267522r753603k0581034j9894295m53867K1769723K5788255J2108775
$$ plain form
44839 -14624340 15513972 36888993 51751524 67984086 72009623 44105515 -2144880
44832 -2144880 -25359231 -7980288 22893958 36171837 34179323 35035546 40097614 40055243
44824 40055243 37540209 39859012 38554957 20354977 -5124542 -12185089 3891681 17118731
44816 17118731 5620143 -19524728 -30483996 -17548088 2904663 10641686 3082987
44809 3082987 -5217485 -578975 13571837 20448808 12176342 3264275 12980476 36468841
44801 36468841 46506748 28169004 -612755 -12550412 -6373208 -5803228 -25836490
44794 -25836490 -52841259 -61868302 -45495373 -19446919 -3081216 -649406 -3523023
44787 -3523023 -6790545 -16544148 -37125182 -57019477 -57473344 -35703621 -9915366 2193409
44779B193409j195565m068925j254230K889214P528444L857938j6830254l8886137
44771d5766106l1355950O933709L5965137K6044306j994213j0907567J1934N829815
44763a5238935K659959O957719J6727022J1930483o627104j5120669p296082k511212
44755h518819p280633m525144R453049J4153568M361726K396986J3281597Q454803
44747C1777133k0345347l2948489l052568K9451562J5535169k3765934l0386011
44740c3734485j528257J2222575n781942j5920796M751864K5737894J8986529
44733D733382J732798k297259k175382j0776506j2842296M484330J8371658L560137
44725D790862k2271223k2470244L082497K0684461J3369518k448621q220633m081578
$$ plain form
44779 2193409 997844 -3071081 -4325311 -1436097 6092347 9950285 -6879969 -45766106
44771 -45766106 -77122056 -70188347 -34223210 -8178904 -10173117 -21080684 -21068750 -15238935
44763 -15238935 -12578976 -5621257 11105765 23036248 16409144 1288475 -6007607 -8518819
44755 -8518819 -15799452 -20324596 -10871547 3282021 7643747 10040733 23322330 31777133
44747 31777133 11431786 -21516703 -24569271 4882291 20417460 -3348474 -33734485
44740 -33734485 -35262742 -23040167 -28822109 -44742905 -39991041 -14253147 4733382
44733 4733382 6466180 4168921 1993539 -8782967 -21625263 -17140933 1230725 4790862
44725 4790862 -17480361 -39950605 -36868108 -16183647 -2814129 -5262750 -13483383 -17564961
44717a7564961K477443O991110N168238l686210j0352133o553951J098952K158566
44709b0262946J674391J1027516K3691131K0257432j966770k2924075k6362945
44702a4866266j6449892m323141O567886J5716482J9030666J5103450J0152644
44695C0931829J0354779J3810089J3249499L197705j5446985l3440986l7791531
44688a5135601k4664885n813505M352936N152137N715182R127874J1027342J1003652
44680G65132J2749682J3107395M024558j1992219k0563460j4750072n754819p426057
44672b9839860j6764297j7378573k45898K3929739L4304609K2042747J770576
44665A7819043m075487O647276J2830124J098660j2857237q153803O564135M438118
$$ plain form
44717 -17564961 -15087518 -8096408 -2928170 -6614380 -16966513 -23520464 -22421512 -20262946
44709 -20262946 -18588555 -7561039 16130092 36387524 34420754 11496679 -14866266
44702 -14866266 -31316158 -35639299 -29071413 -13354931 5675735 20779185 30931829
44695 30931829 41286608 55096697 68346196 71543901 56096916 22655930 -15135601
44688 -15135601 -39800486 -45613991 -41261055 -36108918 -30393736 -21265862 -10238520 765132
44680 765132 13514814 26622209 30646767 18654548 -1908912 -16658984 -22413803 -29839860
44672 -29839860 -46604157 -63982730 -64228628 -40298889 -5994280 16048467 17819043
44665 17819043 13743556 20390832 33220956 34319616 21462379 13308576 19872711 24310829
44657B4310829j6703836k8580180j5397126K646003K864777m634039L187860K2067118
44649a0238594K6881455J2925205K820861P861713Q379731j2854057l6819800
44642a043486l0221062O011489L3212346K3334018p908992k5915646k0632414
44635b3163747r556655n763894l232605M374318R230642L578728m488363k576796
44627c1598372O148990Q181727J158098l096254L127726J3672437J8932477J6311314
44619C2838143P899712l280621j1423041j0523839l151394O0574n969263j3397509
44611f947238j1804013n97817J2798966K1589077K1998982J2931744o99026r076705
44603D0193970q821023r091533j7965388k6034184j5696445J1393510K9300846
$$ plain form
44657 24310829 7606993 -20973187 -36370313 -33724310 -30859533 -35493572 -32305712 -10238594
44649 -10238594 16642861 29568066 32388927 40250640 48630371 35776314 -1043486
44642 -1043486 -31264548 -25253059 7959287 31293305 23384313 -2531333 -23163747
44635 -23163747 -32720402 -38484296 -41716901 -37342583 -28111941 -24533213 -29021576 -31598372
44627 -31598372 -25449382 -17267655 -16109557 -19205811 -16078085 -2405648 16526829 32838143
44619 32838143 40737855 37457234 26034193 15510354 12358960 12419534 6450271 -6947238
44611 -6947238 -18751251 -19349068 -6550102 15038975 37037957 49969701 49270675 40193970
44603 40193970 31372947 22281414 4316026 -21718158 -37414603 -26021093 3279753
44596C279753J9223051l414038p305081J2769222K9190962K0289130j547454j1925633
44588F0559912r412766r265105j1903718l419527J2621043J1533022j4135952
44581C6576909l6471272k9157193l883182J0169583Q203335P662962J4248236
44574G349378J5805486O877758m081151j1826263j7879354j7570813n090743Q364927
44566a8050775M987684q702299o580198J5669723L0510541K0211561J796571m744290
44558C5098518o927827j7445303k5190920j6052451m352850j1542422k4919118
44551g1332373j2910431K0798437L4283299P412949k5416768k0266159J8490844
44544d8940202M5628115L1199106q249392l3120030k3734109K900447J4752415
$$ plain form
44596 3279753 22502804 19088766 11783685 24552907 53743869 74032999 72485545 60559912
44588 60559912 51147146 41882041 29978323 26558796 39179839 50712861 36576909
44581 36576909 105637 -29051556 -32934738 -22765155 -14561820 -6898858 7349378
44574 7349378 23154864 30032622 25951471 14125208 -3754146 -21324959 -26415702 -18050775
44566 -18050775 -13063091 -21765390 -28345588 -12675865 17834676 38046237 39842808 35098518
44558 35098518 28170691 10725388 -14465532 -30517983 -34870833 -46413255 -71332373
44551 -71332373 -84242804 -63444367 -29161068 -21748119 -47164887 -67431046 -48940202
44544 -48940202 -3312087 27887019 19637627 -13482403 -37216512 -34316065 -19563650
44537a9563650J90979k0589206k0937687P20578K2075402K6556235K0764440J9854622
44529B9071713K4867792K1811803J337925k5146562l2576664r660092K1853160
44522C1559075K5848697m422126l3276449k6042220N054659J8651983K527419
44515A9901038j2695732l556292J0350981m90872k6040442k8317506K663818L2039700
44507f145307K6863933l67918j0400003J0288341L3188816K5191114j0651910
44500F7967066l9514769l4402807l144546K3674450K5095939P366862p309938
44493C9732257n763133L476871K653481j1965686k4962980k2260760q954599Q56467
44485b7188082M387629P530466P767056j921583j3180036q069761J0764295J8814001
$$ plain form
44537 -19563650 -19372671 -39961877 -60899564 -60178986 -38103584 -11547349 9217091 29071713
44529 29071713 53939505 75751308 77089233 51942671 19366007 9705915 31559075
44522 31559075 57407772 52985646 19709197 -6333023 -1278364 17373619 19901038
44515 19901038 7205306 3649014 13999995 13509123 -12531319 -40848825 -38185007 -6145307
44507 -6145307 20718626 20350708 9950705 20239046 53427862 78618976 67967066
44500 67967066 28452297 -5950510 -9095056 14579394 39675333 47042195 39732257
44493 39732257 33969124 37445995 40099476 28133790 3170810 -19089950 -28044549 -27188082
44485 -27188082 -22800453 -15269987 -7502931 -9424514 -22604550 -30674311 -19910016 -1096015
44477a096015P760548k25957Q570865J3138278m814941k1861712o464175K5253595
44469B0260486K8888435j68179k1978900j7013437j0337731j9179442k1204087
44462d0732855R28096K1267554R559350j8470698k4846659n688189J0150370P699573
44454d0133458j231927o172114q769507o157179R214347K9222397L2003200J0940380
44446A8916139j4502236k2800341j3111495L95508P568876J1205202K0188158
44439G859811L3484219L3244376N439575l1341165l8159459p449161K0234057
44432B3312253J0396737j7008641k1509704m525055O44220r881884n002662K2674276
44424i00460L7567279J6584636j3718481j9010603o847822o086739j7030861j4048063
$$ plain form
44477 -1096015 6664533 6438576 15009441 28147719 23332778 1471066 -4993109 20260486
44469 20260486 49148921 48980742 27001842 9988405 -349326 -19528768 -40732855
44462 -40732855 -39804759 -18537205 -8977855 -27448553 -52295212 -57983401 -47833031 -40133458
44454 -40133458 -41365385 -47537499 -56307006 -62464185 -53249838 -24027441 7975759 18916139
44446 18916139 4413903 -18386438 -31497933 -31102425 -23533549 -12328347 7859811
44439 7859811 41344030 74588406 80027981 48686816 10527357 3078196 23312253
44432 23312253 33708990 16700349 -4809355 -9334410 -8690190 -18572074 -23574736 -900460
44424 -900460 36666819 53251455 39532974 20522371 13674549 7587810 -9443051 -23491114
44416b3491114R395279K6787516J4401775j6144997l0565561j2450801J6341538
44409a5726365K1482372M63243j3162013K091221K2262703J4461173r758249j2171172
44401I942913Q167863J1530972j5803019l5327490j5892600J8720108K8784633
44394A0123380J4214009Q68262l295913n778557l081682R982607J8830273P955828
44386D9818207j0821883j7449467j6943001k2909042k2897803K455247L5560781
44379c186961L8273715J0236757r221426j144740R963277K705958p890367n29776
44371C9206437J7227426K3322830J1666344p206159k1934983k6584957k3180759
44364A2516179k2498105k9187233k7574325j939177L0967901L6092332R983651
$$ plain form
44416 -23491114 -14095835 12691681 27093456 10948459 -19617102 -32067903 -15726365
44409 -15726365 5756007 6219250 -6942763 -4851542 17411161 31872334 22114085 9942913
44401 9942913 18110776 29641748 13838729 -21488761 -37381361 -18661253 10123380
44394 10123380 24337389 25205651 21909738 16131181 13049499 23032106 41862379 49818207
44386 49818207 38996324 21546857 4603856 -18305186 -41202989 -38747742 -3186961
44379 -3186961 35086754 45323511 36102085 34957345 44920622 47626580 39736213 39206437
44371 39206437 56433863 79756693 91423037 84216878 62281895 35696938 12516179
44364 12516179 -9981926 -39169159 -66743484 -68682661 -37714760 -1622428 8361223
44357H361223j1474214l024587J9370616K8362514J9487107K765506j5450669
44350D8397496k7531922k3045794o429651K706802k564974q572178p739376p159934
44342c1939531l642361J6267899L9549486K9684909j2800297l4616562n424722
44335b921179L1415788K4612323o151638r266040J0673282O838394k2965592l0810491
44327A424847j750658K0843250P616662j4352493j3806663k683287l479984q115449
44319a4303775k28110J1300554J1094661O051463P899497P723370n068350j6609904
44311G859406r461650M843227K793073j1519267j2699999M175169J5616893O467506
44303H074358p957336n158025J3035067K2556765O942174k0861055k9908107o824019
$$ plain form
44357 8361223 -3112991 -6137578 13233038 41595552 61082659 63848165 48397496
44350 48397496 20865574 -2180220 -8609871 -5903069 -8468043 -17040221 -24779597 -31939531
44342 -31939531 -35581892 -19313993 20235493 49920402 37120105 2503543 -2921179
44335 -2921179 28494609 53106932 46955294 37689254 48362536 55200930 32235338 1424847
44327 1424847 -325811 20517439 28134101 13781608 -25055 -2708342 -6188326 -14303775
44319 -14303775 -14531885 -3231331 7863330 13914793 21814290 29537660 24469310 7859406
44311 7859406 -1602244 3240983 6034056 -5485211 -18185210 -14010041 1606852 8074358
44303 8074358 117022 -5041003 7994064 30550829 37493003 16631948 -13276159 -20100178
44295b0100178K4901512L0897312Q274322j2980134j1289152K994014J0706635
44288C3404331R417624M562832n121578j7683726k0422092r447567j404940p698614
44280a4393730j2998917l95006J8189460K2319589J8791733K5302077K9666198
44273H6481404M835014l6663633m6062316p952806L1660788K7586255o027693
44266E3857013k5557556j9904879j0025714m672213N751758J7397250J2004150
44259B8849809p881095j4848636J145966J4247067L308335j2403391k339617K5488309
44251C5566747L2818157O274002k3186436k3186272j016724J1607727J239640
44244D0116841j5713345j8349713m146659J3313394J9643996J1071472l492249
$$ plain form
44295 -20100178 4801334 35698646 43972968 30992834 19703682 22697696 33404331
44288 33404331 42821955 47384787 42263209 24579483 4157391 -5290176 -6695116 -14393730
44280 -14393730 -27392647 -27787653 -9598193 12721396 31513129 56815206 86481404
44273 86481404 91316418 54652785 8590469 637663 32298451 59884706 53857013
44266 53857013 28299457 8394578 -1631136 -6303349 -551591 16845659 28849809
44259 28849809 20968714 6120078 7266044 21513111 24821446 12418055 10078438 35566747
44251 35566747 68384904 74658906 51472470 28286198 27269474 38877201 40116841
44244 40116841 24403496 6053783 1907124 15220518 34864514 45935986 42443737
44237D2443737j0905240p643301l180290n574601q002538K498735K4826417M1488073
44229G5950992L8060009J8083499l552861j6212442j9503956j7945226j3847811
44222F1032204o156277L781392P834349j284145j7056106k3154959j5441766q983918
44214E70774j3686465j5497784J229615K2614506K0529259l610445j7196618l951606
44206h998764J3279546R993961l361538k052852J2879358J8847648P136838q183775
44198C9540422j3639496r809044k076553N806570Q098900J027224q128110p946703
44190A2873210R6847L224083k695011o761735K67909J3593973K2671719K2686761
44182F5957756J3914649j000889j3871205j3919538j482659P653509Q3582j7105481
$$ plain form
44237 42443737 31538497 23895196 20714906 15140305 7137767 9636502 34462919 75950992
44229 75950992 114011001 132094500 128541639 112329197 92825241 74880015 61032204
44222 61032204 54875927 58657319 66491668 65207523 48151417 24996458 9554692 570774
44214 570774 -13115691 -28613475 -27383860 -4769354 15759905 12149460 -5047158 -8998764
44206 -8998764 4280782 14274743 10913205 8860353 21739711 40587359 47724197 39540422
44198 39540422 25900926 16091882 14015329 19821899 27920799 28948023 20819913 12873210
44190 12873210 12970057 16194140 13499129 6737394 7005303 20599276 43270995 65957756
44182 65957756 79872405 78871516 65000311 51080773 49598114 57251623 57335205 40229724
44174D0229724k4787796j6034767k082763O106482J0655649J5764333J5077143
44167D4928005K062342j3508840j5232867n051868j086246p345483n865420J0771208
44159I670831K0140081K458592k4282146k7017005n013599J3184769J4196072
44152C337595J0907729J0507321M097586o656075m714687J0261855J5292857K462491
44144D5496672n862011L972124J2690280K977023j0163718p876678J53911k022570
44136C9365033o972284m567896p330790k3647041l0376061q369606J7639289J5269327
44128h990029n89152M724788K1569488J3222915j3776282j5724049J2358606K6879808
44120C9676093J0372409k561457R365033J8998033N093525j0316425q413245q976484
$$ plain form
44174 40229724 15441928 -592839 -2675602 3430880 14086529 29850862 44928005
44167 44928005 46990347 33481507 18248640 13196772 12110526 4765043 -1100377 9670831
44159 9670831 29810912 32269504 7987358 -19029647 -24043246 -10858477 3337595
44152 3337595 14245324 24752645 28850231 22194156 17479469 27741324 43034181 45496672
44144 45496672 39634661 43606785 56297065 59274088 49110370 41233692 41387603 39365033
44136 39365033 32392749 27824853 20494063 -3152978 -33529039 -41898645 -24259356 -8990029
44128 -8990029 -9579181 -4854393 16715095 29938010 16161728 437679 12796285 39676093
44120 39676093 50048502 47487045 56852078 75850111 80943636 70627211 62213966 53237482
44112E3237482k4888703k6814478N613449L7191495K7944739k311691r151151
44105F0821142L971461J261914j7059463j8029024J472261R871029j565389o844661
44097C3899270L485583O721265m915289o095675J4483554K8222986J2323048j0942201
44089G7182541r727523O503892L928725k1084991l6527761k2244626L675775J2919429
44081A4625461L053356n958258j585277Q639876J3578400J4803010J8642282K0048164
44073H5847014P961521j4608704l0423912l0724100k3430240j4078718L538822
44066a5918317K7505075L7167283J9956903m919265r721900M326871J3008951
44059G1405601N299220p391931j3492148j1954740l360590R410830J3424787o44113
$$ plain form
44112 53237482 28348779 1534301 7147750 44339245 72283984 69972293 60821142
44105 60821142 64792603 66054517 48995054 30966030 32438291 42309320 40743931 33899270
44097 33899270 37384853 44106118 39190829 33095154 47578708 75801694 88124742 77182541
44089 77182541 67455018 73958910 77887635 56802644 20274883 -1969743 1706032 14625461
44081 14625461 17678817 11720559 10135282 18775158 32353558 47156568 65798850 85847014
44073 85847014 93808535 79199831 48775919 18051819 -5378421 -19457139 -15918317
44066 -15918317 11586758 48754041 68710944 63791679 54069779 58396650 71405601
44059 71405601 76704821 69312890 55820742 43866002 40505412 49916242 63341029 62696916
44051F2696916j7527493j1690728J5302057L3465985K5095345N217427o518110
44044A06041399j3013194k4793291l4427831k4853083K882844K6391669K8037685
44037F6266198J4606647N908088P678307M701305j3441369k8656361j4421646
44030D2641169K0526138L3618547N832994k7123684k3437472O349766K0259171
44023G8666629Q497720j531107L340619O550319K02650m15236R995148J4946929
44015A20253671R732631J1976232K3605112J8105589j3054533l5662762k2179934
44008A12776006M400652Q755738j023543N521420K3804774K1409258n374047k4341911
44000A45928347j7989969m675600l251834q541002j0969195j2779341j4070615
$$ plain form
44051 62696916 45169423 33478695 48780752 82246737 107342082 112559509 106041399
44044 106041399 93028205 68234914 33807083 8954000 11836844 38228513 66266198
44037 66266198 80872845 86780933 94459240 99160545 85719176 57062815 42641169
44030 42641169 63167307 96785854 102618848 75495164 52057692 58407458 78666629
44023 78666629 87164349 85633242 88973861 95524180 95726830 95311594 105306742 120253671
44015 120253671 129986302 141962534 165567646 183673235 170618702 134955940 112776006
44008 112776006 117176658 125932396 124908853 130430273 154235047 175644305 170270258 145928347
44000 145928347 127938378 123262778 120010944 111469942 100500747 87721406 73650791
43993G3650791o938764N635434P552748k586595l923828J2855346K6348099J6770992
43985A29364223k449286p146380L1914J21704o183259k781247O856281J467945
43977A19281895j7409930j8994195Q781572L3196523K1362907r953697j7779635
43970A18485440N509098K5336407J7604145k040392q269445K62552R232764J0861782
43962A76982351M882002p001074j5976978j0090684O465990J4281437Q837544
43955A78380588Q902672K1005206K0664411p823994l6455325k9930976P33802
43948A55476384J6768271J0605655O370749R943138L911886p783965J571412K8414489
43940B25278019L1594352k911318l3425076k4920800j237239k404441k2136654
$$ plain form
43993 73650791 66712027 72347461 79900209 77313614 73389786 86245132 112593231 129364223
43985 129364223 126914937 119768557 119800471 119922175 113738916 110957669 117813950 119281895
43977 119281895 101871965 82877770 91659342 124855865 146218772 136265075 118485440
43970 118485440 123994538 149330945 166935090 164894698 156625253 156887805 166120569 176982351
43962 176982351 181864353 174863279 158886301 148795617 155261607 169543044 178380588
43955 178380588 187283260 208288466 228952877 221128883 184673558 154742582 155476384
43948 155476384 172244655 182850310 189221059 199164197 203076083 195292118 196863530 225278019
43940 225278019 256872371 253961053 220535977 195615177 194377938 191973497 169836843
43933A69836843k5635075o524243J2242626J9118907K0525013J7605508Q176969
43926B15346548L082660J1994215K2018825J7368943Q633451J3189390J9426834
43919C11060866N192695j7993842j8051186M684887J7734567J0139581M592612
43912C17360180J0345896O642013j3451017k3454389q484085O511827l02294q225349
43904B86942782J0556069M0827220M5500382K1392299j601458q295229j0329972
43897C84992093j3072007n017739J3526695K1165849P453434q811574q028564
43890C92208187K108526L973072M64298O905222K0442784K0444869K42023k1096826
43882D25692155k4385960j1799790M803124K1514805L6196829L7964418K0311188
$$ plain form
43933 169836843 144201768 137677525 149920151 169039058 189564071 207169579 215346548
43926 215346548 218429208 230423423 252442248 269811191 278444642 291634032 311060866
43919 311060866 316253561 298259719 280208533 284893420 302627987 312767568 317360180
43912 317360180 327706076 334348089 320897072 297442683 288958598 295470425 295168131 286942782
43904 286942782 297498851 338326071 383826453 405218752 403617294 395322065 384992093
43897 384992093 371920086 366902347 380429042 401594891 409048325 400236751 392208187
43890 392208187 394316713 398289785 398754083 405659305 426102089 446546958 446788981 425692155
43882 425692155 401306195 389506405 394309529 415824334 452021163 489985581 510296769
43875E10296769k441631r996778m315998n235647j8890212k9501540k5227030
43868D14687933j3619390n788384j936373J091353L604949R470075K1242109K4871300
43860D53623572K253059l3129914m0774620r104900K0812800J0594817k1628939
43853C82645875l2137591j4972583J369241O017070J4297122K8335073K7615561
43846D13169768M403591k1442343l0399880k3855908j3804217j1636925k4950271
43839B91483815m4240497l9455725L151725M7830060M6467712N385697k2638957
43832B87983830j3612644K525887n63595p854939j118440N620550m714770j8745936
43824B49519943j5907690k012389M288713p99770j0447782j8820608j4671122
$$ plain form
43875 510296769 507855138 497858360 493542362 488306715 469416503 439914963 414687933
43868 414687933 401068543 395280159 393343786 394435139 398040088 407510163 428752272 453623572
43860 453623572 455876631 422746717 381972097 372867197 393679997 404274814 382645875
43853 382645875 350508284 335535701 336904942 342922012 357219134 385554207 413169768
43846 413169768 417573359 396131016 365731136 341875228 328071011 316434086 291483815
43839 291483815 247243318 207787593 210939318 258769378 305237090 310622787 287983830
43832 287983830 274371186 276897073 276333478 268478539 267360099 272980649 268265879 249519943
43824 249519943 233612253 231599864 235888577 235088807 224641025 205820417 191149295
43817A91149295J0713556L5197502J8374248l7136323p2147087m6115010Q054931
43810A08091112L6247644L5138094L2091531K6794781M468440j6265492n508768
43803B21057342K0123785J7573555j0245495j7981188N031564J7954217r23748
43796B52590032k1298627j7725282r515178j7197885k2723493o203402J2508403
43789A70434568N211846j7318591k4730324j4149876l536715N911085K4221966
43782A46043959L9211941K6647015o321438k2986456r791532L874860p112189
43775A69566160k3527372j2552492J8524896K9638191O227718j9647510j6791118
43768A51438473K013888O005547k827251K670847K2655579K4179999l371748k4010709
$$ plain form
43817 191149295 201862851 237060353 255434601 218298278 146151191 100036181 108091112
43810 108091112 144338756 179476850 211568381 238363162 242831602 226566110 221057342
43803 221057342 241181127 258754682 248509187 230527999 235559563 253513780 252590032
43796 252590032 231291405 213566123 204050945 186853060 164129567 157926165 170434568
43789 170434568 175646414 158327823 133597499 119447623 115910908 121821993 146043959
43782 146043959 185255900 211902915 205581477 182595021 172803489 176678349 169566160
43775 169566160 146038788 133486296 152011192 181649383 187877101 168229591 151438473
43768 151438473 153452361 159457908 156630657 159301504 181957083 206137082 202765334 178754625
43760A78754625r196128J5193839Q972581j8337063k3889898M86924J9687093
43753A71671973J2845461j887497n924276n321627o031410Q77157J3799641J2080637
43745A92110059q441760j9712461k446253K2064258K4050718P504264l871485
43738B11257340m038000k035275K730799J5234700K4767562J6405831k419021
43731B61903936r433932J000598J2652892J1455744o71947j3155101j5439415
43724B48312775l414662J2346503J3417405j204812r929820j313812O111957m055535
43716B60269999j3974623n2096K2126277J7419277j1397194k4532782n458590
43709B44400268J7320290J7921027P519832N546900P241850J080329n754500k770351
$$ plain form
43760 178754625 169558497 184752336 193724917 175387854 151497956 151984880 171671973
43753 171671973 184517434 182629937 176705661 171384034 165352624 166229781 180029422 192110059
43745 192110059 183668299 163955838 161509585 183573843 207624561 215128825 211257340
43738 211257340 207219340 205184065 207914864 223149564 247917126 264322957 261903936
43731 261903936 252470004 253470602 266123494 277579238 276907291 263752190 248312775
43724 248312775 244898113 257244616 270662021 269457209 259527389 258213577 264325534 260269999
43716 260269999 246295376 246243280 268369557 285788834 274391640 249858858 244400268
43709 244400268 261720558 279641585 287161417 292708317 299950167 301030496 295275996 292505645
43701B92505645J344958m834750j1126456k385889J1067210N955283j5379361
43694B77146640k4839188r505423J0163869J1172647j338619o919562r34635L065657
43686B58011386k159794o466469L9251R665599P470464n673559j2324205k726376
43678B45836297J0953147J1127327k898096j8015360k5746811k6026466j7745807
43671A77484231m77895J5134067J4467034J7330q741383k240248O147164K091589
43663B03881889q118340j0354276o116393o697367r458669J005715K5316946L9674585
43655B29134090K4247098p995158k4137943j1940750M913506j404143k4940077
43648A87876623l3572458j3668108R894449Q287789j0417258j3643703P951032
$$ plain form
43701 292505645 293850603 289015853 277889397 275503508 286570718 292526001 277146640
43694 277146640 252307452 242802029 252965898 264138545 262799926 255880364 254945729 258011386
43686 258011386 255851592 249385123 249424374 259089973 266560437 260886878 248562673 245836297
43678 245836297 256789444 267916771 265018675 247003315 221256504 195230038 177484231
43671 177484231 177006336 192140403 206607437 206624767 197883384 195643136 201790300 203881889
43663 203881889 195763549 185409273 179292880 172595513 163136844 164142559 189459505 229134090
43655 229134090 253381188 245386030 221248087 209307337 214220843 212816700 187876623
43648 187876623 154304165 140636057 150530506 158818295 148401037 134757334 142708366
43641A42708366K7336312J9728904n715171k3529002k5645018k2833919k2637575
43634H9412897k2000937j7867939j1604374l961660M425610R208274P641266M886794
43626F0139931N953893N226626m286835j3835920o010889J8254204L4036264K2225569
43618A21702843m587312j6939880m995656J1259505J0116198l439066o304994
43611A06811638Q934566K1405025R576800j8652092l7065035l6879485l2562041
43604B1569376l1201080j9490505P814105K8939507K4932099J1320776J4028995
43597E7913273K5822762J8594346n561107j1939748J1408099L0900893J6921818
43590A44060336j3063665k4009434j3177702l487323l091656j028382N237186
$$ plain form
43641 142708366 170044678 189773582 184058411 160529409 134884391 112050472 89412897
43634 89412897 67411960 49544021 37939647 33977987 38403597 47611871 55253137 60139931
43626 60139931 66093824 71320450 67033615 53197695 47186806 65441010 99477274 121702843
43618 121702843 117115531 100175651 95179995 106439500 116555698 113116632 106811638
43611 106811638 115746204 137151229 146728029 128075937 91010902 54131417 21569376
43604 21569376 -9631704 -29122209 -21308104 7631403 32563502 43884278 57913273
43597 57913273 83736035 102330381 96769274 84829526 96237625 127138518 144060336
43590 144060336 130996671 106987237 93809535 90322212 87230556 86202174 91439360
43583I1439360O352069K622975L920372Q326975M221935n664366o186064J622405
43575A06655661m75112j3584498j3482295R250507K6189535J0161532k1594461
43568A03120869l0635480j2962358j478806j3761052k6842000j4439486J3399262
43561A6400949K5810326J4183218O62775O081314K4796111L4861539K3275610
43554A46071842l554174k7640644l2921368j6901444M904807J0640282m267377
43547G6331924j8588573r880437J4689054K5306016R291942j1529965j1607552
43540G4012409M556939J3516820O945936l557138r723887j4529391j7552987j2164898
43532D1503803j073877K677909l952749p682431J171260J6052591K5960799K5300678
$$ plain form
43583 91439360 97791429 100414404 104334776 112661751 116883686 111219320 105033256 106655661
43575 106655661 106180549 92596051 79113756 88364263 114553798 124715330 103120869
43568 103120869 72485389 59523031 58044225 44283173 17441173 3001687 16400949
43561 16400949 42211275 56394493 57057268 63138582 87934693 122796232 146071842
43554 146071842 142517668 114877024 81955656 65054212 69959019 80599301 76331924
43547 76331924 57743351 47862914 62551968 87857984 97149926 85619961 74012409
43540 74012409 78569348 92086168 99032104 95474966 85751079 71221688 53668701 41503803
43532 41503803 40429926 43107835 39155086 31472655 32643915 48696506 74657305 99957983
43524I9957983R140355k1952018m7004342l8488782k512216J9710235P142474
43517B5993689j0577794j491766J7120641J0875458r527379m518044K4843180
43510E2717985L4416537R124943j2218840j765756J3197792j26641k3950940k1591112
43502D9803968J090396Q667668m076156r279120M59885j396028k6171349m4188607
43494b5089343k7623081O670853K0974227Q337329l763805M016814J8986549J9314578
43486B1824121M904558n327180m04322J0025247J1199912K455412n372371o273199
43478C3032178l562401j46664M725850P817663K862035o708907q181153P23394
43470C0561995N453809k462668j0002567m606948J665191r243743k7496929k5786161
$$ plain form
43524 99957983 109098338 87146320 40141978 1653196 -859020 18851215 25993689
43517 25993689 15415895 13924129 31044770 41920228 32392849 27874805 52717985
43510 52717985 87134522 96259465 84040625 82274869 95472661 95346020 71395080 49803968
43502 49803968 50894364 59562032 55485876 46206756 46666641 45270613 19099264 -25089343
43494 -25089343 -52712424 -46041571 -25067344 -16730015 -20493820 -16477006 2509543 21824121
43486 21824121 26728679 21401499 20997177 31022424 42222336 44677748 39305377 33032178
43478 33032178 29469777 29323113 34048963 41866626 44728661 38019754 29838601 30561995
43470 30561995 36015804 33553136 23550569 18943621 20608812 11365069 -16131860 -41918021
43462d1918021j982369J5552288J0595790J020557O364547J6960360J3823619
43455B0416771J578509r42836P327705R786372L20074q869997p831011l22598
43447B1462989P147685J3186445J5669973J0667058J74172r684771j8960821l0285450
43439I377280l5159020k0208649R101084K8427827K5769217J5590997J1652312
43432D4551048M882186j4500950l0103042j9652432P517330K0932633J3837698
43425B7464471Q854149J5871381J4649058p976450l0213175k5396932j777204
43418A475298J0695692K479389q656913p120520L995687J4058318J6598192J0994865
43410D4520008M631261R152158K2464156K2460815m648778l7652702m3281972
$$ plain form
43462 -41918021 -43900390 -28348102 -17752312 -16731755 -10367208 6593152 20416771
43455 20416771 21995280 21052444 28380149 38166521 38486595 29616598 21785587 21462989
43447 21462989 28610674 41797119 57467092 68134150 68308322 58623551 39662730 9377280
43439 9377280 -25781740 -45990389 -36889305 -8461478 17307739 32898736 44551048
43432 44551048 49433234 34932284 4829242 -14823190 -7305860 13626773 27464471
43425 27464471 36318620 52190001 66839059 58862609 28649434 3252502 1475298
43418 1475298 12170990 14650379 5993466 -1127054 2868633 16926951 33525143 44520008
43410 44520008 49151269 58303427 80767583 103228398 98579620 60926918 17644946
43403A7644946k0829700J44476M064875L518787P356592N848686k765164j634402
43395A3349096J2550224J5301863n780007k2771446p477691K1145107K3474261
43388D9791407o50123j5553767p758995j279186j0920264j7952620o514297P274858
43380c562987L599713p137538l060499J1869855J4499330q30050j5038491j2397936
43372a2058603K603849J7219062K3157497J5238111o961344l0373003l4608095
43365b5782526j5186649R295865K1342570K5274239L2003136L3741224J4314238
43358I5002097j7675484l0425192j2744853N277409o821715l4618482l9108631
43351d1114851j3613568Q688697N225582p136131m171445R960100J6310803J1988743
$$ plain form
43403 17644946 -3184754 -3040278 1024597 4543384 11899976 17748662 14983498 13349096
43395 13349096 25899320 41201183 35421176 12649730 5172039 26317146 49791407
43388 49791407 49141284 33587517 25828522 24549336 13629072 -4323548 -10837845 -3562987
43380 -3562987 36726 -7100812 -10161311 1708544 16207874 15377824 339333 -12058603
43372 -12058603 -9454754 7764308 30921805 46159916 39198572 8825569 -25782526
43365 -25782526 -40969175 -31673310 -10330740 14943499 46946635 80687859 95002097
43358 95002097 77326613 46901421 34156568 39433977 32612262 -2006220 -41114851
43351 -41114851 -54728419 -46039722 -40814140 -47950271 -52121716 -42161616 -25850813 -13862070
43343a3862070P561275N551644K29800q655400j6889400k2823636k1021801p79456
43335g0689044L3249268N2039312L4814941Q88136j3726105l465186P514031O146368
43327D6771721J523268k549368j4346204k8813905k5544669k132887J7010865
43320h081179J6749794J0852240J2410918J0721793m012821j6792738j2068927
43313I779080l011395j0202661k4404781j8933681O677787K2543655R841520j4745444
43305b2455920k1625191j634524K7815052M1119088K6772963k897822k3992013
43298B3101633k4770172j2401120L342757J9325415K7781340J5634485j1177652
43291D0836686k1466735K042917L1864430K9329715j301498k0838927j1838306
$$ plain form
43343 -13862070 -6300795 -749151 -519351 -9174751 -26064151 -48887787 -69909588 -70689044
43335 -70689044 -37439776 14599536 49414477 50302613 36576508 33111322 40625353 46771721
43327 46771721 48294989 45745621 31399417 2585512 -22959157 -25092044 -8081179
43320 -8081179 8668615 19520855 31931773 42653566 38640745 21848007 9779080
43313 9779080 6767685 -3434976 -27839757 -46773438 -40095651 -17551996 -7710476 -22455920
43305 -22455920 -44081111 -45715635 -17900583 23218505 49991468 47093646 23101633
43298 23101633 -1668539 -14069659 -10726902 8598513 36379853 52014338 40836686
43291 40836686 19369951 21412868 53277298 82607013 81305515 60466588 48628282
43284D8628282L633235L662768o919638j5841682k0171454j4358650R510545L6039680
43276D4183086L0830143r139960l7203849j6821404K3751770L1494291O057487
43269G3151564n866388J1967485K1572858l839243l4102206k8322967M453322
43262C9014425K3897665J7714848O685553Q47618j1761273l1181379l4822650
43255A0394807j2524862J3111530J6164345q88031j7492121k0834572r554306
43248b1623210J1492360K6652956J6656538j3409747k9690962j1983301J5660867
43241f244499J9364831M407106O51600J1489320J3144889N54935m461106N058309
43233D3965385Q698804j792995o379556M250835Q337928o739055j6795947j505216
$$ plain form
43284 48628282 52261517 55924285 49004647 33162965 12991511 -1367139 8143406 44183086
43276 44183086 75013229 65873269 28669420 11848016 35599786 67094077 73151564
43269 73151564 67285176 79252661 100825519 96986276 62884070 34561103 39014425
43262 39014425 62912090 80626938 87312491 88160109 76398836 45217457 10394807
43255 10394807 -2130055 10981475 27145820 26257789 8765668 -12068904 -21623210
43248 -21623210 -10130850 16522106 33178644 19768897 -9922065 -21905366 -6244499
43241 -6244499 13120332 17527438 18179038 29668358 42813247 43368182 38907076 43965385
43233 43965385 52664189 50871194 44491638 48742473 57080401 50341346 33545399 32040183
43225C2040183J6727460R491942o162277M708129L0689461K4994354j9729474
43218I2759778n3042826l6175645O352914K4660163P149021j6517547k0191296
43211D994562o950202L903835n17627j6300169k6743207j8134561M783462K2703309
43203c2260598K3271699J3557104Q851757J4612606K2494784K0506069N292142
43196G6325563j3359247k1158165j5072237p129806q343854j3791117j0602529
43189a3131392L183674J5836909J6159454M500331q337010r853526J465827J0346557
43181B0170824J415319j5719263j4171381R910124K5358831J0017983j4383864
43174B2598573j5576210n96667j18400j5059993j6952007J116329J3378911P524329
$$ plain form
43225 32040183 48767643 58259585 52097308 56805437 87494898 112489252 92759778
43218 92759778 39716952 3541307 9894221 34554384 41703405 25185858 4994562
43211 4994562 -1955640 1948195 1430568 -14869601 -41612808 -59747369 -54963907 -32260598
43203 -32260598 -8988899 4568205 13419962 28032568 50527352 71033421 76325563
43196 76325563 62966316 41808151 26735914 19606108 11262254 -2528863 -13131392
43189 -13131392 -9947718 5889191 22048645 26548976 18211966 8358440 9824267 20170824
43181 20170824 21586143 5866880 -8304501 1605623 26964454 36982437 22598573
43174 22598573 7022363 6425696 6307296 -8752697 -25704704 -24588375 -11209464 -3685135
43166c685135M533111J8405488K9130993J6118176p379340j6007742r776085p843718
43158B3495748j7558628k8517577k8994062j4688333J0515551L2548177L5576784
43151A2377660K0296728L427315n126525r759476j1066942j915743J1252649Q016354
43143B7502020j2456517k2269355o084536J2864339R213132n244196m827474P020802
43135E718215P976339l609202r828101n348286j33804L597995J0297124J2559936
43127B1230216R16494j1696596l278642J9781153K5858596K483934k5960157l0557668
43119a222670r269710J7926984K9748050J8377893k621248q280199O190449J3622426
43111F4471975n807083k7623189j5943985J7262102K5755115L37862j8055414
$$ plain form
43166 -3685135 847976 19253464 48384457 64502633 57123293 41115551 31339466 23495748
43158 23495748 5937120 -22580457 -51574519 -66262852 -55747301 -23199124 12377660
43151 12377660 32674388 36101703 30975178 21215702 10148760 8233017 19485666 27502020
43143 27502020 15045503 -7223852 -13308388 -444049 8769083 3524887 -1302587 5718215
43135 5718215 13694554 10085352 257251 -5091035 -5224839 -1626844 8670280 21230216
43127 21230216 22146710 10450114 7171472 26952625 52811221 55295155 29334998 -1222670
43119 -1222670 -10492380 7434604 37182654 55560547 52939299 44659100 50849549 64471975
43111 64471975 58664892 31041703 15097718 32359820 58114935 58452797 40397383
43104D0397383n851254Q121261l725719k0786476j3479028L289368l804952k7017816
43096b2857233k6691178O525614L6701480L3496273Q041564j0475251j1566567
43089A3174702n445029k577690k844603l99217O139556Q575661k135539j9577807
43081e089966k3167984m118628J8361415J9113584n55566j6317994j3441440j318055
43073b6534634M925128L684429L582457J0171496K0360484K5158572J6974403
43066E8322335r68151j3617596r143469N464142J0972538j193669j9118490k4925741
43058E791899j3626499M414419J5247873J3049230K943301n145379n592237p83697
43050A6298910L037226J636589n154401j4077184k0047629j9196727j0963856
$$ plain form
43104 40397383 34546129 42667390 38941671 18155195 4676167 7965535 4160583 -22857233
43096 -22857233 -49548411 -43022797 -6321317 27174956 35216520 24741269 13174702
43089 13174702 7729673 5151983 2307380 1908163 8047719 16623380 14487841 -5089966
43081 -5089966 -28257950 -32376578 -14015163 5098421 4542855 -11775139 -25216579 -26534634
43073 -26534634 -21609506 -17925077 -14342620 -4171124 16189360 41347932 58322335
43066 58322335 57354184 43736588 34593119 40057261 51029799 49836130 30717640 5791899
43058 5791899 -7834600 -3420181 11827692 24876922 27820223 22674844 17082607 16298910
43050 16298910 19336136 20972725 15818324 1741140 -18306489 -37503216 -48467072
43043d8467072L018921J8689461K6466782J6338644o411098j9022396p732099
43036a7118857J0889897J2639010L188299Q016902K6555999K8293222K810497
43029G5274969j9938174j7024339p776632j5531659k4383037r686401J2666274
43022f398999J0821412n433665j58509K3127646K3915827l983168j7671643K894773
43014B7113674J9548032o38405l0896057k8996635j451848J4657400Q081915n546738
43006A871338j7436949k3722202r690821K5390614M5274537K0287842k0466046
42999B1508313k5286815L051974J6343668J183989n967608J1278044K2386671
42992D4498236R942739J411067J3949376J7700068j0308128l8990511l1546143
$$ plain form
43043 -48467072 -45448151 -26758690 -291908 16046736 9635638 -9386758 -17118857
43036 -17118857 -6228960 6410050 9598349 17615251 44171250 72464472 75274969
43029 75274969 55336795 38312456 30535824 15004165 -9378872 -19065273 -6398999
43022 -6398999 4422413 -1011252 -1169761 21957885 45873712 41890544 24218901 27113674
43014 27113674 46661706 46023301 15127244 -13869391 -15321239 -663839 7418076 1871338
43006 1871338 -15565611 -39287813 -48978634 -23588020 21686517 41974359 21508313
42999 21508313 -3778502 -726528 15617140 16801129 10833521 22111565 44498236
42992 44498236 54440975 55852042 69801418 87501486 77193358 38202847 6656704
42985F656704n120108K678675l695318K078456J0340720o856822l4880221l1015806
42977e9813720L424517K0715147J638660j8753372j1982193M957291Q950061O485119
42969d4378490R114050J0310182P993881J5375920K8387878J8774276j5581944
42962B9995753l1484905m015931K6609548J2911565k4938573l0894604J12034
42955b1705113K0273204O387978j3138956j2917696n110075o815582j2115360
42948d5141600j2813779j4682783j6549780k590348K6097977L8928409J6719652
42941a0032252j6192470k3636092m540246J4905170K1967600K4290563K4045710
42934C0807983J2813946o000330j3203146j467046R319627k441141k7671928l4931961
$$ plain form
42985 6656704 1536596 4215271 519953 2598409 12939129 6082307 -28797914 -59813720
42977 -59813720 -56389203 -35674056 -34035396 -52788768 -64770961 -59813670 -50863609 -44378490
42969 -44378490 -35264440 -24954258 -16960377 -1584457 26803421 45577697 29995753
42962 29995753 -1489152 -5505083 21104465 34016030 9077457 -21817147 -21705113
42955 -21705113 -1431909 4956069 -8182887 -21100583 -26210658 -33026240 -45141600
42948 -45141600 -57955379 -72638162 -89187942 -91778290 -65680313 -26751904 -10032252
42941 -10032252 -26224722 -49860814 -54401060 -39495890 -17528290 6762273 30807983
42934 30807983 43621929 37621599 24418453 22951407 32271034 29829893 2157965 -32773996
42926c2773996j1734603J6223633J6808304n941384j7420894p37999K0359670
42919a5217269J7240691k429353q443979P367169K2874142J9268603K253112j1929074
42911C0984042j4539890o394826L732402K797456j0732630j8722184p728580N648243
42903a4955967k324300k0335191j4743567J5248772L1807264J6335381m615978
42896F416414p090860n435902j6373318k3443133r834644M061547n194487j6794445
42888g3688828L561004M2135354N3230774K9080889O933322O494534O271002r706120
42880F4311931k4070782k0129398q296207j710678M169021J1403213Q048940o200999
42872B7525041j1439665l101779o226789l0863804m3303790j3758930L1497465
$$ plain form
42926 -32773996 -44508599 -28284966 -11476662 -17418046 -34838940 -35576939 -15217269
42919 -15217269 2023422 -405931 -8849910 -1482741 21391401 40660004 42913116 30984042
42911 30984042 16444152 10049326 13781728 16579184 5846554 -12875630 -20604210 -14955967
42903 -14955967 -17280267 -37615458 -52359025 -37110253 -5302989 11032392 6416414
42896 6416414 -674446 -6110348 -22483666 -45926799 -55761443 -51699896 -56894383 -73688828
42888 -73688828 -70127824 -27992470 25238304 54319193 61252515 67747049 74018051 64311931
42880 64311931 40241149 20111751 11815544 10104866 14273887 25677100 33726040 27525041
42872 27525041 16085376 12983597 6756808 -24106996 -67410786 -81169716 -49672251
42865d9672251M3267025J8380215m198108o004938m521443p390308K833003K6378686
42857A9071881L0871197J723490k5740103j5465195J2816682J3111278j5385546
42850B1003684k8188580o209989J5556775N045450j6588661r948388J9854079
42843E24370L0709342O831206j9682872j6678834O341960J8119203P705403j0143574
42835B3726204j9592619j7471245q631073l15009K654678M913660J5959829L1832914
42827C3077339L3038337J1650701j2267622j6632885p735043n476030r135343
42820B6519454k636665J2148648J5508082L707650m894383k270619k387269j2098195
42812C3596703j6604748o490821M667668M675748K639607P948003J0687531K143599
$$ plain form
42865 -49672251 -6405226 11974989 7776881 1771943 -2749500 -10139808 -7306805 19071881
42857 19071881 49943078 51666568 25926465 10461270 23277952 36389230 21003684
42850 21003684 -7184896 -13394885 2161890 7207340 -9381321 -19329709 524370
42843 524370 31233712 38064918 18382046 1703212 8045172 26164375 33869778 23726204
42835 23726204 4133585 -13337660 -21968733 -22283742 -19629064 -14715404 1244425 33077339
42827 33077339 66115676 77766377 65498755 48865870 41130827 35654797 26519454
42820 26519454 23882789 36031437 51539519 55247169 50352786 48082167 45694898 33596703
42812 33596703 16991955 10501134 15168802 19844550 22484157 30432160 41119691 43263290
42804D3263290n522983j934099j173549j5916398k6770701q940292K3028627L2047672
42796C8081567J4050989P35553O466559R223988o697158k2728114j7521030o59017
42788B0953337M613126n012349j3822109r653339O657538K3205216K0886405r217992
42780C8609833m4304835m5074316n353014L2499483K8594440n069811k5714563
42773b5812783j5299837P862886K1949756K1418203R725396m735981q296253K242762
42765I054149P802186p674628k5813616j5312014J6167258K4613222o229546l5408099
42757c2801088k0209446K3442372M3986861K3608435n845409j3242331m891984
42750A4047410k100199n129235J444725J7355867K1845059L932494j7882193j7963322
$$ plain form
42804 43263290 37740307 35806208 34632659 18716261 -8054440 -16994732 6033895 38081567
42796 38081567 52132556 52868109 59334668 68558656 61861498 39133384 21612354 20953337
42788 20953337 25566463 20554114 6732005 -2921334 3736204 26941420 47827825 38609833
42780 38609833 -5695002 -50769318 -56122332 -23622849 4971591 -98220 -25812783
42773 -25812783 -41112620 -33249734 -11299978 10118225 19843621 15107640 6811387 9054149
42765 9054149 16856335 9181707 -16631909 -31943923 -15776665 8836557 2607011 -32801088
42757 -32801088 -53010534 -29568162 14418699 38027134 32181725 18939394 14047410
42750 14047410 11947211 6817976 8262701 25618568 47463627 51396121 33513928 15550606
42742A5550606J915908J5518298R014741j918106J523632J3746104J6772934P480658
42734G9604775l818310j2817722k0337413j9183842l763441J1539983P914679
42727C9138709n740230l629552J2595816J2424745j2026287k7427662j0270435
42720E065104J5089799J5239887j837693o343032L366890N042942n664496j2256677
42712A7702724j0221738j0924453j4975505j0544213K275789J0953759J2676261
42705c057376J2992282P443679q356003j6788537R45472K5991611K0940675j1689615
42697B8422188k9967537j6655799k0348N39878L965638K1834136K7406331J530283
42689C7054770k7207787k4225813j541886Q388211O043784J2197823K2335066
$$ plain form
42742 15550606 17466514 32984812 41999553 40081447 41605079 55351183 72124117 79604775
42734 79604775 75786465 62968743 42631330 23447488 19684047 31224030 39138709
42727 39138709 33398479 29768927 42364743 54789488 42763201 15335539 5065104
42720 5065104 20154903 35394790 33557097 27214065 30580955 35623897 29959401 17702724
42712 17702724 7480986 -3443467 -18418972 -28963185 -26687396 -15733637 -3057376
42705 -3057376 9934906 17378585 9022582 -7765955 -6820483 19171128 40111803 28422188
42697 28422188 -1545349 -18201148 -18221496 -17681618 -13715980 8118156 35524487 37054770
42689 37054770 9846983 -14378830 -15920716 -7532505 -1488721 10709102 33044168
42682C3044168J6568095K195774L894677J7785849J5392205q206092k7223478
42675E3451198k7335282k0469246j4516195j970572J4649921J7433309L310023
42668B4553156o975376r37476P721088M004335n967635q549152k039186O916916
42660A8726670J3000679J1937679K559819p655077j0438925r111036j0475587
42653H544222j0078232k977589j028525j4775846k4652358k132376M0322792N5532996
42645D8755084K6039303j1072923j7808617l165567J998646p437891j2238461
42638B5069574k204102J2748520J7416000N715060j2517652j6403903J643746
42631C1467243J8810344R783007j1971339j1150496J1658753J8827427j44133
$$ plain form
42682 33044168 49612263 51808037 55702714 73488563 88880768 80674676 53451198
42675 53451198 26115916 5646670 -8869525 -10840097 3809824 21243133 24553156
42668 24553156 17577780 16640304 24361392 28365727 22398092 13848940 11809754 18726670
42660 18726670 31727349 43665028 46224847 38569770 28130845 19019809 8544222
42653 8544222 -1534010 -4511599 -5540124 -20315970 -44968328 -47100704 -6777912 48755084
42645 48755084 74794387 63721464 45912847 42747280 44745926 37308035 25069574
42638 25069574 22865472 35613992 53029992 58745052 46227400 29823497 31467243
42631 31467243 50277587 60060594 48089255 36938759 48597512 67424939 67280806
42624F7280806r565230P789467J5325347j4400909m5401165l2963619K253880
42617i681423R100390r441743o881812K2805986L4861609J1652652q254348L194345
42609D7355656J8419840L939529k3686637k5690354K22683K2619122K3692565
42602F6872404J3391436K075220j3170076l1179096l6928501k0773451L068116
42595a6643948J0816464R9959o988913K855576J2534612J772353j6226520j2299292
42587b4079709Q690836J0993599j1574891j8990284R568233L4319735J5662999
42580B4590518j8214092j4318940J8226409K3395934q745453k7348690n996261
42573h410575J7987456J0377641p402280m273929N774592n847058k8492790l0197640
$$ plain form
42624 67280806 57715576 65505043 80830390 66429481 21028316 -11935303 -9681423
42617 -9681423 -581033 -10022776 -16904588 5901398 40763007 52415659 44161311 47355656
42609 47355656 65775496 69715025 46028388 20338034 20560717 43179839 66872404
42602 66872404 80263840 82339060 69168984 37989888 1061387 -19712064 -16643948
42595 -16643948 -5827484 -5727525 -12716438 -9860862 2673750 4446103 -11780417 -24079709
42587 -24079709 -15388873 -4395274 -15970165 -34960449 -25392216 8927519 24590518
42580 24590518 6376426 -7942514 10283895 33679829 24934376 -2414314 -8410575
42573 -8410575 9576881 19954522 12552242 8278313 14052905 8205847 -20286943 -50484583
42565e0484583j0403171L131561l32900m874102J312282J1846369J6859616J2724448
42557b0220480Q59666r135427l827325J2822923J5749214o404852k7670162j8547800
42549e6374243R755542K2249291J2088303L967422Q194180N924934j1652289k1279327
42541b7126187l631767K1394888K0262595m647059j7118571Q68062K2348264J2462754
42533B4812979k2184027m0414403k0279194J3817289K5712759J2503643q48239
42526f879193r6086P081935J3506939K0807828K2632257N342797k4483714l6650142
42518A262621j6970597R177834J1591784k913551n727871Q176906J5524646K045744
42510B2167516j8253631k4097411j1136040Q610618K0602256J8665028Q856674
$$ plain form
42565 -50484583 -60887754 -57756193 -58089093 -62963195 -61650913 -49804544 -32944928 -20220480
42557 -20220480 -19360814 -28496241 -32323566 -19500643 -3751429 -10156281 -37826443 -56374243
42549 -56374243 -46618701 -24369410 -12281107 -8313685 -119505 5805429 -5846860 -27126187
42541 -27126187 -30757954 -9363066 10899529 6252470 -10866101 -9998039 12350225 24812979
42533 24812979 2628952 -37785451 -58064645 -44247356 -18534597 -6030954 -6879193
42526 -6879193 -6975279 106656 13613595 34421423 57053680 62396477 37912763 1262621
42518 1262621 -15707976 -6530142 5061642 2148091 -3579780 4597126 20121772 22167516
42510 22167516 3913885 -20183526 -31319566 -22708948 -2106692 16558336 25415010
42503B5415010J973267r70520q618431k0159088j9888208j978003J3938144R329509
42495i58320l540689k66755J6656220K2670132J0135714m375086j1014194j7021727
42487A2285295k2478577j3994879P991522K1193339J3221081j417578q753722
42480H046481j5426486k4803559j9319909P797059K5578482M193367l2720501
42473d6655066l3365679P329355L7756379K2859808r697173j5512591N038421
42466c2246546J8766960J2381088J483569l126236o748218r493739k120909J1454196
42458i649835J1687913o955317k3507274j9124498k369149O165629J340207o436047
42450d8848371p519549J410247J7357417K7129341J6552807o217518j3162228
$$ plain form
42503 25415010 27388277 26417757 17799326 -2359762 -22247970 -24225973 -10287829 -958320
42495 -958320 -4499009 -4765764 11890456 34560588 44696302 40321216 29307022 12285295
42487 12285295 -10193282 -24188161 -16196639 4996700 18217781 16800203 8046481
42480 8046481 -7380005 -32183564 -51503473 -43706414 -18127932 -13934565 -46655066
42473 -46655066 -80020745 -72691390 -34935011 -12075203 -21772376 -37284967 -32246546
42466 -32246546 -13479586 -1098498 385071 -2741165 -9489383 -18983122 -21104031 -9649835
42458 -9649835 2038078 -4917239 -28424513 -47549011 -49918160 -43752531 -42412324 -48848371
42450 -48848371 -56367920 -54957673 -37600256 -10470915 6081892 -135626 -13297854
42443a3297854L798922J4806442m884727l2447786k7842014N896810K7577094
42436b6393113J8519717K204151N00589N397307L949992J45563j633209q412792
42428e721795j9773732k0519075n442592J0184265J5869053J8649733K0937606
42421A4183463J2675244k516877l643077R755902Q924611j4619779k6459840m111114
42413e811467K0742932J1565939j2673942j0627120J2410826J7813937j11169
42406C3309936j2014855r196781j0977401j8408803r721162J3856102K3318746
42399A0165782J0636786N61364N478514R074516L963673M080409Q165552o291266
42391D5835330l6501801m3876581j1731322K4468848K8466570J0174197l139835
$$ plain form
42443 -13297854 -9498932 5307510 422783 -32025003 -59867017 -53970207 -26393113
42436 -26393113 -7873396 -5669245 -5168656 228651 4178643 4324206 2690997 -5721795
42428 -5721795 -25495527 -46014602 -51457194 -41272929 -25403876 -6754143 14183463
42421 14183463 26858707 24341830 20698753 30454655 39379266 24759487 -1700353 -5811467
42413 -5811467 14931465 26497404 13823462 3196342 15607168 33421105 33309936
42406 33309936 21295081 12098300 1120899 -17287904 -27009066 -13152964 10165782
42399 10165782 20802568 21363932 26842446 35916962 39880635 43961044 52126596 45835330
42391 45835330 9333529 -34543052 -46274374 -21805526 6661044 16835241 13695406
42384A3695406q631077j3471287j0370715K486256N108369j0620141j7947715
42377c9750904K664521K5427936J8595078k879630m216400R896828P544080j1254375
42369F027134j3868161Q792098K7505609K0743416N15539j4072434j9014319j4627804
42361B001078r7939J3092627O328094j8151014l3692303k1992455N984367K7361250
42353a9166295L1311166K1327836O889296k211304k279625J361119K995505L570884
42345D3798582L130718l903318j6359338k1513313j4632065q645479j0107279
42338b8231492m138242J7190598L2266187K1763056K679036r36616p82749j8799756
42330B1010022l7508692k4358320O064584R518854j1396273q869395K4542860
$$ plain form
42384 13695406 5064329 -8406958 -18777673 -16291417 -11183048 -21803189 -39750904
42377 -39750904 -37086383 -11658447 6936631 4057001 -159399 9737429 17281509 6027134
42369 6027134 -7841027 951071 28456680 49200096 49715635 35643201 16628882 2001078
42361 2001078 1903139 14995766 21323860 3172846 -30519457 -52511912 -46527545 -19166295
42353 -19166295 12144871 33472707 40362003 38150699 35871074 37232193 40227698 43798582
42345 43798582 46929300 43025982 26666644 5153331 -9478734 -18124213 -28231492
42338 -28231492 -32369734 -15179136 17087051 38850107 41529143 40592527 39809778 21010022
42330 21010022 -16498670 -40856990 -34792406 -25273552 -36669825 -45539220 -20996360
42323b0996360L6180700Q89040l3412144k2866453M349016K707216j3571992k566220
42315d9287197K8219132L4703650R414286j1620607q465170K498327O122595O148288
42307A7733304M545838k550592p770188j223678O257530j935893j5165105j0056279
42299a0165063O455028M811676j7089245k9193502j8444499n158620k620920K614417
42291f8790728J7886190K6870372K0447540J3099362J1861104J012898k2123632
42284B63106k8125418J017490L6303762M0255295K0079928J0156227J7187780
42277I7138170J6957306k041320k3548121l0874429k3905458r169679N741038
42270C0297507R193891l433721j7872672j8192742j0751393j0613294j1343830
$$ plain form
42323 -20996360 15184340 16073380 -17338764 -40205217 -35856201 -33148985 -46720977 -49287197
42315 -49287197 -21068065 13635585 23049871 11429264 2964094 5462421 11585016 17733304
42307 17733304 22279142 19728550 11958362 10734684 16992214 15056321 -108784 -10165063
42299 -10165063 -3710035 1101641 -15987604 -45181106 -63625605 -68784225 -71405145 -68790728
42291 -68790728 -50904538 -24034166 -3586626 9512736 21373840 22386738 263106
42284 263106 -27862312 -26844822 9458940 49714235 69794163 79950390 97138170
42277 97138170 114095476 112054156 88506035 57631606 33726148 24556469 30297507
42270 30297507 39491398 36057677 18185005 -7737 -10759130 -21372424 -32716254
42263c2716254M443836K7185257K5033842p072367l3115744k4486001K266757
42256c8460674J3694372N227942k020372L483931J2877902J4917483P848428l600383
42248A3968629j1456790q965131l80135J084110o523270p127767P581582J8691804
42240F873032N477371j9409440k4244321m296451J2465162Q920116J608897Q907745
42232c697889K0067471J5116152o64354n412924L680663O753783o098370j8886241
42224A0858291j3583601M655159J6498170J4166159P222649N588074O469930P52266
42216E2627097j2660164k3608420k2304234j1283657k142325p53184j220831K829815
42208a8515903P550730O537750M205529J0434636K2523116K4794590J0201837
$$ plain form
42263 -32716254 -28272418 -1087161 23946681 16874314 -16241430 -40727431 -38460674
42256 -38460674 -24766302 -19538360 -21558732 -18074801 -5196899 9720584 17569012 13968629
42248 13968629 2511839 -6453292 -6833427 -5749317 -12272587 -19400354 -11818772 6873032
42240 6873032 12350403 -7059037 -31303358 -35599809 -23134647 -14214531 -12605634 -3697889
42232 -3697889 16369582 31485734 30821380 25408456 29089119 35842902 29744532 10858291
42224 10858291 -2725310 1929849 18428019 32594178 39816827 45404901 51874831 52627097
42216 52627097 39966933 16358513 -5945721 -17229378 -19371703 -20124887 -21345718 -18515903
42208 -18515903 -10965173 -4427423 -221894 10212742 32735858 57530448 67732285
42201F7732285q733281j7472417j7987693j9546633j9007761n000900J9732298
42194b84102L4547172K4345499j788578k0518792j8152209k049172P893084j266316
42186B2726586k0123332k3502008o91795K3967782J5617521k3475627m8880571
42179e4361444k7954457J6414942L4265573J1817343j5860725j4884363O894364
42172d3668767J8178746O831436j0538127j5266370q881734n543142r122181n763430
42164g3773569J6229596M3063127M4706701J3496914j9543953k1124724J616445
42157D670537J4675259O551929k842605k964701r697714k8576177l1930687J500423
42149d8613736M5126556N2983361J8819304k1168980l7225317k9880623j0454812
$$ plain form
42201 67732285 58999004 41526587 23538894 3992261 -15015500 -20016400 -284102
42194 -284102 34263070 58608569 56819991 36301199 18148990 16099818 23992902 22726586
42186 22726586 2603254 -20898754 -21590549 2377233 17994754 -5480873 -54361444
42179 -54361444 -82315901 -65900959 -31635386 -19818043 -35678768 -50563131 -43668767
42172 -43668767 -25490021 -18658585 -29196712 -44463082 -53344816 -58887958 -68010139 -73773569
42164 -73773569 -57543973 -14480846 30225855 43722769 24178816 3054092 4670537
42157 4670537 19345796 25897725 23055120 20090419 10392705 -18183472 -50114159 -48613736
42149 -48613736 -3487180 49496181 68315485 47146505 9921188 -19959435 -30414247
42142c0414247J1243840J9368261L525561j6527341q100463K3343745L2409583
42135C4848939n80861l3958986k1291843K1926534M2420851K3914590p85196p108557
42127E9385471p556375j5057650j4351387Q147851L0923606K2386300j1639595
42120G2238221l3061288k3420845n899829p679123k1307894k0521901j713163
42113d1365822J3051080J1724991O974194Q708343N634937r570368j7367127L11588
42105b1898184K2298236J2146560k3633344l8185606j2231220J7981204J8133088
42098b5389266N580209J2770366L0287978K5045860k610727k1481248k0754527
42091C448645j7461858j5008628K505196K7979023K6522886r550486l8229480
$$ plain form
42142 -30414247 -19170407 197854 3723415 -12803926 -20904389 2439356 34848939
42135 34848939 34268078 309092 -20982751 943783 43364634 67279224 66494028 59385471
42127 59385471 51829096 36771446 22420059 30567910 61491516 83877816 72238221
42120 72238221 39176933 15756088 9856259 2177136 -19130758 -39652659 -41365822
42113 -41365822 -28314742 -16589751 -9615557 -907214 4727723 -4842645 -22209772 -21898184
42105 -21898184 400052 12546612 -11086732 -49272338 -61503558 -43522354 -25389266
42098 -25389266 -19809057 -7038691 23249287 48295147 45684420 24203172 3448645
42091 3448645 -14013213 -29021841 -26516645 1462378 27985264 18434778 -19794702
42084a9794702k4632631R828228K2456828Q090793p867150j4731081j9708305
42077d6358020j8619507m84121K2527650K4561286P803478K913606K1357698L7300021
42069E1002091K8033107M984859j0615973j8014979k3804330k1032810n822592
42062D729373K963376j0498964k5712294j1161684K2426489L0902395L306593
42055A6955284j8584670l894473K0000806J3308109j1075731r418497K0145616
42048B7436444L3479232J0879411j3428601p938178R065451N440020j2103562
42041E2830217j4752788j380976M410518k972929o432593j446745k915556j3799913
42033A3539235j7204382o860765J623927p19914j699393O724592J2693496Q077402
$$ plain form
42084 -19794702 -44427333 -34599105 -12142277 -4051484 -11918634 -26649715 -46358020
42077 -46358020 -64977527 -65461648 -42933998 -18372712 -10569234 -7655628 13702070 51002091
42069 51002091 79035198 84020057 73404084 55389105 31584775 10551965 4729373
42062 4729373 7692749 -2806215 -28518509 -39680193 -17253704 13648691 16955284
42055 16955284 -1629386 -5523859 14476947 27785056 16709325 7290828 27436444
42048 27436444 60915676 71795087 58366486 50428308 59493759 64933779 52830217
42041 52830217 38077429 36696453 41106971 38134042 31701449 30254704 27339148 13539235
42033 13539235 -3665147 -10525912 -8901985 -9621899 -11321292 -4596700 8096796 16174198
42025A6174198N080424J1853813J2318333p806042l0707622k7015911J398973
42018a8703834K1607825J0593353k0155338l9790392k7116620J1434062M4451361
42011a7679583M3396461J4836010o689555m785722r37250j4815010k8969289j8598846
42003c4242784L647132P175899m358806K10052K3470598L1342120Q763387j4959314
41995B1048284j2721085J324947J338609q057544n813346P125661J0793292j147873
41987A3890945j4823994j8162423j1130466L235421K1710245L5043061L2598839
41980F2361628J5301852l690467j2381684j0163709o258490j0545402k3078537
41973A1545191l1764296k4715562m257179J6699971K8472820K6731326Q871317
$$ plain form
42025 16174198 21254622 33108435 45426768 37620726 6913104 -20102807 -18703834
42018 -18703834 2903991 13497344 -6657994 -46448386 -73565006 -62130944 -17679583
42011 -17679583 25716878 40552888 33863333 29077611 28140361 13325351 -15643938 -34242784
42003 -34242784 -30595652 -23419753 -27778559 -27568507 -4097909 27244211 36007598 21048284
41995 21048284 8327199 9652146 10990755 2933211 -2880135 4245526 15038818 13890945
41987 13890945 -933049 -19095472 -30225938 -26990517 -5280272 29762789 62361628
41980 62361628 77663480 73973013 61591329 51427620 45169130 34623728 11545191
41973 11545191 -20219105 -44934667 -49191846 -32491875 -4019055 22712271 31583588
41966C1583588j6243281k3183977J532345K9970223K1613885j7322529l8247188
41959a0296934k0794027J335126J307600J098894K1903136L5106320Q338524l1258148
41951F740491l2918471p44993J9128839J6084709J9498243L0502913J4906649
41944G3198380k5717872m0022818q117723K0022436J303837l3447205l0601417
41937d3382382N110040K5618226J1720395j1613969j8118161m892246J5121573
41930b0436524K1137672j34112k8163674k1518612K1500239M7393725K2775239
41923D2553953j1416700l651832K5764725K2847141p068347j3378667O661071
41916F2311344M640431k6972341l6612207n811612J4114092r298398l1239799
$$ plain form
41966 31583588 15340307 -7843670 -6311325 23658898 45272783 27950254 -10296934
41959 -10296934 -31090961 -29755835 -28448235 -27349341 -5446205 29660115 37998639 6740491
41951 6740491 -26177980 -26922973 -7794134 8290575 27788818 58291731 73198380
41944 73198380 47480508 7457690 -660033 19362403 20666240 -12780965 -43382382
41937 -43382382 -38272342 -12654116 -933721 -12547690 -30665851 -35558097 -20436524
41930 -20436524 701148 567036 -27596638 -49115250 -27615011 19778714 42553953
41923 42553953 31137253 27485421 53250146 76097287 69028940 55650273 62311344
41916 62311344 66951775 39979434 3367227 -2444385 11669707 2371309 -28868490
41909b8868490o461132L1440656K4882777j4399164k8809286o241602J3004113
41902a5452128Q236733J90666K248262L26692j1534576j6547256o236244O070337
41894c2697514J1069727J4785066J7694318R698100o731157j3347257l980209
41887c508926O699663Q753442Q882674J0063822K942770j2266970j7474717m014479
41879G7279R946263M741037j1561952j5097831M95648J6654466J3880216n046860
41871A4088266j7298238n460289J9318272K7121227P256733j5894048j7081056
41864A2050867n319129l769669q339982K438686K2836822K2657917j907221j7815559
41856B2832732p007271P278524L349864m606191P64398N001016q764350k1483602
$$ plain form
41909 -28868490 -35329622 -3888966 20993811 6594647 -22214639 -28456241 -15452128
41902 -15452128 -7215395 -7024729 -4776467 -4449775 -15984351 -32531607 -38767851 -32697514
41894 -32697514 -21627787 -6842721 10851597 20549697 13818540 471283 -3508926
41887 -3508926 3190737 11944179 20826853 30890675 33833445 21566475 4091758 77279
41879 77279 10023542 14764579 3202627 -11895204 -11399556 5254910 19135126 14088266
41871 14088266 -3209972 -8670261 10648011 37769238 45025971 29131923 12050867
41864 12050867 6731738 2962069 -5377913 -2939227 19897595 42555512 40648291 22832732
41856 22832732 15825461 23103985 26453849 21847658 22612056 27613072 18848722 -2634880
41848b634880o725606J9975000K0014401q663825k9321268k1949133m724389L651463
41840c0378237Q521662J5870890J4486116k017080j7075157j2526161N994159
41833a7123808J8942050J6951809L823507j3478320k6168077k4370931q594506
41826e0018276O053295P615554L212877O519441J5046129J3862766J130919m997644
41818a574939Q279599K6745524K5018552J072067j8608845j2904723O615590J2870570
41810D7513395n49941j6045297k1436899k3037871k5341763j8078440M212353
41803e2764463K5653023K8361370J7318915R036887M468582o926964k0884842
41796D262508j8375726M523634K4745945J8924235q046471k8972089k4784426
$$ plain form
41848 -2634880 -9360486 10614514 30628915 21965090 -7356178 -29305311 -34029700 -30378237
41840 -30378237 -21856575 -5985685 8500431 6483351 -10591806 -23117967 -17123808
41833 -17123808 1818242 18770051 22593558 9115238 -17052839 -41423770 -50018276
41826 -50018276 -43964981 -36349427 -33136550 -26617109 -11570980 2291786 3422705 -1574939
41818 -1574939 6704660 33450184 58468736 59540803 40931958 28027235 34642825 47513395
41810 47513395 46963454 30918157 9481258 -13556613 -38898376 -56976816 -52764463
41803 -52764463 -27111440 1249930 18568845 27605732 32074314 25147350 4262508
41796 4262508 -14113218 -9589584 15156361 34080596 26034125 -2937964 -27722390
41789b7722390m334999O798399k111691j0983398M813659L4126429L6964337O29862
41781C8180208l5005142k8783166N623811K3263820J1960597k160948m150950
41774H928230m960536o727146M420782K1451661J3547609k1741060m1358001j7420141
41766d3858602J7881200J9899115k986372r257020R024579K1336589J3332911
41759B5372400M876193Q784609P387112j5061600m1324730m1140333j0477247
41752f1583596K3437758L2449154J5213938m687340o170205N778980R224492l053221
41744A0609960j4066949r849318K17743K299625J376767P823733J3693680L816058
41736A5921299j7637962l1964283l0160309j4184174J4176354M2935149M2961185
$$ plain form
41789 -27722390 -32057389 -25258990 -27370681 -38354079 -33540420 586009 37550346 38180208
41781 38180208 3175066 -25608100 -19984289 3279531 15240128 13079180 8928230
41774 8928230 3967694 -2759452 1661330 23112991 36660600 14919540 -26438461 -43858602
41766 -43858602 -25977402 -6078287 -9064659 -18321679 -9297100 12039489 25372400
41759 25372400 30248593 39033202 46420314 31358714 -9966016 -51106349 -61583596
41752 -61583596 -38145838 -5696684 9517254 4829914 -1340291 4438689 13663181 10609960
41744 10609960 -3456989 -13306307 -13088564 -10788939 -9412172 -1588439 12105241 15921299
41736 15921299 -1716663 -33680946 -63841255 -78025429 -63849075 -20913926 22047259
41729B2047259L327955l6988358l0929202Q750387K6953401J0811981M184596
41722H158019K6091197L3169284m892064m4737193l2062777J3025457K8530157
41715B7282080M189562j5015618o802111M526755J428297l447665m508415j4726507
41707g073622k8055526j7299290J3953715K3297537l837531k4033258k865248
41700d5913223K9307092K7854314N124894L310691K0846902J9486117o421964
41693E3594823k1312557j0273507m78235j0176674j9005679o874629J2038469
41686b487989J4918484L451546q384667j7644084k4942195k3101286j1311157
41679f9501348l256948m223178J876083K3847550L9658970K5079970p193301k2001107
$$ plain form
41729 22047259 25375214 -11613144 -42542346 -33791959 -6838558 3973423 8158019
41722 8158019 34249216 67418500 62526436 17789243 -14273534 -1248077 27282080
41715 27282080 31471642 16456024 9653913 14180668 15608965 12161300 7652885 -7073622
41707 -7073622 -35129148 -52428438 -38474723 -15177186 -19014717 -43047975 -45913223
41700 -45913223 -16606131 11248183 16373077 19683768 40530670 60016787 53594823
41693 53594823 32282266 22008759 21530524 11353850 -7651829 -14526458 -2487989
41686 -2487989 12430495 15882041 7497374 -10146710 -35088905 -58190191 -69501348
41679 -69501348 -72758296 -76981474 -75105391 -51257841 -11598871 13481099 6287798 -15713309
41671a5713309p813679J4414462K3323282J6428628N12057j6149907k1966064
41664f964530j0722522O671641J3581684R231007M569768J344341o066687j1788704
41656a44002m638205O181971k767703k9964523m0597194j1936232L2220088N0282800
41648a363000L2705398M960264r560561r650199l129739O259519J4294278J2846136
41640D7362096l39748j4912984j8069240q909025K467007Q660251J1370019J2234884
41632C9863260M928945j4556360l3126481l0108664n848279J3027718P046322
41625a8773539r487976j0221825M529626J1100777N89605r684903o745051j668655
41617d0361941p344616j3898142l127434K1209247L4197130K0692062n358010
$$ plain form
41671 -15713309 -23526988 -9112526 14210756 30639384 31151441 15001534 -6964530
41664 -6964530 -17687052 -11015411 2566273 11797280 16367048 17711389 11644702 -144002
41656 -144002 -4782207 1399764 -1367939 -31332462 -71929656 -83865888 -51645800 -1363000
41648 -1363000 31342398 36302662 26742101 17091902 13962163 20221682 34515960 47362096
41640 47362096 47022348 32109364 14040124 5131099 7598106 16258357 27628376 39863260
41632 39863260 44792205 30235845 -2890636 -32999300 -38847579 -25819861 -18773539
41625 -18773539 -28261515 -38483340 -33953714 -22852937 -22263332 -31948235 -38693286 -40361941
41617 -40361941 -47706557 -61604699 -64732133 -43522886 -9325756 11366306 6008296
41610F008296j6208984j270442K0586277K1989368l43164k1279500j9951934o404747
$$ plain form
41610 6008296 -10200688 -11471130 9115147 31104515 30761351 9481851 -10470083 -16874830
$$ [...]
##END NTUPLES=NMR SPECTRUM
##END=
