##TITLE=31Pdec_LR-688B-C4-EtOAc
 CDCl3, 8 sc
 23.9.2019
##JCAMPDX= 6.0         $$ Bruker NMR JCAMP-DX V2.0
##DATA TYPE= NMR SPECTRUM
##DATA CLASS= NTUPLES
##ORIGIN= UXNMR, Bruker Analytische Messtechnik GmbH
##OWNER= root
$$ XWIN-NMR		Version 3.5
$$ Mon Sep 23 14:36:45 2019 Russian Standard Time (UT+4h)  she@DPX200
##.OBSERVE FREQUENCY= 81.013821
##.OBSERVE NUCLEUS= ^31P
##.ACQUISITION MODE= SIMULTANEOUS
##.ACQUISITION SCHEME= undefined
##.AVERAGES= 24
##.DIGITISER RES= 17
##SPECTROMETER/DATA SYSTEM= spect
##.PULSE SEQUENCE= zgpg30
##.SOLVENT NAME= DMSO
##.SHIFT REFERENCE= (INTERNAL, DMSO, 0, 182.463)
##AUDIT TRAIL= $$ (NUMBER, WHEN, WHO, WHERE, WHAT)
$$ ##TITLE= Audit trail, XWIN-NMR		Version 3.5
$$ ##JCAMPDX= 5.01
$$ ##ORIGIN= Bruker BioSpin GmbH
$$ ##OWNER= she
$$ F:/spectra/data/she/nmr/P31/1/pdata/1/auditp.txt
$$ ##AUDIT TRAIL=  $$ (NUMBER, WHEN, WHO, WHERE, WHAT)
(   1,<2019-09-23 14:35:51.93 +0400>,<she>,<DPX200>,
      <created by zg, POWCHK disabled, PULCHK disabled
       configuration hash MD5:
       00 E9 B6 7A A2 85 ED C7 34 08 36 98 17 FE 4E 26
       data hash MD5: 32K
       A5 00 E9 4F 90 D3 1B B9 56 35 DC 55 D8 16 FF FC>)
(   2,<2019-09-23 14:35:55.17 +0400>,<she>,<DPX200>,
      <Start of raw data processing
       efp BC_mod = 2 LB = 1 FT_mod = 6 PKNL = 1 PHC0 = -186.2748 PHC1 = -497.1997 SI = 64K 
       data hash MD5: 64K
       4A 47 3B B8 E8 63 C9 C3 A6 AE D8 A5 3A 6D AD 33>)
(   3,<2019-09-23 14:36:08.32 +0400>,<she>,<DPX200>,
      <pk PHC0 = -0.9911647 PHC1 = 0 
       data hash MD5: 64K
       5F 36 72 5C 70 0C 78 2F DC 11 B5 59 C9 42 DF CC>)
(   4,<2019-09-23 14:36:13.87 +0400>,<she>,<DPX200>,
      <abs ABSG = 5 
       data hash MD5: 64K
       A9 5B 25 F9 BD 11 A4 49 5A 2C 23 DF 4E 01 F6 CD>)
$$ ##END=
$$ 
$$ hash MD5
$$ AD 05 2D 11 AD 9E F8 1B C0 3E F3 FA 5B B9 BB 6F
##$RELAX= 
##$RELAX= 
##$RELAX= 
##$RELAX= 
##$RELAX= 
##$RELAX= 
##$RELAX= 
##$RELAX= 
$$ Bruker specific parameters
$$ --------------------------
##$DU= <F:/spectra>
##$EXPNO= 1
##$NAME= <P31>
##$PROCNO= 1
##$TYPE= <nmr>
##$USER= <she>
##$AMP= (0..31)
100 100 100 100 100 100 100 100 100 100 100 100 100 100 100 100 100 100 
100 100 100 100 100 100 100 100 100 100 100 100 100 100 
##$AQSEQ= 0
##$AQ_mod= 1
##$AUNM= <au_zg>
##$AUTOPOS= <>
##$BF1= 81.014009
##$BF2= 200.13
##$BF3= 200.13
##$BF4= 200.13
##$BF5= 200.13
##$BF6= 200.13
##$BF7= 200.13
##$BF8= 200.13
##$BYTORDA= 1
##$CFDGTYP= 0
##$CFRGTYP= 5
##$CHEMSTR= <none>
##$CNST= (0..31)
1 1 145 1 1 1 1 1 1 1 1 1 1 1 1 1 1 1 1 1 1 1 1 1 1 1 1 1 1 1 1 1 
##$CPDPRG= <waltz16>
##$CPDPRG1= <>
##$CPDPRG2= <waltz16>
##$CPDPRG3= <>
##$CPDPRG4= <mlev>
##$CPDPRG5= <mlev>
##$CPDPRG6= <mlev>
##$CPDPRG7= <mlev>
##$CPDPRG8= <mlev>
##$CPDPRGB= <>
##$CPDPRGT= <>
##$D= (0..31)
0 1 0 0 0 0 0 0 0 0 0 0.03 2e-05 3e-06 0 0 0 0 0 0 0 0 0 0 0 0 0 0 0 0 
0 0 
##$DATE= 1569234951
##$DBL= (0..7)
120 120 120 11 120 120 24 19 
##$DBP= (0..7)
150 150 150 150 150 150 150 150 
##$DBP07= 0
##$DBPNAM0= <>
##$DBPNAM1= <>
##$DBPNAM2= <>
$$ [...]
##$SUBNAM3= <"">
##$SUBNAM4= <"">
##$SUBNAM5= <"">
##$SUBNAM6= <"">
##$SUBNAM7= <"">
##$SUBNAM8= <"">
##$SUBNAM9= <"">
##$SW= 369.568048894756
##$SWIBOX= (0..15)
0 1 3 0 0 0 0 0 0 0 0 0 0 0 0 0 
##$SW_h= 29940.119760479
##$TD= 32768
##$TD0= 1
##$TE= 0
##$TE2= 300
##$TE3= 300
##$TEG= 300
##$TL= (0..7)
0 120 53 12 22 120 120 120 
##$TP= (0..7)
150 150 150 150 150 150 150 150 
##$TP07= 0
##$TPNAME0= <>
##$TPNAME1= <>
##$TPNAME2= <>
##$TPNAME3= <>
##$TPNAME4= <>
##$TPNAME5= <>
##$TPNAME6= <>
##$TPNAME7= <>
##$TPOAL= (0..7)
0.5 0.5 0.5 0.5 0.5 0.5 0.5 0.5 
##$TPOFFS= (0..7)
0 0 0 0 0 0 0 0 
##$TUNHIN= 0
##$TUNHOUT= 0
##$TUNXOUT= 0
##$USERA1= <user>
##$USERA2= <user>
##$USERA3= <user>
##$USERA4= <user>
##$USERA5= <user>
##$V9= 5
##$VALIST= <valist>
##$VCLIST= <CCCCCCCCCCCCCCC>
##$VD= 0
##$VDLIST= <DDDDDDDDDDDDDDD>
##$VPLIST= <PPPPPPPPPPPPPPP>
##$VTLIST= <TTTTTTTTTTTTTTT>
##$WBST= 1024
##$WBSW= 4
##$XGAIN= (0..3)
0 0 0 0 
##$XL= 0
##$YL= 0
##$YMAX_a= 9142
##$YMIN_a= -11596
##$ZGOPTNS= <>
##$ZL1= 120
##$ZL2= 120
##$ZL3= 120
##$ZL4= 120
##$ABSF1= 182.463
##$ABSF2= -187.1042
##$ABSG= 5
##$ABSL= 3
##$ALPHA= 0
##$AQORDER= 0
##$ASSFAC= 0
##$ASSFACI= 0
##$ASSFACX= 0
##$ASSWID= 0
##$AUNMP= <proc_1d>
##$AZFE= 0.1
##$AZFW= 0.5
##$BCFW= 0
##$BC_mod= 2
##$BYTORDP= 0
##$COROFFS= 0
##$CY= -3
##$DATMOD= 1
##$DC= 0
##$DFILT= <>
##$DTYPP= 0
##$F1P= 0
##$F2P= 0
##$FCOR= 1
##$FTSIZE= 65536
##$FT_mod= 6
##$GAMMA= 0
##$GB= 0
##$INTBC= 1
##$INTSCL= 5.30512e-09
##$ISEN= 30
##$LB= 1
##$LEV0= 0
##$LPBIN= 0
##$MAXI= 10000
##$MC2= 0
##$MEAN= 0
##$ME_mod= 0
##$MI= 50
##$NCOEF= 0
##$NC_proc= -7
##$NLEV= 6
##$NOISF1= 182.463
##$NOISF2= 159.3651
##$NSP= 0
##$NTH_PI= 0
##$NZP= 0
##$OFFSET= 182.463
##$PC= 4
##$PHC0= -187.266
##$PHC1= -497.1997
##$PH_mod= 1
##$PKNL= yes
##$PPARMOD= 0
##$PSCAL= 0
##$PSIGN= 0
##$REVERSE= no
##$SF= 81.0140089999434
##$SI= 65536
##$SIGF1= 159.3651
##$SIGF2= -187.1042
##$SINO= 113.3802
##$SIOLD= 16384
##$SREGLST= <1H.CDCl3>
##$SSB= 0
##$STSI= 65536
##$STSR= 0
##$SW_p= 29940.119760479
##$SYMM= 0
##$S_DEV= 0
##$TDeff= 32768
##$TDoff= 0
##$TI= <>
##$TILT= no
##$TM1= 0
##$TM2= 0
##$TOPLEV= 0
##$USERP1= <user>
##$USERP2= <user>
##$USERP3= <user>
##$USERP4= <user>
##$USERP5= <user>
##$WDW= 1
##$XDIM= 65536
##$YMAX_p= 293693071
##$YMIN_p= -59657177
$$ End of Bruker specific parameters
$$ ---------------------------------
##NTUPLES= NMR SPECTRUM
##VAR_NAME=  FREQUENCY,     SPECTRUM/REAL,   SPECTRUM/IMAG
##SYMBOL=    X,             R,               I
##VAR_TYPE=  INDEPENDENT,   DEPENDENT,       DEPENDENT
##VAR_FORM=  AFFN,          ASDF,            ASDF
##VAR_DIM=   65536,         65536,           65536
##UNITS=     HZ,            ARBITRARY UNITS, ARBITRARY UNITS
##FACTOR=    0.456856943014862, 1,           1
##FIRST=     14782.0589164792, 0,            0
##LAST=      -15158.0608439998, 0,           0
##MIN=       -15158.0608439998, -59657177,   0
##MAX=       14782.0589164792, 293693071,    0
$$ Real data points
##PAGE= N=1
##DATA TABLE= (X++(R..R)), XYDATA
$$ [...]
$$ plain form
46447 -1838833 -4214978 -3344306 -1611869 -2208270 -4342970 -5411510 -5557332 -6716163 -8577555
46438 -8577555 -9044472 -8122124 -7906082 -8619917 -7960885 -5145841 -2674211 -2797081 -4674094
46429 -4674094 -6509500 -8279512 -10403545 -11485166 -9793049 -6173066 -3332607 -2524054
46421 -2524054 -2726707 -2890225 -3027923 -2793886 -960331 2494206 5041702 3985425 -98702
46412 -98702 -3701835 -4408455 -3398564 -3263121 -4321768 -4340932 -1522175 3507715 8609781
46403 8609781 11699050 11328969 7468082 2533229 126821 1417214 3789002 4286945
46395 4286945 3248715 2975740 3913109 4307969 3236152 1823407 1351665 1922578 3143936
46386 3143936 4469152 4677132 2741133 -338496 -2056475 -1287991 456802 874755 -1058237
$$ packed form
46447a838833k376145Q70672J732437n96401k134700j068540j45822j158831j861392
46438h577555m66917R22348K16042p13835O59032K815044K471630j22870j877013
46429d674094j835406j770012k124033j081621J692117L619983K840459Q08553
46421b524054k02653j63518j37698K34037J833555L454537K547496j056277m084127
46412i8702l603133p06620J009891J35443j058647j9164K818757N029890N102066
46403H609781L089269l70081l860887m934853k406408J290393K371788M97943
46395D286945j038230k72975R37369L94860j071817j412745m71742N70913J221358
46386C143936J325216K07980j935999l079629j717979P68484J744793M17953j932992
$$ plain form
46377 -1058237 -4599455 -7439048 -6859653 -2615516 1706243 2525599 1210075 2247771
46369 2247771 6363006 9148348 7789738 5304440 5544238 7254465 6646626 3649397
46361 3649397 1562868 1503912 1174833 -708799 -2193792 -1272036 1154677 2696037 2350179
46352 2350179 1058074 386826 1215348 3031991 4342994 4276051 3468818 2739126 1593819
46343 1593819 -842949 -4046746 -6543164 -7694152 -7797570 -6964271 -5351922 -4067967
46335 -4067967 -4216468 -5207559 -5493142 -4836675 -4388442 -4662334 -5030041 -5231040 -5706777
46326 -5706777 -6086157 -4874942 -1425251 2666203 4783933 3703975 859089 -610065
46318 -610065 1240292 4741035 6225179 4820974 3893333 6067599 8780632 7715494
$$ packed form
46377a058237l541218k839593N79395M244137M321759Q19356j315524J037696
46369B247771M115235K785342j358610k485298K39798J710227o07839k997229
46361C649397k086529n8956l29079j883632j484993R21756K426713J541360l45858
46352B350179j292105o71248Q28522J816643J311003o6943q07233p29692j145307
46343A593819k436768l203797k496418j150988j03418Q33299J612349J283955
46335d067967j48501r91091k85583O56467M48233k73892l67707k00999m75737
46326e706777l79380J211215L449691M091454K117730j079958k844886j469154
46318f10065J850357L500743J484144j404205r27641K174266K713033j065138
$$ plain form
46310 7715494 3387303 496558 840469 994956 -1695579 -4597032 -3789167 -13877 2375593
46301 2375593 1147359 -1772089 -3481379 -3105364 -1579795 -149558 436284 153809 -394614
46292 -394614 -519063 22545 847220 957948 -676849 -3681823 -5767038 -5047130 -2828762
46283 -2828762 -2374238 -4473028 -6089407 -4416954 -652300 1752601 1531573 705183 1654234
46274 1654234 4305706 6213265 4954831 764934 -3096946 -3401407 -502320 2319364
46266 2319364 3201275 3561316 4827978 5473482 3285449 -800030 -3573089 -3795957 -3318005
46257 -3318005 -3840063 -4642261 -4303724 -3121312 -2523519 -2709332 -2138546 284039 3096184
46248 3096184 3169042 -873498 -6599348 -9962591 -9421866 -6916886 -4865507 -3760386 -3319422
$$ packed form
46310G715494m328191k890745L43911J54487k690535k901453Q07865L775290K389470
46301B375593j228234k919448j709290L76015J525569J430237N85842k82475n48423
46292c94614j24449N41608Q24675J10728j634797l004974k085215P19908K218368
46283b828762M54524k098790j616379J672453L764654K404901k21028q26390R49051
46274A654234K651472J907559j258434m189897l861880l04461K899087K821684
46266B319364Q81911L60041J266662O45504k188033m085479k773059k22868M77952
46257c318005n22058q02198L38537J182412N97793j85813N70786K422585K812145
46248C096184P2858m042540n725850l363243N40725K504980K051379J105121M40964
$$ plain form
46239 -3319422 -4222053 -6958014 -9801938 -9942257 -6878327 -3406770 -2737422 -5296050 -8614259
46230 -8614259 -9753979 -7523378 -2842593 2322251 6092647 7210672 5501895 2438297
46222 2438297 502062 876943 2092475 2069922 1066311 994786 2120114 2671187 2122366
46213 2122366 2361021 4374575 6074725 5251759 2786820 779818 -776506 -2756849
46205 -2756849 -3717198 -1408343 2754422 4190763 1007442 -3410204 -4946553 -3593589
46197 -3593589 -2106807 -1723862 -1394283 -310316 945598 1722745 2227440 2844000 3462713
46188 3462713 3670686 2989425 1003914 -1974024 -4388392 -4521871 -2426845 18942 1453407
46179 1453407 2576457 4486201 6237343 5646276 2582354 -208986 -377892 1254345
$$ packed form
46239c319422r02631k735961k843924j40319L063930L471557O69348k558628l318209
46230h614259j139720K230601M680785N164844L770396J118025j708777l063598
46222B438297j936235L74881J215532k2553j003611p1525J125328N51073n48821
46213B122366K38655K013554J700150q22966k464939k007002j556324j980343
46205b756849r60349K308855M162765J436341l183321m417646j536349J352964
46197c593589J486782L82945L29579J083967J255914P77147N04695O16560O18713
46188C462713K07973o81261j985511k977938k414368j33479K095026K445787J434465
46179A453407J123050J909744J751142n91067l063922k791340j68906J632237
$$ plain form
46171 1254345 2350955 2376393 2641986 3662072 4254660 3237113 592994 -2937102 -6023759
46162 -6023759 -6836063 -4798942 -2142218 -1578101 -2333417 -976708 3285546 6965024 7168499
46153 7168499 5269868 3738435 1980840 -1761587 -6267920 -8460765 -7839667 -6718531
46145 -6718531 -6342430 -5561318 -3414533 -520129 2361554 4891460 5979146 4262517
46137 4262517 365144 -3153340 -4648636 -4616965 -3867887 -2419396 -718216 19825 -418932
46128 -418932 -743892 -208725 466747 1004798 2468960 4891001 5782508 3102175 -1255196
46119 -1255196 -3147462 -1217954 1646289 2191911 474122 -1146076 -1343062 -778934 -356080
46110 -356080 -179598 -389426 -1342505 -2141304 -646440 3320860 6058351 3843041 -1670630
$$ packed form
46171A254345J096610K5438K65593J020086N92588j017547k644119l530096l086657
46162f023759q12304K037121K656724N64117p55316J356709M262254L679478K03475
46153G168499j898631j531433j757595l742427m506333k192845O21098J121136
46145f718531L76101P81112K146785K894404K881683K529906J087686j716629
46137D262517l897373l518484j495296L1671P49078J448491J701180P38041m38757
46128d18932l24960N35167O75472N38051J464162K422041Q91507k680333m357371
46119a255196j892266J929508K864243N45622j717789j620198j96986N64128M22854
46110c56080J76482k09828r53079p98799J494864L967300K737491k215310n513671
$$ plain form
46101 -1670630 -4813846 -3056954 257585 1413308 1200310 2009150 3012081 1698630
46093 1698630 -1487726 -3575582 -3310534 -1905653 -261191 1505566 2335928 1250895
46085 1250895 -194317 290375 1627633 526992 -3077163 -5409480 -4431878 -2498252
46077 -2498252 -2300252 -3601146 -5499131 -8474074 -11934066 -12663253 -8540652 -2037391
46069 -2037391 2251825 2188287 -1268952 -5960307 -9209603 -8673147 -4862782 -1415044 -845882
46060 -845882 -1486659 -580780 1293527 1449957 -442563 -1898074 -1308702 140259 372702
46051 372702 -1252161 -3593798 -4887202 -4562839 -4276072 -6114155 -9419853 -11060440 -9605037
46042 -9605037 -7251480 -6408182 -6455121 -5544287 -3652498 -1915127 -623585 261192 334964
$$ packed form
46101a670630l143216J756892L314539J155723k12998Q08840J002931j313451
46093A698630l186356k087856K65048J404881J644462J766757Q30362j085033
46085A250895j445212M84692J337258j100641l604155k332317R77602J933626
46077b498252J98000j300894j897985k974943l459992p29187M122601O503261
46069b037391M289216o3538l457239m691355l249296N36456L810365L447738N69162
46060h45882o40777R05879J874307J56430j892520j455511N89372J448961K32443
46051C72702j624863k341637j293404L24363K86767j838083l305698j640587J455403
46042i605037K353557Q43298m6939R10834J891789J737371J291542Q84777P3772
$$ plain form
46033 334964 251453 1895395 5035812 6268309 3913682 1401228 2430653 5203436 5603421
46024 5603421 4073820 4332620 6414324 6606604 4485108 4451466 8739160 13607030 14686295
46015 14686295 12316512 9309455 6761916 4552470 3150122 2357644 567677 -2318125
46007 -2318125 -3363116 -508021 3812491 5602205 4449230 3083254 2811581 2219424
45999 2219424 211131 -2144130 -3315257 -3177323 -2519320 -1730055 -663387 586283 1299011
45990 1299011 769330 -623544 -1400836 -498753 1565152 3532839 4714313 4658888 2613763
45981 2613763 -1097494 -4009779 -3879395 -1620599 241502 1457343 3691795 6568747
45973 6568747 7347030 5082244 2040296 191130 -637762 -339817 2079030 5226805 5336904
$$ packed form
46033C34964q3511J643942L140417J232497k354627k512454J029425K772783L99985
46024E603421j529601K58800K081704J92280k121496l3642M287694M867870J079265
46015A4686295k369783l007057k547539k209446j402348p92478j789967k885802
46007b318125j044991K855095M320512J789714j152975j365976k71673n92157
45999B219424k008293k355261j171127J37934O58003P89265J066668J249670P12728
45990A299011n29681j392874p77292R02083K063905J967687J181474n5425k045125
45981B613763l711257k912285J30384K258796J862101J215841K234452K876952
45973F568747P78283k264786l041948j849166q28892K97945K418847L147775J10099
$$ plain form
45964 5336904 1948693 -35571 2960576 7680664 8816038 6404798 4213499 3052800
45956 3052800 664672 -2884983 -4711722 -3952293 -2673399 -1580438 1046694 5316817
45948 5316817 8388161 8335528 6173513 3083332 -1010473 -4824956 -5174370 -1213945 3403308
45939 3403308 4866374 3723996 3067167 3963262 4758620 3723361 754224 -2591693 -3791134
45930 -3791134 -1486480 2266235 3752074 2505828 2091927 4689034 7786725 8464057
45922 8464057 7965809 8695047 9164744 6356823 1729683 -63684 1608432 2309951 -275279
45913 -275279 -2876058 -2605365 -2041188 -4611856 -8033909 -7143385 -2030032 1502425 68441
45904 68441 -2945056 -2890132 -326981 818137 -600410 -2059913 -1952251 -1702418 -2674566
$$ packed form
45964E336904l388211j984264K996147M720088J135374k411240k191299j160699
45956C052800k388128l549655j826739P59429J278894J092961K627132M270123
45948E316817L071344n2633k162015l090181m093805l814483l49414L960425M617253
45939C403308J463066j142378o56829Q96095P95358j035259k969137l345917j199441
45930c791134K304654L752715J485839j246246m13901K597107L097691O77332
45922H464057m98248P29238M69697k807921m627140j793367J672116P01519k585230
45913b75279k600779K70693N64177k570668l422053Q90524N113353L532457j433984
45904F8441l013497N4924K563151J145118j418547j459503J07662K49833r72148
$$ plain form
45895 -2674566 -3749015 -3508891 -2802499 -3123043 -3827048 -3300659 -2089790 -2199205 -3355054
45886 -3355054 -2856755 -10123 2036749 658366 -2240929 -2954132 -1158892 384142
45878 384142 469573 770153 2509953 4670805 6192167 7414505 8204306 6938959 3064351
45869 3064351 -1000463 -2395448 -1225348 202856 660993 826946 1443913 2360855 3188038
45860 3188038 3496084 2578604 406079 -1321075 -544688 2504536 5185334 5202853 2564388
45851 2564388 -1217037 -4696684 -6975096 -7650533 -6918966 -5357643 -3546089 -2254389
45843 -2254389 -2504225 -4466337 -6607965 -7104114 -5923450 -4300915 -2486888 181848
45835 181848 2904527 3299145 600202 -2802528 -4292578 -4120206 -4276569 -5542559 -7140418
$$ packed form
45895b674566j074449K40124P06392l20544p04005N26389J210869j09415j155849
45886c355054M98299K846632K046872j378383k899295p13203J795240J543034
45878C84142Q5431L00580J739800K160852J521362J222338P89801j265347l874608
45869C064351m064814j394985J170100J428204M58137J65953O16967R16942Q27183
45860C188038L08046r17480k172525j727154P76387L049224K680798J7519k638465
45851B564388l781425l479647k278412o75437P31567J561323J811554J291700
45843b254389k49836j962112k141628m96149J180664J622535J814027K668736
45835A81848K722679L94618k698943l402730j490050J72372j56363j265990j597859
$$ plain form
45826 -7140418 -8244107 -8174906 -5989304 -1825384 1799385 2093628 -516012 -2801655 -2908274
45817 -2908274 -2272448 -2697306 -3360547 -2263793 390301 2071624 1054483 -1749400 -4367089
45808 -4367089 -5951457 -6706504 -6639645 -5655207 -4528349 -4342760 -4718208 -3991197 -1836751
45799 -1836751 -353209 -1407192 -4119904 -6429684 -7815389 -8365852 -6511480 -1091442
45791 -1091442 4591276 4864244 -822733 -6107559 -5628567 -1550227 706414 309224 501964
45782 501964 2077379 2195849 -344368 -2992827 -3625941 -3343644 -3615519 -3548818 -1972914
45773 -1972914 -185914 -464136 -2780455 -4537599 -3177145 1527820 7065064 9832855
45765 9832855 8297604 4799569 3082827 3911325 4547470 2723476 -620589 -3076321
$$ packed form
45826g140418j103689O9201K185602M163920L624769K94243k609640k285643j06619
45817b908274O35826m24858o63241J096754K654094J681323j017141k803883k617689
45808d367089j584368p55047O6859R84438J126858J85589l75448P27011K154446
45799a836751J483542j053983k712712k309780j385705n50463J854372N420038
45791a091442N682718K72968n686977n284826M78992M078340K256641l97190J92740
45782E01964J575415J18470k540217k648459o33114K82297k71875O6701J575904
45773a972914J787000k78222k316319j757144J360454M704965N537244K767791
45765I832855j535251l498035j716742Q28498O36145j823994l344065k455732
$$ plain form
45757 -3076321 -3572225 -2711613 -1721601 -1705415 -2653904 -2825533 -579113 2960424 4908222
45748 4908222 4571243 4132502 4785248 4815622 2831572 397535 -354553 379781 1465951
45739 1465951 3064927 5318059 6660815 5841989 4033885 2557137 281145 -3785242
45731 -3785242 -6948493 -5643173 -1133661 1473571 154383 -1697487 -664576 2370129
45723 2370129 4755570 5869944 6188604 4929609 1481311 -1981376 -2164151 1002257
45715 1002257 3849499 3482232 1290942 852480 3148630 5337363 4455785 1097322 -1497129
45706 -1497129 -1213302 1304166 4184916 5714353 4365046 -173695 -5247511 -6850261
45698 -6850261 -4388114 -1717950 -1775978 -2631761 -1469218 28587 -1593937 -4831940 -4325822
$$ packed form
45757c076321m95904Q60612R90012J6186r48489j71629K246420L539537J947798
45748D908222l36979m38741O52746L0374j984050k434037p52088P34334J086170
45739A465951J598976K253132J342756q18826j808104j476748k275992m066387
45731c785242l163251J305320M509512K607232j319188j851870J032911L034705
45723B370129K385441J114374L18660j258995l448298l462687j82775L166408
45715A002257K847242l67267k191290m38462K296150K188733q81578l358463k594451
45706a497129K83827K517468K880750J529437j349307m538741n073816j602750
45698f850261K462147K670164n8028q55783J162543J497805j622524l238003N06118
$$ plain form
45689 -4325822 805444 4682635 2817466 -1551647 -2448557 540596 2862562 2165908
45681 2165908 637010 421574 733455 707107 1864277 5330363 8433668 6944639 472771
45672 472771 -6631867 -10168576 -9928087 -7825512 -4369305 786844 5977754 8233572
45664 8233572 7177325 5685272 5802115 6302534 5481960 3939597 2743308 1110615 -1551768
45655 -1551768 -3191989 -1809184 674441 655304 -1728890 -3020302 -2145115 -1858202 -3752400
45646 -3752400 -5459987 -4409737 -1502854 693632 1120587 58348 -2032673 -3941833
45638 -3941833 -3954398 -2121757 -458991 138405 787806 1368682 -327798 -4063561 -5238960
45629 -5238960 -1048928 4090389 3618580 -2171366 -6767428 -6544515 -4644934 -5209279 -7977444
$$ packed form
45689d325822N131266L877191j865169m369113q96910K989153K321966o96654
45681B165908j528898k15436L11881k6348J157170L466086L103305j489029o471868
45672D72771p104638l536709K40489K102575L456207N156149N190910K255818
45664H233572j056247j492053J16843N00419q20574j542363j196289j632693k662383
45655a551768j640221J382805K483625j9137k384194j291412Q75187K86913j894198
45646c752400j707587J050250K906883K196486M26955j062239k091021j909160
45638c941833j2565J832641J662766N97396O49401N80876j696480l735763j175399
45629e238960M190032N139317m71809n789946m596062K22913J899581n64345k768165
$$ plain form
45620 -7977444 -10210528 -10615881 -9344878 -6628269 -3531244 -2222081 -3483102 -5227003
45612 -5227003 -5103514 -3408014 -1962226 -1402968 -1301590 -1888752 -3616908 -5483209 -5702532
45603 -5702532 -4060521 -2117145 -1064111 -756149 -865774 -1437756 -1933967 -1223169 755518
45594 755518 2563663 3346578 4141253 5926223 7443758 6669584 3943971 1780234 1525545
45585 1525545 2000008 1795693 1043061 75764 -1739181 -4300458 -5409661 -3175849 956336
45576 956336 3584576 3478197 2542123 2784768 4111345 5297501 5543416 4711457 3283414
45567 3283414 2213584 1676490 311132 -2665527 -5111050 -4182524 -974955 -61204 -3488866
45558 -3488866 -7955676 -9382598 -7705047 -5232405 -2809029 -358122 681095 -1137594
$$ packed form
45620g977444k233084m05353J271003K716609L097025J309163j261021j743901
45612e227003J23489J695500J445788N59258J01378n87162j728156j866301k19323
45603e702532J642011J943376J053034L07962j09625n71982m96211P10798J978687
45594G55518J808145P82915P94675J784970J517535p74174k725613k163737k54689
45585A525545M74463k04315p52632r67297j814945k561277j109203K233812M132185
45576I56336K628240j06379r36074K42645J326577J186156K45915q31959j428043
45567C283414j069830n37094j365358k976659k445523R28526L207569R13751l427662
45558c488866m466810j426922J677551K472642K423376K450907J039217j818689
$$ plain form
45550 -1137594 -4032088 -4390076 -1503318 1582501 2243193 1118439 258103 345809 684493
45541 684493 700520 575198 940962 2287204 4242571 5538709 5230349 3696204 1893378
45532 1893378 183122 -1313885 -1889033 -982868 571312 1189827 388602 -775329 -995017
45523 -995017 -17719 921780 -196470 -4039699 -8250559 -9526827 -7954316 -7079068 -8455532
45514 -8455532 -8847207 -5262547 -212615 1635417 297998 -248127 1262755 2090748 1031791
45505 1031791 504871 1765656 2334992 394104 -1880046 -2048550 -1474841 -2624579 -4685368
45496 -4685368 -5224065 -4579587 -5079518 -6572920 -6099821 -2344157 2114709 3789045 2009430
45487 2009430 -836770 -1756680 333921 3664839 5129514 3390710 230489 -1770531
$$ packed form
45550a137594k894494l57988K886758L085819O60692j124754q60336Q7706L38684
45541F84493J6027j25322L65764J346242J955367J296138l08360j534145j802826
45532A893378j710256j497007n75148R06165J554180O18515q01225j163931k19688
45523i95017R77298R39499j118250l843229m210860j276268J572511Q75248j376464
45514h455532l91675L584660N049932J848032j337419n46125J510882Q27993j058957
45505A031791n26920J260785N69336j940888k274150j68504N73709j149738k060789
45496d685368n38697O44478m99931j493402M73099L755664M458866J674336j779615
45487B009430k846200r19910K090601L330918J464675j738804l160221k001020
$$ plain form
45479 -1770531 -2242896 -2709598 -3793235 -4124915 -2216303 1498727 4916999 6317833 6021456
45470 6021456 5819342 6466348 6279541 3375977 -958325 -2992851 -1236947 1425114 1467940
45461 1467940 -972589 -3055068 -3135041 -1802716 24356 1847426 2753328 1988131 666512
45452 666512 1169765 4177790 7457527 8223801 5956865 2500700 52988 -536652 62372
45443 62372 747511 1176017 1758007 2567299 2934515 2424221 1442461 322114 -1350070
45434 -1350070 -3636158 -5250525 -4847861 -2921549 -1297732 -948356 -1351507 -1896131 -2800612
45425 -2800612 -4353097 -5962421 -6393397 -4901577 -2232399 -355022 -539512 -1691891
45417 -1691891 -1693988 -650191 -1212518 -4741922 -8785115 -10003123 -8337909 -6276781 -4936776
$$ packed form
45479a770531m72365m66702j083637l31680J908612L715030L418272J400834k96377
45470F021456k02114O47006j86807k903564m334302k034526J755904K662061M2826
45461A467940k440529k082479p9973J332325J827072J823070R05902p65197j321619
45452F66512N03253L008025L279737P66274k266936l456165k447712n89640N99024
45443F2372O85139M28506N81990Q09292L67216n10294r81760j120347j672184
45434a350070k286088j614367M02664J926312J623817L49376m03151n44624r04481
45425b800612j552485j609324m30976J491820K669178J877377j84490j152379
45417a691891k097J043797n62327l529404m043193j218008J665214K061128J340005
$$ plain form
45408 -4936776 -3285513 -901909 1020324 1821441 2421946 3531087 4501268 4676444 4383386
45399 4383386 3831276 2418949 66685 -1878504 -2094216 -989623 -233394 -1034261 -3240768
45390 -3240768 -5553313 -6366267 -5015779 -2365624 351512 2976032 5747560 7607700
45382 7607700 6845782 3715917 854297 423773 1988031 3711692 4477792 4281590 3692041
45373 3692041 3498324 3895485 3789856 2205953 429109 790060 2884582 3439691 1103910
45364 1103910 -1197011 -700828 714194 -623623 -4396243 -6703667 -5709018 -3632190
45356 -3632190 -2887249 -3138044 -2949744 -1927780 -251567 1815945 2946604 1343842 -2329581
45347 -2329581 -4445971 -2541895 1363029 3288969 2101341 9614 -939281 -807702
$$ packed form
45408d936776J651263K383604J922233Q01117O00505J109141R70181J75176k93058
45399D383386n52110j412327k352264j945189k15712J104593P56229q00867k206507
45390c240768k312545q12954J350488K650155K717136K624520K771528J860140
45382G607700p61918l129865k861620m30524J564258J723661P66100j96202n89549
45373C692041j93717L97161j05629j583903j776844L60951K094522N55109k335781
45364A103910k300921M96183J415022j337817l772620k307424R94649K076828
45356c632190P44941k50795J88300J021964J676213K067512J130659j602762l673423
45347b329581k116390J904076L904924J925940j187628k091727r48895J31579
$$ plain form
45339 -807702 -367673 286692 1215250 2093001 2869850 4083524 5942097 7738137 8649528
45330 8649528 8610758 8004101 6990199 5590043 4033862 2590657 1416446 1034639 2450662
45321 2450662 5775452 8747119 7947128 2523904 -3923069 -6545869 -4399403 -1115986
45313 -1115986 -128460 -894361 -1057702 -675013 -1776122 -4259413 -5174161 -2859100 694006
45304 694006 2942593 4048969 5241939 5982065 5255390 4153769 4210359 4165246 1718178
45295 1718178 -1962674 -3280013 -2088563 -2355662 -5410762 -6729593 -2599334 3180136
45287 3180136 3470710 -2785267 -9354259 -10597235 -7051576 -2815558 -488268 148677
45279 148677 480605 1355443 2242097 1942543 737987 746472 2654845 3586689 802696
$$ packed form
45339h07702M40029O54365R28558Q77751P76849J213674J858573J796040R11391
45330H649528l8770o06657j013902j400156j556181j443205j174211l81807J416023
45321B450662L324790K971667p99991n423224o446973k622800K146466L283417
45313a115986R87526p65901j63341L82689j101109k483291r14748K315061L553106
45304F94006K248587J106376J192970P40126p26675j101621N6590m5113k447068
45295A718178l680852j317339J191450k67099l055100j318831M130259N779470
45287C180136K90574o255977o568992j242976L545659M236018K327290O36945
45279A48677L31928Q74838Q86654k99554j204556Q485J908373R31844k783993
$$ plain form
45270 802696 -3676815 -5479014 -4150088 -3038990 -3118267 -1736827 1433946 2363349 -792040
45261 -792040 -3643756 -1855041 2091721 2846530 355123 -790358 1190170 3288527
45253 3288527 3063502 1794758 1623779 2729560 4155152 5150115 5248110 4741061 4837734
45244 4837734 5728209 5539515 3317640 1421295 1890762 2084527 -1908219 -8447922 -11689953
45235 -11689953 -9696193 -6356963 -4659189 -3069295 21279 3178493 5302227 7545877
45227 7545877 9538324 8278837 3644753 454764 1583223 3403526 2085423 -12497
45219 -12497 793092 2470263 1346631 -111703 2967201 8148864 7808979 1121231 -3912284
45210 -3912284 -2197615 1870745 2622963 1430028 2333424 4473334 4359660 2533312 2523445
$$ packed form
45270H02696m479511j802199J328926J111098p9277J381440L170773R29403l155389
45261g92040k851716J788715L946762P54809k491407j145481J980528K098357
45253C288527k25025j268744j70979J105781J425592R94963R7995n07049R6673
45244D837734Q90475j88694k221875j896345M69467J93765l992746o539703l242031
45235a1689953J993760L339230J697774J589894L090574L157214K123734K243650
45227G545877J992447j259487m634084l189989J128459J820303j318103k097920
45219a2497Q05589J677171j123632j458334L078904N181663l39885o687748n033515
45210c912284J714669M068360P52218j192935R03396K139910j13674j826348r867
$$ plain form
45201 2523445 4718146 6063454 5294400 4326696 4294785 3696207 1300688 -1596274 -2839188
45192 -2839188 -1875531 -9138 827568 -461314 -2923775 -4026063 -2335624 592228
45184 592228 2058333 1516104 781736 1257863 2348567 2735755 2030809 764181 -467368
45175 -467368 -1342981 -1611638 -957539 599633 2022724 1640307 -810707 -2996145 -2455192
45166 -2455192 -203740 249442 -1972663 -3496095 -1702609 1086416 958592 -1832920
45158 -1832920 -3647815 -3169929 -2902543 -4624673 -6381693 -5271912 -1283129 2867876
45150 2867876 4467008 2610973 -1476785 -5136517 -6159267 -4551174 -1921447 608255
45142 608255 2834052 4373506 4954968 5606523 7409337 8924907 7306723 2618362 -1454110
$$ packed form
45201B523445K194701J345308p69054r67704l1911n98578k395519k896962j242914
45192b839188R63657J866393Q36706j288882k462461j102288J690439K927852
45184E92228J466105n42229p34368M76127J090704L87188p04946j266628j231549
45175d67368q75613k68657O54099J557172J423091l82417k451014k185438N40953
45166b455192K251452M53182k222105j523432J793486K789025j27824k791512
45158a832920j814895M77886K67386j722130j757020J109781L988783M151005
45150B867876J599132j856035m087758l659732j022750J608093K629727K529702
45142F08255K225797J539454N81462O51555J802814J515570j618184m688361m072472
$$ plain form
45133 -1454110 -2266795 -1146530 -377871 -54579 10410 -1915633 -6504747 -10137652 -8536900
45124 -8536900 -2906626 1167297 793934 -1663668 -3193460 -3564387 -3212133 -1340617 1855257
45115 1855257 3815586 2799795 586984 -5328 1361885 3342591 5345945 6908364
45107 6908364 6320440 2739285 -1277624 -2222335 -246437 1320103 903650 434243 1832408
45098 1832408 4315968 6108847 6853140 7298042 7956553 8745926 8901357 7263233 4126131
45089 4126131 2411327 4643899 8753492 9783229 6429923 2749233 2080233 2643252
45081 2643252 1400309 -909622 -1824506 -1766924 -2756561 -4051573 -3053535 118749 2671862
45072 2671862 3492425 3984258 4681368 4570699 3943928 4316662 5065914 3820629 880355
$$ packed form
45133a454110q12685J120265P68659L23292O4989j926043m589114l632905J600752
45124h536900N630274M073923l73363k457602j529792l70927L52254J871516L195874
45115A855257J960329j015791k212811n92312J367213J980706K003354J562419
45107F908364n87924l581155m016909r44711J975898J566540m16453m69407J398165
45098A832408K483560J792879P44293M44902O58511P89373J55431j638124l137102
45089D126131j714804K232572M109593J029737l353306l680690o69000N63019
45081B643252j242943k309931r14884N7582r89637j295012R98038L172284K553113
45072B671862Q20563M91833O97110j10669o26771L72734P49252j245285k940274
$$ plain form
45063 880355 -652003 -204293 -990468 -4190672 -6253010 -4723244 -2634674 -3412873 -4915538
45054 -4915538 -2936879 2001246 6003174 7864897 8834356 7907109 3073096 -3022320
45046 -3022320 -4466678 -320146 3525611 2598910 -407085 -558024 2424278 5223124
45038 5223124 6093401 5729079 4695938 2962150 1163751 118413 -429583 -1085966 -1428017
45029 -1428017 -466088 2096583 5592770 8440608 8426447 4752343 160145 -1181775 1388047
45020 1388047 4461816 5504379 5391243 4989566 2932236 -875479 -3005591 -1040233
45012 -1040233 2396424 3622573 3329929 4036469 4549082 2040128 -1679293 -1496924 3248041
45003 3248041 7279717 6488373 2302362 -1812359 -3968494 -2979070 1556255 6374060
$$ packed form
45063H80355j532358M47710p86175l200204k062338J529766K088570p78199j502665
45054d915538J978659M938125M001928J861723R69459r27247m834013o095416
45046c022320j444358M146532L845757r26701l005995j50939K982302K798846
45038E223124Q70277l64322j033141j733788j798399j045338n47996o56383l42051
45029a428017R61929K562671L496187K847838j4161l674104m592198j341920K569822
45020A388047L073769J042563j13136m01677k057330l807715k130112J965358
45012a040233L436657J226149k92644P06540N12613k508954l719421J82369M744965
45003C248041M031676p91344m186011m114721k156135R89424M535325M817805
$$ plain form
44995 6374060 5982748 -382686 -6697073 -7732430 -5492571 -5053067 -6991988 -7773125 -5689853
44986 -5689853 -2476153 175837 2338865 4258358 5526329 5794002 4783031 2394002
44978 2394002 143090 712923 3892980 4942332 240483 -6783889 -9249131 -5939019
44970 -5939019 -2747327 -4347307 -8305343 -9328681 -6312605 -2523181 -579778 -77691
44962 -77691 295064 661956 557192 234033 395646 1021574 1313664 972045 750829 1113153
44952 1113153 1140759 101975 -545541 1098507 3649461 3293001 -691370 -4332228 -4750953
44943 -4750953 -4328968 -6072220 -7869621 -5913232 -1888004 -1226564 -4575961 -6713169
44935 -6713169 -4986997 -3261843 -4992541 -7344536 -6024740 -2293818 -692981 -2016199
$$ packed form
44995F374060l91312o365434o314387j035357K239859M39504j938921p81137K083272
44986e689853L213700K651990K163028J919493J267971K67673j010971k389029
44978B394002k250912N69833L180057J049352m701849p024372k465242L310112
44970e939019L191692j599980l958036j023338L016076L789424J943403N02087
44962g7691L72755L66892j04764l23159J61613O25928K92090l41619k21216L62324
44952A113153K7606j038784o47516J644048K550954l56460l984371l640858m18725
44943d750953M21985j743252j797401J956389M025228O61440l349397k137208
44935f713169J726172J725154j730698k351995J319796L730922J600837j323218
$$ plain form
44927 -2016199 -3001407 -1956869 -583039 -353539 -638061 -867952 -1647598 -2957135 -3596957
44918 -3596957 -3300523 -3522435 -5187194 -7076200 -7319671 -5476515 -2543297 177783 1741061
44909 1741061 1957590 1604447 1552523 1439821 44615 -2696574 -4968886 -5026177 -3220901
44900 -3220901 -1378142 -602426 -565720 -762029 -1262635 -1628924 -133965 4324932 9567563
44891 9567563 11270926 7908595 3159499 1655585 3272508 3886366 1424346 -1537282
44883 -1537282 -1801576 324642 2254250 2547641 1575984 204287 -675380 -396369 448838
44874 448838 308873 -1034251 -1953042 -1804664 -2283699 -4266253 -5407648 -3403131 -20502
44865 -20502 1085984 -418777 -1553051 -599950 1402346 3435458 5469140 6401632 4321380
$$ packed form
44927b016199r85208J044538J373830K29500k84522k29891p79646j309537o39822
44918c596957K96434k21912j664759j889006k43471J843156K933218K721080J563278
44909A741061K16529l53143n1924j12702j395206k741189k272312n7291J805276
44900c220901J842759P75716L6706j96309n00606l66289J494959M458897N242631
44891I567563J703363l362331m749096j503914J616923O13858k462020k961628
44883a537282k64294K126218J929608K93391r71657j371697q79667K79011Q45207
44874D48838j39965j343124r18791J48378m79035j982554j141395K004517L382629
44865b0502J106486j504761j134274R53101K002296K033112K033682R32492k080252
$$ plain form
44856 4321380 -189380 -3713157 -4072538 -2508681 -980735 253182 1354268 1785737
44848 1785737 1945440 3611553 7062860 9705236 9194328 6099779 2069301 -2310240
44840 -2310240 -5897737 -5884068 -1419693 3359169 3408725 -880151 -4575772 -4887620 -3564687
44831 -3564687 -2635370 -1463275 728149 2447026 2020575 133103 -1545427 -2796268
44823 -2796268 -4175010 -5089881 -4478955 -2838248 -1843042 -2046823 -2325429 -1700872 -562747
44814 -562747 255758 742356 1462594 2423449 2775671 1889920 556860 539711 2431118
44805 2431118 4380894 3993587 1523252 -143751 667704 1968257 944990 -1675800
44797 -1675800 -2323188 184954 2440126 1005831 -2371045 -2598804 1800374 6098219
$$ packed form
44856D321380m510760l523777l59381J563857J527946J233917J101086M31469
44848A785737J59703J666113L451307K642376n10908l094549m030478m379541
44840b310240l587497J3669M464375M778862M9556m288876l695621l11848J322933
44831c564687R29317J172095K191424J718877m26451j887472j678530j250841
44823b796268j378742r14871O10926J640707R95206k03781k78606O24557J138125
44814e62747Q18505M86598P20238R60855L52222q85751j333060j7149J891407
44805B431118J949776l87307k470335j667003Q11455J300553j023267k620790
44797a675800o47388K508142K255172j434295l376876k27759M399178M297845
$$ plain form
44789 6098219 5094277 -297894 -4486282 -4541562 -3213382 -3840357 -5187563 -3963391 -697647
44780 -697647 652982 -1036873 -2073392 193734 2928021 2190303 -684435 -1070762 1670466
44771 1670466 3289764 1393444 -1114106 -929362 949910 1945307 2461413 4541984 7718428
44762 7718428 9379199 8409737 5859003 2832443 210420 -523891 997084 2230071
44754 2230071 606277 -2433483 -3506126 -2756679 -3320670 -5351895 -5133594 -1294285 2474517
44745 2474517 2950572 1727153 1520135 1738156 822130 -86608 702482 2011770 1900566
44736 1900566 1066523 922864 595670 -565830 117133 4871310 10468405 11838772 9378368
44727 9378368 7543993 7123657 4789191 481042 -1052174 2104096 5340974 4225934
$$ packed form
44789F098219j003942n392171m188388n5280J328180o26975j347206J224172L265744
44780f97647J350629j689855j036519K267126K734287p37718k874738l86327K741228
44771A670466J619298j896320k507550J84744J879272R95397N16106K080571L176444
44762G718428J660771r69462k550734l026560k622023p34311J520975J232987
44754B230071j623794l039760j072643P49447n63991k031225K18301L839309L768802
44745B474517M76055j223419k07018K18021r16026r08738P89090J309288j11204
44736A900566q34043j43659l27194j161500O82963M754177N597095J370367k460404
44727I378368j834375m20336k334466m308149j533216L156270L236878j115040
$$ plain form
44719 4225934 485639 -1627933 -1192331 202957 1883992 3526238 3762899 2343464
44711 2343464 1524437 2769695 4315101 4369767 4079453 4572146 3933644 646650 -2465594
44702 -2465594 -1858162 1021709 2064440 1305752 2587759 6644628 9406348 8292728
44694 8292728 6051681 6363826 8721162 9999950 9070457 7479522 6541876 5753241 4073408
44685 4073408 1686138 84679 444158 2011123 2668320 1462248 -150325 -199746 1455532
44676 1455532 3467760 4801626 5290343 5310215 5786242 7359367 8600348 6691995 1369672
44667 1369672 -3589310 -4849788 -3829305 -4047924 -5719152 -6066992 -4009444 -1208296
44659 -1208296 978266 2254597 1574378 -1643827 -4443519 -2606012 3075344 6717647
$$ packed form
44719D225934l740295k113572M35602J395288J681035J642246K36661j419435
44711B343464q19027J245258J545406N4666k90314M92693o38502l286994l112244
44702b465594O07432K879871J042731p58688J282007M056869K761720j113620
44694H292728k241047L12145K357336J278788r29493j590935r37646p88635j679833
44685D073408k387270j601459L59479J566965O57197j206072j612573m9421J655278
44676A455532K012228J333866M88717J9872M76027J573125J240981j908353n322323
44667A369672m958982j260478J020483k18619j671228l47840K057548K801148
44659a208296K186562J276331o80219l218205k799692J837507N681356L642303
$$ plain form
44651 6717647 5007250 1165649 -687154 -1265953 -3131942 -5158434 -4123390 -289523
44643 -289523 2558062 2328381 696623 -159604 -164395 -114160 -52966 178981 267881 248965
44633 248965 1019662 3082073 5237246 5397701 2863005 -597981 -2302269 -1242419 1296758
44624 1296758 3634125 5183973 5638475 4266599 1624275 614152 3261196 7005254
44616 7005254 7241053 3718061 1085699 2090093 3719982 2179338 -1437270 -3404853
44608 -3404853 -2936768 -2067616 -1578461 -711145 -89214 -1200903 -3155235 -3563159 -2903677
44599 -2903677 -4290983 -7990509 -9983557 -7900646 -4926494 -4934602 -6511315 -5554134 -2102884
44590 -2102884 -236736 -1426348 -2375029 -753210 758154 -1185182 -4843365 -5492792
$$ packed form
44651F717647j710397l841601j852803n78799j865989k026492J035044L833867
44643b89523K847585k29681j631758q56227m791N0235O1194K31947Q8900j8916
44633B48965P70697K062411K155173J60455k534696l460986j704288J059850K539177
44624A296758K337367J549848M54502j371876k642324j010123K647044L744058
44616G005254K35799l522992k632362J004394J629889j540644l616608j967583
44608c404853M68085Q69152M89155Q67316O21931j111689j954332m07924O59482
44599b903677j387306l699526j993048K082911K974152q108j576713R57181L451250
44590b102884J866148j189612r48681J621819J511364j943336l658183o49427
$$ plain form
44582 -5492792 -2214030 883912 421216 -2275879 -3999170 -4000671 -3768200 -4083242 -4296048
44573 -4296048 -3776407 -2395841 27495 3310085 6172322 7200409 6392392 4764473
44565 4764473 2933254 1352223 1273709 3508345 6298304 6532505 3628232 363149 -888505
44556 -888505 -826293 -933460 -486629 1924010 4975237 5478447 2955195 982783 2715176
44547 2715176 6693239 8954213 8405753 7678214 8443407 8643328 6178480 3184469 3441516
44538 3441516 6321686 7101417 3976075 1000863 2045970 5116659 5761005 3615179
44530 3615179 1742232 1040382 -397991 -2792594 -3788478 -2673387 -1828531 -2856081 -4310869
44521 -4310869 -4456990 -3458514 -1561105 2108245 7207107 10967778 11215808 8973962 6648631
$$ packed form
44582e492792L278762L097942m62696k697095j723291j501K32471l15042k12806
44573d296048N19641J380566K423336L282590K862237J028087q08017j627919
44565D764473j831219j581031p8514K234636K789959K34201k904273l265083j251654
44556h88505O2212j07167M46831K410639L051227N03210k523252j972412J732393
44547B715176L978063K260974n48460p27539P65193J99921k464848k994011K57047
44538C441516K880170P79731l125342k975212J045107L070689O44346k145826
44530C615179j872947p01850j438373k394603r95884J115091Q44856j027550j454788
44521d310869j46121R98476J897409L669350N098862L760671K48030k241846k325331
$$ plain form
44512 6648631 5197778 4261002 3439508 2287294 491599 -1159827 -1525043 -1060851 -936164
44503 -936164 -267387 2664538 6168072 6155807 2656616 899643 3560526 6293459 4366549
44494 4366549 -230619 -2552190 -2207234 -2158359 -2480441 -679247 3074860 6054325 7561769
44485 7561769 8800561 8934562 6159260 2370503 1704049 4076137 5033112 2760197 449154
44476 449154 523456 1265510 985906 1063436 2441667 3081609 1687104 541787 1655782
44467 1655782 3049672 2035644 -301487 -1230783 -1006125 -1903728 -3877615 -4489381 -2653652
44458 -2653652 264832 2734771 4071489 3531692 780956 -2716484 -4871510 -5760843
44450 -5760843 -7424037 -10522280 -12895411 -12177513 -8616748 -4445479 -1273258 950544
$$ packed form
44512F648631j450853r36776q21494j152214j795695j651426l65216M64192J24687
44503i36164O68777K931925L503534j2265l499191j756973K660883K732933j926910
44494D366549m597168k321571L44956M8875l22082J801194L754107K979465J507444
44485G561769J238792J34001k775302l788757o66454K372088R56975k272915k311043
44476D49154P4302P42054k79604P7530J378231O39942j394505j145317J113995
44467A655782J393890j014028k337131r29296K24658q97603j973887o11766J835729
44458b653652K918484K469939J336718n39797k750736l497440k155026q89333
44450e760843j663194l098243k373131P17898L560765M171269L172221K223802
$$ plain form
44442 950544 2734621 3811099 3515071 1979086 301443 -643346 -1145760 -2104768 -3750488
44433 -3750488 -5106942 -4572796 -1285814 3421277 6270485 5117217 1786263 6616
44425 6616 221344 -989539 -5181234 -8749019 -7750342 -3352339 738253 3909889 7585680
44416 7585680 10316410 9053605 4930981 2660101 3549267 3911367 1560299 -813474
44408 -813474 -528381 1278094 3008130 5559712 9046014 10342859 7374569 2940469
44400 2940469 937173 1277386 1712493 2139486 3595125 5199946 5777929 6628197 8962899
44391 8962899 10377564 8037552 4060834 3125536 5135268 4948892 123002 -5279582
44383 -5279582 -6335385 -3588846 -1562028 -2829236 -5699021 -7134826 -6419398 -5478751
$$ packed form
44442I50544J784077J076478k96028j535985j677643r44789n02414r59008j645720
44433c750488j356454N34146L286982M707091K849208j153268l330954j779647
44425F616K14728j210883m191695l567785R98677M398003M090592L171636L675791
44416G585680K730730j262805m122624k270880Q89166L62100k351068k373773
44408h13474K85093J806475J730036K551582L486302J296845k968290m434100
44400B940469k003296L40213M35107M26993J455639J604821N77983Q50268K334702
44391H962899J414665k340012l976718r35298K009732j86376m825890n402584
44383e279582j055803K746539K026818j267208k869785j435805P15428R40647
$$ plain form
44375 -5478751 -5839292 -6022371 -3207569 2476930 7231816 8133627 6584729 5794781 6592054
44366 6592054 7579367 7889999 7721410 7384716 7668780 9666763 12354281 12266388 8058684
44357 8058684 3469628 2738320 4798274 5461581 3846710 2585396 2557183 1848432 -57643
44348 -57643 -1261496 -1148766 -1216474 -1375417 766958 5545545 9524273 9893595 7861266
44339 7861266 5962692 4406447 1958663 -1375449 -4359027 -6110799 -6507845 -5831043
44331 -5831043 -4594045 -3045479 -1003940 996436 1456584 372555 405321 3054185 5262263
44322 5262263 3439037 -281881 -233012 4687406 9869996 12225531 13398006 14590733
44314 14590733 13560102 9248773 4819816 3080472 2702359 1874622 1983156 4426633
$$ packed form
44375e478751l60541j83079K814802N684499M754886R01811j548898p89948P97273
44366F592054R87313L10632j68589l36694K84064J997983K687518q7893m207704
44357H058684m589056p31308K059954O63307j614871j261314k8213p08751j906075
44348e7643j203853J12730o7708j58943K142375M778587L978728L69322k032329
44339G861266j898574j556245k447784l334112k983578j751772l97046O76802
44331e831043J236998J548566K041539K000376M60148j084029L2766K648864K208078
44322E262263j823226l720918M8869M920418N182590K355535J172475J192727
44314A4590733j030631m311329m428957j739344l78113q27737J08534K443477
$$ plain form
44306 4426633 7106723 7456764 6110333 4549636 2228636 -718226 -1181786 2623180
44298 2623180 7273073 8367049 6164748 3484065 985698 -1389108 -1472409 1757348
44290 1757348 4671646 4106888 3196190 6122478 9744884 7749054 1433935 -1933617
44282 -1933617 -1249684 -3146381 -9867839 -14439536 -11547824 -5427801 -2086987 -501447
44274 -501447 2582247 4871418 2564421 -1815229 -2797115 -738980 -358716 -1966228 -1077438
44265 -1077438 3288414 6368188 4961295 1674841 70123 -52985 -408700 -830264 -476610
44256 -476610 111936 182035 45410 -309588 -1963035 -4967840 -7211102 -6761601 -4062009
44247 -4062009 -955416 955629 485332 -2415647 -5209805 -4462642 -401034 2598945
$$ packed form
44306D426633K680090L50041j346431j560697k321000k946862m63560L804966
44298B623180M649893J093976k202301k680683k498367k374806q3301L229757
44290A757348K914298n64758r10698K926288L622406j995830o315119l367552
44282a933617O83933j896697o721458m571697K891712O120023L340814J585540
44274e01447L083694K289171k306997m379650r81886K058135L80264j607512Q88790
44265a077438M365852L079774j406893l286454j604718j23108l55715m21564L53654
44256d76610N88546P0099j36625l54998j653447l004805k243262M49501K699592
44247d062009L106593J911045m70297k900979k794158P47163M061608K999979
$$ plain form
44239 2598945 1850466 153342 1236947 3777102 3531571 53797 -2789717 -2804092 -1973726
44230 -1973726 -2155447 -1924381 402767 3346031 4194680 2573032 -98751 -3275542 -7056255
44221 -7056255 -10138217 -10448659 -7824603 -4285207 -1610382 -192937 -177055 -1811538 -4171648
44212 -4171648 -5276033 -4525808 -3825662 -5068971 -7288899 -7683061 -5271521 -2223006 -1110692
44203 -1110692 -1801381 -2039097 -826008 42341 -1503101 -4661403 -6558215 -6049542 -5077866
44194 -5077866 -5597384 -6701536 -6170471 -3832539 -1713614 -1331927 -2422967 -4053991 -5409902
44185 -5409902 -5648901 -4693869 -4173499 -5736848 -8226862 -8568100 -6022502 -3364371 -2742375
44176 -2742375 -2595983 -498364 2778578 4483560 4101494 3714791 4421487 4912112 4088888
$$ packed form
44239B598945p48479j697124J083605K540155k45531l477774k843514j4375Q30366
44230a973726j81721K31066K327148K943264Q48649j621648k671783l176791l780713
44221g056255l081962l10442K624056L539396K674825J417445J5882j634483k360110
44212d171648j104385P50225P00146j243309k219928l94162K411540L048515J112314
44203a110692o90689k37716J213089Q68349j545442l158302j896812N08673R71676
44194e077866n19518j104152N31065K337932K118925L81687j091040j631024j355911
44185e409902k38999R55032N20370j563349k490014l41238K545598K658131O21996
44176b742375J46392K097619L276942J704982l82066l86703P06696M90625q23224
$$ plain form
44167 4088888 2995305 3102673 4087821 4489482 3799085 2878812 2641169 3067535 3460592
44158 3460592 3231781 2463830 1934839 2527621 4345266 6221753 6192884 2958390 -2527741
44149 -2527741 -7021431 -7346434 -3250433 2397783 6408684 7842469 7798084 7502154 7088630
44140 7088630 5753422 2778518 -1169917 -3821968 -3311220 -504086 1844606 2448503
44132 2448503 2444811 2554410 1449677 -1561763 -4132070 -3486784 -443042 1511545 689038
44123 689038 -1383726 -2734436 -2923589 -2106340 -166849 2546355 4948119 6182881 6132493
44114 6132493 5225440 4628884 5772358 8201589 8972124 6370929 3313968 4131827 8368521
44105 8368521 11104690 9662333 6414795 4106947 2247357 -5354 -1006982 481823
$$ packed form
44167D088888j093583J07368R85148M01661o90397r20273k37643M26366L93057
44158C460592k28811p67951n28991N92782J817645J876487k8869l234494n486131
44149b527741m493690l25003M096001N648216M010901J433785m4385k95930m13524
44140G088630j335208k974904l948435k652051N10748K807134K348692O03897
44132B448503l692J09599j104733l011440k570307O45286L043742J954587q22507
44123F89038k072764j350710j89153Q17249J939491K713204K401764J234762n0388
44114F132493r07053n96556J143474K429231P70535k601195l056961Q17859M236694
44105H368521K736169j442357l247538k307848j859590k252711j001628J488805
$$ plain form
44097 481823 2325382 2024375 602062 430930 1030889 346575 -1201704 -1425495 -241616
44088 -241616 536708 678699 1458790 2538583 2455863 2107731 3984833 7523448 9060235
44079 9060235 7387209 5502671 5249629 4099004 -120508 -4609566 -5200925 -2453394
44071 -2453394 -623619 -1755024 -3990022 -5032100 -4271839 -1811135 1750082 4448513
44063 4448513 4452765 2831688 2637101 4781745 6922277 7065985 6237225 6451575 7595774
44054 7595774 7672774 5374838 1447733 -2103337 -3675489 -3238986 -1931200 -293769 2352912
44045 2352912 5955172 8299185 7457327 5046069 4630173 6886625 8928370 8849543 8077565
44036 8077565 8086567 7706628 5783029 4137305 5183297 8052409 9705306 9006519 7375183
$$ packed form
44097D81823J843559l01007j422313j71132N99959o84314j548279k23791J183879
44088b41616P78324J41991P80091J079793q2720l48132J877102L538615J536787
44079I060235j673026j884538k53042j150625m219512m489058n91359K747531
44071b453394J829775j131405k234998j042078P60261K460704L561217K698431
44063D448513M252j621077j94587K144644K140532J43708q28760K14350J144199
44054G595774P7000k297936l927105l551070j572152M36503J307786J637431K646681
44045B352912L602260K344013q41858k411258m15896K256452K041745p8827p71978
44036H077565R002l79939j923599j645724J045992K869112J652897o98787j631336
$$ plain form
44027 7375183 6121073 5370501 5093525 5127750 4678983 3636154 3505030 4925063 5456135
44018 5456135 2764078 -855212 -780909 3115346 5814204 4188770 969179 -8630 901381
44009 901381 1132754 537598 1005465 2951981 4943841 6065582 6500599 6356685 5740496
44000 5740496 5506214 6395354 7835152 8663620 8378217 6896819 4324878 1919509 1640270
43991 1640270 3341522 4133191 2272678 -76372 -50164 1790933 3134676 3949928 5576884
43982 5576884 7102806 6475656 4693244 4933302 7430998 9166438 9160671 9930274 12469413
43973 12469413 14040266 13109138 12499292 14573815 16724458 15519089 12627135 11974415
43965 11974415 12634708 9829698 3043230 -1910344 -476399 5053200 9798187 12712501
$$ packed form
44027G375183j254110p50572k76976L4225m48767j042829j31124J420033N31072
44018E456135k692057l619290P4303L896255K698858j625434l219591r77809R10011
44009I01381K31373n95156M67867J946516J991860J121741M35017j43914o16189
44000E740496k34282Q89140J439798Q28468k85403j481398k571941k405369k79239
43991A640270J701252P91669j860513k349050K6208J841097J343743Q15252J626956
43982E576884J525922o27150j782412K40058K497696J735440n767P69603K539139
43973A2469413J570853r31128o09846K074523K150643j205369k891954o52720
43965A1974415O60293k805010o786468m953574J433945N529599M744987K914314
$$ plain form
43957 12712501 15661035 18581333 19465577 18284103 17255225 16966006 15390159 11704951
43949 11704951 8332934 7580153 8400684 8523800 8176537 9274276 11822193 13709347 13989728
43940 13989728 14045758 15025088 15982085 15290335 12641575 9210685 6862392 7086527 9331156
43931 9331156 10701110 9178010 6793710 7114114 9737249 10614304 8409668 6629744
43923 6629744 7700116 8894361 7128847 4383761 4437003 6710983 7690053 6768986 6203251
43914 6203251 6241025 4940015 2689562 2497757 5147844 7842445 8527162 8330808 8945186
43905 8945186 10536500 12822964 15312806 16147171 13928593 11093836 11894673 16238101
43897 16238101 19215721 17986238 15514972 15793782 18648834 21263653 22023206 20909238
$$ packed form
43957A2712501K948534K920298Q84244j181474j028878k89219j575847l685208
43949A1704951l372017p52781Q20531J23116l47263J097739K547917J887154K80381
43940A3989728N6030R79330R56997o91750k648760l430890k348293K24135K244629
43931I331156J369954j523100k384300L20404K623135Q77055k204636j779924
43923F629744J070372J194245j765514k745086N3242K273980R79070r21067n65735
43914F203251L7774j301010k250453j91805K650087K694601O84717j96354O14378
43905H945186J591314K286464K489842Q34365k218578k834757Q00837M343428
43897A6238101K977620j229483k471266K78810K855052K614819P59553j113968
$$ plain form
43889 20909238 18536664 16506463 16558257 18235146 19659847 21002754 23924493 27223712
43881 27223712 27454107 25055448 24882279 28465646 30985601 29225611 27419770 30694383
43873 30694383 37086858 41362996 43285615 46400565 51178126 55234269 58827794 64623931
43865 64623931 72877197 81759284 91640209 104325683 118813376 132493653 145977711
43858 145977711 162198028 181303665 200952878 220921877 242488727 263625428 279807689
43851 279807689 289466579 293693071 290920459 277778588 255829356 231587684 208526137
43844 208526137 184629621 159444273 137591849 122447439 111387236 100444053 89287355
43837 89287355 78631776 67287528 55509239 47283208 45071351 45296625 42983492 38167175
$$ packed form
43889B0909238k372574k030201N1794J676889J424701J342907K921739L299219
43881B7223712K30395k398659j73169L583367K519955j759990j805841L274613
43873C0694383O392475M276138J922619L114950M777561M056143L593525N796137
43865F4623931Q253266Q882087R880925J2685474J4487693J3680277J3484058
43858A45977711J6220317J9105637J9649213J9968999K1566850K1136701J6182261
43851B79807689R658890M226492k772612j3141871k1949232k4241672k3061547
43844B08526137k3896516k5185348k1852424j5144410j1060203j0943183j1156698
43837H9287355j0655579j1344248j1778289q226031k211857K25274k313133m816317
$$ plain form
43829 38167175 33772366 29785399 24221387 18362544 16279879 19148637 23554045 25723560
43821 25723560 24817218 21920701 18233431 14904473 13072070 13173571 14415681 14970638
43813 14970638 13177261 9556190 7091232 7730091 9143972 7611358 3901321 2786831
43805 2786831 6109780 10185257 11530448 11293667 11849157 12770986 13073179 14056717 16441086
43796 16441086 17395795 14180742 8786986 5480252 5369039 6605509 8221984 10257701
43788 10257701 11418013 10182039 7559647 5822005 5242690 4643923 4050819 4121027 4122053
43779 4122053 3264712 2908662 4612617 7060702 7712184 6444597 4904714 3591552 2460867
43770 2460867 2919459 5896706 9176751 10062377 9570209 10513670 12595203 13188411 12006577
$$ packed form
43829C8167175m394809l986967n564012n858843k082665K868758M405408K169515
43821B5723560r06342k896517l687270l328958j832403J01501J242110N54957
43813A4970638j793377l621071k464958O38859J413881j532614l710037j114490
43805B786831L322949M075477J345191k36781N55490R21829L02193R83538K384369
43796A6441086R54709l215053n393756l306734j11213J236470J616475K035717
43788A0257701J160312j235974k622392j737642n79315n98767n93104P0208J026
43779D122053q57341l56050J703955K448085O51482j267587j539883j313162j130685
43770B460867M58592K977247L280045Q85626m92168R43461K081533N93208j181834
$$ plain form
43761 12006577 10986594 10293061 8608407 6849037 7219738 8814767 8672207 7247179
43753 7247179 8078380 11450853 13287845 11689661 9993732 11358810 14268713 15692329
43745 15692329 15459595 15293222 16146251 18303441 21692285 24684718 25083634 23502728 23215558
43736 23215558 25719830 29324197 32952038 37831473 43999558 48758081 50748516 52574721
43728 52574721 57330460 65236950 75381698 87591415 100557768 111479954 120186399
43721 120186399 130499049 144453626 157768779 164203935 162302283 154981687 144781491
43714 144781491 132845243 120713272 109463261 97971153 84954389 71933758 61670205
43707 61670205 54569678 48924260 43700494 38862908 33949732 28516516 23244277 19035241
$$ packed form
43761A2006577j019983o93533j684654j759370L70701J595029j42560j425028
43753G247179Q31201L372473J836992j598184j695929J365078K909903J423616
43745A5692329k32734j66373Q53029K157190L388844K992433L98916j580906k87170
43736B3215558K504272L604367L627841M879435O168085M758523J990435J826205
43728E2574721M755739P906490J0144748J2209717J2966353J0922186Q706445
43721A20186399J0312650J3954577J3315153O435156j901652p320596j0200196
43714A44781491j1936248j2131971j1250011j1492108j3016764j3020631j0263553
43707F1670205p100527n645418n223766m837586m913176n433216n272239m209036
$$ plain form
43699 19035241 16115520 15097985 16781872 19352245 18532615 12938785 6679641 3907548
43691 3907548 3556617 2745840 2332378 4549898 7477618 7246878 4696128 4516058 7903834
43682 7903834 10977749 10852222 8720629 6290554 3609568 1437736 1557879 3375955
43674 3375955 4049246 3298693 4126472 7094999 8030830 4041512 -1611891 -3721326 -1686250
43665 -1686250 1081377 2268202 2159523 1343366 -252245 -2419052 -4557201 -6107616
43657 -6107616 -6210608 -4118416 -880808 1005556 849980 868535 2503062 3596422 1450318
43648 1450318 -2819664 -5610162 -5732746 -5400311 -6378227 -7409785 -6130138 -2206795 2132218
43639 2132218 4270312 3743943 2612050 2806602 3345312 1637977 -2155227 -4218318 -1949673
$$ packed form
43699A9035241k919721j017535J683887K570373q19630n593830o259144k772093
43691C907548l50931q10777m13462K217520K927720k30740k550750j80070L387776
43682G903834L073915j25527k131593k430075k680986k171832J20143J818076
43674C375955O73291p50553Q27779K968527R35831l989318n653403k109435K035076
43665a686250K767627J186825j08679q16157j595611k166807k138149j550415
43657f107616j02992K092192L237608J886364j55576J8555J634527J093360k146104
43648A450318m269982k790498j22584L32435r77916j031558J279647L923343M339013
43639B132218K138094n26369j131893J94552N38710j707335l793204k063091K268645
$$ plain form
43630 -1949673 2127201 3522445 1663927 101384 1292866 3763564 4835879 4060721
43622 4060721 3009987 3011985 3983635 4742466 3965665 1466206 -1215372 -2091608 -723454
43613 -723454 1598441 3477560 4406934 4389423 3738619 3306868 3672724 3859882 2232326
43604 2232326 -728044 -1897248 1087408 6729072 11121280 11925924 9862366 6948560
43596 6948560 4836175 4665045 6686703 9313608 9827954 7005827 2385431 -1583907
43588 -1583907 -3771243 -4258449 -3361755 -1939469 -1537523 -2594247 -3241694 -1707985 586326
43579 586326 453674 -2544837 -5179430 -4630940 -1561580 1494611 2896088 2268379 43093
43570 43093 -2305765 -3212056 -3093297 -3718663 -4888910 -4284221 -1693159 -166517 -858247
$$ packed form
43630a949673M076874J395244j858518j562543J191482K470698J072315p75158
43622D060721j050734J998R71650P58831p76801k499459k681578q76236J368154
43613g23454K321895J879119R29374j7511o50804m31751L65856J87158j627556
43604B232326k960370j169204K984656N641664M392208Q04644k063558k913806
43596F948560k112385j71130K021658K626905N14346k822127m620396l969338
43588a583907k187336m87206Q96694J422286M01946j056724o47447J533709K294311
43579E86326j32652k998511k634593N48490L069360L056191J401477o27709k225286
43570D3093k348858r06291J18759o25366j170247O04689K591062J526642o91730
$$ plain form
43561 -858247 -197168 4338286 8703697 7365983 2021440 -322794 2416454 4773826
43553 4773826 2438935 -1669556 -2514099 -59171 1847354 1057379 -1315602 -3208620
43545 -3208620 -3148013 -695009 2947699 5792710 7403374 8885669 10132796 9501371 7072313
43536 7072313 5321243 5053659 3718441 -51164 -3099320 -1794549 2837563 6927309
43528 6927309 8732286 8894534 7809457 6198039 6545987 9948277 12574557 9549717
43520 9549717 2066166 -3628184 -4639505 -4401027 -5942060 -6545092 -2101058 5993398
43512 5993398 11801028 11740561 7788495 4014898 2164658 1222267 -100113 -1510588 -1514264
43503 -1514264 899735 4971742 8260268 8034184 3370510 -3291438 -7197277 -5402100
$$ packed form
43561h58247O61079M535454M365411j337714n344543k344234K739248K357372
43553D773826k334891m108491q44543K454928J906525p89975k372981j893018
43545c208620O0607K453004L642708K845011J610664J482295J247127o31425k429058
43536G072313j751070k67584j335218l769605l048156J304771M632112M089746
43528F927309J804977J62248j085077j611418L47948L402290K626280l024840
43520I549717p483551n694350j011321K38478j541033o03032M444034Q094456
43512E993398N807630o0467l952066l773597j850240r42391j322380j410475l676
43503a514264K413999M072007L288526k26084m663674o661948l905839J795177
$$ plain form
43495 -5402100 -182111 2956313 1096646 -3593590 -7489888 -9563440 -10682387 -11007664
43487 -11007664 -10199854 -8933933 -8116903 -7442713 -6500019 -6314098 -7836144 -9806197 -10156738
43478 -10156738 -8734446 -6628529 -3840775 -120211 2685894 2047405 -1505939 -4548217
43470 -4548217 -4759173 -2662246 286098 2822973 3315461 960983 -2114689 -2660978 -734536
43461 -734536 271988 -1281438 -2769298 -996251 3718817 8293240 10081672 8607281
43453 8607281 5681809 4210954 5256601 6279615 4267077 304389 -1627788 -285854
43445 -285854 1641813 2249348 2626841 3416558 3052174 1213623 444435 2075476 3798139
43436 3798139 3723361 3585363 5030313 5947252 4102955 1662902 1883476 3362659 2217026
$$ packed form
43495e402100N219989L138424j859667m690236l896298k073552j118947l25277
43487a1007664Q07810J265921Q17030O74190R42694J85921j522046j970053l50541
43478a0156738J422292K105917K787754L720564K806105o38489l553344l042278
43470d548217k10956K096927K948344K536875M92488k354478l075672n46289J926442
43461g34536J006524j553426j487860J773047M715068M574423J788432j474391
43453H607281k925472j470855J045647J023014k012538l962688j932177J341934
43445b85854J927667O07535L77493P89717l64384j838551p69188J631041J722663
43436C798139p4778j37998J444950R16939j844297k440053K20574J479183j145633
$$ plain form
43427 2217026 -1151538 -2231894 692362 4137889 4661833 2822914 715882 -1303038
43419 -1303038 -3682047 -5641004 -5913203 -4508611 -2672941 -1716174 -2185731 -3381174 -3648646
43410 -3648646 -2100653 28678 701557 -454356 -1957409 -2363835 -1257058 1158858
43402 1158858 4105682 6113623 6063727 4220106 1497451 -1558919 -4133231 -4697907 -2863242
43393 -2863242 -742002 -538883 -1361831 -387074 3149704 7029673 8949026 8575649 6799278
43384 6799278 4606953 2812975 1633045 572799 -406757 -347710 989686 2025003 1496773
43375 1496773 391970 -163908 -1406874 -4676716 -7927131 -7774437 -4498786 -1730924
43367 -1730924 -1297799 -1609917 -1254855 -843602 -780059 -394646 -17081 -848167 -1997514
$$ packed form
43427B217026l368564j080356K924256L445527N23944j838919k107032k018920
43419a303038k379009j958957k72199J404592J835670R56767m69557j195443k67472
43410c648646J547993K129331O72879j155913j503053m06426J106777K415916
43402A158858K946824K007941m9896j843621k722655l056370k574312n64676J834665
43393b863242K121240K03119q22948R74757L536778L879969J919353l73377j776371
43384F799278k192325j793978j179930j060246r79556N9047J337396J035317n28230
43375A496773j104803n55878j242966l269842l250415J52694L275651K767862
43367a730924M33125l12118L55062M11253O3543L85413L77565q31086j149347
$$ plain form
43358 -1997514 -812203 2811855 5572035 5419147 3955498 2850670 1286105 -1044855
43350 -1044855 -1704915 967077 4639557 6068865 5314570 4237192 2849977 204930
43342 204930 -2615088 -3550144 -2814413 -2426762 -3112941 -3995668 -4670750 -5267625 -5027762
43333 -5027762 -3140520 -648916 589357 535720 553523 679920 -502952 -3152856 -5249605
43324 -5249605 -4873178 -2153491 1252865 3677736 4606324 5301975 7849348 12402635 15802936
43315 15802936 14315583 7722331 -273634 -5544515 -6705606 -5364685 -4256451 -4811092
43307 -4811092 -5803328 -4817077 -1479103 1714179 2396212 884242 -1121250 -2851077 -4170877
43298 -4170877 -4502429 -3775802 -3215098 -3386935 -2700602 133660 3308123 3915311 1944219
$$ packed form
43358a997514J185311L624058K760180j52888j463649j104828j564565k330960
43350a044855o60060K671992L672480J429308p54295j077378j387215k645047
43342B04930k820018r35056P35731L87651o86179q82727o75082n96875K39863
43333e027762J887242K491604J238273n3637J7803J26397j182872k649904k096749
43324e249605L76427K719687L406356K424871R28588O95651K547373M553287L400301
43315A5802936j487353o593252p995965n270881j161091J340921J108234n54641
43307d811092r92236R86251L337974L193282O82033j511970k005492j729827j319800
43298d170877l31552P26627N60704j71837O86333K834262L174463O07188j971092
$$ plain form
43289 1944219 -92845 -966228 -1735962 -3193392 -4622207 -5229036 -4957654 -3911435 -2564579
43280 -2564579 -2148392 -3116078 -3845731 -2773249 -972867 -332182 -138147 1537310 3657715
43271 3657715 2977318 -774366 -3879604 -3600089 -1087610 1542430 3849065 5439495
43263 5439495 4857094 2163500 172722 866993 2394254 1685853 -1417081 -4529629 -5977536
43254 -5977536 -6004217 -5736936 -6296668 -7964609 -9272094 -8174381 -4939381 -2225060 -1378762
43245 -1378762 -681097 1486388 4001264 5307674 6116521 7455144 7965317 5942281 2648450
43236 2648450 665584 -49942 -1500241 -3776578 -5025162 -5036606 -5632261 -7072783 -7102581
43227 -7102581 -4550875 -1387688 16861 -283527 -802817 -653896 415271 2231315 3322663
$$ packed form
43289A944219k037064q73383p69734j457430j428815o06829K71382J046219J346856
43280b564579M16187r67686p29653J072482J800382O40685J94035J675457K120405
43271C657715o80397l751684l105238K79515K512479K630040K306635J590430
43263E439495n82401k693594j990778O94271J527261p08401l102934l112548j447907
43254e977536k6681K67281n59732j667941j307485J097713L235000K714321Q46298
43245a378762O97665K167485K514876J306410Q08847J338623N10173k023036l293831
43236B648450j982866p15526j450299k276337j248584j1444n95655j440522k9798
43227g102581K551706L163187J404549l00388n19290J48921J069167J816044J091348
$$ plain form
43218 3322663 1618429 -2590069 -5992556 -6140478 -4519640 -3956314 -4379319 -3553734 -1177144
43209 -1177144 492626 60117 -1509268 -3187768 -5132159 -6777192 -6337587 -3929752
43201 -3929752 -2858734 -5273319 -8228274 -7194003 -2648382 274868 -1171761 -4089608
43193 -4089608 -4716336 -3327929 -2607102 -3677205 -5830062 -8069652 -8781516 -6005388 -650557
43184 -650557 2532334 413428 -3562861 -3550451 486580 2872256 559838 -2868341 -2743722
43175 -2743722 735764 3937246 4462152 2510850 -313487 -1873190 -850492 1463147
43167 1463147 2272688 921181 -569134 -1187153 -2421803 -4881738 -6431603 -5637062 -4298049
43158 -4298049 -4163093 -3696544 -1051978 1852205 1625140 -1472012 -3886246 -3556132 -1536855
$$ packed form
43218C322663j704234m208498l402487j47922J620838N63326m23005Q25585K376590
43209a177144J669770m32509j569385j678500j944391j645033M39605K407835
43201c929752J071018k414585k954955J034271M545621K923250j446629k917847
43193d089608o26728J388407P20827j070103k152857k239590p11864K776128N354831
43184f50557L182891k118906l976289J2410M037031K385676k312418l428179J24619
43175b743722L479486L201482N24906j951302k824337j559703J022698K313639
43167A463147Q09541j351507j490315o18019j234650k459935j549865P94541J339013
43158d298049J34956M66549K644566K904183k27065l097152k414234L30114K019277
$$ plain form
43149 -1536855 602828 2342877 3388914 3510519 3066776 2137593 -36283 -3064253 -4236209
43140 -4236209 -1707587 2315758 4178015 3487866 2436261 1577961 -181631 -1974296
43132 -1974296 -1278115 1771363 3941179 3624605 2820170 3326311 3965358 3058401 1115433
43123 1115433 -533834 -1682489 -2305538 -1544484 812171 3258698 4236941 3651800 1963751
43114 1963751 -590773 -2922332 -2996376 -225743 3256355 4877951 4158963 2190937 6626
43105 6626 -1407462 -773976 2233192 5860264 7477103 5922229 2448039 -374112 -898309
43096 -898309 -112187 -544967 -2705883 -3857815 -1981014 554846 144137 -2250149 -2271913
43087 -2271913 905831 3181650 2155554 725152 1672909 2626574 -33731 -5071114
$$ packed form
43149a536855K139683J740049J046037J21605m43743r29183k173876l027970j171956
43140d236209K528622M023345J862257o90149j051605q58300j759592j792665
43132a974296O96181L049478K169816l16574q04435N06141O39047r06957j942968
43123A115433j649267j148655o23049P61054K356655K446527R78243n85141j688049
43114A963751k554524k331559p4044K770633L482098J621596p18988j968026k184311
43105F626j414088O33486L007168L627072J616839j554874l474190k822151n24197
43096h98309P86122m32780k160916j151932J876801K535860m10709k394286k1764
43087b271913L177744K275819j026096j430402R47757R53665k660305n037383
$$ plain form
43079 -5071114 -8156787 -8001646 -6826378 -5664562 -3120118 1002403 4079052 3716348
43071 3716348 555984 -2647651 -3613012 -2164442 -362954 -733425 -3319038 -5076344
43063 -5076344 -3369134 712787 3924378 4913303 4962008 5302385 5658881 5394369 4468054
43054 4468054 3172212 2174426 2668757 5149875 8069008 8926492 6830715 3211818 227998
43045 227998 -812315 47563 1563377 2314725 2201420 2258375 2581989 1861989 -91855
43036 -91855 -1122161 269598 2234088 2124667 589093 518564 2483598 3928312 3067739
43027 3067739 1261894 911689 2644990 5125099 6524628 5976745 4318612 3077554
43019 3077554 2227814 311184 -2196905 -1970368 2178750 5548575 2795630 -4062123
$$ packed form
43079e071114l085673J55141J175268J161816K544444M122521L076649l62704
43071C716348l160364l203635r65361J448570J801488l70471k585613j757306
43063e076344J707210M081921L211591R88925M8705L40377L56496k64512r26315
43054D468054j295842r97786M94331K481118K919133Q57484k095777l618897k983820
43045B27998j040313Q59878J515814P51348j13305N6955L23614p20000j953844
43036i1855j030306J391759J964490j09421j535574p0529J965034J444714q60573
43027C067739j805845l50205J733301K480109J399529n47883j658133j241058
43019C077554q49740j916630k508089K26537M149118L369825k752945o857753
$$ plain form
43011 -4062123 -7556014 -4949508 -1608096 -2478323 -4876732 -3299810 1751943 4280786
43003 4280786 1233781 -3501654 -4406815 -1227442 1061919 -1364083 -6149171 -7193935
42995 -7193935 -2151628 4337592 6549413 5063751 4952770 7394833 7813261 3632167
42987 3632167 -929560 -1130847 966937 65596 -3735070 -5164627 -2118266 1436760
42979 1436760 1878668 645761 412771 439974 -1075408 -2785278 -2254482 -859586 -2474217
42970 -2474217 -7199335 -10294221 -8695145 -5339441 -4687198 -6445799 -6931557 -5192893
42962 -5192893 -3917833 -4274544 -3734349 -473640 3198168 4054802 2306887 272527 -1415024
42953 -1415024 -3380916 -4666860 -3656845 -1349898 -480931 -1350957 -1662882 -869694 -1358541
$$ packed form
43011d062123l493891K606506L341412q70227k398409J576922N051753K528843
43003D280786l047005m735435r05161L179373K289361k426002m785088j044764
42995g193935N042307O489220K211821j485662j10981K442063M18428m181094
42987C632167m561727k01287K097784r01341l800666j429557L046361L555026
42979A436760M41908j232907k32990K7203j515382j709870N30796J394896j614631
42970b474217m725118l094886J599076L355704O52243j758601m85758J738664
42962e192893J275060l56711N40195L260709L671808Q56634j747915k034360j687551
42953a415024j965892j285944J010015K306947Q68967q70026l11925P93188m88847
$$ plain form
42944 -1358541 -4164204 -6589842 -5978635 -3469353 -1918977 -1986574 -2508961 -3311261 -5146838
42935 -5146838 -7376208 -7793205 -4983063 56107 4415029 4997141 743956 -6055989
42927 -6055989 -11548223 -13961648 -14378546 -13698657 -11110392 -6761404 -3439061 -3207512 -4119649
42918 -4119649 -2989935 -156446 1579106 1971553 3698352 7333808 9409113 7137765
42910 7137765 2648000 301312 1055362 1682439 -617600 -4610125 -6710711 -5395345
42902 -5395345 -2894466 -2398900 -4437825 -6782308 -7382144 -6146079 -3982035 -1709108
42894 -1709108 -254664 -139826 -60456 2000616 5074846 4982811 -42784 -5635783 -6256129
42885 -6256129 -2394553 843145 1568203 3084496 7321454 10715157 9150402 3982762
$$ packed form
42944a358541k805663k425638O11207K509282J550376o7597n22387q02300j835577
42935e146838k229370m16997K810142N039170M358922N82112m253185o799945
42927f055989n492234k413425m16898O79889K588265M348988L322343K31549r12137
42918d119649J129714K833489J735552L92447J726799L635456K075305k271348
42910G137765m489765k346688P54050O27077k300039l992525k100586J315366
42902e395345K500879M95566k038925k344483n99836J236065K164044K272927
42894a709108J454444J14838P9370K061072L074230r2035n025595n592999o20346
42885f256129L861576L237698P25058J516293M236958L393703j564755n167640
$$ plain form
42877 3982762 59010 -546868 125781 -46967 -723616 -612262 677924 2823182 5242607
42868 5242607 6676776 5474079 1315535 -3729644 -6726052 -6647867 -5171211 -4306771 -3705349
42859 -3705349 -1400606 2704533 5800096 5843404 4736599 5582584 7663478 7182173 3171228
42850 3171228 -621616 -1064175 106055 -483420 -2811286 -4498260 -5069993 -5847087 -6524758
42841 -6524758 -5390932 -2877895 -1506535 -1743238 -1152750 1245267 2980128 2295878 1313575
42832 1313575 2284047 3023343 -269520 -6643802 -10593407 -8926821 -4324783 -1092492
42824 -1092492 59 1045775 3050926 4677980 4332128 2148972 -48773 -374984
42816 -374984 1203285 2657078 2345021 1192567 959081 961239 -816506 -3263442 -2416252
$$ packed form
42877C982762l923752o05878O72649j72748o76649J11354J290186K145258K419425
42868E242607J434169j202697m158544n045179k996408P8185J476656Q64440O01422
42859c705349K304743M105139L095563M3308j106805Q45985K080894m81305m010945
42850C171228l792844m42559J170230n89475k327866j686974n71733p77094o77671
42841f524758J133826K513037J371360k36703N90488K398017J734861o84250r82303
42832A313575R70472P39296l292863o374282l949605J666586M602038L232291
42824a092492J092551J045716K005151J627054l45852k183156k197745l26211
42816c74984J578269J453793l12057j152454k33486K158j777745k446936Q47190
$$ plain form
42807 -2416252 2244401 5451852 3142170 -1281787 -1810591 1229807 2128370 -1228753
42799 -1228753 -4781199 -5232540 -4302087 -4299435 -4169114 -2616953 -1265883 -1574500 -1830628
42790 -1830628 -492463 340186 -1593218 -4198079 -3951776 -1469507 49900 590395 2982619
42781 2982619 7219836 9537330 7668828 3331619 -1079324 -4698172 -6321228 -4067122
42773 -4067122 1360824 5915385 6622886 4822726 3646060 4135359 5098807 5103131 3508777
42764 3508777 979343 -464666 402788 1673149 552468 -1817447 -1105568 3580436
42756 3580436 7531589 7088584 4908938 5310235 7285329 6485046 2551548 -203641 654525
42747 654525 2634699 2746534 1553934 1122600 1342277 370522 -2383702 -5343000 -6484699
$$ packed form
42807b416252M660653L207451k309682m423957n28804L040398Q98563l357123
42799a228753l552446m51341R30453K652J30321J552161J351070l08617k56128
42790a830628J338165Q32649j933404k604861K46303K482269J519407N40495K392224
42781B982619M237217K317494j868502m337209m410943l618848j623056K254106
42773d067122N427946M554561P07501j800160j176666M89299R63448M324j594354
42764C508777k529434j444009Q67454J270361j120681k369915P11879M686004
42756C580436L951153m43005k179646M01297J975094q00283l933498k755189Q58166
42747F54525J980174J11835j192600m31334K19677r71755k754224k959298j141699
$$ plain form
42738 -6484699 -5128105 -2219190 727847 3047048 5245693 7805732 10170886 11363439
42730 11363439 10938591 8706458 4468431 -877070 -4973360 -6425800 -6932448 -9001160
42722 -9001160 -11800347 -11592829 -6743653 -106919 4562234 6642812 7693089 8201004
42714 8201004 7470657 5949866 5267972 5590204 4723869 807896 -5076000 -9855692 -11493751
42705 -11493751 -10405057 -8400042 -7070785 -6961553 -7404716 -7035551 -5093979 -2318277
42697 -2318277 -55287 1326424 2302184 2711048 1846906 282736 -151637 850521 1078198
42688 1078198 -808648 -2471759 -807260 3283646 5686926 4340987 1115366 -1542900
42680 -1542900 -3031140 -3215908 -1597525 949305 2130322 1373038 810075 1755872 2591054
$$ packed form
42738f484699J356594K908915K947037K319201K198645K560039K365154J192553
42730A1363439m24848k232133m238027n345501m096290j452440n06648k068712
42722i001160k799187K07518M849176O636734M669153K080578J050277N07915
42714H201004p30347j520791o81894L22232q66335l915973n883896m779692j638059
42705a1493751J088694K005015J329257J09232m43163L69165J941572K775702
42697b318277K262990J381711R75760M08864q64142j564170m34373J002158K27677
42688A078198j886846j663111J664499M090906K403280j345939l225621k658266
42680a542900j488240j84768J618383K546830J181017p57284n62963R45797Q35182
$$ plain form
42671 2591054 1854052 909055 1183477 1049431 -1517850 -4818912 -5337179 -3000930 -1385278
42662 -1385278 -2805200 -5841795 -7734554 -6964253 -3649068 315054 1689797 -1081581
42654 -1081581 -5214909 -6265562 -3574417 -737967 -569476 -2169446 -3459268 -4002862
42646 -4002862 -4317623 -4536520 -4801947 -5241624 -4890464 -2599429 364032 988942 -1115013
42637 -1115013 -2440295 -382135 2731508 2614687 -1298585 -5429260 -6715341 -5660499
42629 -5660499 -4630673 -4590525 -4240866 -2102543 1012538 2360709 631517 -1982491 -2392238
42620 -2392238 -384922 2179061 5033031 9310693 13810432 15163132 12771444 9990634
42612 9990634 8719458 6592688 2210279 -642456 1780609 6405790 6883203 2791318
$$ packed form
42671B591054p37002r44997K74422j34046k567281l301062n18267K336249J615652
42662a385278j419922l036595j892759P70301L315185L964122J374743k771378
42654a081581m133328j050653K691145K836450J68491j599970j289822n43594
42646d002862l14761k18897k65427m39677L51160K291035K963461O24910k103955
42637a115013j325282K058160L113643j16821l913272m130675j286081J054842
42629e660499J029826M0148L49659K138323L115081J348171j729192k614008m09747
42620b392238K007316K563983K853970M277662M499739J352700k391688k780810
42612I990634j271176k126770m382409k852735K423065M625181M77413m091885
$$ plain form
42604 2791318 115969 2295757 5700483 5629124 2749725 964791 1599549 2644525 2450124
42595 2450124 1611194 1385862 1853220 1848754 126587 -3302926 -6772263 -8231319 -6999136
42586 -6999136 -3973897 -545291 2061169 3119052 3299471 4527337 7326200 9000995
42578 9000995 6704899 2007532 -382583 1055984 2492449 241086 -4128871 -6179755
42570 -6179755 -4183590 -63428 3823939 6319178 6553961 3972942 -327286 -3819492
42562 -3819492 -4604997 -2660760 648113 3505567 4547845 3714029 1891756 -601195
42554 -601195 -4034637 -7171219 -7147865 -3281450 751058 1228381 -315907 599026 4408285
42545 4408285 6864691 5973254 5173697 7356317 9523231 7154655 1519902 -1715263
$$ packed form
42604B791318k675349K179788L404726p1359k879399j784934O34758J044976j94401
42595B450124q38930k25332M67358m466j722167l429513l469337j459056J232183
42586f999136L025239L428606K606460J057883J80419J227866K798863J674795
42578I000995k296096m697367k390115J438567J436465k251363m369957k050884
42570f179755J996165M120162L887367K495239K34783k581019m300228l492206
42562c819492p85505J944237L308873K857454J042278q33816j822273k492951
42554f01195l433442l136582K3354L866415M032508M77323j544288R14933L809259
42545D408285K456406q91437p99557K182620K166914k368576n634753l235165
$$ plain form
42537 -1715263 -343439 2114041 2268057 1068656 756106 881179 -278874 -2406433 -3730430
42528 -3730430 -3773589 -3312934 -2399868 -670701 702672 -279427 -3333442 -5407931 -4235040
42519 -4235040 -1039866 1262417 1514830 842877 512686 673806 1116496 1998230 3310940
42510 3310940 4354625 4429629 3836035 3538529 3628399 2653035 -726684 -5312526 -7594795
42501 -7594795 -5409237 -950578 1232730 -551057 -3395425 -4043999 -3330292 -4524525
42493 -4524525 -7998347 -10019928 -7528634 -2167536 1824377 2513975 1467620 790536
42485 790536 867770 1101355 1152162 714358 -750924 -3100484 -5025896 -5344994 -4292035
42476 -4292035 -2772272 -916236 1499397 3416425 2677226 -1503377 -6944682 -10119434
$$ packed form
42537a715263J371824K457480J54016j199401l12550J25073j160053k127559j323997
42528c730430m3159M60655R13066J729167J373373r82099l054015k074489J172891
42519d235040L195174K302283K52413o71953l30191J61120M42690Q81734J312710
42510C310940J043685P5004n93594k97506Q9870r75364l379719m585842k282269
42501g594795K185558M458659K183308j783787k844368o48574P13707j194233
42493d524525l473822k021581K491294N361098L991913O89598j046355o77084
42485G90536P7234K33585N0807m37804j465282k349560j925412l19098J052959
42476d292035J519763J856036K415633J917028p39199m180603n441305l174752
$$ plain form
42468 -10119434 -9286957 -5776481 -2398650 -877568 -695376 -109252 1887720 4628708
42460 4628708 6577592 6656152 4709045 1347164 -2035238 -3609925 -2537578 -14796
42452 -14796 2015993 3132516 4217699 4953137 3422991 -654952 -3966009 -2983462 1347703
42443 1347703 4574202 4412094 3100683 3298427 4089074 3190732 1506060 2303687 5815287
42434 5815287 7764394 4929873 37451 -1400188 1826043 5389344 5277593 2155795
42426 2155795 -1021371 -3171392 -4892695 -5943591 -5450871 -3791531 -1968415 240607
42418 240607 3115224 4632417 2379794 -2094137 -4244274 -2749925 -1373451 -2978885
42410 -2978885 -5126210 -4298068 -1565420 -472818 -1302197 -1385262 552 1030750 1209843
$$ packed form
42468a0119434Q32477L510476L377831J521082J82192N86124J996972K740988
42460D628708J948884P8560j947107l361881l382402j574687J072347K522782
42452a4796K030789J116523J085183P35438j530146m077943l311057R82547M331165
42443A347703L226499j62108j311411J97744P90647q98342j684672P97627L511600
42434E815287J949107k834521m892422j437639L226231L563301j11751l121798
42426B155795l177166k150021j721303j050896M92720J659340J823116K209022
42418B40607K874617J517193k252623m473931k150137J494349J376474j605434
42410b978885k147325Q28142K732648J092602q29379q3065J385814J030198J79093
$$ plain form
42401 1209843 2005361 3506852 4128753 4055892 5236988 7097378 6210675 1977808 -1085686
42392 -1085686 550840 3874273 3036035 -3087168 -9910168 -12630655 -10270395 -5127766
42384 -5127766 -507212 1452043 1422340 1935332 3779682 4718575 3184914 1300312 1830006
42375 1830006 3823855 4431900 3946752 5219764 8054867 8165335 3179570 -3396319 -6378448
42366 -6378448 -5037531 -2771030 -1978923 -1798269 -742037 682009 1004797 323622 401757
42357 401757 2140999 4004515 3860509 1938578 612911 1056571 1671932 840391 -130833
42348 -130833 1402455 5357592 8247992 6934119 1987288 -3032309 -4959330 -3467790
42340 -3467790 -691785 1159845 1565270 958627 -853983 -4007003 -6600597 -5855555 -2157308
$$ packed form
42401A209843P95518J501491O21901p2861J181096J860390q86703m232867l063494
42392a085686J636526L323433q38238o123203o823000k720487K360260N142629
42384e127766M620554J959255k9703N12992J844350R38893j533661j884602N29694
42375A830006J993849O08045m85148J273012K835103J10468m985765o575889k982129
42366f378448J340917K266501P92107J80654J056232J424046L22788o81175P8135
42357D01757J739242J863516j44006j921931j325667M43660O15361q31541r71224
42348a30833J533288L955137K890400j313873m946831n019597j927021J491540
42340c467790K776005J851630M05425o06643j812610l153020k593594P45042L698247
$$ plain form
42331 -2157308 391293 -944435 -4050274 -5563374 -5663103 -6420038 -7359378 -6415430 -4212994
42322 -4212994 -3404039 -4096906 -3895244 -2491339 -2052995 -2541313 -1098742 2628260 5053468
42313 5053468 4585507 4553964 7212060 8990027 5903076 444005 -1889135 -912833 -1278888
42304 -1278888 -4397066 -6165069 -3570986 930063 3347804 3036002 1680259 134443
42296 134443 -1470397 -2302921 -1730857 -610744 34353 767402 2548161 4419112 4149422
42287 4149422 1312239 -1595950 -1705272 1109462 4106610 4470216 1918564 -1399534
42279 -1399534 -3174092 -2747610 -984342 846157 1821511 1757386 1411392 1853236 3187726
42270 3187726 4347655 4473164 3815747 2853067 1413965 -579576 -2380066 -3374217 -4010622
$$ packed form
42331b157308K548601j335728l105839j513100r9729p56935r39340R43948K202436
42322d212994Q08955o92867K01662J403905M38344m88318J442571L727002K425208
42313E053468m67961l1543K658096J777967l086951n459071k333140R76302l66055
42304a278888l118178j768003K594083M501049K417741l11802j355743j545816
42296A34443j604840q32524N72064J120113O45097P33049J780759J870951k69690
42287D149422k837183k908189j09322K814734K997148L63606k551652l318098
42279a399534j774558M26482J763268J830499R75354o4125l45994M41844J334490
42270C187726J159929J25509o57417r62680j439102j993541j800490r94151o36405
$$ plain form
42261 -4010622 -4804084 -5291017 -5120909 -5159637 -5944378 -6037760 -4022708 -1461113 -1268385
42252 -1268385 -3181402 -3676991 -1157611 1499168 1082248 -1515319 -3024858 -2338181 -1064261
42243 -1064261 -602756 -1012703 -2359991 -4916468 -7812980 -9301018 -8794378 -7338566 -5879724
42234 -5879724 -4491690 -3489907 -3529623 -3907280 -2576551 768208 3037008 1096518 -3835733
42225 -3835733 -7086296 -5846303 -1935822 1040273 1625198 773293 -371909 -1482392
42217 -1482392 -2423221 -3036725 -3574735 -4331270 -4600066 -2763885 1982348 8027593 11776995
42208 11776995 10311338 4361285 -1552862 -3185634 -1198574 -383262 -3388806 -6900343
42200 -6900343 -6021411 -1193823 2264181 1514581 -158815 1538234 5805725 8144123
$$ packed form
42261d010622p93462m86933J70108l8728p84741r3382K015052K561595J92728
42252a268385j913017m95589K519380K656779m16920k597567j509539O86677J273920
42243a064261M61505m09947j347288k556477k896512j488038N06640J455812J458842
42234e879724J388034J001783l9716l77657J330729L344759K268800j940490m932251
42225c835733l250563J239993L910481K976095N84925q51905j145202j110483
42217a482392r40829o13504n38010p56535k68796J836181M746233O045245L749402
42208A1776995j465657n950053n914147j632772J987060Q15312l005544l511537
42200f900343Q78932M827588L458004p49600j673396J697049M267491K338398
$$ plain form
42192 8144123 6307344 2218732 -1444278 -3904513 -5151622 -4493774 -1680306 1653623
42184 1653623 3167515 2323979 803713 312276 684265 548695 -680477 -2288387 -3588394
42175 -3588394 -4660680 -5311225 -4479591 -1884415 541522 529251 -1416354 -2488909 -1332609
42166 -1332609 392510 698260 -197816 -977767 -1391091 -1986562 -2584772 -2343155 -1093675
42157 -1093675 89519 -410580 -3249831 -6527303 -6326905 -802533 6291349 8596816
42149 8596816 4413391 -1397924 -3683357 -2430676 -510404 818163 1502752 547368
42141 547368 -2258942 -4364734 -3833834 -3190347 -5926429 -10228938 -10665495 -6039471 -1136424
42132 -1136424 105787 -927253 -1194441 -390205 263033 565713 555587 -498829 -2457979
$$ packed form
42192H144123j836779m088612l663010k460235j247109O57848K813468L333929
42184A653623J513892q43536j520266m91437L71989j35570j229172j607910j300007
42175c588394j072286o50545Q31634K595176K425937j2271j945605j072555J156300
42166a332609J725119L05750q96076p79951m13324n95471n98210K41617J249480
42157a093675J183194n00099k839251l277472K00398N524372P093882K305467
42149H596816m183425n811315k285433J252681J920272J328567O84589r55384
42141E47368k806310k105792N30900O43487k736082m302509m36557M626024M903047
42132a136424J242211j033040k67188Q04236O53238L02680j0126j054416j959150
$$ plain form
42123 -2457979 -3671180 -3454095 -3043367 -2703425 -518809 3911965 7138867 5988928 2217654
42114 2217654 104012 595257 808323 -1193783 -3981069 -5295414 -4719992 -3210502 -1594706
42105 -1594706 -317524 236365 -158228 -1343577 -2758907 -3638132 -3543506 -2745538 -1716597
42096 -1716597 -563247 344648 -95243 -2052582 -3249204 -1389260 1980257 2727915 -273394
42087 -273394 -3730346 -5065187 -5758302 -7786387 -9866490 -9871288 -8372190 -6759898 -4070435
42078 -4070435 875201 5871993 7601996 6506263 5815966 6414994 6292288 4777921 3576216
42069 3576216 3291532 2412361 434771 -1139144 -1708532 -2478179 -3523971 -2940348 -238251
42060 -238251 2117040 2135003 922590 314871 145863 -324806 -332671 918042 2249391
$$ packed form
42123b457979j213201K17085M10728L39942K184616M430774L226902j149939l771274
42114B217654k113642M91245K13066k002106k787286j314345N75422J509490J615796
42105a594706J277182N53889l94593j185349j415330q79225R4626P97968J028941
42096a716597J153350R07895m39891j957339j196622J859944L369517P47658l001309
42087b73394l456952j334841o93115k028085k080103m798J499098J612292K689463
42078d070435M945636M996792J730003j095733o90297N99028j22706j514367j201705
42069C576216k84684q79171j977590j573915n69388p69647j045792N83623K702097
42060b38251K355291J7963j212413o07719j69008m70669p865J250713J331349
$$ plain form
42051 2249391 2080878 868407 73379 -274239 -1035301 -1784658 -1203673 695501 2519948
42042 2519948 3525652 4087879 4168703 2968879 562970 -1442752 -1692472 -755022 -209956
42033 -209956 -479064 -494881 350500 829693 -685401 -3764037 -6114297 -6499406 -6114297
42024 -6114297 -6240539 -6001097 -4166568 -2179065 -2901421 -6254039 -8413252 -6301010 -1282585
42015 -1282585 2658054 3299204 1749187 446465 552156 1096454 364850 -1771751 -3383025
42006 -3383025 -2964185 -1479366 -508365 619101 3382244 6256830 5676408 1543666 -1554260
41997 -1554260 -388509 2626248 3658805 3313584 4727619 7390604 7042015 1979637
41989 1979637 -3946529 -5914332 -3515224 -260893 803275 -328423 -1674916 -1820800
$$ packed form
42051B249391j68513j212471p95028l47618p61062p49357N80985J899174J824447
42042B519948J005704N62227Q0824j199824k405909k005722k49720R37450N45066
42033b09956k69108j5817Q45381M79193j515094l078636k350260l85109L85109
42024f114297j26242K39442J834529J987503p22356l352618k159213K112242N018425
42015a282585L940639O41150j550017j302722J05691N44298p31604k136601j611274
42006c383025M18840J484819R71001J127466K763143K874586n80422m132742l097926
41997a554260J165751L014757J032557l45221J414035K662985l48589n062378
41989A979637n926166j967803K399108L254331J064168j131698j346493j45884
$$ plain form
41981 -1820800 -1428706 -2368782 -5218254 -8098857 -8732402 -7223481 -5712078 -5520361 -6056627
41972 -6056627 -6664017 -7796698 -9258135 -8619486 -3537462 4167148 8738265 6426109
41964 6426109 353365 -2726239 -680144 1595007 -530048 -4477779 -4267330 290746
41956 290746 3035505 651324 -2529441 -1452332 2142435 3216571 1590231 1576518 4561064
41947 4561064 6989051 6198188 3865038 2282364 919188 -1301153 -3263040 -3623013
41939 -3623013 -3372838 -3967984 -4479842 -3241517 -1427237 -2273823 -6638300 -11455513 -13223759
41930 -13223759 -11569279 -8648535 -6155020 -4004282 -1564445 936907 2664538 3292467
41922 3292467 3189890 2609129 1481399 238604 -75769 785945 1469586 579654 -1349369
$$ packed form
41981a820800L92094r40076k849472k880603o33545J508921J511403J91717n36266
41972f056627o07390j132681j461437O38649N082024P704610M571117k312156
41964F426109o072744l079604K046095K275151k125055l947731K10449M558076
41956B90746K744759k384181l180765J077109L594767J074136j626340j3713K984546
41947D561064K427987p90863k333150j582674j363176k220341j961887l59973
41939c623013K50175n95146n11858J238325J814280q46586m364477m817213j768246
41930a3223759J654480K920744K493515K150738K439837K501352J727631O27929
41922C292467j02577n80761j127730j242795l14373Q61714O83641q89932j929023
$$ plain form
41913 -1349369 -2334014 -1120267 1768295 4566082 5117763 2236636 -2469903 -5166267
41905 -5166267 -3982921 -1715411 -2074234 -4164890 -3921607 -811992 934116 -1009068
41897 -1009068 -3183900 -1751186 1514007 2278187 539094 227944 2677474 4608668
41889 4608668 3149909 -547544 -3882640 -6233409 -8105343 -8772039 -6819387 -2439880
41881 -2439880 2127454 4369722 3359556 308921 -2530950 -4004333 -4947404 -6253561
41873 -6253561 -6601478 -3693943 2183893 7537579 9156509 6899549 2634959 -1847542
41865 -1847542 -5023643 -5585689 -3844073 -2056993 -1774790 -1685832 346896 3874480 6324428
41856 6324428 6546119 6022584 6351375 7113337 6801835 4825277 2186361 900476 2630504
$$ packed form
41913a349369r84645J213747K888562K797787N51681k881127m706539k696364
41905e166267J183346K267510l58823k090656K43283L109615J746108j943184
41897a009068k174832J432714L265193P64180j739093l11150K449530J931194
41889D608668j458759l697453l335096k350769j871934o66696J952652M379507
41881b439880M567334K242268j010166l050635k839871j473383r43071j306157
41873f253561l47917K907535N877836N353686J618930k256960m264590m482501
41865a847542l176101n62046J741616J787080K82203Q8958K032728L527584K449948
41856F324428K21691n23535L28791P61962l11502j976558k638916j285885J730028
$$ plain form
41847 2630504 6778521 10034481 9340200 5562054 2578941 2167913 1703819 -1745495 -6709615
41838 -6709615 -8778230 -6008647 -835711 3174819 4513892 3519554 1026241 -1767981
41830 -1767981 -3410149 -3421113 -2948956 -3528900 -5638426 -8759712 -11903414 -13401089 -11336490
41821 -11336490 -5712314 167373 2111810 -637184 -4471949 -5393136 -3217661 -1138125
41813 -1138125 -1610742 -3664347 -4363960 -2138360 1785186 4747892 4885580 2360176 -740001
41804 -740001 -1607371 1271830 6542664 10612668 10430863 5895284 -252588 -4479380 -4608120
41795 -4608120 -1080890 3216933 5105766 3855975 1331371 -908759 -3350796 -6357929
41787 -6357929 -7872102 -5548254 -497999 3569431 4887375 4941336 5161638 5079539 4480213
$$ packed form
41847B630504M148017L255960o94281l778146k983113m11028m64094l449314m964120
41838f709615k068615K769583N172936M010530J339073r94338k493313k794222
41830a767981j642168j0964M72157n79944k109526l121286l143702j497675K064599
41821a1336490N624176N879687J944437k748994l834765r21187K175475K079536
41813a138125m72617k053605o99613K225600L923546K962706J37688k525404l100177
41804g40001q67370K879201N270834M070004j81805m535579o147872m226792j28740
41795d608120L527230M297823J888833j249791k524604k240130k442037l007133
41787f357929j514173K323848N050255M067430J317944N3961K20302q2099n99326
$$ plain form
41778 4480213 4459800 4820617 3090228 -1663008 -6152041 -6573197 -3572428 -1079374 -1280827
41769 -1280827 -3074054 -4544216 -4620615 -3054286 -1005222 -829805 -3010221 -4349816 -1953058
41760 -1953058 1989319 2736704 -118210 -1968316 245409 4252164 6137266 4814768
41752 4814768 1834210 -555154 -280822 2871821 5681733 4549025 866601 -138197
41744 -138197 3002392 5656150 4304695 1759328 1993282 3722831 3418639 1635151 1333954
41735 1333954 1850624 -157366 -4440821 -6864697 -5645462 -3467134 -2638806 -2160099 -814557
41726 -814557 407649 668853 1137203 2543037 3061418 599439 -4102288 -8097288 -9156157
41717 -9156157 -7386586 -4848809 -3849894 -4633321 -4879220 -2742243 92954 217999 -2952459
$$ packed form
41778D480213k0413L60817j730389m753236m489033m21156L000769K493054k01453
41769a280827j793227j470162p6399J566329K049064J75417k180416j339595K396758
41760a953058L942377P47385k854914j850106K213725M006755J885102j322498
41752D814768k980558k389364K74332L152643K809912j132708l682424j004798
41744a38197L140589K653758j351455k545367K33954J729549l04192j783488l01197
41735A333954N16670k007990m283455k423876J219235K178328Q28328M78707J345542
41726h14557J222206K61204M68350J405834N18381k461979m701727l995000j058869
41717i156157J769571K537777R98915p83427k45899K136977K835197J25045l170458
$$ plain form
41708 -2952459 -6520035 -7812832 -6541950 -3472807 367498 2950525 2539903 412712
41700 412712 -231180 1304422 2484515 1867148 1217839 2208317 3801101 4236880 3083987
41691 3083987 280928 -3895359 -6739955 -4571483 1718139 6011518 4400451 44802
41683 44802 -2166261 -2291787 -2947848 -3474562 -1429171 1906630 2477106 -683713 -4604881
41674 -4604881 -6834288 -7074197 -5293546 -2238973 -990813 -3569410 -6530030 -4778400
41666 -4778400 360849 2271512 -1076820 -4111565 -2432123 904858 991838 -1769712
41658 -1769712 -4007953 -5048984 -5863300 -5215792 -1554975 2927255 4488160 3223146
41650 3223146 2460718 3337674 3567714 1533650 -1542910 -3691992 -3859463 -1546611 2606729
$$ packed form
41708b952459l567576j292797J270882L069143L840305K583027m10622k127191
41700D12712o43892J535602J180093o17367o49309R90478J592784M35779j152893
41691C083987k803059m176287k844596K168472O289622M293379j611067m355649
41683D4802k211063j25526o56061n26714K045391L335801N70476l160819l921168
41674d604881k229407k39909J780651L054573J248160k578597k960620J751630
41666d778400N139249J910663l348332l034745J679442L336981Q6980k761550
41658a769712k238241j041031q14316O47508L660817M482230J560905j265014
41650C223146p62428Q76956K30040k034064l076560k149082j67471K312852M153340
$$ plain form
41641 2606729 5866234 5648677 2999511 1481294 2400237 3556290 3038453 1695554 1129199
41632 1129199 1580971 2693948 4245354 5283932 4726268 3727881 5032095 8616038 10508880
41623 10508880 7965409 3597943 1837663 3157213 4846570 6002712 7779258 9076979
41615 9076979 6564361 475769 -3558184 -1392765 3541747 4506194 313427 -3843209
41607 -3843209 -4002521 -1946151 -1241819 -2393390 -3972555 -5752923 -7870482 -8610436 -6090523
41598 -6090523 -1432995 2302373 3795486 3719716 2209420 -810282 -3142207 -1792274
41590 -1792274 2563096 6037670 7164675 8162892 9394076 7437357 1686674 -1880738
41582 -1880738 1541211 7574534 8464904 4680126 3586208 7003675 8034397 2551125
$$ packed form
41641B606729L259505k17557k649166j518217R18943J156053n17837j342899n66355
41632A129199M51772J112977J551406J038578n57664r98387J304214L583943J892842
41623A0508880k543471m367466j760280J319550J689357J156142J776546J297721
41615I076979k512618o088592m033953K165419M934512R64447m192767m156636
41607c843209j59312K056370P04332j151571j579165j780368k117559p39954K519913
41598f090523M657528L735368J493113p5770j510296l019702k331925J349933
41590a792274M355370L474574J127005R98217J231184j956719n750683l567412
41582a880738L421949O033323Q90370l784778j093918L417467J030722n483272
$$ plain form
41574 2551125 -3519701 -3163055 986523 1100074 -3879051 -7418394 -5571722 -1684555
41566 -1684555 -51437 -205565 202763 872262 345552 -450161 461144 2208085 1526854
41557 1526854 -2668949 -7389336 -9118781 -7861678 -6405396 -6207389 -5607353 -2682165
41549 -2682165 1303749 2882270 874056 -1642581 -910781 2785725 5338571 3626729
41541 3626729 -1098183 -5000151 -5921898 -5077313 -4778498 -5392532 -5202273 -3038235 23993
41532 23993 2264885 3728347 5614997 7640454 7931594 6039042 4140171 4025927 4423804
41523 4423804 2953659 -332402 -3171562 -4191652 -4008098 -3611576 -3437519 -3937158 -5385621
41514 -5385621 -6947015 -7319258 -6460446 -5478331 -4870469 -4190283 -3348109 -2771585 -2315994
$$ packed form
41574B551125o070826L56646M149578J13551m979125l539343J846672L887167
41566a684555J633118j54128M08328O69499n26710p95713R11305J746941o81231
41557A526854m195803m720387j729445J257103J456282J98007O00036K925188
41549b682165L985914J578521k008214k516637P31800L696506K552846j711842
41541C626729m724912l901968r21747Q44585K98815o14034J90259K164038L062228
41532B3993K240892J463462J886650K025457K91140j892552j898871j14244L97877
41523D423804j470145l286061k839160j020090J83554L96522J74057m99639j448463
41514e385621j561394l72243Q58812R82115O07862O80186Q42174N76524M55591
$$ plain form
41505 -2315994 -1537047 -939577 -1215124 -1375317 154659 2413119 2475642 -76619 -2008094
41496 -2008094 -1226686 -54039 -1374425 -3719934 -3336528 -4146 2556990 2083757 613387
41487 613387 1101200 3450802 5229154 4922670 3065391 752346 -1688103 -4316533 -6492356
41478 -6492356 -6825903 -4581492 -845787 2368753 4104029 4719993 4356005 2591045 13596
41469 13596 -1494234 -950216 608077 2026924 3420074 4616963 4296446 2386505 1262286
41460 1262286 2248716 2917549 785358 -2182406 -2565003 -1622007 -3730633 -8868386 -11629115
41451 -11629115 -8842336 -3649804 -264114 1026298 1309525 -215188 -3573783 -5572502
41443 -5572502 -3966534 -1520358 -1988115 -4240346 -4580039 -3061343 -2738047 -3604146 -2329125
$$ packed form
41505b315994P78947N97470k75547j60193J529976K258460O2523k552261j931475
41496b008094P81408J172647j320386k345509L83406L332382K561136m73233j470370
41487F13387M87813K349602J778352l06484j857279k313045k440449k628430k175823
41478f492356l33547K244411L735705L214540J735276O15964l63988j764960k577449
41469A3596j507830N44018J558293J418847J393150J196889l20517j909941j124219
41460A262286R86430O68833k132191k967764l82597R42996k108626n137753k760729
41451a1629115K786779N192532L385690J290412K83227j524713l358595j998719
41443e572502J605968K446176m67757k252231l39693J518696L23296q66099J275021
$$ plain form
41434 -2329125 1794403 5288656 5776444 4742599 3850814 2456556 512708 250354 2458657
41425 2458657 3974898 1713405 -2777229 -5459779 -5132955 -4103619 -4334188 -5144779 -4658868
41416 -4658868 -2173640 940584 2347191 1369200 382444 2019011 4993064 5230115 1928125
41407 1928125 -497536 1566489 5646464 6672041 3827243 845005 604085 2328714
41399 2328714 3501468 2117437 -2103027 -6276916 -5351346 2214374 10478343 11390139
41391 11390139 4198638 -3960952 -7094906 -6145991 -4944937 -4615509 -4353035 -4445210 -5425683
41382 -5425683 -6276680 -6289655 -7100474 -10009741 -12431658 -10153766 -3102880 3639622 5142669
41373 5142669 1402745 -3533966 -5954992 -5453066 -4221827 -4010751 -4182029 -3204045 -1443591
$$ packed form
41434b329125M123528L494253M87788j033845q91785j394258j943848k62354K208303
41425B458657J516241k261493m490634k682550L26824J029336k30569q10591M85911
41416d658868K485228L114224J406607r77991r86756J636567K974053K37051l301990
41407A928125k425661K064025M079975J025577k844798k982238k40920J724629
41399B328714J172754j384031m220464m173889R25570P565720Q263969R11796
41391A1390139p191501q159590l133954R48915J201054L29428K62474r2175r80473
41382e425683q50997j2975q10819k909267k421917K277892P050886O742502J503047
41373E142669l739924m936711k421026N01926J231239K11076j71278R77984J760454
$$ plain form
41364 -1443591 -875814 -1927425 -2623028 -1672005 -383499 -241343 -566612 -273124 9420
41355 9420 -311472 180826 2390189 3761812 1182361 -3988075 -7236969 -7031881 -6177118
41346 -6177118 -6756068 -7209132 -5508597 -2271080 642763 2224009 1956295 -113875 -1867252
41337 -1867252 -487621 3145335 4323984 799453 -3596990 -4200772 -1783296 -316849
41329 -316849 -586007 8605 2351869 4385790 4862614 4644688 3924409 1720653 -950201
41320 -950201 -871047 2626199 5477608 3739629 -1248280 -4831174 -4868679 -3243480 -2156549
41311 -2156549 -1311621 618084 3140267 3740161 696534 -4232327 -6778563 -4671232
41303 -4671232 -674470 323611 -2761995 -5961025 -5473531 -2308391 -487098 -2108814
$$ packed form
41364a443591N67777j051611o95603R51023J288506J42156l25269K93488K82544
41355I420l20892M92298K209363J371623k579451n170436l248894K05088Q54763
41346f177118n78950m53064J700535L237517K913843J581246k67714k070170j753377
41337a867252J379631L632956J178649l524531m396443o03782K417476J466447
41329c16849k69158N94612K343264K033921M76824k17926p20279k203756k670854
41320i50201P9154L497246K851409j737979m987909l582894l7505J625199J086931
41311b156549Q44928J929705K522183N99894l043627m928861k546236K107331
41303d671232L996762R98081l085606l199030M87494L165140J821293j621716
$$ plain form
41295 -2108814 -5782511 -8896986 -9704226 -7827154 -4549151 -2472959 -3340819 -6051352
41287 -6051352 -7920809 -7758014 -6513787 -5161647 -3565290 -1730737 -656489 -1097963
41279 -1097963 -2321631 -2782897 -1654442 506422 2100094 1544456 -1211623 -4174933
41271 -4174933 -5090630 -3735768 -1664162 -45580 871404 417304 -2264900 -6072627 -8167519
$$ packed form
41295b108814l673697l114475q07240J877072L278003K076192q67860k710533
41287f051352j869457J62795J244227J352140J596357J834553J074248m41474
41279a097963j223668m61266J128455K160864J593672n55638k756079k963310
41271d174933r15697J354862K071606J618582R16984m54100k682204l807727k094892
$$ [...]
##END NTUPLES=NMR SPECTRUM
##END=
