##TITLE=31Pdec_LR-688B-C4-CHL
 CDCl3, 8 sc
 20.9.2019
##JCAMPDX= 6.0         $$ Bruker NMR JCAMP-DX V2.0
##DATA TYPE= NMR SPECTRUM
##DATA CLASS= NTUPLES
##ORIGIN= UXNMR, Bruker Analytische Messtechnik GmbH
##OWNER= root
$$ XWIN-NMR		Version 3.5
$$ Fri Sep 20 14:53:51 2019 Russian Standard Time (UT+4h)  she@DPX200
##.OBSERVE FREQUENCY= 81.013821
##.OBSERVE NUCLEUS= ^31P
##.ACQUISITION MODE= SIMULTANEOUS
##.ACQUISITION SCHEME= undefined
##.AVERAGES= 24
##.DIGITISER RES= 17
##SPECTROMETER/DATA SYSTEM= spect
##.PULSE SEQUENCE= zgpg30
##.SOLVENT NAME= DMSO
##.SHIFT REFERENCE= (INTERNAL, DMSO, 0, 182.463)
##AUDIT TRAIL= $$ (NUMBER, WHEN, WHO, WHERE, WHAT)
$$ ##TITLE= Audit trail, XWIN-NMR		Version 3.5
$$ ##JCAMPDX= 5.01
$$ ##ORIGIN= Bruker BioSpin GmbH
$$ ##OWNER= she
$$ F:/spectra/data/she/nmr/P31/1/pdata/1/auditp.txt
$$ ##AUDIT TRAIL=  $$ (NUMBER, WHEN, WHO, WHERE, WHAT)
(   1,<2019-09-20 14:52:51.40 +0400>,<she>,<DPX200>,
      <created by zg, POWCHK disabled, PULCHK disabled
       configuration hash MD5:
       00 E9 B6 7A A2 85 ED C7 34 08 36 98 17 FE 4E 26
       data hash MD5: 32K
       61 6E BA B1 3B 14 A5 75 D4 77 1C EF 9B E0 FE CD>)
(   2,<2019-09-20 14:52:53.95 +0400>,<she>,<DPX200>,
      <Start of raw data processing
       efp BC_mod = 2 LB = 1 FT_mod = 6 PKNL = 1 PHC0 = -182.85 PHC1 = -497.1997 SI = 64K 
       data hash MD5: 64K
       51 57 53 E2 25 37 34 18 DB C4 96 F7 9D 7D 87 38>)
(   3,<2019-09-20 14:53:07.56 +0400>,<she>,<DPX200>,
      <pk PHC0 = -3.424783 PHC1 = 0 
       data hash MD5: 64K
       00 FE E7 54 DB 35 E5 8B F1 24 5A A7 BF 32 83 F5>)
(   4,<2019-09-20 14:53:11.04 +0400>,<she>,<DPX200>,
      <abs ABSG = 5 
       data hash MD5: 64K
       C3 C1 A5 6A BE AB 83 EE 37 C1 F8 0F 96 3E B4 EF>)
$$ ##END=
$$ 
$$ hash MD5
$$ 65 F0 09 54 BB 9B D0 53 6A 22 1A F9 F5 AB 54 20
##$RELAX= 
##$RELAX= 
##$RELAX= 
##$RELAX= 
##$RELAX= 
##$RELAX= 
##$RELAX= 
##$RELAX= 
$$ Bruker specific parameters
$$ --------------------------
##$DU= <F:/spectra>
##$EXPNO= 1
##$NAME= <P31>
##$PROCNO= 1
##$TYPE= <nmr>
##$USER= <she>
##$AMP= (0..31)
100 100 100 100 100 100 100 100 100 100 100 100 100 100 100 100 100 100 
100 100 100 100 100 100 100 100 100 100 100 100 100 100 
##$AQSEQ= 0
##$AQ_mod= 1
##$AUNM= <au_zg>
##$AUTOPOS= <>
##$BF1= 81.014009
##$BF2= 200.13
##$BF3= 200.13
##$BF4= 200.13
##$BF5= 200.13
##$BF6= 200.13
##$BF7= 200.13
##$BF8= 200.13
##$BYTORDA= 1
##$CFDGTYP= 0
##$CFRGTYP= 5
##$CHEMSTR= <none>
##$CNST= (0..31)
1 1 145 1 1 1 1 1 1 1 1 1 1 1 1 1 1 1 1 1 1 1 1 1 1 1 1 1 1 1 1 1 
##$CPDPRG= <waltz16>
##$CPDPRG1= <>
##$CPDPRG2= <waltz16>
##$CPDPRG3= <>
##$CPDPRG4= <mlev>
##$CPDPRG5= <mlev>
##$CPDPRG6= <mlev>
##$CPDPRG7= <mlev>
##$CPDPRG8= <mlev>
##$CPDPRGB= <>
##$CPDPRGT= <>
##$D= (0..31)
0 1 0 0 0 0 0 0 0 0 0 0.03 2e-05 3e-06 0 0 0 0 0 0 0 0 0 0 0 0 0 0 0 0 
0 0 
##$DATE= 1568976770
##$DBL= (0..7)
120 120 120 11 120 120 24 19 
##$DBP= (0..7)
150 150 150 150 150 150 150 150 
##$DBP07= 0
##$DBPNAM0= <>
##$DBPNAM1= <>
##$DBPNAM2= <>
$$ [...]
##$SUBNAM3= <"">
##$SUBNAM4= <"">
##$SUBNAM5= <"">
##$SUBNAM6= <"">
##$SUBNAM7= <"">
##$SUBNAM8= <"">
##$SUBNAM9= <"">
##$SW= 369.568048894756
##$SWIBOX= (0..15)
0 1 3 0 0 0 0 0 0 0 0 0 0 0 0 0 
##$SW_h= 29940.119760479
##$TD= 32768
##$TD0= 1
##$TE= 0
##$TE2= 300
##$TE3= 300
##$TEG= 300
##$TL= (0..7)
0 120 53 12 22 120 120 120 
##$TP= (0..7)
150 150 150 150 150 150 150 150 
##$TP07= 0
##$TPNAME0= <>
##$TPNAME1= <>
##$TPNAME2= <>
##$TPNAME3= <>
##$TPNAME4= <>
##$TPNAME5= <>
##$TPNAME6= <>
##$TPNAME7= <>
##$TPOAL= (0..7)
0.5 0.5 0.5 0.5 0.5 0.5 0.5 0.5 
##$TPOFFS= (0..7)
0 0 0 0 0 0 0 0 
##$TUNHIN= 0
##$TUNHOUT= 0
##$TUNXOUT= 0
##$USERA1= <user>
##$USERA2= <user>
##$USERA3= <user>
##$USERA4= <user>
##$USERA5= <user>
##$V9= 5
##$VALIST= <valist>
##$VCLIST= <CCCCCCCCCCCCCCC>
##$VD= 0
##$VDLIST= <DDDDDDDDDDDDDDD>
##$VPLIST= <PPPPPPPPPPPPPPP>
##$VTLIST= <TTTTTTTTTTTTTTT>
##$WBST= 1024
##$WBSW= 4
##$XGAIN= (0..3)
0 0 0 0 
##$XL= 0
##$YL= 0
##$YMAX_a= 16494
##$YMIN_a= -17870
##$ZGOPTNS= <>
##$ZL1= 120
##$ZL2= 120
##$ZL3= 120
##$ZL4= 120
##$ABSF1= 182.463
##$ABSF2= -187.1042
##$ABSG= 5
##$ABSL= 3
##$ALPHA= 0
##$AQORDER= 0
##$ASSFAC= 0
##$ASSFACI= 0
##$ASSFACX= 0
##$ASSWID= 0
##$AUNMP= <proc_1d>
##$AZFE= 0.1
##$AZFW= 0.5
##$BCFW= 0
##$BC_mod= 2
##$BYTORDP= 0
##$COROFFS= 0
##$CY= -3
##$DATMOD= 1
##$DC= 0
##$DFILT= <>
##$DTYPP= 0
##$F1P= 0
##$F2P= 0
##$FCOR= 1
##$FTSIZE= 65536
##$FT_mod= 6
##$GAMMA= 0
##$GB= 0
##$INTBC= 1
##$INTSCL= 5.30512e-09
##$ISEN= 30
##$LB= 1
##$LEV0= 0
##$LPBIN= 0
##$MAXI= 10000
##$MC2= 0
##$MEAN= 0
##$ME_mod= 0
##$MI= 50
##$NCOEF= 0
##$NC_proc= -7
##$NLEV= 6
##$NOISF1= 182.463
##$NOISF2= 159.3651
##$NSP= 0
##$NTH_PI= 0
##$NZP= 0
##$OFFSET= 182.463
##$PC= 4
##$PHC0= -186.2748
##$PHC1= -497.1997
##$PH_mod= 1
##$PKNL= yes
##$PPARMOD= 0
##$PSCAL= 0
##$PSIGN= 0
##$REVERSE= no
##$SF= 81.0140089999434
##$SI= 65536
##$SIGF1= 159.3651
##$SIGF2= -187.1042
##$SINO= 113.3802
##$SIOLD= 16384
##$SREGLST= <1H.CDCl3>
##$SSB= 0
##$STSI= 65536
##$STSR= 0
##$SW_p= 29940.119760479
##$SYMM= 0
##$S_DEV= 0
##$TDeff= 32768
##$TDoff= 0
##$TI= <>
##$TILT= no
##$TM1= 0
##$TM2= 0
##$TOPLEV= 0
##$USERP1= <user>
##$USERP2= <user>
##$USERP3= <user>
##$USERP4= <user>
##$USERP5= <user>
##$WDW= 1
##$XDIM= 65536
##$YMAX_p= 527908749
##$YMIN_p= -71521238
$$ End of Bruker specific parameters
$$ ---------------------------------
##NTUPLES= NMR SPECTRUM
##VAR_NAME=  FREQUENCY,     SPECTRUM/REAL,   SPECTRUM/IMAG
##SYMBOL=    X,             R,               I
##VAR_TYPE=  INDEPENDENT,   DEPENDENT,       DEPENDENT
##VAR_FORM=  AFFN,          ASDF,            ASDF
##VAR_DIM=   65536,         65536,           65536
##UNITS=     HZ,            ARBITRARY UNITS, ARBITRARY UNITS
##FACTOR=    0.456856943014862, 1,           1
##FIRST=     14782.0589164792, 0,            0
##LAST=      -15158.0608439998, 0,           0
##MIN=       -15158.0608439998, -71521238,   0
##MAX=       14782.0589164792, 527908749,    0
$$ Real data points
##PAGE= N=1
##DATA TABLE= (X++(R..R)), XYDATA
$$ [...]
$$ plain form
45987 -6185138 -7608317 -9405935 -8524663 -3995048 1254036 3418497 1944453 -493181
45979 -493181 -1817516 -2744023 -4606237 -6623631 -6843457 -4895874 -2185672 83890 1413051
45970 1413051 1059164 -1336769 -4162233 -4905219 -3258982 -1499472 -1427776 -2596518 -3838183
45961 -3838183 -4637009 -4471144 -2752717 -144783 1939490 3800069 7190984 11618215
45953 11618215 13419570 10358663 5057764 1647820 605396 -670101 -3304468 -5631835
45945 -5631835 -6124349 -5401075 -5011891 -5563431 -6220470 -5394293 -2361328 1253372 2613163
45936 2613163 1104979 -634415 -221686 1391802 1789369 555719 -927755 -1754876 -1483148
45927 -1483148 783659 4762997 7479538 6215305 2386880 -336347 -1252290 -2709516
$$ packed form
45987f185138j423179j797618Q81272M529615N249084K164461j474044k437634
45979d93181j324335r26507j862214k017394k19826J947583K710202K269562J329161
45970A413051l53887k395933k825464p42986J646237J759510P1696j168742j241665
45961c838183p98826J65865J718427K607934K084273J860579L390915M427231
45953A1618215J801355l060907n300899l409944j042424j275497k634367k327367
45945e631835m92514P23274L89184n51540o57039Q26177L032965L614700J359791
45936B613163j508184j739394M12729J613488L97567j233650j483474q27121K71728
45927a483148K266807L979338K716541j264233l828425k723227r15943j457226
$$ plain form
45919 -2709516 -5088400 -5513326 -2628685 837677 2153557 2252760 2866413 2485134 -1391546
45910 -1391546 -7078142 -9379215 -5990864 -580611 1808460 632024 -655220 -32134
45902 -32134 476735 -1792363 -5973412 -8621628 -8036677 -5680577 -3456705 -1800428 -974439
45893 -974439 -1850408 -4023779 -5246814 -4597372 -4361578 -6500988 -8925414 -8126555 -4355205
45884 -4355205 -1024902 368811 1356415 2657278 2775477 1118391 -588974 -1032809 -805076
45875 -805076 -286792 1200808 3033701 2931213 527803 -1325941 -677304 540758 -193644
45866 -193644 -1847847 -1590667 724105 2409790 1620165 -834096 -2891187 -2955993 -726175
45857 -726175 2454333 4475144 4347341 2533720 -530535 -4387567 -6812292 -4988359
$$ packed form
45919b709516k378884m24926K884641L466362J315880R9203O13653l81279l876680
45910a391546n686596k301073L388351N410253K389071j176436j287244O23086
45902c2134N08869k269098m181049k648216N84951K356100K223872J656277Q25989
45893i74439q75969k173371j223035O49442K35794k139410k424426P98859L771350
45884d355205L330303J393713R87604J300863J18199j657086j707365m43835K27733
45875h05076N18284J487600J832893j02488k403410j853744O48637J218062p34402
45866a93644j654203K57180K314772J685685p89625k454261k057091o4806K229818
45857g26175L180508K020811j27803j813621l064255l857032k424725J823933
$$ plain form
45849 -4988359 216646 3989149 3624882 2117020 3060712 4667047 2534917 -3399869
45841 -3399869 -8729942 -10559892 -9824367 -8006240 -5298776 -2292112 -166498 1286839
45833 1286839 2983073 3753560 1484391 -2532668 -3950717 -1278225 1765451 1367349
45825 1367349 -1852073 -5261660 -8213051 -10902542 -11489528 -7849722 -1641959 2287171
45817 2287171 1172624 -2500671 -3630867 325837 6906973 11082760 10255994 6658101
45809 6658101 4223027 3707780 2488937 -1000860 -4887799 -6649626 -6237028 -5103210
45801 -5103210 -3771750 -1948589 110659 1880840 3435947 4849258 5517865 5083046
45793 5083046 4099096 2880359 876405 -1759354 -3404063 -3162024 -2406236 -2476677 -2342360
$$ packed form
45849d988359N205005L772503l64267j507862R43692J606335k132130n934786
45841c399869n330073j829950P35525J818127K707464L006664K125614J453337
45833A286839J696234P70487k269169m017059j418049K672492L043676l98102
45825A367349l219422l409587k951391k689491n86986L639806O207763L929130
45817B287171j114547l673295j130196L956704O581136M175787q26766l597893
45809F658101k435074n15247j218843l489797l886939j761827M12598J133818
45801e103210J331460J823161K059248J770181J555107J413311O68607m34819
45793E083046r83950j218737k003954k635759j644709K42039P55788p0441J34317
$$ plain form
45784 -2342360 -694267 1032881 521400 -1407326 -1821514 -552982 -612483 -3037903 -4705716
45775 -4705716 -2973652 308571 1749858 1202507 832148 960803 152309 -1073638 -149585
45766 -149585 3115015 5081804 3110400 -349027 -926459 1707329 3877604 3592690 3164766
45757 3164766 5153953 8234399 9149030 7301122 5095243 4379627 4808316 5551154 6311601
45748 6311601 6308722 4555766 2026622 1361179 3057152 4004396 1720300 -1759821 -2753319
45739 -2753319 -1348590 -788318 -1962962 -2134760 165918 2461479 2366079 1437299 2346807
45730 2346807 4228295 4045553 1624998 12775 795742 2120207 2118078 1593974 1947884
45721 1947884 2665868 2637646 2203111 1913218 775252 -1830067 -3546713 -1352352 3609563
$$ packed form
45784b342360J648093J727148n11481j928726m14188J268532n9501k425420j667813
45775d705716J732064L282223J441287n47351l70359J28655q08494j225947R24053
45766a49585L264600J966789j971404l459427n77432K633788K170275k84914m27924
45757C164766J989187L080446R14631j847908k205879p15616M28689P42838P60447
45748F311601k879j752956k529144o65443J695973R47244k284096l480121r93498
45739b753319J404729N60272j174644j71798K300678K295561r5400r28780R09508
45730B346807J881488j82742k420555j612223P82967J324465k129n24104L53910
45721A947884P17984k8222m34535k89893j137966k605319j716646K194361M961915
$$ plain form
45712 3609563 6482666 4786966 1451352 437915 1754407 2891045 3250792 4200526
45704 4200526 5511169 4864586 1369620 -2852795 -5461131 -6274378 -5843031 -3726016 -82474
45695 -82474 2521291 1546175 -1541529 -2310191 857331 4200587 3382405 -719088 -3340230
45686 -3340230 -2350200 -698513 -1669403 -4257992 -5232187 -4089191 -3237213 -3833073 -4345325
45677 -4345325 -3667594 -2887010 -2717083 -1689777 1009614 2859083 966440 -3242841 -5326654
45668 -5326654 -3829622 -2117526 -3334902 -6014028 -6473197 -4030171 -1614247 -1474199
45660 -1474199 -2179661 -753108 3032727 5778033 4448529 532463 -1244054 1303529
45652 1303529 4919328 5099231 1916942 -414554 744147 3592456 5011558 4267896
$$ packed form
45712C609563K873103j695700l335614j013437J316492J136638L59747R49734
45704D200526J310643o46583l494966m222415k608336q13247M31347K117015L643542
45695h2474K603765r75116l087704p68662L167522L343256q18182m101493k621142
45686c340230R90030J651687r70890k588589r74195J142996Q51978n95860n12252
45677d345325O77731P80584J69927J027306K699391J849469j892643m209281k083813
45668e326654J497032J712096j217376k679126m59169K443026K415924J40048
45660a474199p05462J426553L785835K745306j329504l916066j776517K547583
45652A303529L615799J79903l182289k331496J158701K848309J419102p43662
$$ plain form
45644 4267896 2664720 1355905 780510 934029 994035 -195864 -2159500 -2514557 -15799
45635 -15799 3217658 4150311 2719745 1479769 1823221 2589814 2574076 2397973 2972244
45626 2972244 3590859 2934636 1208710 -112109 -401477 -369898 -316427 569423 2311237
45617 2311237 2997093 1297153 -719727 193415 3291278 3816722 -428418 -5229236 -5289531
45608 -5289531 -1373033 1351366 927429 375180 1660562 2265086 -382479 -4434417 -6228674
45599 -6228674 -5203265 -3627303 -2873131 -2417004 -1752475 -1198198 -1099663 -1564005 -2503460
45590 -2503460 -3075008 -2087707 131623 1679594 1986166 3012754 5914742 8367192 7531487
45581 7531487 4207749 1355769 -383666 -2585622 -4988824 -4965615 -1627341 2364423
$$ packed form
45644D267896j603176j308815n75395J53519O0006j189899j963636l55057K498758
45635a5799L233457R32653j430566j239976L43452P66593j5738j76103N74271
45626B972244O18615o56223j725926j320819k89368L1579N3471Q85850J741814
45617B311237O85856j699940k016880R13142L097863N25444m245140m800818o0295
45608e289531L916498K724399m23937n52249J285382O04524k647565m051938j794257
45599f228674J025409J575962P54172M56127O64529N54277R8535m64342r39455
45590b503460n71548R87301K219330J547971L06572J026588K901988K452450q35705
45581G531487l323738k851980j739435k201956k403202K3209L338274L991764
$$ plain form
45573 2364423 4151032 3644267 2078605 -264169 -3191788 -4946227 -3621327 -136018
45565 -136018 1855919 -140748 -4229361 -5765560 -2510483 2701445 5270890 3989619
45557 3989619 1368483 -500374 -1873974 -2981878 -2791146 -1461988 -1165705 -2485640
45549 -2485640 -2723416 -304923 1791338 247552 -3301168 -5027689 -4925335 -5447089 -5618367
45540 -5618367 -2129271 3699711 5808701 1828365 -3298794 -4419753 -2706040 -2341268
45532 -2341268 -4213482 -6116285 -6688250 -6038206 -4186714 -1503299 661431 1740203
45524 1740203 2729393 3507640 1619856 -3864788 -9327357 -10379986 -7319511 -3965343
45516 -3965343 -2218859 -917747 529578 841424 -255227 -702900 971026 3237237
$$ packed form
45573B364423J786609n06765j565662k342774k927619j754439J324900L485309
45565a36018J991937j996667m088613j536199L255077N211928K569445j281271
45557C989619k621136j868857j373600j107904J90732J329158K96283j319935
45549b485640k37776K418493K096261j543786l548720j726521J02354n21754j71278
45540e618367L489096N828982K108990l980336n127159j120959J713713L64772
45532b341268j872214j902803n71965O50044J851492K683415K164730J078772
45524A740203R89190P78247j887784n484644n462569j052629L060475L354168
45516c965343J746484J301112J447325L11846j096651m47673J673926K266211
$$ plain form
45508 3237237 3588691 2045312 1125941 2349315 4021179 3462178 902576 -548330 613608
45499 613608 1843096 451493 -1795019 -1117273 2088269 3445885 1380738 -439933
45491 -439933 907885 2989883 2115968 -868004 -2141696 -401243 2262699 3735157
45483 3735157 3437652 1504542 -1146266 -2645298 -2130033 -1143132 -1430319 -2492904 -3070068
45474 -3070068 -3617426 -5109333 -6496847 -5629644 -2074658 2607896 6448152 7660190
45466 7660190 5334728 1156359 -1481661 -1810205 -2755733 -5670974 -7181604 -4476811
45458 -4476811 -455972 891757 1416154 5348455 10605091 10231494 2755967 -5159379
45450 -5159379 -7786025 -6387051 -4224331 -1130977 3431609 6306204 4099398 -1648266
$$ packed form
45508C237237L51454j543379r19371J223374J671864n59001k559602j450906J161938
45499F13608J229488j391603k246512O77746L205542J357616k065147j820671
45491d39933J347818K081998q73915k983972j273692J740453K663942J472458
45483C735157k97505j933110k650808j499032N15265R86901k87187j062585n77164
45474c070068n47358j491907j387514Q67203L554986M682554L840256J212038
45466G660190k325462m178369k638020l28544r45528k915241j510630K704793
45458d476811M020839J347729N24397L932301N256636l73597p475527p915346
45450e159379k626646J398974K162720L093354M562586K874595k206806n747664
$$ plain form
45442 -1648266 -6533013 -9063744 -11140803 -13677260 -14735497 -12197868 -6507222 -406488
45434 -406488 3347321 4079430 3209194 1956364 -268671 -4046308 -7437484 -7535190 -4445197
45425 -4445197 -1521549 -1362447 -3440315 -5705371 -6496877 -4981795 -2014431 -475331
45417 -475331 -2238723 -4891094 -4264460 -237813 3065050 3051257 1356471 405809 715839
45408 715839 2148827 4242985 4664669 1281677 -3332338 -3771693 496054 3832007 2614783
45399 2614783 -106269 -667672 -554561 -2519054 -5269079 -6198874 -5880182 -5694529 -4257215
45390 -4257215 -510949 2591270 2000456 -373598 -903112 -60136 -501489 -1762905 -1678830
45381 -1678830 -1011662 -1786050 -2917247 -2425192 -2026169 -4197240 -6539546 -4945321 -936040
$$ packed form
45442a648266m884747k530731k077059k536457j058237K537629N690646O100734
45434d06488L753809P32109q70236j252830k225035l777637l391176r7706L089993
45425d445197K923648J59102k077868k265056p91506J515082K967364J539100
45417d75331j763392k652371O26634M026647L302863j3793j694786r50662L10030
45408G15839J432988K094158M21684l382992m614015m39355M267747L335953j217224
45399B614783k721052n61403J13111j964493k750025r29795L18692J85653J437314
45390d257215L746266L102219n90814k374054n29514Q42976m41353j261416Q4075
45381a678830O67168p74388j131197M92055L99023k171071k342306J594225M009281
$$ plain form
45372 -936040 413029 -1151459 -1403946 204003 -51837 -2270688 -1983528 1398131 2647403
45363 2647403 -159043 -1659679 2029172 6951558 8056069 6626230 6060199 5299937
45355 5299937 2223246 -356258 1597732 5971846 6866114 3275937 108431 747902
45347 747902 3179361 4044382 3042752 2409589 4122986 7899700 10678548 8952329 3145946
45338 3145946 -1718321 -1699925 1203637 2170043 11785 -2224486 -1974137 480233 3724225
45329 3724225 6446149 7137401 5066061 1727100 -458713 -775204 -170256 670600 1564561
45320 1564561 1990470 1785627 1859768 2568320 2571526 1210924 489505 2112312 3912923
45311 3912923 2423534 -1719462 -4300873 -3369620 -1372258 -1110708 -2533250 -4274169
$$ packed form
45372i36040J349069j564488k52487J607949k55840k218851K87160L381659J249272
45363B647403k806446j500636L688851M922386J104511j429839n66031p60262
45355E299937l076691k579504J953990M374114Q94268l590177l167506O39471
45347G47902K431459Q65021j001630o33163J713397L776714K778848j726219n806383
45338C145946m864267J8396K903562R66406k158258k236271K50349K454370L243992
45329C724225K721924O91252k071340l338961k185813l16491O04948Q40856Q93961
45320A564561M25909k04843P4141P08552L206j360602p21419J622807J800611
45311C912923j489389m142996k581411R31253J997362K61550j422542j740919
$$ plain form
45303 -4274169 -5763070 -6743531 -6677907 -5574168 -3991200 -1900037 967542 3712156 5037411
45294 5037411 5270491 5544243 5271189 3097849 362010 335293 3137036 4622578 2101374
45285 2101374 -1490358 -1420580 2642237 6574309 6901900 4044710 1078734 699270 2951746
45276 2951746 5046635 4022871 141869 -3343807 -4210058 -3522461 -3152333 -2935629 -1816070
45267 -1816070 -280817 251609 -453984 -1667972 -3247068 -5263808 -6774055 -6834836 -6431340
45258 -6431340 -7549892 -10301831 -12606964 -12952026 -11963471 -10825658 -9521542 -7427982
45250 -7427982 -4732782 -2366487 -861338 175742 1547261 3536015 5292774 5320293
45242 5320293 3109181 202334 -1151498 -586933 -44894 -1174202 -3163301 -4015673 -3296930
$$ packed form
45303d274169j488901r80461O5624J103739J582968K091163K867579K744614J325255
45294E037411K33080K73752k73054k173340k735839k6717K801743J485542k521204
45285B101374l591732O9778M062817L932072L27591k857190k965976l79464K252476
45276B951746K094889j023764l881002l485676q66251O87597L70128K16704J119559
45267a816070J535253N32426p05593j213988j579096k016740j510247o0781M03496
45258f431340j118552k751939k305133l45062R88555J137813J304116K093560
45250g427982K695200K366295J505149J037080J371519J988754J756759K7519
45242E320293k211112k906847j353832N64565N42039j129308j989099q52372P18743
$$ plain form
45233 -3296930 -2257571 -1423679 185769 2799805 4550043 3858904 1945490 976271 543277
45224 543277 -1485395 -4837239 -6613894 -5909839 -5478455 -7137347 -8556334 -7145925 -4386471
45215 -4386471 -2940880 -1844527 1140616 4090062 3112926 -468631 -945364 2688234
45207 2688234 4252111 -370513 -6687984 -8225025 -5486898 -3542732 -3918491 -4517814
45199 -4517814 -5642711 -9729167 -15050095 -15761358 -10200099 -4408661 -4442753 -8482530 -9941932
45190 -9941932 -6410187 -2014498 -1406695 -4314876 -6768140 -6022942 -3147353 -1197640
45182 -1197640 -1722637 -3497122 -4437890 -3864704 -2354529 -285495 2168050 3930765 3501693
45173 3501693 1010497 -1295720 -1369023 333999 1421296 247066 -2369020 -4244594
$$ packed form
45233c296930J039359Q33892J609448K614036J750238o91139j913414r69219m32994
45224E43277k028672l351844j776655P04055M31384j658892j418987J410409K759454
45215d386471J445591J096353K985143K949446r77136l581557m76733L633598
45207B688234J563877m622624o317471j537041K738127J944166l75759n99323
45199d517814j124897m086456n320928p11263N561259N791438l4092m039777j459402
45190i941932L531745M395689O07803k908181k453264P45198K875589J949713
45182a197640n24997j774485r40768N73186J510175K069034K453545J762715m29072
45173C501693k491196k306217p3303J703022J087297j174230k616086j875574
$$ plain form
45165 -4244594 -4503352 -4483845 -5376746 -5816198 -3633808 126266 1436461 -1545256 -5951976
45156 -5951976 -8315650 -8637587 -8274360 -6666315 -3556442 -1981147 -4506038 -8010909
45148 -8010909 -7394523 -3820532 -3501677 -7822083 -10889748 -8815628 -5259248 -4426557 -4348242
45139 -4348242 -1910265 364392 -1324719 -4361414 -3140833 1628151 3806013 1497645
45131 1497645 -697112 247422 1636280 774851 -560119 -18506 1242803 1224657 459777
45122 459777 151675 -42752 -17286 1892791 5399557 6670249 3358577 -1337185 -2931058
45113 -2931058 -1702590 -1000289 -1561090 -1590201 -1146993 -2046297 -3728890 -3391921 -671778
45104 -671778 1425169 1052254 -200697 -476814 -108091 268651 1256232 2831718 3348208
$$ packed form
45165d244594k58758J9507q92901m39452K182390L760074J310195k981717m406720
45156e951976k363674l21937L63227J608045L109873J575295k524891l504871
45148h010909O16386L573991L18855m320406l067665K074120L556380Q32691P8315
45139d348242K437977K274657j689111l036695J220581M768984K177862k308368
45131A497645k194757R44534J388858q61429j334970N41613J261309j8146p64880
45122D59777l08102j94427K5466J910077L506766J270692l311672m695762j593873
45113b931058J228468P02301n60801k9111M43208q99304j682593L36969K720143
45104f71778K096947l72915j252951k76117L68723L76742R87581J575486N16490
$$ plain form
45095 3348208 2132116 1063248 1746394 2822317 2077811 -56962 -1189851 -439918 611403
45086 611403 221099 -1627021 -3591482 -4308484 -3337578 -1209161 1479595 4644043 7593101
45077 7593101 8050869 4404131 -941703 -3051020 -407966 3074721 3608547 2499110
45069 2499110 3004435 4522448 3652934 79028 -2567500 -2043580 -351080 -311543 -1990094
45060 -1990094 -3688235 -4238022 -3064868 73730 4042432 6557118 6670040 5741088 5103211
45051 5103211 4377422 3083386 2054902 1749419 792826 -1907065 -4745624 -5036744 -2381198
45042 -2381198 1134919 3451770 3830786 2420705 152570 -1393595 -1392806 -622575 62339
45033 62339 1098726 2842833 4252921 4759986 5938004 8769515 10579269 8101662 3027623
$$ packed form
45095C348208j216092j068868O83146J075923p44506k134773j132889P49933J051321
45086F11403l90304j848120j964461p17002R70906K128417K688756L164448K949058
45077G593101M57768l646738n345834k109317K643054L482687N33826j109437
45069B499110N05325J518013q69514l573906k646528N23920J692500L9537j678551
45060a990094j698141n49787J173154L138598L968702K514686J12922r28952o37877
45051E103211p25789j294036j028484l05483r56593k699891k838559k91120K655546
45042b381198L516117K316851L79016j410081k268135j546165P89P70231O84914
45033F2339J036387J744107J410088N07065J178018K831511J809754k477607n074039
$$ plain form
45024 3027623 585095 2209011 3693872 2035640 70702 1587931 5070132 5974513
45016 5974513 3304186 90674 -1731672 -3133125 -4654126 -4852536 -3172806 -1547439
45008 -1547439 -1442292 -1309056 937896 4016444 4199611 384713 -3538121 -2703556 2834262
44999 2834262 7672419 7099985 2417729 -1146941 -1096991 26499 -699345 -2260927 -1849512
44990 -1849512 546301 2236023 1741897 216115 -810574 -862858 329604 2871113 5406263
44981 5406263 5805707 3929060 2027907 1620861 1601950 350538 -1972599 -4509599 -7509528
44972 -7509528 -11172602 -13564101 -11825778 -5782343 977348 4322942 3538929 1723459
44964 1723459 2218338 4844595 6296817 4557031 1731760 1092852 2301991 2133091 -104944
$$ packed form
45024C027623k442528J623916J484861j658232j964938J517229L482201R04381
45016E974513k670327l213512j822346j401453j521001j98410J679730J625367
45008a547439J05147J33236K246952L078548J83167l814898l922834Q34565N537818
44999B834262M838157n72434m682256l564670M9950J123490p25844j561582M11415
44990a849512K395813J689722m94126j525782j026689n2284J192462K541509K535150
44981E406263L99444j876647j901153m07046j8911j251412k323137k537000k999929
44972g509528l663074k391499J738323O043435O759691L345594p84013j815470
44964A723459M94879K626257J452222j739786k825271o38908J209139j68900k238035
$$ plain form
44955 -104944 -1060236 1371862 4164555 3177590 -857353 -3499544 -2894449 -1770554 -3041707
44946 -3041707 -6112086 -8298611 -7965874 -5501428 -2720518 -1838770 -3488800 -5196183
44938 -5196183 -3456091 1821781 6405883 6363122 2445115 -1216199 -1740022 434073 3215894
44929 3215894 4931798 4863634 3229959 1184422 30442 -162378 -779119 -2924633 -5555114
44920 -5555114 -6031160 -3053863 1324815 3534226 2440019 472253 349540 1826999
44912 1826999 2728227 2227643 1574251 2008327 3481479 5238517 6243589 5294722 2363687
44903 2363687 -306502 -246863 2078027 4043993 4696212 5310119 5916582 4560096 1391049
44894 1391049 145070 2933744 6272761 5685109 2314444 1020506 2958222 4372181
$$ packed form
44955a04944r55292K432098K792693r86965m034943k642191O05095J123895j271153
44946c041707l070379k186525L32737K464446K780910Q81748j650030j707383
44938e196183J740092N277872M584102m2761l918007l661314n23823K174095K781821
44929C215894J715904o8164j633675k045537j153980j92820o16741k145514k630481
44920e555114m76046K977297M378678K209411j094207j967766j22713J477459
44912A826999R01228n00584o53392M34076J473152J757038J005072r48867k931035
44903B363687k670189N9639K324890J965966O52219O13907O06463j356486l169047
44894A391049j245979K788674L339017n87652l370665j293938J937716J413959
$$ plain form
44886 4372181 2824874 351590 -700414 -1117759 -2174968 -2827563 -2121575 -1804953 -3487009
44877 -3487009 -5053429 -3340726 553849 2155834 -174430 -3195902 -3756444 -2823782
44869 -2823782 -2890341 -3753030 -3411169 -1945858 -1675101 -3275439 -4088182 -1515355 3184493
44860 3184493 6038389 5020650 2246126 1107048 2220644 3240607 2340508 528402
44852 528402 -72813 834700 1772530 2035210 2614250 4235374 5885464 6180033 5146523
44843 5146523 3548456 1338656 -1723784 -4430675 -4861473 -2886424 -465674 764272
44835 764272 779510 -94339 -1855811 -3566401 -3386549 -1159083 734654 661238 283895
44826 283895 1892601 4656102 5997406 5618850 5261336 5030627 3271247 367929 -654360
$$ packed form
44886D372181j547307k473284j052004m17345j057209o52595P05988L16622j682056
44877c487009j566420J712703L894575J601985k330264l021472n60542R32662
44869b823782o6559q62689L41861J465311K70757j600338q12743K572827M699848
44860C184493K853896j017739k774524j139078J113596J019963r00099j812106
44852E28402o01215R07513R37830K62680N79040J621124J650090K94569j033510
44843E146523j598067k209800l062440k706891m30798J975049K420750J229946
44835G64272J5238q73849j761472j710590J79852K227466J893737p3416l77343
44826B83895J608706K763501J341304l78556l57514k30709j759380k903318j022289
$$ plain form
44817 -654360 1491518 4156309 4541269 3473101 3672357 5994724 9000493 10771581 9805881
44808 9805881 5777591 891526 -1239164 255533 2120268 1459102 -270482 81980
44800 81980 2557794 4750692 5878134 6945915 7480717 5431996 686059 -3898685 -5584235
44791 -5584235 -4209157 -1569190 68783 -653871 -2452178 -1882603 2161464 5545002
44783 5545002 3625508 -1877843 -4639492 -2314446 996735 1775193 1881103 3910234
44775 3910234 5874503 4341096 406930 -1477829 330216 3072921 3975238 3469750
44767 3469750 3556756 4769144 5556840 4106682 569158 -2622885 -3308011 -2294857 -2198362
44758 -2198362 -3613372 -4328509 -2738838 80477 2452798 4052896 4846087 4460823 3835324
$$ packed form
44817f54360K145878K664791L84960j068168J99256K322367L005769J771088r65700
44808I805881m028290m886065k130690J494697J864735o61166j729584L52462
44800H1980K475814K192898J127442J067781N34802k048721m745937m584744j685550
44791e584235J375078K639967J637973p22654j798307N69575M044067L383538
44783E545002j919494n503351k761649K325046L311181P78458J05910K029131
44775C910234J964269j533407l934166j884759J808045K742705R02317n05488
44767C469750Q7006J212388P87696j450158l537524l192043o85126J013154R6495
44758b198362j415010p15137J589671K819315K372321J600098P93191l85264o25499
$$ plain form
44749 3835324 4916932 7122489 6823867 2507480 -2198147 -3286058 -1733564 -1085977
44741 -1085977 -1935333 -2392209 -2338312 -3243338 -4633374 -4471168 -2647293 -839228 617802
44732 617802 2597212 4605962 5613299 6629117 8810958 9836541 6474265 437834
44724 437834 -2989884 -2386511 -1376256 -1781822 -1015109 2036069 4031292 2974817 2013471
44715 2013471 3719318 4991890 2240194 -1891675 -2199394 1035459 2971167 1772357
44707 1772357 -1668 -983935 -2681350 -5048461 -5293319 -2708007 -673739 -1697503
44699 -1697503 -3639198 -3351833 -1593265 -1451226 -3365193 -4653662 -3649229 -1841284
44691 -1841284 -1436122 -2541877 -3700875 -4173694 -4530516 -5249542 -5787803 -5367919 -3990926
$$ packed form
44749C835324J081608K205557k98622m316387m705627j087911J552494O47587
44741a085977q49356m56876N3897r05026j390036J62206J823875J808065J457030
44732F17802J979410K008750J007337J015818K181841J025583l362276o036431
44724D37834l427718O03373J010255m05566P66713L051178J995223j056475r61346
44715B013471J705847J272572k751696m131869l07719L234853J935708j198810
44707A772357j774025r82267j697415k367111k44858K585312K034268j023764
44699a697503j941695K87365J758568J42039j913967j288469J004433J807945
44691a841284M05162j105755j158998m72819l56822p19026n38261M19884J376993
$$ plain form
44682 -3990926 -2182951 -347290 938310 625675 -1602084 -4064430 -4364768 -2121206
44674 -2121206 697911 2250945 2369199 1547423 33400 -1524356 -2045316 -1409606 -644162
44665 -644162 -203196 483554 1299660 1154535 142749 -114029 666447 558085 -1066486
44656 -1066486 -1675705 553267 3341038 3650861 2528716 3240265 5871116 7439085 6807241
44647 6807241 5848979 5738500 5634608 5559502 7118704 10106724 11303502 8391821 3110417
44638 3110417 -951176 -2138024 -1119039 1056560 3920868 7232634 10320929 11534996
44630 11534996 8993620 3104519 -2509628 -4603748 -4211222 -4590476 -5976681 -5653443
44622 -5653443 -3186005 -1666559 -2640733 -3495770 -1828128 757200 1527946 651322 -77496
$$ packed form
44682c990926J807975J835661J285600l12635k227759k462346l00338K243562
44674b121206K819117J553034J18254q21776j514023j557756n20960O35710P65444
44665f44162M40966O86750Q16106j45125j011786k56778P80476j08362j624571
44656a066486o09219K228972K787771L09823j122145P11549K630851J567969o31844
44647F807241r58262j10479j03892p5106J559202K988020J196778k911681n281404
44638C110417m061593j186848J018985K175599K864308L311766L088295J214067
44630A1534996k541376n889101n614147k094120L92526l79254j386205L23238
44622e653443K467438J519446r74174q55037J667642K585328P70746q76624p28818
$$ plain form
44613 -77496 -220744 13858 1308712 3553137 4677652 3752049 3131287 4621824 5699389
44604 5699389 3142480 -1331596 -3219650 -1968596 -1141767 -2176130 -2585744 -1033882
44596 -1033882 276620 -70017 112516 2633282 5101321 4016793 -66649 -3156148
44588 -3156148 -2743453 -51868 2166082 2498034 1682358 1451210 2465152 3370995 2695597
44579 2695597 1382494 1742070 3775544 4790062 3426334 1661832 1409509 1504148 193687
44570 193687 -1391464 -1001908 799380 1404715 263534 -585354 63828 1256297 2095626
44561 2095626 2744126 2869902 1745425 656329 2473341 7308643 10956464 9757921
44553 9757921 5313144 2060052 1433874 1095834 -532817 -1803924 -599413 2439861
$$ packed form
44613g7496j43248K34602J294854K244425J124515r25603o20762J490537J077565
44604E699389k556909m474076j888054J251054Q26829j034363m09614J551862
44596a033882J310502l46637J82533K520766K468039j084528m083442l089499
44588c156148M12695K691585K217950L31952q15676k31148J013942R05843o75398
44579B695597j313103L59576K033474J014518j363728j764502k52323R4639j310461
44570A93687j585151L89556J801288O05335j141181q48888O49182J192469Q39329
44561B095626O48500J25776j124477j089096J817012M835302L647821j198543
44553I757921m444777l253092o26178l38040j628651j271107J204511L039274
$$ plain form
44545 2439861 4585406 3954293 1075875 -1785704 -2538311 -1182494 101832 -341294 -1043072
44536 -1043072 941759 5543135 8830579 7821544 4374505 2449366 2843587 3153023
44528 3153023 2355820 2404768 4528830 6559663 5658958 2115896 -1356376 -3065005 -3343691
44519 -3343691 -2948284 -2429603 -2725053 -4239343 -5176181 -2975524 1760402 4786213 3178742
44510 3178742 -707178 -2232413 -539433 743661 -1137906 -4418900 -5577082 -3926209
44502 -3926209 -1770743 -970629 -1193822 -1341433 -1039998 -452949 71652 -209392 -1753766
44493 -1753766 -3356203 -2860843 -215019 1556712 67292 -2640266 -2186411 2260823
44485 2260823 6347419 5616540 603113 -4296998 -5792779 -4183516 -1849068 -893959
$$ packed form
44545B439861K145545o31113k878418k861579p52607J355817J284326m43126p01778
44536a043072J984831M601376L287444j009035l447039j925139L94221L09436
44528C153023p97203M8948K124062K030833r00705l543062l472272j708629k78686
44519c343691L95407N18681k95450j514290r36838K200657M735926L025811j607471
44510C178742l885920j525235J692980J283094j881567l280994j158182J650873
44502c926209K155466Q00114k23193j47611L01435N87049N24601k81044j544374
44493a753766j602437M95360K645824J771731j489420k707558M53855M447234
44485B260823M086596p30879n013427m900111j495781J609263K334448R55109
$$ plain form
44477 -893959 -1889249 -3454766 -3233118 -609718 1794975 1037645 -1771526 -2244863 1241611
44468 1241611 4530084 2727478 -3191508 -7480997 -6867867 -3828787 -2030853 -1359398
44460 -1359398 468114 3207887 4014645 1956854 9519 1400967 5448090 8371250
44452 8371250 7577749 4007200 566647 -702462 86893 1253792 1059254 -821443 -2943999
44443 -2943999 -3444866 -1901918 431274 2261354 3443659 4082855 3294072 325059 -3022750
44434 -3022750 -2969200 1722853 6884690 6938652 1846586 -2371413 -1090174 3368537 5752488
44425 5752488 5359468 6000562 9186044 11437043 9516681 4931192 1127904 -1184256
44417 -1184256 -3325331 -5136528 -5088195 -2940267 231644 3924226 7728254 9759189
$$ packed form
44477h93959r95290j565517K21648K623400K404693p57330k809171m73337L486474
44468A241611L288473j802606n918986m289489O13130L039080J797934O71455
44460a359398J827512K739773Q06758k057791j947335J391448M047123K923160
44452H371250p93501l570549l440553j269109P89355J166899j94538j880697k122556
44443b943999n00867J542948K333192J830080J182305O39196p88783k969013l347809
44434c022750N3550M692053N161837N3962n092066m217999J281239M458711K383951
44425E752488l93020O41094L185482K250999j920362m585489l803288k312160
44417a184256k141075j811197M8333K147928L171911L692582L804028K030935
$$ plain form
44409 9759189 8331260 4880750 2533402 1965764 1532370 1311812 3387954 7285688 8854092
44400 8854092 5728984 1029916 -769346 595342 2216600 2721685 3170366 4417828
44392 4417828 6131557 7712318 8114899 5683001 372575 -4747194 -6607153 -6043958
44384 -6043958 -6105536 -7159607 -6752593 -4290014 -2535381 -3463367 -5384743 -5656058 -4078285
44375 -4078285 -2034232 -121487 1516653 1954424 689743 -671251 33750 2410391
44367 2410391 3622953 1871678 -1553352 -4144528 -5036871 -5266970 -5910527 -6994646 -8072875
44358 -8072875 -8749737 -8256845 -5620720 -1303043 2123982 2560417 1396528 2033549 5122249
44349 5122249 7504817 6873248 5070291 4796900 5179888 3594108 649468 -133034 2462261
$$ packed form
44409I759189j427929l450510k347348n67638m33394k20558K076142L897734J568404
44400H854092l125108m699068j799262J364688J621258N05085M48681J247462
44392D417828J713729J580761M02581k431898n310426n119769j859959N63195
44384f043958o1578j054071M07014K462579J754633r27986j921376k71315J577773
44375d078285K044053J912745J638140M37771j264681j360994P05001K376641
44367B410391J212562j751275l425030k591176q92343k30099o43557j084119j078229
44358h072875o76862M92892K636125M317677L427025M36435j163889O37021L088700
44349E122249K382568o31569j802957k73391L82988j585780k944640p82502K595295
$$ plain form
44340 2462261 5703779 7114197 7426934 8232118 9134918 8695437 6312504 1977736 -3871213
44331 -3871213 -8916643 -9570063 -5125586 253006 2005804 633023 386915 3177575
44323 3177575 6325759 6553691 3925787 875013 -1100995 -2384511 -3544562 -4116623
44315 -4116623 -3499701 -2372869 -2246009 -3335232 -3748696 -1748345 1623606 3475777 2637019
44306 2637019 949894 685851 2030244 3723275 4832684 4927321 3634332 1283158 -650409
44297 -650409 -854682 367072 1618385 1889679 954698 -977282 -3145214 -4256898 -3523693
44288 -3523693 -1638369 -303694 -725566 -2336347 -2723740 379919 5943883 9322116
44280 9322116 7002471 1201652 -2635419 -2613023 -1576416 -1437055 -506098 1916047 2738414
$$ packed form
44340B462261L241518J410418L12737Q05184R02800m39481k382933m334768n848949
44331c871213n045430o53420M444477N378592J752798j372781k46108K790660
44323C177575L148184K27932k627904l050774j976008j283516j160051n72061
44315d116623O16922J126832J26860j089223m13464K000351L371951J852171q38758
44306B637019j687125k64043J344393J693031J109409R4637j292989k351174j933567
44297f50409k04273J221754J251313K71294r34981j931980k167932j111684P33205
44288c523693J885324J334675m21872j610781l87393L103659N563964L378233
44280I322116k319645n800819l837071K2396J036607J39361R30957K422145Q22367
$$ plain form
44271 2738414 232766 -1630280 1492709 7087692 8917507 6050138 3411838 3532248
44263 3532248 3287680 244627 -2686082 -1680842 2314805 5302892 5499803 4326267
44255 4326267 3584176 3820116 4595221 4797239 3432557 1169458 190727 1672675 4381562
44246 4381562 6336341 6651371 5351576 3074021 1654388 3146294 7150660 10677762
44238 10677762 11602212 10554761 8547603 5085503 332246 -3063778 -2804185 -228121
44230 -228121 1683855 2598096 4550933 7842623 9825511 8297185 4375633 1318606
44222 1318606 1312041 3614473 5389535 4631644 2538926 2097754 3952576 5359190 4396072
44213 4396072 3294381 5341346 9739414 12267778 10674874 6909312 3956806 2762631
$$ packed form
44271B738414k505648j863046L122989N594983J829815k867369k638300J20410
44263C532248k44568l043053k930709J005240L995647K988087J96911j173536
44255D326267p42091K35940P75105K02018j364682k263099r78731J481948K708887
44246D381562J954779L15030j299795k277555j419633J491906M004366L527102
44238A0677762R24450j047451k007158l462100m753257l396024K59593K576064
44230b28121J911976R14241J952837L291690J982888j528326l921552l057027
44222A318606o565K302432J775062p57891k092718m41172J854822J406614r63118
44213D396072j101691K046965M398068K528364j592904l765562k952506j194175
$$ plain form
44205 2762631 2640211 2696405 2272127 1487819 1550896 2991301 3841030 1806208 -1709994
44196 -1709994 -2582464 191911 2564788 1136589 -1804024 -1577584 2332136 6077494
44188 6077494 6894735 5613959 3900760 2231903 1411148 3085136 6893448 9288297
44180 9288297 7604101 4037148 3031149 5304494 7209124 6202122 4108239 3697789
44172 3697789 4456509 3941902 1838361 168819 152435 1256725 3102514 5778294 7998975
44163 7998975 7570703 4692775 2515207 2966760 3988905 2714172 -273872 -2086152
44155 -2086152 -1802640 -1103129 -1037750 -674193 599516 1482110 615012 -1028531 -843748
44146 -843748 2239037 5814496 6002413 2073305 -1598510 -36725 5789064 9449749
$$ packed form
44205B762631j22420N6194m24278p84308O3077J440405Q49729k034822l516202
44196a709994q72470K774375K372877j428199k940613K26440L909720L745358
44188F077494Q17241j280776j713199j668857q20755J673988L808312K394849
44180I288297j684196l566953j005999K273345J904630j007002k093883m10450
44172C697789P58720n14607k103541j669542j6384J104290J845789K675780K220681
44163G998975m28272k877928k177568M51553J022145j274733k988044j812280
44155b086152K83512O99511O5379L63557J273709Q82594q67098j643543J84783
44146h43748L082785L575459J87917l929108l671815J561785N825789L660685
$$ plain form
44138 9449749 7240387 3021276 2398882 4715956 4880428 1754825 -283464 1360834
44130 1360834 3392391 1879508 -2049093 -4598003 -4894142 -5104121 -6302095 -6981907 -5313970
44121 -5313970 -1131284 3889443 6914720 5917161 2332301 487512 2623897 5702645
44113 5702645 5409946 2462663 2057234 6746374 12445950 12956132 7157221 271240 -1765153
44104 -1765153 1675825 5646108 4969037 -601549 -6654075 -8760602 -5903722 -2349
44096 -2349 5871574 8392384 5450021 -1482224 -7646244 -9347512 -7390571 -5175610 -4569528
44087 -4569528 -5001322 -5255122 -4216298 -873831 4269772 8461885 9388798 7912036 6128970
44078 6128970 3844148 -162006 -4159765 -4518164 -1120399 1858243 1719060 502578
$$ packed form
44138I449749k209362m219111o22394K317074J64472l125603k038289J644298
44130A360834K031557j512883l928601k548910k96139k09979j197974o79812J667937
44121e313970M182686N020727L025277r97559l584860j844789K136385L078748
44113E702645k92699k947283m05429M689140N699576N10182n798911o885981k036393
44104a765153L440978L970283o77071n570586o052526k106527K856880N901373
44096b349N873923K520810k942363o932245o164020j701268J956941K214961O06082
44087d569528m31794k53800J038824L342467N143603M192113R26913j476762j783066
44078F128970k284822m006154l997759l58399L397765K978642j39183j216482
$$ plain form
44070 502578 940293 2426635 3387724 4769508 7920307 10902501 10514052 7245040 4950838
44061 4950838 5630771 7408954 8103208 8132357 8777624 9544740 8772092 5918056 2155880
44052 2155880 -773980 -1655222 -333356 2102145 3919256 4108794 3273352 3037831 4453206
44043 4453206 6781674 7894877 6321694 3034589 645681 609457 1935782 2979732
44035 2979732 3455324 3898776 4209477 4076523 4240675 5806105 8389965 10252080 10387918
44026 10387918 9479174 8701765 8542479 8842044 9025175 8115898 5434337 1642529 -1427127
44017 -1427127 -2188956 -400919 2713729 5029676 5010611 3522182 3330618 5589840 7723227
44008 7723227 6504382 2515500 -651375 -1267451 -903883 -734203 659635 4396753 8540076
$$ packed form
44070E02578M37715J486342R61089J381784L150799K982194l88449l269012k294202
44061D950838O79933J778183O94254K9149O45267P67116p72648k854036l762176
44052B155880k929860q81242J321866K435501J817111J89538q35442k35521J415375
44043D453206K328468J113203j573183l287105k388908l6224J326325J043950
44035B979732M75592M43452L10701j32954J64152J565430K583860J862115J35838
44026A0387918r08744p77409j59286K99565J83131r09277k681561l791808l069656
44017a427127p61829J788037L114648K315947j9065j488429j91564K259222K133387
44008G723227j218845l988882l166875o16076L63568J69680J393838L737118M143323
$$ plain form
43999 8540076 10213753 9131497 7298594 6140901 5388542 4112386 1741270 -1311995
43991 -1311995 -3366400 -2868140 -673295 587456 265784 888576 4212218 8146739 9672686
43982 9672686 8984439 8171352 7366319 5405009 3370897 3834041 6428678 7536396 5245492
43973 5245492 1926442 810552 2254308 4482431 6058208 6456165 5784646 4955995 4865475
43964 4865475 4903730 3778469 2025582 1694350 3163411 4624719 5336439 6621507 8527669
43955 8527669 8606470 6033926 4036661 5389596 7865177 7563239 5086283 4537126 7029525
43946 7029525 9028784 7535029 3738553 673541 -224310 699200 2364754 3099953 1511450
43937 1511450 -1608284 -3468232 -2271541 882858 3530081 4222219 3072237 1138600
$$ packed form
43999H540076J673677j082256j832903j157693p52359j276156k371116l053265
43991a311995k054405M98260K194845J260751l21672O22792L323642L934521J525947
43982I672686o88247q13087q05033j961310k034112M63144K594637J107718k290904
43973E245492l319050j115890J443756K228123J575777L97957o71519q28651r0520
43964D865475L8255j125261j752887l31232J469061J461308P11720J285068J906162
43955H527669P8801k572544j997265J352935K475581l01938k476956n49157K492399
43946G029525J999259j493755l796476l065012q97851R23510J665554P35199j588503
43937A511450l119734j859948J196691L154399K647223O92138j149982j933637
$$ plain form
43929 1138600 -255816 -620007 -1044509 -2827957 -5154318 -5351283 -1880323 3860756 8855143
43920 8855143 10637335 8459538 3939753 663755 1364147 4937094 7636511 7446351
43912 7446351 5623956 3864238 2374392 1525755 2706511 5748798 7704163 6506402
43904 6506402 4338845 4891940 8240276 10927054 10665849 8571964 6768706 6010312 6056975
43895 6056975 6447332 6147021 3962874 273861 -2654619 -2990522 -1358233 182505 718054
43886 718054 1234865 2846562 5046587 6358770 6525324 7042719 8907841 10783014 10786982
43877 10786982 9525416 9310695 10326728 10065488 7528891 5409686 6107339 7713805
43869 7713805 6766440 3683039 2254684 4065433 6519754 6890730 5633070 4677829 4640865
$$ packed form
43929A138600j394416l64191m24502j783448k326361j96965L470960N741079M994387
43920H855143J782192k177797m519785l275998P00392L572947K699417j90160
43912G446351j822395j759718j489846q48637J180756L042287J955365j197761
43904F506402k167557N53095L348336K686778k61205k093885j803258p58394M6663
43895F056975L90357l00311k184147l689013k928480l35903J632289J540738N35549
43886G18054N16811J611697K200025J312183J66554N17395J865122J875173L968
43877A0786982j261566k14721J016033k61240k536597k119205O97653J606466
43869G713805r47365l083401j428355J810749K454321L70976j257660r55241l6964
$$ plain form
43860 4640865 5098453 6111544 8057241 10714926 13405759 15487104 16371604 15866707 14726434
43851 14726434 13943791 13359358 12027212 10020561 8575060 8245304 8301098 8253488 8554727
43842 8554727 9404995 10322129 11307369 12870757 14381030 14064584 11391586 7957971 5425325
43833 5425325 4293202 5115534 8426113 12304400 12759048 8665258 4088253 3205047 4900634
43824 4900634 5386755 4513683 5701581 10131682 14744253 16489222 15530236 13611327 12136897
43815 12136897 12791439 17148110 23879307 28421307 27390811 22222944 17081853 14312445
43807 14312445 13302310 12807518 12746605 13804501 16135490 18537195 19025426 16935502 14261945
43798 14261945 13656710 15103159 16180598 15833328 15845024 17766618 20417025 21792410 21751506
$$ packed form
43860D640865M57588J013091J945697K657685K690833K081345Q84500n04897j140273
43851A4726434p82643n84433j332146k006651j445501l29756N5794m7610L01239
43842H554727Q50268R17134R85240J563388J510273l16446k672998l433615k532646
43833E425325j132123Q22332L310579L878287M54648m093790m577005q83206J695587
43824D900634M86121q73072J187898M430101M612571J744969r58986j918909j474430
43815A2136897O54542M356671O731197M542000j030496n167867n141091k769408
43807A4312445j010135m94792o0913J057896K330989K401705M88231k089924k673557
43798A4261945o05235J446449J077439l47270J1696J921594K650407J375385m0904
$$ plain form
43789 21751506 21266114 20547762 19651312 19537512 20568124 21149848 20054047 19037399 20551414
43780 20551414 23398438 23618097 20102808 16707161 17585167 22187645 26179036 26289300
43772 26289300 23224293 20322457 19990892 21343490 21512712 19578467 18182057 19946309
43764 19946309 23299784 24153801 21473206 18477960 17706645 17619940 15649916 12387433 10544851
43755 10544851 11147140 13028995 15349960 18324707 21497128 23236114 22535854 20240669
43747 20240669 18113438 17438449 18651881 21485935 25050732 28161962 29876208 29731779
43739 29731779 27777416 24719909 21861934 20481082 21087699 23089798 24981726 25274482
43731 25274482 23909773 22475186 22237344 22438553 21760366 20902967 21706597 23769660 24400618
$$ packed form
43789B1751506m85392p18352q96450j13800J030612N81724j095801j016648J514015
43780B0551414K847024K19659l515289l395647Q78006M602478L991391J10264
43772B6289300l065007k901836l31565J352598J69222j934245j396410J764252
43764A9946309L353475Q54017k680595k995246p71315q6705j970024l262483j842582
43755A0544851O02289J881855K320965K974747L172421J738986p00260k295185
43747B0240669k127231o74989J213432K834054L564797L111230J714246j44429
43739B9731779j954363l057507k857975j380852O06617K002099J891928K92756
43731B5274482j364709j434587k37842K01209o78187q57399Q03630K063063O30958
$$ plain form
43722 24400618 22592957 20551524 20091502 20030781 18843185 17420995 16954179 16372489 14667565
43713 14667565 13715059 15508647 18226295 18713404 17658344 18260427 20454675 20803954 18082133
43704 18082133 14598454 11654820 8347088 5763883 7262177 12439473 15570080 13057057
43696 13057057 8375254 6274551 6022904 4581929 2996061 4338277 7407853 7984766
43688 7984766 5605032 4029454 4953536 5926269 5174019 4198296 4297808 4251655 3243417
43679 3243417 3062048 5326573 8681914 10662730 10802434 10299997 9814480 9045907 7807286
43670 7807286 6479602 5703640 5947519 7032863 8287447 9637312 11799689 14599438
43662 14599438 16361035 16397488 16638549 18730499 21017308 21086379 19873653 19842320 20281167
$$ packed form
43722B4400618j807661k041433m60022o0721j187596j422190m66816n81690j704924
43713A4667565r52506J793588K717648M87109j055060O02083K194248L49279k721821
43704A8082133l483679k943634l307732k583205J498294N177296L130607k513023
43696A3057057m681803k100703k51647j440975j585868J342216L069576N76913
43688G984766k379734j575578R24082R72733p52250r75723R9512m6153j008238
43679C243417j81369K264525L355341J980816J39704n02437m85517p68573j238621
43670G807286j327684p75962K43879J085344J254584J349865K162377K799749
43662A4599438J761597L6453K41061K091950K286809O9071j212726l1333M38847
$$ plain form
43653 20281167 18612642 15769021 15406811 17487869 17813872 15124447 13356466 14789634
43645 14789634 16336616 15758800 16268830 20481741 24366671 22867783 18270549 16783385
43637 16783385 18762517 18748860 14685390 10979842 11603639 15280754 18882120 21281987
43629 21281987 22261473 21268637 19024875 17462628 16741407 15121807 12892672 13241168 17460537
43620 17460537 22037478 22676503 19392381 15894420 15472511 18787583 24037337 27920804
43612 27920804 27856994 24441185 20622994 18093093 16235410 14836839 15138310 17223022
43604 17223022 19108619 19898239 21164033 23483166 24554134 23286743 22919082 26432088
43596 26432088 30779368 29961260 23335631 16840780 15423276 17727968 19537967 19516158
$$ packed form
43653B0281167j668525k843621l62210K081058L26003k689425j767981J433168
43645A4789634J546982n77816N10030M212911L884930j498888m597234j487164
43637A6783385J979132j3657m063470l705548O23797L677115L601366K399867
43629B1281987R79486r92836k243762j562247p21221j619600k229135L48496M219369
43620A7460537M576941O39025l284122l497961m21909L315072N249754L883467
43612B7920804o3810l415809l818191k529901j857683j398571L01471K084712
43604A7223022J885597P89620J265794K319133J070968j267391l67661L513006
43596B6432088M347280q18108o625629o494851j417504K304692J809999k1809
$$ plain form
43588 19516158 19411589 20348268 21315436 21046900 19777905 18737989 18555105 18535852 17474523
43579 17474523 15081392 12447223 10938561 10739514 10714464 9805888 8527958 8772817 11609417
43570 11609417 15446825 17613456 18150622 20147536 24800792 28270422 26538767 22003661
43562 22003661 20924465 24391623 26794113 24670599 21856137 22567217 24023843 21002777
43554 21002777 14746135 11563422 13707950 17051346 17813649 16717900 15735029 15062145
43546 15062145 14650026 15132505 15828849 14839732 12282573 10559221 10470588 10116100 8619239
43537 8619239 7610271 7759157 7428744 6533046 7985004 12718725 16686426 16108012 13050132
43528 13050132 12314192 14864728 17796528 19047945 18597042 16453131 13191071 11474690
$$ packed form
43588A9516158j04569R36679R67168k68536j268995j039916j82884j9253j061329
43579A7474523k393131k634169j508662j99047k5050r08576j277930K44859K836600
43570A1609417L837408K166631N37166J996914M653256L469630j731655m535106
43562B2003661j079196L467158K402490k123514k814462P11080J456626l021066
43554B1002777o256642l182713K144528L343396P62303j095749r82871o72884
43546A5062145m12119M82479O96344r89117k557159j723352q8633l54488j496861
43537H619239j008968J48886l30413q95698J451958M733721L967701n78414l057880
43528A3050132p35940K550536K931800J251417m50903k143911l262060j716381
$$ plain form
43520 11474690 13344427 16647342 17763624 17251193 18765408 22521334 24284399 21812254
43512 21812254 18168772 16820301 16916560 15819858 13628062 12447727 12801261 13239790 12749380
43503 12749380 11779458 11366046 12236481 14065536 15090601 13749073 11288424 11019095 13961420
43494 13961420 17059031 17183831 15251277 14511357 16072004 18208797 19288625 19287676 18739130
43485 18739130 17973864 17341707 16811754 15564585 13275395 11442279 11879698 13947645 14875740
43476 14875740 13266068 11042289 11230242 14500411 18569456 20785530 20737295 19961200 19306863
43467 19306863 17729184 14635854 12294268 13618509 17692732 20281417 19644052 18917299
43459 18917299 20947760 23695992 23729336 21995393 22360101 25729987 29623074 32917202
$$ packed form
43520A1474690J869737L302915J116282n12431J514215L755926J763065k472145
43512B1812254l643482j348471R6259j096702k191796j180335L53534M38529m90410
43503A2749380r69922m13412Q70435J829055J025065j341528k460649k69329K942325
43494A3961420L097611J24800j932554p39920J560647K136793J079828r49n48546
43485A8739130p65266o32157n29953j247169k289190j833116M37419K067947R28095
43476A4875740j609672k223779J87953L270169M069045K216074m8235p76095o54337
43467A9306863j577679l093330k341586J324241M074223K588685o37365p26753
43459A8917299K030461K748232L3344j733943L64708L369886L893087L294128
$$ plain form
43451 32917202 36709424 40312606 40984398 39008543 38906876 43355028 49293691 52692503
43443 52692503 54258310 57388623 62775186 68347762 72961227 76874958 79793245 81836354
43435 81836354 85761511 94713788 107763933 120928395 132992622 147069861 165423372
43428 165423372 186015037 206284058 227924274 255070713 288750827 325729904 362767466
43421 362767466 399739887 437625997 474654058 505586289 524528383 527908749 515318511
43414 515318511 488883235 452570675 411382394 369929707 331249343 296919533 267562992
43407 267562992 242351501 218803304 195009483 172339657 154156740 141200183 130115997
43400 130115997 117766177 105247853 95872571 90465510 86702012 82273267 76638738 70067952
$$ packed form
43451C2917202L792222L603182O71792j975855j01667M448152N938663L398812
43443E2692503J565807L130313N386563N572576M613465L913731K918287K043109
43435H1836354L925157Q952277J3050145J3164462J2064227J4077239J8353511
43428A65423372K0591665K0269021K1640216K7146439L3680114L6979077L7037562
43421C62767466L6972421L7886110L7028061L0932231J8942094L380366j2590238
43414E15318511k6435276l6312560m1188281m1452687l8680364l4329810k9356541
43407B67562992k5211491k3548197k3793821k2669826j8182917j2956557j1084186
43400A30115997j2349820j2518324r375282n407061l763498m428745n634529o570786
$$ plain form
43392 70067952 62912211 55810934 49210507 42953457 37473090 34361735 33942665 33412457
43384 33412457 30009553 25387103 23758331 25627220 26575742 23210065 17576410 14349997
43376 14349997 15738853 20259131 24545374 25395971 22128164 17929771 16751636 18028075
43368 18028075 17215787 12822574 9522450 11729177 17024619 19526444 17801570 15448270
43360 15448270 14792057 14163430 11770961 8748249 7121985 7142762 7893450 8939456 10303800
43351 10303800 11785727 12955082 13260495 12182652 9998355 8029670 7258916 7263297 7464511
43342 7464511 8426337 10428633 11774029 10533334 7389632 4774337 3755927 3871203
43334 3871203 5287614 8393050 11503386 11989850 10047702 8543164 8647765 8651524 7955297
$$ packed form
43392G0067952p155741p101277o600427o257050n480367l111355m19070n30208
43384C3412457l402904m622450j628772J868889R48522l365677n633655l226413
43376A4349997J388856M520278M286243Q50597l267807m198393j178135J276439
43368A8028075q12288m393213l300124K206727N295442K501825j724874k353300
43360A5448270o56213o28627k392469l022712j626264K0777P50688J046006J364344
43351A0303800J481927J169355L05413j077843k184297j968685p70754M381K01214
43342G464511R61826K002296J345396j240695l143702k615295j018410J15276
43334C871203J416411L105436L110336M86464j942148j504538J04601L759o96227
$$ plain form
43325 7955297 8863542 12538222 16084390 16244627 13947731 12503517 12722762 12584229 10994299
43316 10994299 9302709 9137561 10640418 12904039 14720750 14942867 13349635 11184940
43308 11184940 10011432 10290426 11716115 14175354 17337345 19994035 21047462 20741842
43300 20741842 19941653 18813516 17311011 16234517 16419003 17332181 17795887 17643187 17297448
43291 17297448 16222021 13495656 9816830 7281046 6980396 8216882 10186862 12861250
43283 12861250 15785556 17550997 17317585 15873156 14530870 13890167 14213758 15848637
43275 15848637 18257854 19519609 18132382 15077183 12982924 13237728 14858044 16279535
43267 16279535 17129915 17635402 17312227 15574015 13330852 12452389 13202000 13583207 12229322
$$ packed form
43325G955297R08245L674680L546168J60237k296896j444214K19245j38533j589930
43316A0994299j691590j65148J502857K263621J816711K22117j593232k164695
43308A1184940j173508K78994J425689K459239L161991K656690J053427l05620
43300B0741842q00189j128137j502505j076494J84486R13178M63706j52700l45739
43291A7297448j075427k726365l678826k535784l00650J236486J969980K674388
43283A2861250K924306J765441k33412j444429j342286o40703L23591J634879
43275A5848637K409217J261755j387227l055199k094259K54804J620316J421491
43267A6279535Q50380N05487l23175j738212k243163q78463P49611L81207j353885
$$ plain form
43258 12229322 10834719 12266520 16905119 22409136 26694764 29464908 31082487 31943433
43250 31943433 33026848 34913927 35977403 33983317 30128957 28702775 31470611 35353704
43242 35353704 37643260 40393030 46495821 54032834 58751060 60763010 64372631 71699286
43234 71699286 80787630 90179779 100936290 113168580 124859147 135878537 149228988
43227 149228988 165832568 181495721 192068356 198840090 205396593 211227446 212261609
43220 212261609 206661107 196449954 183756172 168876929 152522497 137048209 124171529
43213 124171529 113060369 101654854 89141866 76946347 67826597 63362593 61415364
43206 61415364 57211658 48639519 39434899 34839084 34794516 34208059 29849815 23945389
$$ packed form
43258A2229322j394603J431801M638599N504017M285628K770144J617579Q60946
43250C1943433J083415J887079J063476j994086l854360j426182K767836L883093
43242C5353704K289556K749770O102791P537013M718226K011950L609621P326655
43234G1699286R088344R392149J0756511J2232290J1690567J1019390J3350451
43227A49228988J6603580J5663153J0572635O771734O556503N830853J034163
43220B12261609n600502j0211153j2693782j4879243j6354432j5474288j2876680
43213A24171529j1111160j1405515j2512988j2195519r119750m464004j947229
43206F1415364m203706q572139r204620m595815m4568n86457m358244n904426
$$ plain form
43198 23945389 20197539 19120211 18846378 18354550 17992779 18078327 18429623 18378567 16584153
43189 16584153 12426786 8331041 8357278 12772096 16279533 14237148 8890222 6215789
43181 6215789 7666457 8931469 6986376 4256237 4084095 5432972 5007451 2757178
43173 2757178 2103715 5130811 10039953 13494008 13504627 9773466 3303088 -3212769 -6133751
43164 -6133751 -3814804 1335869 4893359 4756824 2825065 2208326 3585902 5086752
43156 5086752 5361459 5389578 6466694 7410429 5552119 780804 -3058252 -2079828 3148757
43147 3148757 8432164 10879179 11437485 12347747 13746767 13904672 11928236 8872170 6268506
43138 6268506 4623242 3712167 3622243 4731359 6675178 7962544 7183091 4602691 2134231
$$ packed form
43198B3945389l747850j077328k73833m91828l61771Q5548L51296n1056j794414
43189A6584153m157367m095745K6237M414818L507437k042385n346926k674433
43181F215789J450668J265012j945093k730139j72142J348877m25521k250273
43173B757178o53463L027096M909142L454055J0619l731161o470378o515857k920982
43164f133751K318947N150673L557490j36535j931759o16739J377576J500850
43156E086752K74707K8119J077116R43735j858310m771315l839056R78424N228585
43147C148757N283407K447015N58306R10262J399020J57905j976436l056066k603664
43138F268506j645264r11075q9924J109116J943819J287366p79453k580400k468460
$$ plain form
43129 2134231 1529639 2896150 5130192 7297162 9136404 10621615 11660105 12067386
43121 12067386 11360636 8843569 4497672 -340044 -3657730 -4031098 -1236885 3405457
43113 3405457 6829700 5929110 1118687 -2839115 -1659537 3337044 7026186 6845187
43105 6845187 4732001 3054463 2060231 2025584 4251372 8108700 10230734 8954627 6949602
43096 6949602 7104209 8486813 9073142 9659753 11602139 13197561 12504137 11810731 14628702
43087 14628702 19491396 21630418 20103153 18192073 17088802 14841301 12119055 13019060
43079 13019060 18215467 22713963 23092316 22284947 24276722 28368265 31874013 34624580
43071 34624580 37657299 41131416 46467057 56715557 72401406 92097727 119457713
$$ packed form
43129B134231o04592J366511K234042K166970J839242J485211J038490M07281
43121A2067386p06750k517067m345897m837716l317686l73368K794213M642342
43113C405457L424243r00590m810423l957802J179578M996581L689142j80999
43105F845187k113186j677538r94232l4647K225788L857328K122034j276107k005025
43096F949602J54607J382604N86329N86611J942386J595422o93424o93406K817971
43087A4628702M862694K139022j527265j911080j103271k247501k722246R00005
43079A3019060N196407M498496L78353q07369J991775M091543L505748K750567
43071C4624580L032719L474117N335641J0248500J5685849J9696321K7359986
$$ plain form
43064 119457713 161038924 210076165 240622283 230291265 186580264 139606418 109808252
43057 109808252 94327323 84862105 83137452 91200010 98784791 92790790 74237152 55438473
43049 55438473 43031645 33161976 22339148 13687975 10598952 11253659 12303081 13002095
43041 13002095 13114284 10948966 6457866 3091008 3432409 5126009 4137957 666128
43033 666128 -1265609 329205 2906369 3525728 3084773 4466870 7680625 9544932 8552458
43024 8552458 7293519 8216836 9286970 7017808 2434650 -141123 -49109 -1183723 -4670834
43015 -4670834 -5849620 -1765795 2918149 2347227 -1489151 -1982520 1652241 3593746
43007 3593746 1024262 -1812655 -852265 1943772 2789572 1777823 953372 -33959 -2536625
$$ packed form
43064A19457713M1581211M9037241L0546118j0331018m3711001m6973846k9798166
43057A09808252j5480929r465218j724653Q062558P584781n994001j8553638j8798679
43049E5438473j2406828r869669j0822828q651173l089023O54707J049422O99014
43041A3002095J12189k165318m491100l366858L41401J693600r88052l471829
43033F66128j931737J594814K577164O19359m40955J382097L213755J864307r92474
43024H552458j258939R23317J070134k269162m583158k575773R2014j134614l487111
43015d670834j178786M083825M683944n70922l836378m93369L634761J941505
43007C593746k569484k836917R60390K796037Q45800j011749q24451r87331k502666
$$ plain form
42998 -2536625 -5199321 -5275345 -2717491 -132996 672671 -139367 -1850236 -3458171 -3304557
42989 -3304557 -801971 1890254 2089149 88469 -1726998 -2760986 -4462666 -6593301
42981 -6593301 -6324313 -2457676 1788154 2285484 -914522 -3896224 -3650470 -758625 2512406
42972 2512406 4978829 6701401 7585701 7099356 5309629 3351791 2462844 2860406 3920474
42963 3920474 5225240 6849486 8515318 9178393 8166605 6473467 5978622 7055576
42955 7055576 7775347 6353724 4006260 4184861 8730603 15940074 23196491 30359104
42947 30359104 38913678 48177717 54371126 54127118 47581592 37429441 26529347 17411751
42939 17411751 12231771 10982083 10584436 7977201 3867611 1447041 1625620 1969124
$$ packed form
42998b536625k662696p6024K557854K584495Q05667q12038j710869j607935J53614
42989c304557K502586K692225J98895k000680j815467j033988j701680k130635
42981f593301K68988L866637M245830M97330l200006k981702K45754K891845L271031
42972B512406K466423J722572Q84300m86345j789727j957838q88947L97562J060068
42963C920474J304766J624246J665832O63075j011788j693138m94845J076954
42955G055576P19771j421623k347464J78601M545742P209471P256417P162613
42947C0359104Q554574R264039O193409k44008o545526j0152151j0900094r117596
42939A7411751n179980j249688l97647k607235m109590k420570J78579L43504
$$ plain form
42931 1969124 796336 -212444 1075806 3599577 4332707 2343463 -112291 -482435
42923 -482435 1175897 2316270 540250 -3696949 -6923726 -5845753 -999353 3455815
42915 3455815 3898407 550258 -3443723 -5187275 -4022025 -1599430 -563877 -2070343
42907 -2070343 -4068872 -3277811 568556 3967934 4045046 2020329 875314 1131837 951590
42898 951590 -592935 -2523733 -3778995 -4085355 -3235724 -1288674 558311 882506 -185588
42889 -185588 -1467035 -2730801 -4509464 -6049020 -5369702 -1822585 2880365 6572258
42881 6572258 8302569 8000384 6085953 3920240 3223468 4353362 6125163 7606149
42873 7606149 8939632 10295152 11613940 13852436 18644163 25508217 30661824 30132898
$$ packed form
42931A969124j172788j008780J288250K523771P33130j989244k455754l70144
42923d82435J658332J140373j776020m237199l226777J077973M846400M455168
42915C455815M42592l348149l993981j743552J165250K422595J035553j506466
42907b070343j998529P91061L846367L399378P7112k024717j145015K56523j80247
42898I51590j544525j930798j255262l06360Q49631J947050J846985L24195j068094
42889a85588j281447j263766j778663j539556O79318L547117M702950L691893
42881F572258J730311l02185j914431k165713o96772J129894J771801J480986
42873G606149J333483J355520J318788K238496M791727O864054N153607n28926
$$ plain form
42865 30132898 23760643 15347640 9174042 6762924 6553527 6227714 5343485 5334989 6641672
42856 6641672 7078498 4614305 825322 -794714 372167 1740633 2105286 3164511
42848 3164511 5324490 5530454 1766379 -3050505 -4783971 -3752661 -3402569 -4685227
42840 -4685227 -5327850 -4145421 -2622436 -2110054 -2526835 -4105780 -7297457 -10230817 -9448202
42831 -9448202 -4677221 -228333 312804 -1264744 -642031 3010992 6274524 6111334 3086772
42822 3086772 -85855 -1525120 -1218211 -139687 954411 2006210 3119345 3768782
42814 3768782 3118887 1291231 -419990 -1092963 -1309276 -2098447 -3287076 -3747965 -3088605
42805 -3088605 -2288163 -2547678 -4039083 -5963617 -7450220 -8048725 -7440210 -5184002 -1365973
$$ packed form
42865C0132898o372255q413003o173598k411118k09397l25813q84229q496J306683
42856F641672M36826k464193l788983j620036J166881J368466L64653J059225
42848C164511K159979K05964l764075m816884j733466J031310L50092j282658
42840d685227o42623J182429J522985N12382m16781j578945l191677k933360P82615
42831i448202M770981M448888N41137j577548O22713L653023L263532j63190l024562
42822C086772l172627j439265L06909J078524J094098J051799J113135O49437
42814C768782o49895j827656j711221o72973k16313p89171j188629m60889O59360
42805c088605Q00442k59515j491405j924534j486603n98505O08515K256208L818029
$$ plain form
42796 -1365973 2469130 3864870 1695908 -2450683 -5828469 -7172350 -7056909 -6161036
42788 -6161036 -4603245 -3051235 -2883046 -4417059 -6040038 -6038991 -4643496 -3472889 -3556802
42779 -3556802 -4677700 -6114979 -7149475 -7191161 -6300146 -5438900 -5438892 -5741274 -4814076 -1920121
42769 -1920121 1933155 4809365 5315670 3435067 360269 -2453704 -4341970 -5580205
42761 -5580205 -6467042 -6605906 -5480748 -3575037 -2392513 -3070595 -5009956 -6059165 -4327991
42752 -4327991 -23109 4583785 7108311 6809490 4478459 1378590 -1097416 -1486126
42744 -1486126 722178 4152593 6750283 8057412 9282674 10996004 12036011 11289798
42736 11289798 9499699 8444143 8890753 9998364 10400142 9589819 8568778 8904369 10349827
$$ packed form
42796a365973L835103J395740k168962m146591l377786j343881J15441Q95873
42788f161036J557791J552010J68189j534013j622979J047J395495J170607q3913
42779c556802j120898j437279j034496m1686Q91015Q61246Ql02382R27198K893955
42769a920121L853276K876210N06305j880603l074798k813973j888266j238235
42761e580205q86837j38864J125158J905711J182524o78082j939361j049209J731174
42752d327991M304882M606894K524526k98821k331031l099869k476006l88710
42744a486126K208304L430415K597690J307129J225262J713330J040007p46213
42736A1289798j790099j055556M46610J107611M01778q10323j021041L35591J445458
$$ plain form
42727 10349827 9892450 4900695 -2650238 -7188434 -5712307 -1095422 2054754 3001058
42719 3001058 4382907 7459983 10345211 10836575 9188311 7829028 9246211 13810922
42711 13810922 18882346 20881798 19314807 17667922 18940276 21580203 21809945 18760561
42703 18760561 14710454 11082259 7436604 4437277 4321774 7230613 9936395 10015200
42695 10015200 9149431 10278031 12968187 13786316 10695689 5446136 1705908 1751502 4829676
42686 4829676 8231411 10096045 11026490 12372987 13662454 13536729 13007848 15075063 20006559
42677 20006559 23443500 21263217 14786318 8986972 6600796 6340368 6415906 7230446 9914334
42668 9914334 13917940 17224421 18442613 18086858 17856369 18717603 19711120 18958587 15874161
$$ packed form
42727A0349827m57377m991755p550933m538196J476127M616885L150176R46304
42719C001058J381849L077076K885228M91364j648264j359283J417183M564711
42711A3810922N071424J999452j566991j646885J272354K639927K29742l049384
42703A8760561m050107l628195l645655k999327j15503K908839K705782P8805
42695A0015200q65769J128600K690156Q18129l090627n249553l740228M5594L078174
42686D829676L401735J864634R30445J346497J289467j25725n28881K067215M931496
42677B0006559L436941k180283o476899n799346k386176k60428P5538Q14540K683888
42668I914334M003606L306481J218192l55755k30489Q61234R93517p52533l084426
$$ plain form
42659 15874161 11832995 8619197 7039273 7148215 8546073 9825520 9016751 5737129
42651 5737129 2142860 718584 1676356 3336585 4389153 4866233 5417228 6450338 7638221
42642 7638221 7876979 6385126 4058138 2670328 2488754 2166849 1435916 1928536 4332950
42633 4332950 6824849 7869978 8592425 10399666 12095297 11709009 9688144 7813132
42625 7813132 6348127 4870753 4427163 5735203 6532383 4352045 1100343 881548 3645094
42616 3645094 5359685 4745155 5076147 8042617 10549911 9984960 8495204 8912903 9905808
42607 9905808 8831686 6661101 5967643 5876086 3342498 -1277500 -3996480 -2714379 387374
42598 387374 2496015 3238674 3194709 2008603 -368942 -2225490 -1648101 1015649 3370282
$$ packed form
42659A5874161m041166l213798j579924J08942J397858J279447q08769l279622
42651E737129l594269j424276R57772J660229J052568M77080N50995J033110J187883
42642G638221K38758j491853k326988j387810j81574l21905p30933M92620K404414
42633D332950K491899J045129P22447J807241J695631l86288k020865j875012
42625G813132j465005j477374m43590J308040P97180k180338l251702k18795K763546
42616C645094J714591o14530L30992K966470K507294n64951j489756M17699R92905
42607I905808j074122k170585o93458r1557k533588m619998k718980J282101L101753
42598C87374K108641P42659m3965j186106k377545j856548N77389K663750K354633
$$ plain form
42589 3370282 3440546 1321307 -1390535 -3130279 -3106214 -1049580 2703903 6394107 7278514
42580 7278514 4491903 934138 280923 2186865 2873036 855830 -888686 203994
42572 203994 2358077 2819467 2445967 3597108 5404145 5212067 3894969 5399136 10495496
42563 10495496 14866233 14927915 12593820 12266078 15096876 18247361 18703221 16134969 12492240
42554 12492240 9963899 9277143 9547227 9741633 9796842 9729649 8608518 5909417 3229686
42545 3229686 2646414 3595570 3612366 2313540 2149430 4399662 6832446 6881601 5369547
42536 5369547 5224932 7478111 10189853 11037534 9860483 8599204 9003810 10335615 9914368
42527 9914368 6768336 3769957 4265923 7280255 8791148 7710118 7217516 9174269
$$ packed form
42589C370282P0264k119239k711842j739744K4065K056634L753483L690204Q84407
42580G278514k786611l557765o53215J905942O86171k017206j744516J092680
42572B03994K154083M61390l73500J151141J807037j92078j317098J504167N096360
42563A0495496M370737O1682k334095l27742K830798L150485M55860k568252l642729
42554A2492240k528341o86756K70084J94406N5209o7193j121131k699101k679731
42545C229686n83272R49156J6796j298826j64110K250232K432784M9155j512054
42536E369547j44615K253179K711742Q47681j177051j261279M04606J331805m21247
42527I914368l146032k998379M95966L014332J510893j081030m92602J956753
$$ plain form
42519 9174269 10726099 8683111 4462134 1916234 2352383 4511834 7600258 11097383
42511 11097383 12974803 11753726 9766907 10820464 14524903 16220650 13069475 7293140
42503 7293140 2644584 499754 514471 2406164 5339246 7530761 8222588 8659771 9843139
42494 9843139 10923122 11227011 12088322 14619317 16990048 16328070 12736237 9152767 7394274
42485 7394274 6555621 5577799 5147002 6053532 7486185 8473024 9784562 12531664 15397968
42476 15397968 15372061 11737867 7657074 6597672 8182264 8979848 6937090 3502275
42468 3502275 1325860 1370121 2823822 4522087 5445904 4753733 2559648 346580 -293333
42459 -293333 873096 2988949 5183407 6685518 6754309 5646378 4917098 5395849 5606804
$$ packed form
42519I174269J551830k042988m220977k545900M36149K159451L088424L497125
42511A1097383J877420j221077j986819J053557L704439J695747l151175n776335
42503G293140m648556k144830J4717J891693K933082K191515O91827M37183J183368
42494I843139J079983L03889Q61311K530995K370731o61978l591833l583470j758493
42485G394274q38653r77822m30797R06530J432653R86839J311538K747102K866304
42476A5397968k5907l634194m080793j059402J584592P97584k042758l434815
42468C502275k176415M4261J453701J698265R23817o92171k194085k213068o39913
42459b93333J166429K115853K194458J502111O8791j107931p29280M78751K10955
$$ plain form
42450 5606804 4034155 2402253 4145470 9238587 13220696 12777456 10116122 9686905
42442 9686905 12061660 13662004 11976077 8366830 5410163 3952730 3953845 6128009 10601423
42433 10601423 14850239 15324412 11520242 6908502 5158749 6497394 8382253 8624429
42425 8624429 6888617 4153446 2072647 2136785 3830172 4159296 1060614 -2961624 -3268634
42416 -3268634 305977 2406365 -475740 -4559421 -3951864 709320 2989978 -411467
42408 -411467 -5755804 -8216600 -7877661 -7656156 -8138142 -7338874 -4153604 369892 4420543
42399 4420543 6372293 5362791 2716336 1798747 4423181 8072398 8736791 6002111
42391 6002111 3100065 2102277 1523098 -751214 -4276883 -6861730 -7130376 -5344726 -2824000
$$ packed form
42450E606804j572649j631902J743217N093117L982109m43240k661334m29217
42442I686905K374755J600344j685927l609247k956667j457433J115K174164M473414
42433A0601423M248816M74173l804170m611740j749753J338645J884859K42176
42425H624429j735812k735171k080799O4138J693387L29124l098682m022238l07010
42416c268634L574611K100388k882105m083681O07557M661184K280658l401445
42408d11467n344337k460796L38939K21505m81986P99268L185270M523496M050651
42399D420543J951750j009502k646455r17589K624434L649217O64393k734680
42391F002111k902046r97788n79179k274312l525669k584847k68646J785650K520726
$$ plain form
42382 -2824000 -1364913 -2107081 -4043990 -4643659 -2917959 -916024 -968560 -2296864 -2045762
42373 -2045762 499626 2523058 1209504 -2549882 -5155541 -4536047 -2191852 -868812
42365 -868812 -1289211 -2001859 -1836320 -1228539 -977258 -873755 -239219 1052814 2917594
42356 2917594 5549925 8362394 9206811 6503284 2022090 -481532 171786 1503673
42348 1503673 1724592 2606542 5852659 8782161 7199119 1852410 -1858128 -1211120 575841
42339 575841 24109 -1389896 -735630 657205 -655037 -3891847 -4742392 -2386757 -970685
42330 -970685 -2765301 -4431101 -2709535 30395 -395493 -3380425 -4910494 -3886261
42322 -3886261 -2722409 -2384173 -1275737 609073 655432 -1865609 -3683595 -1894283 1960180
$$ packed form
42382b824000J459087p42168j936909n99669J725700K001935n2536j328304K51102
42373b045762K545388K023432j313554l759386k605659O19494K344195J323040
42365h68812m20399p12648J65539O07781K51281J03503O34536J292033J864780
42356B917594K632331K812469Q44417k703527m481194k503622O53318J331887
42348A503673K20919Q81950L246117K929502j583042n346709l710538O47008J786961
42339E75841n51732j414005O54266J392835j312242l236810q50545K355635J416072
42330i70685j794616j665800J721566K739930m25888k984932j530069J024233
42322c886261J163852L38236J108436J884810M6359k521041j817986J789312L854463
$$ plain form
42313 1960180 4056110 2854831 82998 -1410104 220083 4327150 7724513 7788264
42305 7788264 5882106 5371861 6117190 4517406 99913 -2325448 144487 3194789
42297 3194789 1302351 -4013020 -6853303 -5748632 -4286777 -3900026 -1949561 2352631
42289 2352631 5578087 5467134 4163956 3841257 3086655 336641 -2566924 -3400960 -3310050
42280 -3310050 -4105472 -4122213 -740684 4206766 5666024 2119990 -2216720 -2770899 280649
42271 280649 3244106 3334002 685254 -2740656 -4889348 -4667186 -2307466 945667 3664325
42262 3664325 5119808 5785789 6834696 8474448 8956165 6459202 2171343 -186748
42254 -186748 1060698 2962707 1629286 -2541878 -5494168 -5096109 -3781909 -4845735
$$ packed form
42313A960180K095930j201279k771833j493102J630187M107067L397363O3751
42305G788264j906158n10245P45329j599784m417493k425361K469935L050302
42297C194789j892438n315371k840283J104671J461855L86751J950465M302192
42289B352631L225456j10953j303178l22699p54602k750014k903565q34036R0910
42280c310050p95422j6741L381529M947450J459258l546034m336710n54179L051548
42271B80649K963457Q9896k648748l425910k148692K22162K359720L253133K718658
42262C664325J455483O65981J048907J639752M81717k496963m287859k358091
42254a86748J247446J902009j333421m171164k952290L98059J314200j063826
$$ plain form
42246 -4845735 -7881721 -9491412 -7875233 -5059269 -4050359 -4855367 -4656103 -1891997
42238 -1891997 1408657 2445784 1563006 1386146 2566089 2934806 1424034 195605 1271063
42229 1271063 3144719 3027719 1091157 -102933 248257 262458 -1272214 -2978634 -3041011
42220 -3041011 -1405303 1149854 4608035 8938039 12468109 12585652 8466862 2550581
42212 2550581 -1208053 -708099 2747528 6308300 8506255 9718162 10285526 9802991 8585525
42203 8585525 8016972 8342596 7758470 5313384 3219501 3978235 6181551 5996165 2727286
42194 2727286 19171 734439 3193053 4005892 2702990 1546912 1830105 2490750 2344545
42185 2344545 2003439 2828106 4672282 5556937 3932949 985282 -134236 2105205 5447961
$$ packed form
42246d845735l035986j609691J616179K815964J008910q05008J99264K764106
42238a891997L300654J037127q82778j76860J179943L68717j510772j228429J075458
42229A271063J873656j17000j936562j194090L51190J4201j534672j706420o2377
42220c041011J635708K555157L458181M330004L530070J17543m118790n916281
42212B550581l758634M99954L455627L560772K197955J211907N67364m82535j217466
42203H585525n68553L25624n84126k445086k093883P58734K203316j85386l268879
42194B727286k708115P15268K458614Q12839j302902j156078K83193O60645j46205
42185B344545l41106Q24667J844176Q84655j623988k947667j119518K239441L342756
$$ plain form
42176 5447961 6259121 3759313 654007 -424689 283451 892917 643913 429230 1116128
42167 1116128 2324725 2980965 2706989 2471563 3697262 6607081 9755728 11481059 11432357
42158 11432357 10303549 8680079 6876505 5438260 5020822 6126742 9356045 14763254
42150 14763254 19993441 20736481 15381967 8344639 5870898 8527649 10813581 8891873
42142 8891873 5548627 5619983 9069549 11480425 10278508 7620791 6943900 8643475 9963342
42133 9963342 8303829 4084192 512509 541788 3967391 7721278 8977168 7586337
42125 7586337 5666403 5449412 7319879 9204030 8279333 4272645 415960 -330774 813979
42116 813979 533711 -1272384 -1443132 987966 2983159 2458361 1430011 1974629 2415731
$$ packed form
42176E447961Q11160k499808l105306j078696P08140O09466k49004k14683O86898
42167A116128J208597O56240k73976k35426J225699K909819L148647J725331m8702
42158A1432357j128808j623470j803574j438245m17438J105920L229303N407209
42150A4763254N230187P43040n354514p037328k473741K656751K285932j921708
42142H891873l343246P1356L449566K410876j201917k657717o76891J699575J319867
42133I963342j659513m219637l571683K9279L425603L753887J255890j390831
42125G586337j919934k16991J870467J884151r24697m006688l856685p46734J144753
42116H13979k80268j806095j70748K431098J995193n24798j028350N44618M41102
$$ plain form
42107 2415731 715267 -1085564 278733 3818427 5813314 5833315 7029773 10574954
42099 10574954 13812225 14452173 12990773 10122551 5303477 -589530 -4239524 -3622150
42091 -3622150 -686415 1449610 2188567 2724424 3341247 3294832 2268737 457871 -1861117
42082 -1861117 -3809422 -4247746 -3731396 -4582853 -7594620 -10222886 -9877754 -7627074 -6452624
42073 -6452624 -6886647 -6884703 -5486385 -3937972 -3100972 -2333643 -1612956 -2398033 -5084468
42064 -5084468 -7375558 -6783931 -3711283 -692097 625523 541399 110044 195611 1219762
42055 1219762 2654253 3162808 2241822 991364 29964 -2176282 -6640531 -10318219 -8595231
42046 -8595231 -1902497 3528306 3238316 -104816 -1341005 13875 740145 -54277 -333121
$$ packed form
42107B415731j700464j800831J364297L539694J994887K0001J196458L545181
42099A0574954L237271O39948j461400k868222m819074n893007l649994O17374
42091c622150K935735K136025P38957N35857O16823m6415j026095j810866k318988
42082a861117j948305m38324N16350q51457l011767k628266L45132K250680J174450
42073f452624m34023J944J398318J548413Q37000P67329P20687p85077k686435
42064e084468k291090N91627L072648L019186J317620q4124m31355Q5567J024151
42055A219762J434491N08555r20986j250458r61400k206246m464249l677688J722988
42046h595231O692734N430803k89990l343132j236189J354880P26270p94422k78844
$$ plain form
42037 -333121 264661 -101321 -1137870 -185605 2514077 2853392 -680342 -3706510 -2128789
42028 -2128789 1884135 3689033 3038325 2976491 3975912 3863603 2686819 3025311 5215043
42019 5215043 6254840 4409880 1740674 867916 1608261 1963599 830299 -967890 -1320702
42010 -1320702 1193833 4810717 5322400 1344680 -2837836 -2779900 -553037 -1507746 -5337850
42001 -5337850 -6083971 -1807161 1778222 70998 -3274280 -2195989 2606659 5351257
41993 5351257 3870377 1618948 1574599 2583375 2556943 2049352 3062392 5833128 8099624
41984 8099624 7370550 3691609 -85767 -1410756 -980990 -1125246 -1726858 -462603 2527099
41975 2527099 3636299 1165108 -1508177 -777841 1793757 2138565 -246694 -2415881
$$ packed form
42037c33121N97782l65982j036549R52265K699682L39315l533734l026168J577721
42028b128789M012924J804898o50708o1834R99421j12309j176784L38492K189732
42019E215043J039797j844960k669206q72758P40345L55338j133300j798189l52812
42010a320702K514535L616884N11683l977720m182516N7936K226863r54709l830104
42001e337850p46121M276810L585383j707224l345278J078291M802648K744598
41993E351257j480880k251429m4349J008776k6432n07591J013040K770736K266496
41984H099624p29074l678941l777376j324989M29766j44256o01612J264255K989702
41975B527099J109200k471191k673285P30336K571598L44808k385259k169187
$$ plain form
41967 -2415881 -2847991 -2567942 -2007968 -326600 1924916 2482601 486438 -2123905 -2900140
41958 -2900140 -1230626 1565872 3316326 2690348 958920 983108 3161862 4187521 1879124
41949 1879124 -869926 -77240 3185688 4600618 3492792 3363092 5503738 6670656
41941 6670656 4330298 393673 -1924780 -1885348 -369030 1832821 3279059 2168092
41933 2168092 -848236 -2509050 -1258716 618680 844542 579707 1742050 3068678
41925 3068678 1715851 -2310701 -5868010 -6483361 -4715437 -2956695 -3029692 -4638693 -5561397
41916 -5561397 -3987253 -880451 1161395 1492066 1942565 3257479 3428740 1010241 -2013939
41907 -2013939 -2656143 -832359 998463 1107788 -115367 -1159392 -518949 2250344 5577363
$$ packed form
41967b415881m32110K80049N59974J681368K251516N57685j996163k610343p76235
41958b900140J669514K796498J750454o25978j731428K4188K178754J025659k308397
41949A879124k749050P92686L262928J414930j107826j29700K140646J166918
41941F670656k340358l936625k318453L9432J516318K201851J446238j110967
41933B168092l016328j660814J250334J877396K25862k64835J162343J326628
41925C068678j352827m026552l557309o15351J767924J758742p2997j609001r22704
41916e561397J574144L106802K041846L30671M50499J314914J71261k418499l024180
41907b013939o42204J823784J830822J09325j223155j044025O40443K769293L327019
$$ plain form
41898 5577363 6971136 5800253 3733136 2079885 767202 451624 2606339 5989326
41890 5989326 6320524 2119475 -2010227 -1240584 2739417 4647356 3294030 1899709
41882 1899709 1915665 1448842 -130688 -765734 19318 -489311 -3812719 -7517211 -8659063
41873 -8659063 -7384798 -5378534 -3020926 80477 3435057 6027731 7032278 5559850
41865 5559850 1683059 -1722062 -933277 3441688 6027659 3448312 -1024760 -2151778
41857 -2151778 234186 2140800 1778262 1148907 1638420 1763349 190866 -1828833 -2375128
41848 -2375128 -1283357 466111 2159551 3038929 2073663 -563116 -2829294 -3029140 -1999356
41839 -1999356 -1744390 -2454654 -2464092 -1046741 470808 901303 911719 1395741 1382094 -601936
$$ packed form
41898E577363J393773j170883k067117j653251j312683l15578K154715L382987
41890E989326L31198m201049m129702P69643L980001J907939j353326j394321
41882A899709J5956m66823j579530o35046P85052n08629l323408l704492j141852
41873h659063J274265K006264K357608L101403L354580K592674J004547j472428
41865E559850l876791l405121P88785M374965K585971k579347m473072j127018
41857b151778K385964J906614l62538o29355M89513J24929j572483k019699n46295
41848b375128J091771J749468J693440Q79378r65266k636779k266178j99846J029784
41839a999356K54966p10264r438J417351J517549M30495J0416M84022j3647j984030
$$ plain form
41829 -601936 -3571499 -4649197 -3005426 -1183878 -1380922 -2318980 -1760398 -623603 -1726825
41820 -1726825 -4851909 -6279193 -4150183 -1499364 -2062355 -5034437 -6369238 -4242901
41812 -4242901 -833545 1019340 700524 -919688 -3167152 -5571348 -7363043 -7989121
41804 -7989121 -7675933 -6875110 -5476378 -3083986 -28641 2195895 1840518 -1294280 -4909694
41795 -4909694 -5869968 -3487546 -604727 -553864 -3422370 -6257442 -6646963 -4981508 -3277657
41786 -3277657 -2957158 -3993108 -5254000 -5390847 -4078652 -2394793 -1320398 -406110 810319
41777 810319 765857 -2458589 -7377597 -9732739 -7870677 -4868080 -3714840 -3127240 -777216
41768 -777216 1710408 842079 -2696038 -4157170 -1202362 3224404 5284583 4405740 1959117
$$ packed form
41829f01936k969563j077698J643771J821548j97044r38058N58582J136795j103222
41820a726825l125084j427284K129010K650819n62991k972082j334801K126337
41812d242901L409356J852885l18816j620212k247464k404196j791695o26078
41804g989121L13188Q00823J398732K392392L055345K224536l55377l134798l615414
41795d909694r60274K382422K882819N0863k868506k835072l89521J665455J703851
41786c277657L20499j035950j260892j36847J312195J683859J074395R14288J216429
41777H10319m4462l224446m919008k355142J862062L002597J153240N87600K350024
41768g77216K487624q68329l538117j461132K954808M426766K060179q78843k446623
$$ plain form
41759 1959117 -1231450 -4342030 -5889217 -5497106 -4592056 -3940687 -2427474 329695 2396772
41750 2396772 2386927 1772064 2297573 3218146 3359119 3606217 4519863 3808092 -164051 -4190914
41740 -4190914 -3791807 200111 3075962 3494222 4238741 5749111 4551927 -324004 -4604033
41731 -4604033 -5032229 -3905627 -4254236 -4550662 -2129340 1277079 1786296 -794052 -3329358
41722 -3329358 -4080400 -3363244 -869213 3640028 7637651 7782935 4594038 1776925 840877
41713 840877 -178221 -2226198 -3048424 -899059 2280210 3081761 308364 -4730070 -9928691
41704 -9928691 -13155235 -12693379 -8512090 -2899806 847588 636923 -2841323 -6212521
41696 -6212521 -6124794 -2964555 -776819 -2119905 -4570288 -4553897 -2925225 -3179847 -4999232
$$ packed form
41759A959117l190567l110580j547187L92111R05050O51369J513213K757169K067077
41750B396772r845o14863N25509R20573J40973K47098R13646p11771l972143m026863
41740d190914L99107L991918K875851M18260P44519J510370j197184m875931m280029
41731d604033m28196J126602l48609k96426K421322L406419N09217k580348k535306
41722c329358p51042P17156K494031M509241L997623J45284l188897k817113r36048
41713H40877j019098k047977q22226K149365L179269Q01551k773397n038434n198621
41704i928691l226544M61856M181289N612284L747394k10665l478246l371198
41696f212521Q7727L160239K187736j343086k450383J6391J628672k54622j819385
$$ plain form
41687 -4999232 -4089701 805475 5074594 4514532 998766 -906654 -479021 -802471 -3541502
41678 -3541502 -6783537 -7919020 -6608399 -4719370 -4392859 -6005261 -7537158 -6699507
41670 -6699507 -4007311 -2325610 -2807069 -3316824 -2161049 -1095066 -2321694 -4349199
41662 -4349199 -3982147 -1529456 -540604 -2189861 -3345208 -1489402 1343210 1699184 -279868
41653 -279868 -1675744 -1490672 -1390692 -1683810 197477 5538975 11021837 12105845 8514993
41644 8514993 3671856 -533960 -4974859 -9068979 -9441627 -5023272 -266809 71754
41636 71754 -2624205 -3236718 -588315 1244767 -743874 -4527368 -6285845 -4786385 -1533210
41627 -1533210 1204655 1711518 127651 -1084981 141460 2330229 2351202 175425 -1376883
$$ packed form
41687d999232R09531M895176M269119n60062l515766j905420M27633l23450k739031
41678c541502l242035j135483J310621J889029L26511j612402j531897Q37651
41670f699507K692196J681701m81459n09755J155775J065983j226628k027505
41662d349199L67052K452691R88852j649257j155347J855806K832612L55974j979052
41653b79868j395876J85072R9980k93118J881287N341498N482862J084008l590852
41644H514993m843137m205816m440899m094120l72648M418355M756463L38563
41636G1754k695959o12513K648403J833082j988641l783494j758477J499460L253175
41627a533210K737865N06863j583867j212632J226441K188769K0973k175777j552308
$$ plain form
41618 -1376883 -1599900 -2681214 -4744030 -4464419 -563893 3330743 3876407 2380929 1046924
41609 1046924 -1396363 -6322451 -10560000 -9981723 -6050740 -4099279 -5856642 -7921269
41601 -7921269 -7320395 -4630102 -1531699 1026765 1804808 -234556 -3590905 -5074035
41593 -5074035 -3712554 -1624988 -674623 -539944 -492717 -899609 -2359136 -4920990 -8238370
41584 -8238370 -11060257 -11172775 -7770064 -3177855 -56581 2145610 5303466 8326907
41576 8326907 8335333 5615723 3514768 3336167 3372997 3363782 5272063 8247576 7574849 1460234
41566 1460234 -4948081 -5791668 -2014005 846893 239870 -1766233 -3131556 -4216676
41558 -4216676 -5465127 -5900854 -4902126 -3524317 -2983973 -2783528 -1211018 2397350 6212772
$$ packed form
41618a376883k23017j081314k062816K79611L900526L894636N45664j495478j334005
41609A046924k443287m926088m237549N78277L930983J951461j757363k064627
41601g921269O00874K690293L098403K558464P78043k039364l356349j483130
41593e074035J361481K087566R50365J34679M7227m06892j459527k561854l317380
41584h238370k821887j12518L402711M592209L121274K202191L157856L023441
41576H326907Q426k719610k100955j78601L6830r215J908281K975513o72727o114615
41566A460234o408315q43587L777663K860898o07023k006103j365323j085120
41558d216676j248451m35727R98728J377809N40344K00445J572510L608368L815422
$$ plain form
41549 6212772 7158170 4023924 -1046683 -4816858 -5980605 -4919610 -1789452 2816184
41541 2816184 6175533 5680106 2896172 2072990 4031577 5181844 3789908 3088157 5652503
41532 5652503 8446290 7133059 2673972 -373179 -390875 474925 911937 1685847 2456949
41523 2456949 1329913 -1535271 -3011954 -1172822 1683646 1623174 -2385098 -7490703
41515 -7490703 -10006145 -8949666 -6607219 -5452450 -4998018 -3123564 -363538 -157893
41507 -157893 -3580073 -6610466 -5087216 -202398 3702169 4859914 4426456 2980741
41499 2980741 682027 -230000 2444504 6429109 6975447 3673739 1015444 1314530 1426459
41490 1426459 -1730762 -6313226 -8661714 -8218797 -6842453 -5698632 -5224943 -6059327 -7753506
$$ packed form
41549F212772R45398l134246n070607l770175j163747J060995L130158M605636
41541B816184L359349m95427k783934q23182J958587J150267j391936p01751K564346
41532E652503K793787j313231m459087l047151j7696Q65800M37012P73910P71102
41523B456949j127036k865184j476683J839132K856468o0472m008272n105605
41515g490703k515442J056479K342447J154769M54432J874454K760026K05645
41507a57893l422180l030393J523250M884818L904567J157745m33458j445715
41499B980741k298714r12027K674504L984605N46338l301708k658295K99086J11929
41490A426459l157221m582464k348488M42917J376344J143821M73689q34384j694179
$$ plain form
41481 -7753506 -8400210 -7386460 -6420564 -6077030 -4076564 455057 3799744 2239735 -2194270
41472 -2194270 -4453109 -3570535 -2912665 -4065021 -4892852 -4029394 -3148690 -3545037 -3947506
41463 -3947506 -3403478 -3377928 -4937857 -6173925 -4711700 -1267759 1363064 1823022 910698
41454 910698 -398100 -1935162 -3671642 -5287615 -6238746 -5689409 -3090914 530480 2830387
41445 2830387 2626784 1311053 877511 1376489 1289888 -310405 -2819255 -4487108 -3199261
41436 -3199261 1628240 6962217 7973283 3843727 -134538 1035335 5107488 5589215
41428 5589215 870351 -3868922 -4249300 -1780708 302940 2151358 5178334 7870872
41420 7870872 7523917 4632862 2139677 1187146 734386 745631 2450908 5316361 6766292
$$ packed form
41481g753506o46704J013750R65896L43534K000466M531621L344687j560009m434005
41472b194270k258839Q82574O57870j152356q27831Q63458Q80704l96347m02469
41463c947506N44028K5550j559929j236068J462225L443941K630823M59958r12324
41454I10698j308798j537062j736480j615973r51131N49337K598495L621394K299907
41445B830387k03603j315731m33542M98978q6601j600293k508850j667853J287847
41436c199261M827501N333977J011066m129556l978265J169873M072153M81727
41428E589215m718864m739273l80378K468592K083648J848418L026976K692538
41420G870872l46955k891055k493185r52531m52760J1245J705277K865453J449931
$$ plain form
41411 6766292 5665743 3758340 2861490 2593534 1701837 8273 -1772002 -2907318 -2871532
41402 -2871532 -1860818 -1280841 -2440243 -4709190 -6349924 -6990914 -7521610 -7695387 -6055296
41393 -6055296 -2533397 1050834 3523244 5234828 6057445 5051839 2866327 1779817
41385 1779817 2226777 1901624 -421702 -3048298 -4931111 -7795853 -12117997 -14046023
41377 -14046023 -9990286 -2292529 3430173 5287179 5810175 6693869 6885931 5841388
41369 5841388 4929509 4897127 4811454 4142667 3456930 2751343 1611230 1227461 3508212
41360 3508212 7698227 10561713 10542050 9141457 7665595 5620080 3298634 2766767 4587110
41351 4587110 6376680 6604465 7248670 10333017 14072836 15210871 13565828 11535386
$$ packed form
41411F766292j100549j907403q96850k67956q91697j693564j780275j135316L5786
41402b871532J010714N79977j159402k268947j640734o40990n30696j73777J640091
41393f055296L521899L584231K472410J711584Q22617j005606k185512j086510
41385A779817M46960l25153k323326k626596j882813k864742m322144j928026
41377a4046023M055737P697757N722702J857006N22996Q83694J92062j044543
41369E841388r11879l2382q5673o68787o85737p05587j140113l83769K280751
41360C508212M190015K863486j9663j400593j475862k045515k321446n31867J820343
41351D587110J789570K27785O44205L084347L739819J138035j645043k030442
$$ plain form
41343 11535386 10328165 9444439 8987004 9595827 10379257 9536499 7147593 5187860 4747001
41334 4747001 5295423 6551879 8561745 9698344 7531373 2897542 426081 2895337
41326 2895337 6967898 7094971 2584030 -1877664 -2274684 975219 5491803 10023110
41318 10023110 13565759 14122905 11198923 8245100 9500354 14427242 17981958 16897040
41310 16897040 13107925 9919160 7454952 4119351 716445 131491 3199967 7274981
41302 7274981 9317265 8793669 7052604 5158279 3156973 912051 -1057540 -1920439
41294 -1920439 -1924883 -2897491 -6093108 -9620656 -9955402 -6711840 -3712224 -3893968 -5489508
41285 -5489508 -5524688 -4840987 -6242598 -9053390 -9499390 -6287766 -2122437 645914 2424787
$$ packed form
41343A1535386j207221q83726m57435O08823P83430q42758k388906j959733m40859
41334D747001N48422J256456K009866J136599k166971m633831k471461K469256
41326B895337M072561J27073m510941m461694l97020L249903M516584M531307
41318A0023110L542649N57146k923982k953823J255254M926888L554716j084918
41310A6897040l789115l188765k464208l335601l402906n84954L068476M075014
41302G274981K042284n23596j741065j894325k001306k244922j969591q62899
41294a920439m444r72608l195617l527548l34746L243562K999616j81744j595540
41285e489508l5180O83701j401611k810792m46000L211624M165329K768351J778873
$$ plain form
41276 2424787 3830373 4147424 3437137 3155463 3484321 2894782 1457110 1431978 3074552
41267 3074552 3101406 -575138 -5512389 -8431616 -9417085 -9807900 -8726027 -5113923 -1125516
41258 -1125516 206395 -611123 -829397 -37141 54170 -463462 174339 1440055 468370
41249 468370 -3220919 -6110971 -5087023 -1129427 2545770 4083465 3611544 2003440
41241 2003440 367701 -315859 -170118 -399187 -1615440 -2740494 -2104368 600640 3587076
41232 3587076 4171995 1324397 -2590353 -3612671 -674477 2679779 2282364 -1877719
41224 -1877719 -6281313 -8241330 -7753408 -5851202 -3469167 -1710373 -1072089 -460201 1047125
41215 1047125 1847216 -192730 -3494233 -3756395 -90208 2999037 1596177 -2302847
$$ packed form
41276B424787J405586L17051p10287k81674L28858n89539j437672k5132J642574
41267C074552K6854l676544m937251k919227r85469l90815J081873L612104L988407
41258a125516J331911q17518k18274P92256R1311n17632O37801J265716r71685
41249D68370l689289k890052J023948L957596L675197J537695m71921j608104
41241B003440j635739o83560J45741k29069j216253j125054O36126K705008K986436
41232C587076N84919k847598l914750j022318K938194L354256l97415m160083
41224a877719m403594j960017M87922J902206K382035J758794O38284O11888J507326
41215A047125Q00091k039946l301503k62162L666187L089245j402860l899024
$$ plain form
41207 -2302847 -3922894 -2179941 -88570 138818 -790053 -1855287 -3333680 -4941389
41199 -4941389 -4982826 -3014153 -1486519 -2603364 -4724537 -4483873 -2139552 -1806174 -5412497
41190 -5412497 -9284270 -9019819 -5706054 -4078203 -5469158 -6360114 -4385374 -2146572
41182 -2146572 -3256376 -7190546 -10262339 -10057863 -7062959 -3342856 -1313728 -2420819
41174 -2420819 -5349945 -6839222 -5631714 -3882825 -3257171 -2246050 219859 1350107
41166 1350107 -1435731 -5074239 -4392819 -419128 61120 -5785856 -12227730 -12306539 -6413161
41157 -6413161 -888792 -293958 -3656163 -7135908 -8029224 -6250194 -3321406 -545289
41149 -545289 1641486 2640392 1386147 -1750519 -4066897 -3467920 -1286562 -17090 528861
$$ packed form
41207b302847j620047J742953K091371K27388r28871j065234j478393j607709
41199d941389m1437J968673J527634j116845k121173K40664K344321L33378l606323
41190e412497l871773K64451L313765J627851j390955q90956J974740K238802
41182b146572j109804l934170l071793K04476K994904L720103K029128j107091
41174b420819k929126j489277J207508J748889O25654J011121K465909J130248
41166A350107k785838l638508O81420L973691M80248n846976o441874p8809N893378
41157f413161N524369N94834l362205l479745q93316J779030K928788K776117
41149e45289K186775R98906j254245l136666k316378N98977K181358J269472N45951
$$ plain form
41140 528861 1913222 3047887 1334861 -2406407 -4253747 -2934585 -1224106 -695646
41132 -695646 629986 3709162 5789021 4870350 3203098 3318711 3743463 2062085 -346295
41123 -346295 -331671 2056660 4109954 4654243 4480353 3704569 1943795 461865 1124797
41114 1124797 3460464 5209522 5434394 4862656 3768913 1978278 560306 1005062 2760614
41105 2760614 3790938 3556344 3370279 3824222 4000106 3512838 3336628 3945013 4155667
41096 4155667 2673992 -43027 -2110601 -2211552 -1142700 -1096163 -2731145 -3429323 -284021
41087 -284021 5049340 7144612 3763746 -606765 -491254 3452323 6011042 4624991
41079 4624991 1602657 -311672 -1150615 -1961266 -2524936 -2048166 -738479 151164 -626580
$$ packed form
41140E28861J384361J134665j713026l741268j847340J319162J710479N28460
41132f95646J325632L079176K079859r18671j667252J15613M24752j681378k408380
41123c46295J4624K388331K053294N44289j73890p75784j760774j481930O62932
41114A124797K335667J749058K24872n71738j093743j790635j417972M44756J755552
41105B760614J030324k34594j86065M53943J75884m87268j76210O08385K10654
41096D155667j481675k717019k067574j00951J068852M6537j634982o98178L145302
41087b84021N333361K095272l380866m370511J15511L943577K558719j386051
41079D624991l022334j914329q38943q10651n63670M76770J309687Q89643p77744
$$ plain form
41070 -626580 -3038954 -5039642 -3969551 391835 5133052 7466536 7353419 5918594
41062 5918594 3278370 -244889 -2672829 -2474453 -632372 1456189 4130834 6974731
41054 6974731 6648914 1105602 -5685390 -7648500 -4586608 -2031316 -3357913 -6287184
41046 -6287184 -7536128 -6838895 -5429318 -4031696 -3396757 -3984928 -4548138 -3681097 -2639026
41037 -2639026 -3438655 -4618082 -2903091 1086301 3427506 3467597 4659931 7885159 9435789
41028 9435789 7490742 5096681 4155872 1998443 -2615701 -5515839 -3713211 -1272973
41020 -1272973 -3273380 -7690088 -9015372 -6961856 -5506244 -5413512 -4033410 -1487379
41012 -1487379 -894311 -2444876 -2747665 -521722 1999530 3836996 6515216 9635496
$$ packed form
41070f26580k412374k000688J070091M361386M741217K333484j13117j434825
41062E918594k640224l523259k427940J98376J842081K088561K674645K843897
41054F974731l25817n543312o790992j963110L061892K555292j326597k929271
41046f287184j248944O97233J409577J397622O34939n88171n63210Q67041J042071
41037b639026p99629j179427J714991L989392K341205M0091J192334L225228J550630
41028I435789j945047k394061r40809k157429m614144k900138J802628K440238
41020a272973k000407m416708j325284K053516J455612R2732J380102K546031
41012a487379N93068j550565l02789K225943K521252J837466K678220L120280
$$ plain form
41004 9635496 10018469 6838253 3377631 1935785 938612 -1001463 -2118648 -1091450
40996 -1091450 -44896 -896796 -1617842 392361 3307722 2995332 -867925 -4239064 -4160532
40987 -4160532 -1940655 -466458 -566622 -911970 -148965 1722978 3430303 3427837 1284590
40978 1284590 -1695271 -3591786 -3720883 -3052293 -2729408 -2619458 -1751333 -28321 1233263
40969 1233263 982150 55321 45897 762782 326144 -1856573 -3906756 -4204388 -3631057
40960 -3631057 -3612531 -3466384 -1776666 673992 1768072 1362183 1344608 2446850 3226645
40951 3226645 2481415 768687 -739377 -1272311 -370008 1456970 2197863 536382 -1675522
40942 -1675522 -1551649 417553 974042 -836687 -2625962 -3251762 -4459056 -6387869 -5673220
$$ packed form
41004I635496L82973l180216l460622j441846r97173j940075j117185J027198
40996a091450J046554q51900p21046K010203K915361l12390l863257l371139P8532
40987d160532K219877J474197j00164l45348P63005J871943J707325k466k143247
40978A284590k979861j896515j29097O68590L22885J09950Q68125J723012J261584
40969A233263k51113r26829r424P16885m36638k182717k050183k97632N73331
40960c631057J8526J46147J689718K450658J094080m05889j7575J102242P79795
40951C226645p45230j712728j508064n32934R02303J826978P40893j661481k211904
40942a675522J23873J969202N56489j810729j789275o25800j207294j928813P14649
$$ plain form
40933 -5673220 -1017413 2914275 1259123 -3679003 -5216084 -1303070 3463424 4593829
40925 4593829 2573987 442496 -209655 293363 914888 546159 -1023683 -2381313 -2067269
40916 -2067269 -610378 609583 1697212 3085020 3008346 -449413 -5114329 -6583565
40908 -6583565 -4817201 -4367447 -6618837 -6872465 -2289286 2116162 519071 -4152238
40900 -4152238 -4099330 1473511 5354593 3689972 1397627 3463265 6834410 5789512
40892 5789512 1349756 -468785 2015973 4351811 3531065 2094739 2940816 4265242
40884 4265242 2748558 -753588 -2223926 -403810 1376693 -167226 -3871672 -5508047
40876 -5508047 -2667958 2685804 6267044 5465617 1392877 -2554271 -3870985 -2748946
$$ packed form
40933e673220M655807L931688j655152m938126j537081L913014M766494J130405
40925D593829k019842k131491o52151N03018O21525l68729j569842j357630L14044
40916b067269J456891J219961J087629J387808p6674l457759m664916j469236
40908f583565J766364M49754k251390k53628M583179M405448j597091m671309
40900d152238N2908N572841L881082j664621k292345K065638L371145j044898
40892E789512m439756j818541K484758K335838q20746j436326Q46077J324426
40884D265242j516684l502146j470338J820116J780503j543919l704446j636375
40876e508047K840089N353762L581240q01427m072740l947148j316714J122039
$$ plain form
40868 -2748946 -1037831 93382 1060924 2543723 3955394 3962678 2425641 826092 160552
40859 160552 -690855 -3203519 -6328357 -7297587 -5623187 -4138486 -4787150 -5366048 -2716467
40850 -2716467 2110251 4714356 3122114 -48853 -1602791 -1361422 -783441 -300756 431793
40841 431793 1195194 1510804 1136013 -568346 -4138319 -7944316 -8747397 -5918270 -3051204
$$ packed form
40868b748946J711115J131213R67542J482799J411671P284j537037j599549o65540
40859A60552q51407k512664l124838r69230J674400J484701o48664n78898K649581
40850b716467M826718K604105j592242l170967j553938K41369N77981M82685P32549
40841D31793P63401L15610l74791j704359l569973l805997q03081K829127K867066
$$ [...]
##END NTUPLES=NMR SPECTRUM
##END=
