##TITLE=31Pdec_LR-688B-BACID
 , 124 sc
 1.8.2019
##JCAMPDX= 6.0         $$ Bruker NMR JCAMP-DX V2.0
##DATA TYPE= NMR SPECTRUM
##DATA CLASS= NTUPLES
##ORIGIN= UXNMR, Bruker Analytische Messtechnik GmbH
##OWNER= root
$$ XWIN-NMR		Version 3.5
$$ Thu Aug  1 15:58:49 2019 Russian Standard Time (UT+4h)  she@DPX200
##.OBSERVE FREQUENCY= 81.013821
##.OBSERVE NUCLEUS= ^31P
##.ACQUISITION MODE= SIMULTANEOUS
##.ACQUISITION SCHEME= undefined
##.AVERAGES= 124
##.DIGITISER RES= 17
##SPECTROMETER/DATA SYSTEM= spect
##.PULSE SEQUENCE= zgpg30
##.SOLVENT NAME= DMSO
##.SHIFT REFERENCE= (INTERNAL, DMSO, 0, 182.463)
##AUDIT TRAIL= $$ (NUMBER, WHEN, WHO, WHERE, WHAT)
$$ ##TITLE= Audit trail, XWIN-NMR		Version 3.5
$$ ##JCAMPDX= 5.01
$$ ##ORIGIN= Bruker BioSpin GmbH
$$ ##OWNER= she
$$ F:/spectra/data/she/nmr/P31/1/pdata/1/auditp.txt
$$ ##AUDIT TRAIL=  $$ (NUMBER, WHEN, WHO, WHERE, WHAT)
(   1,<2019-08-01 15:57:31.21 +0400>,<she>,<DPX200>,
      <continue with go, POWCHK disabled, PULCHK disabled
       configuration hash MD5:
       00 E9 B6 7A A2 85 ED C7 34 08 36 98 17 FE 4E 26
       data hash MD5: 32K
       78 F9 48 4E 19 06 C3 C8 6C 90 09 9F D2 C9 FC 6F>)
(   2,<2019-08-01 15:57:35.60 +0400>,<she>,<DPX200>,
      <Start of raw data processing
       efp BC_mod = 2 LB = 1 FT_mod = 6 PKNL = 1 PHC0 = -587.5986 PHC1 = 680.4003 SI = 64K 
       data hash MD5: 64K
       82 98 A0 42 F7 7B 17 83 7A B0 65 15 E2 26 39 CB>)
(   3,<2019-08-01 15:58:10.92 +0400>,<she>,<DPX200>,
      <pk PHC0 = 1.048149 PHC1 = -115.4 
       data hash MD5: 64K
       BB CF E5 D8 C6 FD E7 7D 97 AF 29 12 3F 82 34 E0>)
(   4,<2019-08-01 15:58:14.25 +0400>,<she>,<DPX200>,
      <abs ABSG = 5 
       data hash MD5: 64K
       5C E0 5E 6D F6 21 E0 A8 49 34 79 35 A2 91 EA 40>)
$$ ##END=
$$ 
$$ hash MD5
$$ BA 75 CA EA B4 85 C4 5D FF 29 4E 20 62 FA 84 41
##$RELAX= 
##$RELAX= 
##$RELAX= 
##$RELAX= 
##$RELAX= 
##$RELAX= 
##$RELAX= 
##$RELAX= 
$$ Bruker specific parameters
$$ --------------------------
##$DU= <F:/spectra>
##$EXPNO= 1
##$NAME= <P31>
##$PROCNO= 1
##$TYPE= <nmr>
##$USER= <she>
##$AMP= (0..31)
100 100 100 100 100 100 100 100 100 100 100 100 100 100 100 100 100 100 
100 100 100 100 100 100 100 100 100 100 100 100 100 100 
##$AQSEQ= 0
##$AQ_mod= 1
##$AUNM= <au_zg>
##$AUTOPOS= <>
##$BF1= 81.014009
##$BF2= 200.13
##$BF3= 200.13
##$BF4= 200.13
##$BF5= 200.13
##$BF6= 200.13
##$BF7= 200.13
##$BF8= 200.13
##$BYTORDA= 1
##$CFDGTYP= 0
##$CFRGTYP= 5
##$CHEMSTR= <none>
##$CNST= (0..31)
1 1 145 1 1 1 1 1 1 1 1 1 1 1 1 1 1 1 1 1 1 1 1 1 1 1 1 1 1 1 1 1 
##$CPDPRG= <waltz16>
##$CPDPRG1= <>
##$CPDPRG2= <waltz16>
##$CPDPRG3= <>
##$CPDPRG4= <mlev>
##$CPDPRG5= <mlev>
##$CPDPRG6= <mlev>
##$CPDPRG7= <mlev>
##$CPDPRG8= <mlev>
##$CPDPRGB= <>
##$CPDPRGT= <>
##$D= (0..31)
0 1 0 0 0 0 0 0 0 0 0 0.03 2e-05 3e-06 0 0 0 0 0 0 0 0 0 0 0 0 0 0 0 0 
0 0 
##$DATE= 1564660470
##$DBL= (0..7)
120 120 120 11 120 120 24 19 
##$DBP= (0..7)
150 150 150 150 150 150 150 150 
##$DBP07= 0
##$DBPNAM0= <>
##$DBPNAM1= <>
##$DBPNAM2= <>
$$ [...]
##$SUBNAM3= <"">
##$SUBNAM4= <"">
##$SUBNAM5= <"">
##$SUBNAM6= <"">
##$SUBNAM7= <"">
##$SUBNAM8= <"">
##$SUBNAM9= <"">
##$SW= 369.568048894756
##$SWIBOX= (0..15)
0 1 3 0 0 0 0 0 0 0 0 0 0 0 0 0 
##$SW_h= 29940.119760479
##$TD= 32768
##$TD0= 1
##$TE= 0
##$TE2= 300
##$TE3= 300
##$TEG= 300
##$TL= (0..7)
0 120 53 12 22 120 120 120 
##$TP= (0..7)
150 150 150 150 150 150 150 150 
##$TP07= 0
##$TPNAME0= <>
##$TPNAME1= <>
##$TPNAME2= <>
##$TPNAME3= <>
##$TPNAME4= <>
##$TPNAME5= <>
##$TPNAME6= <>
##$TPNAME7= <>
##$TPOAL= (0..7)
0.5 0.5 0.5 0.5 0.5 0.5 0.5 0.5 
##$TPOFFS= (0..7)
0 0 0 0 0 0 0 0 
##$TUNHIN= 0
##$TUNHOUT= 0
##$TUNXOUT= 0
##$USERA1= <user>
##$USERA2= <user>
##$USERA3= <user>
##$USERA4= <user>
##$USERA5= <user>
##$V9= 5
##$VALIST= <valist>
##$VCLIST= <CCCCCCCCCCCCCCC>
##$VD= 0
##$VDLIST= <DDDDDDDDDDDDDDD>
##$VPLIST= <PPPPPPPPPPPPPPP>
##$VTLIST= <TTTTTTTTTTTTTTT>
##$WBST= 1024
##$WBSW= 4
##$XGAIN= (0..3)
0 0 0 0 
##$XL= 0
##$YL= 0
##$YMAX_a= 18311
##$YMIN_a= -24953
##$ZGOPTNS= <>
##$ZL1= 120
##$ZL2= 120
##$ZL3= 120
##$ZL4= 120
##$ABSF1= 182.463
##$ABSF2= -187.1042
##$ABSG= 5
##$ABSL= 3
##$ALPHA= 0
##$AQORDER= 0
##$ASSFAC= 0
##$ASSFACI= 0
##$ASSFACX= 0
##$ASSWID= 0
##$AUNMP= <proc_1d>
##$AZFE= 0.1
##$AZFW= 0.5
##$BCFW= 0
##$BC_mod= 2
##$BYTORDP= 0
##$COROFFS= 0
##$CY= -3
##$DATMOD= 1
##$DC= 0
##$DFILT= <>
##$DTYPP= 0
##$F1P= 0
##$F2P= 0
##$FCOR= 1
##$FTSIZE= 65536
##$FT_mod= 6
##$GAMMA= 0
##$GB= 0
##$INTBC= 1
##$INTSCL= 5.30512e-09
##$ISEN= 30
##$LB= 1
##$LEV0= 0
##$LPBIN= 0
##$MAXI= 10000
##$MC2= 0
##$MEAN= 0
##$ME_mod= 0
##$MI= 50
##$NCOEF= 0
##$NC_proc= -7
##$NLEV= 6
##$NOISF1= 182.463
##$NOISF2= 159.3651
##$NSP= 0
##$NTH_PI= 0
##$NZP= 0
##$OFFSET= 182.463
##$PC= 4
##$PHC0= -586.5504
##$PHC1= 565.0003
##$PH_mod= 1
##$PKNL= yes
##$PPARMOD= 0
##$PSCAL= 0
##$PSIGN= 0
##$REVERSE= no
##$SF= 81.0140089999434
##$SI= 65536
##$SIGF1= 159.3651
##$SIGF2= -187.1042
##$SINO= 113.3802
##$SIOLD= 16384
##$SREGLST= <1H.CDCl3>
##$SSB= 0
##$STSI= 65536
##$STSR= 0
##$SW_p= 29940.119760479
##$SYMM= 0
##$S_DEV= 0
##$TDeff= 32768
##$TDoff= 0
##$TI= <>
##$TILT= no
##$TM1= 0
##$TM2= 0
##$TOPLEV= 0
##$USERP1= <user>
##$USERP2= <user>
##$USERP3= <user>
##$USERP4= <user>
##$USERP5= <user>
##$WDW= 1
##$XDIM= 65536
##$YMAX_p= 355164150
##$YMIN_p= -45073247
$$ End of Bruker specific parameters
$$ ---------------------------------
##NTUPLES= NMR SPECTRUM
##VAR_NAME=  FREQUENCY,     SPECTRUM/REAL,   SPECTRUM/IMAG
##SYMBOL=    X,             R,               I
##VAR_TYPE=  INDEPENDENT,   DEPENDENT,       DEPENDENT
##VAR_FORM=  AFFN,          ASDF,            ASDF
##VAR_DIM=   65536,         65536,           65536
##UNITS=     HZ,            ARBITRARY UNITS, ARBITRARY UNITS
##FACTOR=    0.456856943014862, 1,           1
##FIRST=     14782.0589164792, 0,            0
##LAST=      -15158.0608439998, 0,           0
##MIN=       -15158.0608439998, -45073247,   0
##MAX=       14782.0589164792, 355164150,    0
$$ Real data points
##PAGE= N=1
##DATA TABLE= (X++(R..R)), XYDATA
$$ [...]
44574a1075926k382981N756263R400479K556202n964364m522839N086869J0495818
44566I349521N631171k356888l948998P39319M119474J798246l255020o004033
44558F072792m695323p51256L032587L440059m22229m270418k576243L146637
44550B976606N061722O51994k625648Q24034N066014K604189k234870q15038L419091
44541A4928094j03949r184695r703260J050167Q049712K074666n702450k668791
44533a260506N282452N759043P31443J75491K911543K79582n842886n423507J120512
44524C733167K822890k685221n127010N39173O073133M444009M43110J017856
44516A1261107M573160N754459L493781m44061m650510o496803l547032J216294
$$ plain form
44574 -11075926 -13458907 -7702644 1697835 4254037 -1710327 -6233166 -1146297 9349521
44566 9349521 14980692 12623804 8674806 9414125 13533599 15331845 12076825 6072792
44558 6072792 1377469 626213 3658800 7098859 6676630 2406212 -170031 2976606
44550 2976606 8038328 8690322 6064674 6888708 11954722 14558911 12324041 11509003 14928094
44541 14928094 14824145 5639450 -4063810 -3013643 5036069 7110735 1408285 -1260506
44533 -1260506 4021946 9780989 10512432 10687923 13599466 13879048 8036162 2612655 3733167
44524 3733167 6556057 3870836 -1256174 -717001 5356132 9800141 10243251 11261107
44516 11261107 15834267 21588726 25082507 24638446 19987936 13491133 9944101 11160395
44508A1160395J990168r13503k108667j365992l415881o720180l698468N174168
44500A02040R314348M339801j409121j961977k803026p584919q506649j77280
44492h686783P966993N119270l741174o396497j768441K627562N035961Q115001
44484H271892Q557080J873486o021045n622815K70112R50032l973330n124393
44476h18981j363892j651177p049461o690333L074126R937023M157047n997336
44468f402984p114783n1619M137201J753276q85646K26163J605254J7142j952237
44459h668233n68262L006842M143980Q00577l782703m794104j488608K256536
44451i093975L239415K612995K856162L481316K320734p22428l828613n598083
$$ plain form
44508 11160395 13150563 12237060 10128393 8762401 5346520 -1373660 -5072128 102040
44500 102040 9416388 13756189 12347068 10385091 7582065 -2854 -8509503 -8686783
44492 -8686783 -719790 4399480 658306 -5738191 -7506632 -4879070 156891 8271892
44484 8271892 16828972 18702458 12681413 7058598 7328710 8278742 4305412 -818981
44476 -818981 -2182873 -3834050 -10883511 -17573844 -14499718 -4562695 -405648 -6402984
44468 -6402984 -13517767 -13569386 -9432185 -7678909 -8564555 -8338392 -6733138 -6715996 -8668233
44459 -8668233 -9236495 -6229653 -2085673 -1285096 -5067799 -9861903 -11350511 -9093975
44451 -9093975 -5854560 -3241565 -385403 3095913 5416647 4694219 865606 -4732477
44443d732477n258792k893589j083993k507322m049972P38200R949565J1991495
44435B153115K355616o702390k998916O673313P244084r85035m881438j342070
44427A516279r6310l544295k184453N949468R129565K182876l612145L2782M530570
44418A3904337J089009l246809J51298M053078j635266r643116o289996M091310
44410B473845M949393n076880r676877j054192Q881732Q033089O9311n452873
44402C146548o716406n951765j962337N293484R598997O104625m01301j863736
44394G248109J616462L229883L03856k731173k243045p07039j889920m326741
44386E00392l431196P67634K416365j571699n700271l539691J531311P88834m990177
$$ plain form
44443 -4732477 -9991269 -12884858 -13968851 -16476173 -20526145 -19787945 -9838380 2153115
44435 2153115 4508731 -2193659 -5192575 1480738 8724822 7739787 2858349 1516279
44427 1516279 1419969 -2124326 -4308779 1640689 10770254 12953130 9340985 9373767 13904337
44418 13904337 14993346 11746537 11897835 15950913 14315647 4672531 -1617465 2473845
44410 2473845 7423238 2346358 -7330519 -8384711 497021 8530110 8599421 3146548
44402 3146548 -3569858 -9521623 -11483960 -6190476 3408521 9513146 9111845 7248109
44394 7248109 8864571 12094454 12398310 9667137 7424092 6717053 4827133 500392
44386 500392 -2930804 -2163170 253195 -1318504 -7018775 -10558466 -9027155 -8238321 -13228498
44377a3228498m826137M930181J2344563O534874n569939q932603j238932O794361
44369c192130Q299668N937615K325421l349359q358398p048596p64554K440742
44361c709591M67736K0336L822874N147133P6937m409137j765691K640424P0057
44352B361078p080741q733575k537510L016788J160559m363134n198143R41797
44344b0432881P873456Q096378J393591m279089j804972N805136Q416233J794066
44336F861918o410932o306130J793157Q269125O168159j231293n186530j754168
44328B203306M148692N153347O47475l110104k464814j443278m034629o092568
44320d992573j484299O493410Q109261J246709n868759p116861n255604l798792
$$ plain form
44377 -13228498 -18054635 -13124454 -779891 5754983 185044 -8747559 -9986491 -3192130
44369 -3192130 5107538 11045153 13370574 10021215 1662817 -5385779 -6150333 -3709591
44361 -3709591 -3241855 -3221519 601355 5748488 5825425 1416288 -349403 2291021 2361078
44352 2361078 -4719663 -13453238 -15990748 -12973960 -11813401 -16176535 -21374678 -20432881
44344 -20432881 -12559425 -4463047 -3069456 -7348545 -9153517 -3348381 5067852 6861918
44336 6861918 450986 -5855144 -4061987 4207138 10375297 9144004 3957474 2203306
44328 2203306 6351998 11505345 12152820 9042716 6577902 5134624 1099995 -4992573
44320 -4992573 -6476872 16538 8125799 9372508 3503749 -3613112 -8868716 -12667508
44312a2667508p88718M742565P776478M899758R05447J333909L379594J192124
44304A0773649l642352m525915p00900J722860n03092l207190j328649M206514
44296B794925P952363O258822R83638k731232k413366j027550j986751l186228
44288F644621m81799L905597L175947k870739o050850k198147K307042J025444
44280E457116k997379m296989m478204o820464p575287k085788M773271M439360
44272a3584364j478363l229864K015386O648921M663820j194848n359050n223764
44264a6742126l17766P283717J1271608O941748r12651l185112N66390K654516
44256G560324P91934Q15526L974193K890320m808596r514705l865660M868331
$$ plain form
44312 -12667508 -13456226 -8713661 -937183 3962575 4868022 6201931 9581525 10773649
44304 10773649 7131297 2605382 1904482 3627342 3124250 -82940 -1411589 2794925
44296 2794925 10747288 17006110 17989748 15258516 12845150 11817600 9830849 6644621
44288 6644621 6162822 10068419 13244366 10373627 4322777 2124630 4431672 5457116
44280 5457116 2459737 -1837252 -6315456 -13135920 -20711207 -22796995 -18023724 -13584364
44272 -13584364 -15062727 -18292591 -16277205 -9628284 -4964464 -6159312 -11518362 -16742126
44264 -16742126 -17059892 -9776175 1495433 8437181 7524530 4339418 4905808 7560324
44256 7560324 8352258 9167784 13141977 16032297 11223701 1708996 -2156664 2711667
44248B711667N641018j31420l267172k461053l781125p062635m872882L782123
44240i441479R414507N652944j379504k568789J414918L075908M7610k611098
44232C605017j097240J946583K086961r53292l817598l651150k13787M404912
44224B310406O973908N702122K686010J656074K093427r61962q265548j1653648
44216E40789m264270O848863P210077m705985j3083958n838802Q235936J1736986
44208F679636K359581o113008m421681J407061J730852l147652n449997p10292
44200g665500P743413J2313040P572381l918065j1989916q889496J140332O873800
44192C179989M355799J63346J7379J421910J71902k643551m094320m285767l755795
$$ plain form
44248 2711667 8352685 8221265 4954093 2493040 -1288085 -8350720 -13223602 -9441479
44240 -9441479 -26972 5625972 4246468 1677679 3092597 6168505 6216115 3605017
44232 3605017 2507777 4454360 6541321 5588029 1770431 -1880719 -2094506 2310406
44224 2310406 9284314 14986436 17672446 19328520 21421947 20459985 12194437 540789
44216 540789 -3723481 3125382 10335459 5629474 -7454484 -13293286 -5057350 6679636
44208 6679636 9039217 2926209 -1495472 -88411 1642441 -1505211 -6955208 -7665500
44200 -7665500 77913 12390953 19963334 16045269 4055353 -4834143 -3693811 3179989
44192 3179989 7535788 7699134 7716513 9138423 9310325 6666774 2572454 -1713313 -5469108
44183e469108j101851K774659L283449m95305k444121J207612M533615Q50541
44175C139491n622470n589993N73964L294752j296145o028740m208917J436699
44167a4301359M807793N029206M568987L570083J061777j187696q32653O33164
44159C349302k74966l662884o282812o232777m091729J18824O772859J2685402
44151B381219J1967651L580104n488982q161638n559572l128830j404919K852600
44143b962367P661066O516311q6422k736301K370690N294273l240899j5742330
44135b925979j6779026m601822P203290Q914363M449114O80965k030848m860329
44127i950272n522988l337141j801945j662121J281254P162967Q995910M005181
$$ plain form
44183 -5469108 -6570959 -3796300 -512851 -1008156 -3452277 -2244665 2288950 3139491
44175 3139491 -2482979 -8072972 -7499008 -4204256 -5500401 -11529141 -15738058 -14301359
44167 -14301359 -9493566 -4464360 104627 3674710 4736487 3548791 2716138 3349302
44159 3349302 3074336 -588548 -6871360 -13104137 -17195866 -17077042 -10304183 2381219
44151 2381219 14348870 17928974 12439992 4278354 -1281218 -4410048 -5814967 -2962367
44143 -2962367 4698699 11215010 11128588 8392287 10762977 16057250 12816351 -2925979
44135 -2925979 -19705005 -24306827 -17103537 -8189174 -3740060 -3059095 -5089943 -9950272
44127 -9950272 -15473260 -18810401 -20612346 -22274467 -20993213 -13830246 -4834336 -829155
44119h29155l06661J902962N122880K925800n0395L029587P284879L580834m776021
44110A7884710o535507j493538n31837o106018p450499O00018P586127L726263
44102G679719m547247m934120K202352N946138J721939l458667k051780M918241
44094G476575J0582962R261086L22351j1086970j6731071j2089221j457289O021965
44086g699612O095318L124326L180357N557108L909621l990327j0790699p393258
44078h007166M376511J1867034O916734l293264n771738O84899M551021j474183
44070I849848r921121q830027K260307J1977026J1144568K504888m169689l602794
44062A1213006L36751P82817l377743o620163m334783J244333M155567J874445
$$ plain form
44119 -829155 -1135816 767146 5890026 8815826 8765431 11795018 19079897 22660731 17884710
44110 17884710 11349203 9855665 9323828 3217810 -4232689 -3632671 3953456 7679719
44102 7679719 3132472 -1801648 400704 6346842 8068781 4610114 2558334 7476575
44094 7476575 18059537 27320623 27642974 16556004 -175067 -12264288 -13721577 -7699612
44086 -7699612 -1604294 1520032 4700389 10257497 14167118 10176791 -613908 -8007166
44078 -8007166 -3630655 8236379 15153113 11859849 6088111 6773010 11324031 9849848
44070 9849848 -71273 -8901300 -6640993 5336033 16480601 18985489 14815800 11213006
44062 11213006 11549757 12332574 8954831 2334668 -2000115 -755782 3399785 5274230
44054E274230k682056m863966j985859M927940J0605017Q710535j029194j0350376
44046H606271j0857136l945521J389595k30019n487117p853528m222342L363162
44038a9236635Q927856O772108j394746n602584N66172R626536R208466q4183
44030H782990n513398j516567K897224j99886n577254n301809j799712j258376
44022i486788j321668L736644J0126493Q322543j812714j0101308j0319263o066147
44014a6922208j716423L055225P443673P082437J457543l329794l298903j671862
44006g900312j177810J598268Q219475J1391655M449126o342873q573730j270791
43998C93008M029167P11170l961453j134786O378763R163761M255328l145256
$$ plain form
44054 5274230 2592174 -2271792 -4257651 670289 11275306 19985841 18956647 8606271
44046 8606271 -2250865 -6196386 -4806791 -5036810 -10523927 -18377455 -22599797 -19236635
44038 -19236635 -10308779 -3536671 -4931417 -10534001 -9967829 -341293 8867173 8782990
44030 8782990 3269592 1753025 4650249 4450363 -1126891 -6428700 -8228412 -9486788
44022 -9486788 -10808456 -7071812 3054681 11377224 9564510 -536798 -10856061 -16922208
44014 -16922208 -18638631 -15583406 -8139733 -1057296 400247 -2929547 -6228450 -7900312
44006 -7900312 -9078122 -7479854 739621 12131276 16580402 10237529 1663799 393008
43998 393008 4422175 5133345 1171892 37106 6415869 15579630 19834958 16689702
43990A6689702p552488o946850j496836N325471O477397j206523j0405542j0799951
43982i915620k644786M129562M285897K580518L247671L172373l73027l302736
43974A179852j906246K05425r99420j867392K508768Q239429P514209R98980k904795
43965A2968810l44786L641966L162233j904472p418091q797855m185151K675203
43957b02143N050191K125444R55691N057959P456115K304721l625283j622385
43949A7500310K952409j062665j0224638j0255715K52168O518494J007976n636741
43941A051598k946591M166861O140800K767723j488097n750376q544693n083703
43933i686478L541990P671261L031590j912595l6288L004741j7499n131012n338764
$$ plain form
43990 16689702 9137214 2190364 693528 6018999 12496396 11289873 884331 -9915620
43982 -9915620 -12560406 -8430844 -4144947 -1564429 1683242 4855615 4482588 1179852
43974 1179852 -726394 -520969 -1520389 -3387781 -879013 7360416 14874625 15873605 12968810
43965 12968810 12624024 16265990 19428223 17523751 10105660 1307805 -2877346 -202143
43957 -202143 4848048 6973492 7929183 12987142 20443257 22747978 19122695 17500310
43949 17500310 20452719 19390054 9165416 -1090299 -838131 5680363 6688339 1051598
43941 1051598 -1894993 2271868 8412668 11180391 9692294 3941918 -4602775 -9686478
43933 -9686478 -6144488 1526773 4558363 2645768 2609480 5614221 5596722 465710 -4873054
43924d873054k542685j283544P10859N405652O741590J165157k876686J995453
43916D442742Q163925N351394j501105j534300K289748p50088q836627j0573383
43908b947694m797398o64194l50144J778188M580916J601741l941149k610402
43900g350136L367545L097140k451082j704402N076962N195921j971609j971608
43892A288731P492742R331081l111000j1411905j401695J2815831J1540141m10122
43884B6133804n528576k319969j638298l997048j467706L718289K467681k618328
43876A4749849q20000O189783N766034l349545p950050k569485K006729k064574
43868A1958741o994422l835312K661194L313967m84054j388431L65997j283540
$$ plain form
43924 -4873054 -7415739 -8699283 -7988424 -2582772 4158818 5323975 2447289 4442742
43916 4442742 12606667 17958061 16456956 14922656 17212404 16462316 7625689 -2947694
43908 -2947694 -7745092 -8409286 -8759430 -6981242 -2400326 -798585 -4739734 -7350136
43900 -7350136 -3982591 -885451 -3336533 -5040935 36027 5231948 3260339 1288731
43892 1288731 8781473 18112554 15001554 3589649 2187954 15003785 26543926 26133804
43884 26133804 20605228 18285259 16646961 12649913 11182207 14900496 17368177 14749849
43876 14749849 13929849 20119632 25885666 22536121 14586071 12016586 14023315 11958741
43868 11958741 4964319 1129007 3790201 7104168 6620114 5231683 5597680 4314140
43860D314140n769440n447162J725392P672116N797285O81841O04402M406207
43852A3984781L553804l190480n990630J332722J0657793J0952574M392110J406197
43844C7098871L525018K986440j736062l212237J17190l48944p856864j2777606
43836A7795806p759454L26882J814364j855121m279916n230418o374266m345133
43828i907256J977071N311839J525565r91611M749214R613663K042122j0539079
43820C781528j0877597J406216R775428O521663J388134K683664N845427N014050
43812B5538513K247369K40829k496743m923329k878564J163809q95743q248510
43804I747631r723860j726125M862843K322753j626355K026767Q136373O908593
$$ plain form
43860 4314140 -1455300 -6902462 -5177070 2495046 8292331 8974172 9578574 13984781
43852 13984781 17538585 14348105 8357475 9690197 20347990 31300564 35692674 37098871
43844 37098871 40623889 43610329 41874267 38662030 38779220 38430276 30573412 17795806
43836 17795806 10036352 10363234 12177598 10322477 6042561 812143 -5562123 -9907256
43828 -9907256 -7930185 -2618346 -1092781 -2084392 2664822 12278485 14320607 3781528
43820 3781528 -7096069 -5689853 4085575 10607238 11995372 14679036 20524463 25538513
43812 25538513 27785882 28026711 25529968 20606639 17728075 18891884 17996141 9747631
43804 9747631 23771 -1702354 3160489 5483242 3856887 5883654 14020027 20928620
43796B0928620L45656k496838q68205j384833n120632o422168l497461j009046
43788D75093j732930k903283j983285n90216j070537k571181k017838K024575
43780a0369602O681458O768146J423751k906033n56168L923307J670530n432276
43772A203113n522154M440061J1363302M392779q567388j2115224m508312K929503
43764f384320L344324M91030r26119r84210l61587J255308J891100n16264k405213
43755d595951J679334R082772J0388983K578390o299214q336352n066144j946311
43747b514493K72354L403528N625882L906021O71568J781753P419094J0254271
43739C0819978N037429l574135o438142j680437L209253J767479l126155m512368
$$ plain form
43796 20928620 21274276 18777438 17909233 16524400 11403768 4981600 1484139 475093
43788 475093 -1257837 -4161120 -6144405 -6734621 -7805158 -10376339 -12394177 -10369602
43780 -10369602 -3688144 3080002 4503753 1597720 1041552 4964859 6635389 1203113
43772 1203113 -4319041 121020 11484322 15877101 7309713 -4805511 -9313823 -6384320
43764 -6384320 -3039996 -2548966 -3475085 -4459295 -4820882 -3565574 -1674474 -2190738 -4595951
43755 -4595951 -2916617 6166155 16555138 19133528 12834314 4497962 -568182 -2514493
43747 -2514493 -2242139 1161389 6787271 10693292 11364860 13146613 20565707 30819978
43739 30819978 35857407 32283272 25845130 24164693 27373946 29141425 26015270 21502902
43731B1502902j931810j388318n202281p930702m818385O33318J806035j472008
43723A198751l525057j712521L67791p53815l035790k243317J662734M432284
43715c608940L728200K884500O405099J2559355J3812166O285013m222603r113136
43707B8729654p688414o117562o947349o185106j931360J124439k98062j486050
43699g99810K948702R051152P861481j420875r291066q077803j012402L242933
43691B502312J428806k361003l847911l750849m657590n434286k244100M746434
43683a3618187R451312P220188J402889j146053P50507K418615J155041j148744
43675F485568l021287n133330o088684k697403L384899N320473O36020m366842
$$ plain form
43731 21502902 19571092 18182774 12980493 5049791 231406 864724 2670759 1198751
43723 1198751 -2326306 -4038827 -3671036 -4424851 -7460641 -9703958 -8041224 -3608940
43715 -3608940 119260 3003760 9408859 21968214 35780380 42065393 37842790 28729654
43707 28729654 21041240 14923678 7976329 1791223 -140137 984302 686240 -799810
43699 -799810 2148892 11200044 19061525 17640650 8349584 271781 -740621 2502312
43691 2502312 3931118 1570115 -2277796 -6028645 -10686235 -16120521 -18364621 -13618187
43683 -13618187 -4166875 3053313 4456202 3310149 4060656 6479271 7634312 6485568
43675 6485568 3464281 -1669049 -7757733 -10455136 -7070237 -1749764 -1113744 -5480586
43667e480586l608709M67274K135823J247596J359454K544877J980102k16386
43659D29445q95045J297009M696950P052070O482197K162195l360524n349828
43651A2514469l050588j148333k173764k138144J965888N310046K048529m815112
43643H512991p369030m217317j018932r36228j221045Q41985M140147O072014
43635D804585M703313m46020o165457o428289J39503O511495N986226J305389
43627A0410745q37047m51043j733826l379907q71106L445840K789350j918061
43619G454945k784459J352284K794305j108626l001953J142122M344266Q15071
43611A1007955l432848n73629N543149N427403r66940m841734k512632L5741k633359
$$ plain form
43667 -5480586 -9089295 -8622021 -6486198 -5238602 -3879148 -1334271 645831 429445
43659 429445 -465600 831409 5528359 12580429 19062626 21224821 17864297 12514469
43651 12514469 9463881 8315548 6141784 4003640 5969528 11279574 13328103 8512991
43643 8512991 1143961 -3073356 -4092288 -5028516 -6249561 -5407576 -1267429 4804585
43635 4804585 9507898 9061878 2896421 -3531868 -3392365 3119130 9105356 10410745
43627 10410745 9573698 9122655 7388829 4008922 3137816 6583656 9373006 7454945
43619 7454945 4670486 6022770 8817075 7708449 4706496 5848618 10192884 11007955
43611 11007955 7575107 7001478 12544627 17972030 17005090 12163356 9650724 9686465 7053106
43602G053106p397250p248226k86184Q035487J0256478M075689m994480q790785
43594G03835n052407N40578J604132j828463m842982m126157p84054K000305K186332
43585i598881K57114j604289j975583j579647j329479j80369K863923N691021
43577g456190N185129J937359m37904l68606P93211K519151N498341Q109483O937053
43568B2717027J701131m142881q203301j0604397j0671747p085179j842595J124166
43560a7007776K002735M183583O625243M079250l030143o493465k030572L790897
43552g880248L574570j00618l46990K486091K557197q87647k316612J025700N066719
43543C178162N016937J325176j825566j514719J372146L533704L015852J436085
$$ plain form
43602 7053106 -344144 -7592370 -7878554 156933 10413411 14489100 9494620 703835
43594 703835 -4348572 -3807994 -2203862 -4032325 -8875307 -13001464 -13785518 -11785213 -9598881
43585 -9598881 -9341767 -10946056 -12921639 -14501286 -15830765 -16011134 -13147211 -7456190
43577 -7456190 -2271061 -333702 -771606 -1140212 -347001 2172150 7670491 15779974 22717027
43568 22717027 24418158 20275277 12071976 1467579 -9204168 -16289347 -18131942 -17007776
43560 -17007776 -15005041 -10821458 -4196215 -116965 -3147108 -9640573 -11671145 -7880248
43552 -7880248 -4305678 -4406296 -4753286 -2267195 290002 -597645 -2914257 -1888557 3178162
43543 3178162 8195099 9520275 7694709 6179990 7552136 11085840 14101692 15537777
43535A5537777J206644J227610j569169o299069p824377l710907K285978N287758
43527F142245M243280N15644m235472p065276n186319n61454J396931k65064m80893
43518e496378L159721N928474L503345j623741n105817o449411n611845j73530
43510a1869182Q551107J2520836O922519j567421l436664Q22265L604297K081258
43502A7629015n94733k992996n989952p229642l109559L810330O330462K101153
43494I954078l837048o108151l982015J28336K758910Q97193m558298q193079
43486a2940074o458597k227383N37900K676837N640847O171894J714680l048653
43478g932549k476818R00925J296736r4691J512339M454918L801216J598898L278842
$$ plain form
43535 15537777 16744421 17972031 16402862 10103793 2279416 -1431491 854487 6142245
43527 6142245 10385525 10901169 6665697 -399579 -5585898 -6147352 -4750421 -5015485 -5496378
43518 -5496378 -2336657 3591817 7095162 5471421 365604 -6083807 -11695652 -11869182
43510 -11869182 -3318075 9202761 16125280 14557859 11121195 11943460 15547757 17629015
43502 17629015 17034282 14041286 8051334 821692 -2287867 1522463 7852925 9954078
43494 9954078 6117030 8879 -3973136 -3844800 -1085890 -188697 -4746995 -12940074
43486 -12940074 -19398671 -21626054 -21088154 -18411317 -12770470 -6598576 -4883896 -7932549
43478 -7932549 -10409367 -9508442 -8211706 -8306397 -6794058 -2339140 1462076 3060974 6339816
43469F339816O276445L949029j028617m04047L286507p36436j0875073j1695750
43461d888126J313912J1758218O553514m212056m261867L627550M754227k601082
43453A2044290o151997j105581L125184k73873n214584m182140O0369R60845n95259
43444a332746O35997L663100K114303m261055o661565M02136R440799R297725
43436A3298694J253938k794864J443816M351287j311035p908363n512218J175250
43428C996505O23384n813664o018500K566350R114768P325082L244340J716334
43420A6754599j341651p349624q639434j745630L932936K39224o132236m302476
43412h584292L909180Q267417N725416J611624o37890j518945m68651K572125
$$ plain form
43469 6339816 12616261 16565290 15536673 15132626 18419133 17682697 6807624 -4888126
43461 -4888126 -3574214 8184004 14737518 10525462 6263595 9891145 14645372 12044290
43453 12044290 5892293 4786712 7911896 7638023 2423439 -1758701 -1698332 -737487 -1332746
43444 -1332746 -696749 2966351 5080654 819599 -5841966 -5439830 4000969 13298694
43436 13298694 14552632 11757768 13201584 17552871 16241836 8333473 2821255 3996505
43428 3996505 4619889 -1193775 -7212275 -4645925 4468843 11793925 15038265 16754599
43420 16754599 15412948 8063324 -576110 -2321740 1611196 1850420 -4281816 -8584292
43412 -8584292 -4675112 3592305 9317721 10929345 10291455 8772510 8303859 10875984
43404A0875984L371894j011668n610440l877767K106363M815307J915551k833776
43396I751448o088222n932061n03579P304024Q349684j300384j1692063j0826541
43388a0937694j344822M455877K888430J122806L105766M763740L363092J248942
43380H666137n38983l100870l834960Q95173P024009O356222o85880n718454o091189
43371B971205p019294r074541n831187K854626P354614L131279j894993p50191
43363h258482K096632M24417k985482k835679l39310J639898M590899Q101530
43355B434423N971078k855004p830505j598755O384953L218773o651575q227652
43347i154264R7536N152390J552542n12056N458542R858434K619317r496908j2232892
$$ plain form
43404 10875984 14247878 13236210 7625770 3748003 5854366 10669673 12585224 9751448
43396 9751448 3663226 -2268835 -2772414 4531610 12881294 11580910 -111153 -10937694
43388 -10937694 -12282516 -7826639 -4938209 -3815403 -709637 4054103 7417195 8666137
43380 8666137 8127154 5026284 1191324 2086497 9110506 15466728 14780848 9062394 2971205
43371 2971205 -4048089 -13122630 -18953817 -16099191 -8744577 -5613298 -7508291 -8258482
43363 -8258482 -6161850 -5737433 -8722915 -11558594 -11897904 -10258006 -5667107 2434423
43355 2434423 8405501 5550497 -2280008 -3878763 2506190 5724963 -926612 -9154264
43347 -9154264 -9056728 -3904338 -2351796 -2863852 2594690 12453124 15072441 5575533 -6657359
43338f657359m134151L461782L720965J094268Q55247J449961K68344l23822K504730
43329B239965O269791O881024M906849L181495R24347l717804p101024l757765
43321I826878L014087K930182n720401j1038063m281030O123694O528219j744312
43313E639254n711222j384267J907437j303077m002356K69707O654133P704252
43305I773861M377476J494350o34407l081609l162334K87418K072653j481950
43297I645458n039687k511853K239500J887196j560229o71906L658662L615791
43289A1262932j335163l239283M7587O65559n417055j0475361o765257J686193
43281a3569848N785166M144416K160884K152678J478473r79180k433935o67243
$$ plain form
43338 -6657359 -10791510 -7329728 -3608763 -2514495 -1659248 -209287 59057 -264765 2239965
43329 2239965 8509756 15390780 20297629 23479124 24403471 20685667 13584643 9826878
43321 9826878 12840965 15771147 10050746 -987317 -5268347 855347 7383566 5639254
43313 5639254 -71968 -1456235 451202 -851875 -4854231 -4584524 2069609 9773861
43305 9773861 14151337 15645687 15011280 11929671 8767337 9054755 11127408 9645458
43297 9645458 4605771 2093918 4333418 6220614 4660385 3988479 7647141 11262932
43289 11262932 9927769 6688486 6736073 7401632 1984577 -8490784 -15256041 -13569848
43281 -13569848 -7784682 -3640266 -1479382 673296 2151769 1172589 -1261346 -1928589
43273a928589K914100N245426M456151Q45997l322812n221986l762807l05139
43265a079659L066588M995296M806911K846288R37824N37441M89020j064374k886589
43256A2648746j992088J172051K778699J580850N62756J231268R35135j601624
43248A7315793k769544K4698K943099J151033l161350l713310L67325L452396
43240A5610140J548275l403249p595481r005812o308588Q64968Q649177J0368533
43232A0727963M248414l472146o018271l718778j022288Q00107L026856L776159
43224H348016l62187o471059o011679L170177J1253229Q537121o98173l776838
43216A3988607K333257P047748K139911o441663p941347j904636L272777L362156
$$ plain form
43273 -1928589 985511 6230937 10687088 11533085 8210273 2988287 -774520 -1079659
43265 -1079659 1986929 6982225 11789136 14635424 15573248 16110689 16599709 15535335 12648746
43256 12648746 10656658 11828709 14607408 16188258 16751014 17982282 18917417 17315793
43248 17315793 14546249 14570947 17514046 18665079 15503729 11790419 12157744 15610140
43240 15610140 17158415 13755166 6159685 -2846127 -9154715 -8289747 359430 10727963
43232 10727963 14976377 11504231 5485960 1767182 744894 1545001 4571857 8348016
43224 8348016 7985829 1514770 -4496909 -1326732 9926497 18463618 17765445 13988607
43216 13988607 16321864 23369612 25509523 19067860 11126513 9221877 12494654 15856810
43208A5856810J918805K090762K738232L426714N750400P550497L208928o355194
43200C6185954j0783421l420278P634220Q899880q40476r822407r396431l417641
43192A5039400k60857j892808m103562l469767n49971K000572K264426Q55616
43184I883049L05505J407447J180796k688419o586115m762931J736292N488434
43176E964058L238300N7236M68605J739276K75983j347761J36050J269592k450106
43167I351233p095745n214064J731959N057349K542143O88130K215403J813543
43159A1089951k115815k072603N635739J1777579O948676l406931o947919k723991
43151A8184686l66962l346070m850643j146612K057279N8705l210896k885224
$$ plain form
43208 15856810 17775615 19866377 22604609 26031323 31781723 39332220 42541148 36185954
43200 36185954 25402533 21982255 29616475 38516355 37675879 27853472 18457041 15039400
43192 15039400 14778543 12885735 8782173 5312406 4762435 6763007 9027433 9883049
43184 9883049 10188554 11596001 12776797 10088378 3502263 -1260668 475624 5964058
43176 5964058 9202358 9259594 9728199 11467475 11743458 10395697 10531747 11801339 9351233
43167 9351233 2255488 -2958576 -1226617 3830732 6372875 7061005 9276408 11089951
43159 11089951 8974136 6901533 12537272 24314851 31263527 27856596 20908677 18184686
43151 18184686 17817724 14471654 9621011 8474399 10531678 10590383 7379487 4494263
43143D494263j157339j949704l241670q47669L773910N165630J413524m072729
43135C578216o662194l593050M332655J1141821R156341j765609j1207124r162654
43127d181598J750273R683781P865819P18520l794681l045279p4939J202073l82547
43118I741422k420444j175024L807915P793382N600001k156251r484117j1074614
43110F32270o231571J822667Q045209Q335228L326399j381029j615501K8423j284980
43101A1677115m370762l464861K143851N721796K484433l286048l876307K113392
43093I142609R068366J1516989Q692234K878396l486643q383778j0081305q210964
43085A1135904m813355l049070l974666n193296l951012r38668J152639K366665
$$ plain form
43143 4494263 3336924 1387220 -1854450 -2702119 1071791 6237421 7650945 3578216
43135 3578216 -3083978 -6677028 -2344373 8797448 17953789 16188180 4981056 -4181598
43127 -4181598 -2431325 7252456 15118275 15836795 12042114 8996835 8921896 10123969 9741422
43118 9741422 7320978 6145954 9953869 17747251 23347252 21191001 11706884 632270
43110 632270 -5599301 -3776634 4268575 12603803 15930202 14549173 12933672 12962095 11677115
43101 11677115 7306353 3841492 5985343 11707139 14191572 10905524 7029217 9142609
43093 9142609 18210975 29727964 38420198 41298594 37811951 29428173 19346868 11135904
43085 11135904 6322549 3273479 -701187 -5894483 -9845495 -10784163 -9631524 -7264859
43077g264859N090887Q269718O896122N4575n381432l701270J114661J633355
43069F711757j781114l100823j426564j117189k121356L61638N464763N463335
43061H454447j776157p820113n654533R56784N076575O232276O582812M437245
43053A6489336j212475n501886m715487l435129o574076r154415l677318N844904
43045a1936546Q150452J777552l181326j203808J508913j009912n082996m942620
43037a5920291k055090r59411j174429Q94701N378260R068225R769422P122184
43029A2123571J633119m148492o156236l408219L00497J603298J551179K008277
43021E506994J593726j214321l742497k114896K771410N877415M182918k56565
$$ plain form
43077 -7264859 -2173972 6095746 12991868 13046443 7665011 3963741 5078402 6711757
43069 6711757 4930643 1829820 403256 -713933 -2835289 -2473651 2991112 8454447
43061 8454447 6678290 -1141823 -6796356 -5839572 -762997 5469279 12052091 16489336
43053 16489336 15276861 9774975 5059488 1624359 -4949717 -14104132 -17781450 -11936546
43045 -11936546 -3786094 -2008542 -5189868 -6393676 -4884763 -5894675 -10977671 -15920291
43037 -15920291 -17975381 -18934792 -20109221 -19214520 -13836260 -4768035 5001387 12123571
43029 12123571 13756690 9608198 3451962 43743 344240 1947538 3498717 5506994
43021 5506994 7100720 5886399 2143902 29006 2800416 8677831 12860749 12604184
43013A2604184l097720k126893N56434M90488l558822o648736l618220K553988
43005b845297L674374j574909n122453j849738K792433K551172O81215K955640
42997A262437O262437M010209o68781J608690J0298690J3437080M767206p359626
42989C3618342j2261950r842508o188587l393209j47376K418935K002166l11631
42981E894182j609568j361829p63113l84783j111333l969790o416216l378641
42973a3101091M482938Q790438M574982j838249k202801J444889J681604j487913
42965B344797k139847j89587j217889m993007m710751Q21649M276787J887318
42957c920530j054715n08325j20250k342471k259667K982926O703751K631947
$$ plain form
43013 12604184 9506464 7379571 7936005 8426493 4867671 -1781065 -5399285 -2845297
43005 -2845297 829077 -745832 -5868285 -7718023 -4925590 -2374418 -1693203 1262437
42997 1262437 7524874 11535083 10866302 12474992 22773682 36210762 40977968 33618342
42989 33618342 21356392 11513884 5325297 1932088 1784712 4203647 6205813 5894182
42981 5894182 4284614 2922785 2159672 1774889 663556 -3306234 -9722450 -13101091
42973 -13101091 -8618153 172285 4747267 2909018 706217 2151106 3832710 2344797
42965 2344797 204950 15363 -1202526 -6195533 -10906284 -10084635 -5807848 -3920530
42957 -3920530 -4975245 -5483570 -5603820 -7946291 -10205958 -7223032 -519281 2112666
42949B112666m381522n993005k702298L49132L961903J0507035J3690681N466263
42941B3010855q532194j3305848n028136M564151O158257L450069K335486J224620
42933A3877260k069423l867084k006861j284469m470881n694497l41849N780282
42925g7522N550252K074773J947715L225934P05693k021237K001768Q740383P311363
42916B9459122k155447p778974m588053j340085m963636r859202q623101l591704
42908a3441080m61702J773742O604664J1343048J0394763L780438l573958q001848
42900H418067p985545k959060L923355O141539K117907j277072J061546M029167
42892A3469904J049733l986913k737990L175187M313313j123088m666493j582489
$$ plain form
42949 2112666 -2268856 -8261861 -10964159 -10615027 -6653124 3853911 17544592 23010855
42941 23010855 14478661 1172813 -3855323 708828 6867085 10317154 12652640 13877260
42933 13877260 11807837 7940753 5933892 4649423 178542 -5515955 -5857804 -77522
42925 -77522 5472730 7547503 9495218 12721152 13426845 11405608 13407376 22147759 29459122
42916 29459122 27303675 19524701 14936648 13596563 8632927 -1226275 -9849376 -13441080
42908 -13441080 -13902782 -12129040 -5524376 5818672 16213435 19993873 16419915 8418067
42900 8418067 432522 -2526538 1396817 7538356 9656263 8379191 9440737 13469904
42892 13469904 14519637 10532724 7794734 10969921 15283234 14160146 9493653 7911164
42884G911164K518939K100307j54496r5290L50866k089392n083994m037341R29151
42875B349914N677057P198245N031516L71870l645677l747618p91605R20097L2282
42866A3396081m28620N89789J80179j683575k40957M892283O076780m28297o088883
42857A6264780k442128M329431K417155o060094p797991K06557N996269K245873
42849A5159852l164100k290163l54028m317008q275704k678017P951332R948234
42841A1980398J215917n757548k859020L110431K910959j521749k316338J637245
42833H400295M263541J822234k832015m762437k198154K211988L556263m64805
42825I996910n585531m698335K614123P978217M949939j933060l801403j84798
$$ plain form
42884 7911164 10430103 12530410 12375914 12280624 12631490 10542098 5458104 1420763 2349914
42875 2349914 8026971 15225216 20256732 20628602 16982925 13235307 12443702 13363799 13396081
42866 13396081 12967461 13557250 13737429 12053854 11812897 16705180 22781960 22353663 16264780
42857 16264780 13822652 18152083 20569238 14509144 6711153 6917710 12913979 15159852
42849 15159852 11995752 9705589 9351561 5034553 -3241151 -5919168 2032164 11980398
42841 11980398 13196315 7438767 4579747 7690178 10601137 9079388 6763050 8400295
42833 8400295 12663836 14486070 11654055 6891618 4693464 6905452 10461715 9996910
42825 9996910 4411379 -286956 2327167 10305384 15255323 13322263 9520860 9336062
42817I336062J532393j770063m920983l849179j755973k405189l357570j001709
42809h192211K224162J673014j372204j706911J277650L430031L418664L765643
42801D517838M111754Q47709m665148n196659J036532N360166J021675n582017
42793A451850m183291L253989N666614M16627l285168j44571K761373j402232
42785D535191o925812m079932N205215R231357K782528o173636p152390P61426
42777a816053R282886J0191296K887816n511968p268460k116105K947644K973646
42769A1570702R82932J717867L379683J186189l412592m384173j502439j187470
42761H350699n338725p281321k846198J601657j487290q403356q624949M00654
$$ plain form
42817 9336062 10868455 9098392 4177409 328230 -1427743 -3832932 -7190502 -8192211
42809 -8192211 -5968049 -4295035 -5667239 -7374150 -6096500 -2666469 752195 4517838
42801 4517838 8629592 9477301 4812153 -384506 652026 6012192 7033867 1451850
42793 1451850 -2731441 522548 6189162 6605789 3320621 3176050 5937423 4535191
42785 4535191 -2390621 -6470553 -1265338 7966019 10748547 4574911 -2577479 -1816053
42777 -1816053 7466833 17658129 20545945 15033977 7765517 5649412 8597056 11570702
42769 11570702 12553634 14271501 17651184 18837373 15424781 11040608 9538169 8350699
42761 8350699 3011974 -4269347 -7115545 -5513888 -7001178 -15404534 -24029483 -23628829
42753b3628829J0037693J1984981P054398J321371j531706j793886r89109k00050
42745B254863R3880r2784p89249k138974l151977j820326J565761K841117j060515
42736b298204o444029o137614J197313Q736882R564758L966914k432357m738030
42728A415633j719554M062345P252142L945480k822961m864536J131099Q281565
42720A6681213P840566M71059n203744l967529Q80948L704716L092681R68765
42712B4468675r84502j857484r75127J191787L056231L804416L589569J662609
42704C3956174k764544o972041n830848J180087P488073P541893M794762P032203
42696D6425759J5076374K1229439J9326746J1675434M344568n35921m982959j0140957
$$ plain form
42753 -23628829 -13591136 -1606155 5448243 6769614 5237908 3444022 2454913 2254863
42745 2254863 2348743 2255959 1466710 -672264 -3824241 -5644567 -4078806 -1237689 -2298204
42736 -2298204 -8742233 -14879847 -13682534 -4945652 4619106 8586020 6153663 1415633
42728 1415633 -303921 3758424 11010566 14956046 12133085 7268549 8399648 16681213
42720 16681213 24521779 24992838 19789094 15821565 16702513 20407229 23499910 24468675
42712 24468675 23484173 21626689 20651562 21843349 24899580 28703996 32293565 33956174
42704 33956174 31191630 24219589 18388741 19568828 27056901 34598794 39393556 46425759
42696 46425759 61502133 82731572 102058318 113733752 118078320 117542399 112559440 102418483
42688A02418483j4285550j5399784j3783872j1768167j1168680j0923843q113101
42681A6975486k593953Q30629k023509p720503q249223j860929M129423L724135
42673C211556L43276M28617L405906L814772M71343l042912n326120p483730p081846
42664a1259138J53446J0845466J4041080M985770p247427j0978928o042184j153131
42656f655046j044963k807639l048325j960347k15346K488814M628529L188323
42648e426000j424521m148669q99334O522667J2257738J1725282N136513k420263
42640B1323413m720222o26285L752674J899363m579412p945301m911596n59543
42632C633091j46504j894567j392796P67803P04596j565069k051700M03104K299667
$$ plain form
42688 102418483 88132933 72733149 58949277 47181110 36012430 25088587 16975486
42681 16975486 14381533 15212162 13188653 5468150 -2781073 -4642002 -512579 3211556
42673 3211556 3554832 3983449 7389355 11204127 11675470 8632558 3306438 -4177292 -11259138
42664 -11259138 -11105692 -260226 13780854 18766624 11519197 540269 -5501915 -6655046
42656 -6655046 -7700009 -10507648 -13555973 -15516320 -15731666 -13242852 -8614323 -5426000
42648 -5426000 -6850521 -10999190 -11898524 -5375857 6881881 18607163 23743676 21323413
42640 21323413 16603191 15976906 19729580 21628943 17049531 9104230 4192634 3633091
42632 3633091 3486587 1592020 199224 967027 1671623 106554 -1945146 -1542042 757625
42623G57625J449311K16623P64274J261736J61645N57444N095374Q744830L681908
42614B2690770p791613j2693646m142597P366915O809188m679006j1204215m311944
42606g956148N974508O401308j430730n518808j121733M380123L074880l913268
42598a09868r146685o718058K802114J1954544J2060748K892636n435478m783163
42590C516790j86053j944636r090531j0465995k660371L966934J297234m133234
42582a9699862j650177P631570J3410284J0507799L197812k219233k962759J51302
42574H366736L091614J226961m277087o151996j587619K012959j594751n936019
42566d849202j287152Q212956R057640o62309p631547l519199L209723J669174
$$ plain form
42623 757625 2206936 2423559 3187833 4449569 4611214 5168658 10264032 19008862 22690770
42614 22690770 14899157 2205511 -1937086 5429829 12239017 7560011 -3644204 -7956148
42606 -7956148 -1981640 4419668 2988938 -2529870 -3651603 728520 3803400 -109868
42598 -109868 -9256553 -15974611 -13172497 -1217953 10842795 13735431 8299953 3516790
42590 3516790 3330737 1386101 -7704430 -18170425 -20830796 -16863862 -15566628 -19699862
42582 -19699862 -21350039 -13718469 -308185 10199614 13397426 11178193 8215434 8366736
42574 8366736 11458350 12685311 8408224 2256228 668609 2681568 1086817 -4849202
42566 -4849202 -6136354 2076602 11134242 10471933 2840386 -678813 2530910 4200084
42558D200084n181337o802100q41667N872072Q205121P115346N250018L917995
42550B1735532L146340J151251l792036q373866n912152L108655Q127167K346225
42542B1537116o219966n966190N83991R50022p276436j2300857n845362N360150
42534i177532J0002632O072070m67978m516808m434129q04429K909894K554144
42526B137864n15476j01054M781326O478798M9205q017547q891288m022623q96909
42517h997704l65647K400551O492170N270823j386611m820308r65530K602321
42509B30065j498850q173547o636913L841563J2200228R508879p23170p877118
42501H71137o717828j859787k08227j604391Q9591O677668J0929507N842141m622594
$$ plain form
42558 4200084 -981253 -7783353 -8625020 -2752948 5452173 12567519 17817537 21735532
42550 21735532 24881872 26033123 22241087 13867221 7955069 11063724 19190891 21537116
42542 21537116 15317150 9350960 9934951 10884973 3608537 -8692320 -14537682 -9177532
42534 -9177532 825100 6897170 6429192 1912384 -2521745 -3326174 -416280 2137864
42526 2137864 1622388 1521334 6302660 12781458 12830663 4813116 -4078172 -8100795 -8997704
42517 -8997704 -9363351 -6962800 -470630 4800193 3413582 -1406726 -2372256 230065
42509 230065 -1268785 -9442332 -16079245 -12237682 -37454 9471425 8748255 871137
42501 871137 -5846691 -7706478 -7914705 -9519096 -9429505 -2751837 8177670 14019811 9397217
42492I397217r774818n872227P49392M073276M755310M574611K194716j745902
42484H351575k126161K743995O194808K216352m958535o696931k039184K554666
42476F240585K990741O93511k055066l730310k171915K443674M980652J729352
42468A1121224k783159k191847J003394l35074m746361l469710M492319R405182
42460A2495968N776681J06285r15356m70884l525583o741172m299117J771618
42452D198440M633691K251118k275369o467790q853660o989495o93613N507457
42444h689221P679306O975937N166156O68287o173950r492027n758168j26014
42436i749694J502272J168928K503925K234608k642898n506225M29591Q261320
$$ plain form
42492 9397217 -377601 -6249828 -5500436 -1427160 3328150 7902761 10097477 8351575
42484 8351575 6225414 8969409 15164217 17380569 12422034 5725103 3685919 6240585
42476 6240585 9231326 9924837 7869771 4139461 1967546 4411220 9391872 11121224
42468 11121224 8338065 6146218 7149612 6814538 2068177 -1401533 3090786 12495968
42460 12495968 18272649 18378934 17463578 16992694 13467111 6725939 2426822 4198440
42452 4198440 8832131 11083249 8807880 2340090 -6513570 -13503065 -14196678 -8689221
42444 -8689221 -1009915 5966022 11132178 11800465 5626515 -3865512 -9623680 -9749694
42436 -9749694 -8247422 -7078494 -4574569 -2339961 -4982859 -10489084 -10059493 -1798173
42428a798173O456124j556326k015423N926978Q168349p66740q779275o602342
42420i66828j585855k511262m604931q12471L634001R61842l548863K61308R161439
42411a1620J0372486J342442o877427n924661O85007N457270N294148R38543m652252
42402F623936o476017k046091M134702O000176M487429M570196N735823L139869
42394B6170023k793916o272601n623085m561994l592857Q02342O785181O608628
42386A7521721q90436o237697l085325J980815L02711m807028l607879M262071
42378E438953Q784754M063489l987030o590984l223725k52322j394688l585571
42370g47124k437805J283766L126150J777166P24826K008766K394070q89699m086784
$$ plain form
42428 -1798173 4657951 3101625 1086202 7013180 15181529 14414789 5635514 -966828
42420 -966828 -2552683 -5063945 -9668876 -10481347 -6847346 -5885504 -9434367 -9173059 -11620
42411 -11620 10360866 11703308 4825881 -1098780 -413773 5043497 10337645 11276188 6623936
42402 6623936 147919 -1898172 2236530 8236706 12724135 17294331 23030154 26170023
42394 26170023 23376107 17103506 11480421 6918427 3325570 4127912 10913093 17521721
42386 17521721 16631285 10393588 7308263 9289078 9591789 4784761 1176882 5438953
42378 5438953 14223707 18287196 14300166 7709182 4485457 4233135 2838447 -747124
42370 -747124 -3184929 -1901163 1224987 3002153 3726979 5735745 8129815 7240116 3153332
42361C153332j765491M302638O973557L643468j512573m798426o166989n102915
42353a273399n05028M226764L561945o46410p6411O368780Q498419K1894j0309137
42344I867417j0513772k109283L749376K526370m58078p05554K92816J03930j425513
42335A327709l728347m833228q35548P983000J3089201P420329k737968m680632
42327A3004516K231073N030963l597937j4015780j2741873j96134J0668338J0010827
42319A0393993P55348n969955k836127N499628P179595j593679r567549m755378
42311h94124P605101J1243634K225950n897969l124512L264495K493495l305132
42303A3610938n806610m836908n183893n408988j174717M422883M872408J754861
$$ plain form
42361 3153332 1387841 5690479 12664036 16307504 14794931 9996505 3829516 -1273399
42353 -1273399 -1778427 2448337 6010282 5363872 5287461 11656241 20154660 20176554 9867417
42344 9867417 -646355 -2755638 993738 3520108 3062030 2356476 2649292 2753222 1327709
42335 1327709 -2400638 -7233866 -8069414 -86414 13002787 20423116 17685148 13004516
42327 13004516 15235589 20266552 16668615 2652835 -10089038 -10285172 383166 10393993
42319 10393993 11149341 5179386 2343259 7842887 15022482 13428803 3861254 -894124
42311 -894124 6710977 17954611 20180561 14282592 11158080 14422575 16916070 13610938
42303 13610938 7804328 2967420 -2216473 -7625461 -8800178 -4377295 495113 2249974
42295B249974J598474L573105J520765l091284k328604L571743M954225j272382
42287A0776016o099895l212635J583886J653237L21731K806820N696968L311317
42279A6837445j676577l037506j816150l348019o732761o329407j965397R30541
42271g137831O66850P36109K031111J479626q15906p21509K071709K708613K3049
42262A041821o45099K963070M847258N30826m205234j623966N054242N420971
42254A3383889k690034r617703p074187J603854P209138N834597Q84545k697416
42246F836683k600609M47763L271415K415473j842757m923708l614689n34755
42238e45184N7070q82632J078727N786358P351880K558759m089165o441127m337007
$$ plain form
42295 2249974 3848448 7421553 8942318 5851034 3522430 7094173 12048398 10776016
42287 10776016 4676121 1463486 3047372 4700609 5022340 7829160 13526128 16837445
42279 16837445 15160868 12123362 10307212 6959193 226432 -6102975 -8068372 -7137831
42271 -7137831 -6470981 -5734872 -3703761 -2224135 -3040041 -3761550 -1689841 1018772 1041821
42262 1041821 396722 3359792 8207050 8737876 4532642 2908676 7962918 13383889
42254 13383889 10693855 1076152 -5998035 -4394181 2814957 8649554 9534099 6836683
42246 6836683 4236074 4683837 7955252 10370725 8527968 3604260 -10429 -545184
42238 -545184 -488114 -1370746 -292019 5494339 12846219 15404978 11315813 4874686 537679
42229E37679j978581j492081j814079j988164j685140K25783L729897N290642
42221H25956J677993m120252n277915j32978N269101N032162L22590l297239k518657
42212b219239J572943N619071O530062L827602O79578P11019L141619L647995
42204B3510650P57394j895660j125334J340007K032016L37794k464668n866782
42196A6625417q973684r147862n018310O62896L741819K982737M6036k722584
42188a803535k837417J045632O092725O772388K262478j126135J374937N580274
42180A7361347M611141n94110l329039j895016j382136m610982p790205o759278
42172d388278k330964K487768O197962P746913N724079J046604k508595k685886
$$ plain form
42229 537679 -1440902 -2932983 -4747062 -6735226 -8420366 -8194583 -4464686 825956
42221 825956 2503949 -1616303 -6894218 -7027196 -1758095 3274067 3596657 299418 -2219239
42212 -2219239 -646296 4972775 11502837 15330439 16010017 16721036 19862655 23510650
42204 23510650 24268044 22372384 21247050 22587057 24619073 24956867 22492199 16625417
42196 16625417 7651733 -1496129 -6514439 -5851543 -2109724 873013 919049 -1803535
42188 -1803535 -4640952 -3595320 2497405 9269793 11532271 10406136 11781073 17361347
42180 17361347 21972488 21378378 18049339 16154323 14772187 10161205 2371000 -4388278
42172 -4388278 -6719242 -4231474 1966488 9713401 15437480 16484084 13975489 11289603
42164A1289603j475421j823751l703544m993892m488288k522944J61319K898826
42156d658092M879531N057970K729745q21088j767212K280472P222846N740518
42148B0664690k178318p072467k568814N033513N908873P75069k276954j358991
42140A6926601j181613j731691J987564Q195306Q157417J012790k633395K673534
42132C3406513P765672L641264l693943l097826L893095O371979J543890k167909
42124D7662735J034927O774949Q301598M915304N94425r26893J937098Q121396
42116G8415539J4041868J6382030J5161377J3071057J2986531J6862678K4168268
42109A91089348L0014385K8929486K2848335K0307800K3956940K4570935J3446921
$$ plain form
42164 11289603 9814182 7990431 4286887 -707005 -5195293 -7718237 -7556918 -4658092
42156 -4658092 221439 5279409 8009154 7188066 5420854 7701326 14924172 20664690
42148 20664690 18486372 11413905 8845091 13878604 19787477 20562546 18285592 16926601
42140 16926601 15744988 14013297 16000861 24196167 32353584 33366374 30732979 33406513
42132 33406513 41172185 44813449 41119506 38021680 41914775 48286754 49830644 47662735
42124 47662735 48697662 55472611 63774209 68689513 69283938 68357045 70294143 78415539
42116 78415539 92457407 108839437 124000814 137071871 150058402 166921080 191089348
42109 191089348 221103733 250033219 272881554 293189354 317146294 341717229 355164150
42102C55164150m245864j6209332j9549636k1704695k6549288k9242544k6162609
42095B11500182k1429968k0128302k1153325k0518774j7476266j4013552j1391816
42088H5388179j0090788j0962049j3768275j5569029j2548881l979170N645492
42081B4115479R217951L845576m708115p423889k795192J705516N40844k730911
42073B1767259k626411m75969m71990j678343p66076P48653p62957l605967l390721
42064H737478j178482j591259m216486m349370j289924J423864L010166N135329
42056E681316N820889J910347l281422l659433j038712k310060o056581l452813
42048f386469N611590R477485K421702n710123m158833L798460P963809N565115
$$ plain form
42102 355164150 350918286 334708954 315159318 293454623 266905335 237662791 211500182
42095 211500182 190070214 169941912 148788587 128269813 110793547 96779995 85388179
42088 85388179 75297391 64335342 50567067 34998038 22449157 18469987 24115479
42081 24115479 33333430 37179006 32470891 25047002 22251810 23957326 24498170 21767259
42073 21767259 19140848 18664879 18192889 16514546 15748470 16497123 15734166 12128199 8737478
42064 8737478 7558996 5967737 1751251 -2598119 -3888043 -2464179 545987 5681316
42056 5681316 11502205 13412552 10131130 6471697 5432985 3122925 -2933656 -6386469
42048 -6386469 -774879 8702606 11124308 5414185 1255352 5053812 13017621 18582736
42040A8582736Q16692l523089o502808n891875j808908P05666j192411k869565
42032a683562L1431L435875J381399l405705l207387K804584P629125O381374
42024A3367134J179457l459400n228704m196477k037481j019861j669265k330474
42016e395071j886469n48639K351586P258320J0502623P149314o48561m461113
42008A4321990j197952K851629K542613P28631N00839r83632n015610n861123
42000G887385j34007N740314N438393K990010M269322N342353j43599p870972
41992B3519199q792000l798210p06755k26380K631176N756164K027944o280072
41984A4131066q398168j714311M646702M987534L929589M975396L753250k244289
$$ plain form
42040 18582736 19399428 15876339 9373531 3481656 1672748 2378414 1186003 -1683562
42032 -1683562 -1652131 1783744 3165143 -240562 -3447949 -643365 6985760 13367134
42024 13367134 14546591 11087191 5858487 1662010 -375471 -1395332 -3064597 -5395071
42016 -5395071 -7281540 -7830179 -5478593 1779727 12282350 19431664 18783103 14321990
42008 14321990 13124038 15975667 18518280 19246911 19747750 18764118 13748508 7887385
42000 7887385 7753378 13493692 18932085 21922095 26191417 31533770 31390171 23519199
41992 23519199 14727199 10928989 10222234 9995854 12627030 18383194 20411138 14131066
41984 14131066 5732898 4018587 8665289 13652823 17582412 22557808 26311058 24066769
41976B4066769o966530m779042J313860N440543O363106N057761J185997l893128
41968B7789336o253591n061515l877179l928449k074564K286693M880769L628507
41960A7390007J373931o04849m163208p004402l020882N996452Q780562J047431
41952A9795042n811580j046966Q523780Q697721n20516n709453o00787N991890
41944B9319131M770537j174870k920208Q37813K829885j906104q893299r783998
41936A3078887l298029K775342J917933k275184k006652K333078K668114l544113
41928A1649376q355444m807682L254491P536896O149710K771294p19506m621047
41920A2858088o929545m444147K126190Q122567R648675O100426k69374m968477
$$ plain form
41976 24066769 17100239 12321197 13635057 19075600 25438706 30496467 31682464 27789336
41968 27789336 21535745 16474230 12597051 8668602 6594038 8880731 13761500 17390007
41960 17390007 18763938 18159089 13995881 6991479 3970597 9967049 18747611 19795042
41952 19795042 13983462 12936496 21460276 30157997 29637481 23928028 23327241 29319131
41944 29319131 34089668 32914798 29994590 30832403 33662288 31756184 22862885 13078887
41936 13078887 9780858 12556200 14474133 12198949 10192297 12525375 15193489 11649376
41928 11649376 3293932 -1513750 1740741 9277637 15427347 18198641 17479135 12858088
41920 12858088 5928543 1484396 3610586 11733153 21381828 27482254 27212880 22244403
41912B2244403l776739K413014P101273N194105j104217n496012m775141q84767
41904B0915919K238064K172462N3044k84009K621847M408151O76314m720537l745863
41895B4335392K960516N399926q52683p450498o000979k88822R89173k517458
41887A6574567m532435k765705l20775O16519K60543q86174o33618M465278J2164740
41878B4942940J3217876L543059p632251r543380m618289k373316l500332j256702
41870A2779605M243716N540697J411827q52371J673887L266734Q07062r01517
41862B7969640J058949J893109j918078n718050m417931p29769J15800j218178
41854A7035492p68818J467049K202439M59644j719196k646487k262018j469496
$$ plain form
41912 22244403 18467664 20880678 27981951 33176056 32071839 26575827 21800686 20915919
41904 20915919 23153983 25326445 25379489 25095480 27717327 32125478 32801792 28081255 24335392
41895 24335392 27295908 32695834 31843151 24392653 18391674 18102852 19092025 16574567
41887 16574567 12042132 9276427 8955652 9572171 9832714 8946540 8312922 12778200 24942940
41878 24942940 38160816 41703875 34071624 24528244 19909955 17536639 14036307 12779605
41870 12779605 17023321 22564018 23975845 23123474 24797361 28064095 28871157 27969640
41862 27969640 29028589 30921698 29003620 23285570 18867639 18137870 18253670 17035492
41854 17035492 16266674 17733723 19936162 20395806 18676610 16030123 13768105 12298609
41846A2298609j754978l573484m564986k300405R85998N65337l147314m068933
41838e560156O69121O309790P592845N546214L656231J513937k985786p594227
41830I147969o773484J221523J1194020J5574616J1513866L728688l6174K599055
41822D8170079N912864L554606l282841q518334r774272r189558p204404k203294
41814A7464846L561781M760087J242348j062998N45194K073824J051484P24509
41806C0361075K279115O61281o000354r728133l161364Q164708J2240360O403661
41798D1220349j036143l201197j056338K005125M698234N959246M359274J015573
41790E3964123j049667j322660j963147l457711m098167l902818m637496n298388
$$ plain form
41846 12298609 10543631 6970147 2405161 104756 1090754 1656091 -1491223 -5560156
41838 -5560156 -4891035 1418755 9011600 14557814 18214045 19727982 16742196 9147969
41830 9147969 2374485 3596008 14790028 30364644 41878510 45607198 45571024 48170079
41822 48170079 54082943 57637549 54354708 45836374 36062102 26872544 19668140 17464846
41814 17464846 21026627 25786714 27029062 25966064 26511258 28585082 29636566 30361075
41806 30361075 32640190 33301471 27301117 17572984 14411620 22576328 34816688 41220349
41798 41220349 40184206 36983009 35926671 37931796 42630030 48589276 52948550 53964123
41790 53964123 52914456 51591796 49628649 46170938 42072771 38169953 33532457 28234069
41782B8234069k281939M178013P973680M465754k860903o201533k649340K960897
41774C3818698M246517N37727k813000j036031M094160O278616K767088j920982
41766D5972793k132640J164899K115639j289280m273375k355879J944662K376348
41758D3523167k467173o962573n367614J347014P183722Q318105O149563L330561
41750E5054772N2648l821013n779015l448597J015631L306143L077386L279934
41742E2737889L654530O61144m613826m865501L058384J1425444J0924505L167802
41734G6150371k355517j588041O21268k95055k808712l781085k809908j65576
41726F2967745M283114P623901M625608m440777j1256805r428140l432360k113348
$$ plain form
41782 28234069 25952130 30130143 38103823 42569577 39708674 33507141 30857801 33818698
41774 33818698 38065215 38602942 35789942 34753911 38848071 45126687 47893775 45972793
41766 45972793 43840153 45005052 47120691 45831411 41558036 39202157 41146819 43523167
41758 43523167 41055994 34093421 28725807 30072821 37256543 45574648 51724211 55054772
41750 55054772 55107420 51286407 45507392 42058795 43074426 46380569 49457955 52737889
41742 52737889 56392419 57053563 52439737 47574236 50632620 62058064 72982569 76150371
41734 76150371 73794854 72206813 72828081 72533026 69724314 65943229 63133321 62967745
41726 62967745 67250859 74874760 79500368 75059591 63802786 54374646 50942286 48828938
41718D8828938n922359p372289l273473J050881J228682L2237K63331j646136
41710C3189812q301524j2726893o173097P242144J3433934P170810j327084k169736
41702C0338366R94718Q5266l155910j845024K142803P17608n165279m845748M674176
41693B3940976J1353517M198526j0789002j8116637j1883379l74040O066844N206124
41685I602929J301194j228747q49004J521140M101731N603225N216641K215649
41677B7484758k594890n654459m077059n77143j040815n864857p952808k007339
41669b284612P722155J2272567Q025788r45932q114386r118552l559300M416084
41661H413812Q775776P496680M389870L282335K987009N59805l300620n549946
$$ plain form
41718 48828938 42906579 35534290 32260817 33311698 34540380 34572617 34835948 33189812
41710 33189812 24888288 12161395 5988298 13230442 26664376 33835186 32508102 30338366
41702 30338366 31333084 31418350 28262440 26417416 28560219 29277827 24112548 19266800 23940976
41693 23940976 35294493 39493019 28704017 10587380 -1295999 -1670039 4396805 9602929
41685 9602929 10904123 9675376 8826372 10347512 14449243 20052468 25269109 27484758
41677 27484758 24889868 19235409 15158350 14581207 13540392 7675535 -277273 -2284612
41669 -2284612 5437543 17710110 25735898 24789966 16675580 7557028 3997728 8413812
41661 8413812 17189588 24686268 29076138 32358473 35345482 35905287 32604667 27054721
41653B7054721n415588m372585l191659k028367j765690k454962k260015n92466
41645D973389J6701j933365l592974k061586P28587J482709J295644L207395O082411
41636A0198911O085696K960086k16868k533699n312735p306291n336154n7943
41628a518997M024778N122420N941925P705201P189359K213486l522073m290833
41620B2865266N01249N472858N513560J701837l4889L082217N566664K23013j0192294
41611C4699481j3704993m642958P276330Q987983P68722o146955n492655j320099
41603B0424856J247710J984786J466787j225857m547380m513408r30054J683593
41595A5591033J016173m61648j066812k149479l178031r92820L529397M473850
$$ plain form
41653 27054721 21639133 17266548 14074889 12046522 10280832 7825870 5565855 4973389
41645 4973389 4990090 3056725 -536249 -2597835 -1869248 -386539 909105 4116500 10198911
41636 10198911 16284607 19244693 19027825 16494126 11181391 3875100 -1461054 -1518997
41628 -1518997 2505781 7628201 13570126 21275327 28464686 30678172 27156099 22865266
41620 22865266 23366515 28839373 34352933 36054770 36019881 39102098 44668762 44891775 34699481
41611 34699481 20994488 16351530 23627860 32615843 33384565 27237610 21744955 20424856
41603 20424856 21672566 23657352 25124139 23898282 19350902 14837494 13907440 15591033
41595 15591033 16607206 16145558 15078746 12929267 9751236 8758416 12287813 16761663
41587A6761663m1131l878286k189801R38489o28669n201662o264368k316704K121858
41578f98611L750665L612994L551216L648294L404585K843337K244664J894170
41570B4251314J452474n64375m712653q071549o917860k215726J501299L051134
41562G774058N114984O867109L217860n237182r074831l003175M439768K353431
41554A2452022n993752p901049l65060O143286M053251j158497j223249K480984
41546H487936K800679j840753o304290o653795l893907p01084J245589Q68006
41538e991619j649155l368513r56409M484003P609980N340785R24774n12575J302044
41529G183315K281879K41455k724294m362327n178756n670975l947663R74863
$$ plain form
41587 16761663 16720532 12842246 10652445 11590934 10962265 5760603 -503765 -2820469 -698611
41578 -698611 3052054 6665048 10216264 13864558 17269143 20112480 22357144 24251314
41570 24251314 25703788 25139413 20426760 12355211 5437351 3221625 4722924 7774058
41562 7774058 12889042 19756151 22974011 17736829 8661998 5658823 10098591 12452022
41554 12452022 6458270 -1442779 -1807839 4335447 8388698 7230201 6006952 8487936
41546 8487936 11288615 9447862 3143572 -3510223 -7404130 -8105214 -6859625 -5991619
41538 -5991619 -7640774 -11009287 -11965696 -7481693 128287 5469072 6393846 5881271 7183315
41529 7183315 9465194 9706649 6982355 2620028 -2558728 -8229703 -12177366 -11202503
41521a1202503N710848N794068J468198k723284l346573m45354M256096Q170168
41513G681664P822621J990655n217627q116855o281934l922692k760222l92267
41505i196657L608052N481365L489348J463062K765350M605325K428438k669961
41497A1974322n155848k558192J690666K806872q3383l365340k895794J069937
41489C483240L368205N4776n688857o873859j748817M434572P193328P509041
41481A1731629O910371L109863n247156j2925273j2374615l089278O788378Q703530
41473C607449K171036m932854m422105L153676Q524815M651106m206506q137214
41465D09403m571413M2043Q98295J38495L31411l1302j653712j613028J044013
$$ plain form
41521 -11202503 -5491655 302413 1770611 -952673 -4299246 -4744600 -488504 7681664
41513 7681664 15504285 17494940 12277313 4160458 -2121476 -6044168 -8804390 -9196657
41505 -9196657 -5588605 -107240 3382108 4845170 7610520 12215845 14644283 11974322
41497 11974322 6818474 4260282 5950948 8757820 8674437 5309097 2413303 3483240
41489 3483240 6851445 6906221 1217364 -5656495 -7405312 -2970740 4222588 11731629
41481 11731629 18642000 21751863 16504707 3579434 -8795181 -11884459 -5096081 3607449
41473 3607449 5778485 845631 -3576474 -422798 8102017 12753123 8546617 409403
41465 409403 -4162010 -4119967 -3221672 -3083177 -2751766 -2783068 -4436780 -6049808 -5005795
41456e005795K764279J933755J750419L159579J814739l404351o063104k168356
41448e218835K412250J301325k159773j740409P12343j03802k532014j588955
41440h917870J129063P71400j009981O15815L670837K882207M59246K414709O161366
41431H176792L739009l209189m257940K716434P510999L587488l216929n891031
41423I155633n750368o067310n552242l162178j215358N22871N537503J1546461
41415E015012J0214113O62553o562950m921235j152911j968706k238384L516725
41407B564217P745590J240237q899981p557470N015254J2679113O763584l340191
41399A6210353o137225l166430k458811n040112m934793J090718Q874318J0962804
$$ plain form
41456 -5005795 -2241516 -307761 1442658 4602237 6416976 3012625 -3050479 -5218835
41448 -5218835 -2806585 -1505260 -3665033 -5405442 -4693099 -4796901 -7328915 -8917870
41440 -8917870 -7788807 -7017407 -8027388 -7411573 -3740736 -858529 -399283 2015426 8176792
41431 8176792 11915801 8706612 4448672 7165106 14676105 18263593 15046664 9155633
41423 9155633 3405265 -2662045 -8214287 -11376465 -12591823 -12068952 -6531449 5015012
41415 5015012 15229125 15891678 9328728 4407493 3254582 1285876 -952508 2564217
41407 2564217 10309807 11550044 2650063 -4907407 107847 12786960 19550544 16210353
41399 16210353 10073128 6906698 4447887 -592225 -5527018 -4436300 4438018 15400822
41391A5400822L974355o620698j0066404k251458P345994O174931m635347j1233610
41383a911415n857320L403679N440109J144193j023536Q67592J042316k915754
41375A89864o087220m553202j259015o13837j579814K31056N674634J0297517
41367B299983Q929916Q64500q621959j1668175n063444M960785Q049053J690052
41359A440711n272674m031439K645141N098447O24948l901424l060231L66578
41351f089943J677246J143276J186671J581700J397575J746024K709850J235953
41343F588352l835144q104586p204056k740198J501326N411144R621767J0763437
41335A2002042N979933q78117m094340m389389n709807o857716m360469j087062
$$ plain form
41391 15400822 19375177 12754479 2688075 436617 7782611 13957542 9322195 -1911415
41383 -1911415 -7768735 -4365056 1075053 2219246 1195710 2063302 3105618 189864
41375 189864 -5897356 -10450558 -11709573 -12323410 -13903224 -13672168 -7997534 2299983
41367 2299983 11229899 12094399 3472440 -8195735 -13259179 -8298394 -249341 1440711
41359 1440711 -3831963 -7863402 -5218261 -119814 505134 -3396290 -6456521 -6089943
41351 -6089943 -4412697 -3269421 -2082750 -501050 896525 2642549 5352399 6588352
41343 6588352 2753208 -5351378 -12555434 -15295632 -13794306 -8383162 1238605 12002042
41335 12002042 17981975 17103858 13009518 8620129 2910322 -3947394 -8307863 -9394925
41327i394925k563650n952457k990853N681174R728866M838455j015802p75016
41319b444208J735094K55854l559372m299271j192131L056716O777229Q403499
41311H733410O148125K222048J760422M209607K369224o013989j2841482j0916383
41303d329018l769217J345886L467627M606418L096675k140048o047233l775024
41295g543934J714876M958314N941196O078822K257262o685853j2902560q638533
41287a4820410J502979O963842O317188N803688O027454J943940m771716n401676
41279C565289J873297P950216N844613n16817l799636k711048o69438j99960j248144
41270A0088372j686138Q81282M713003L676940l621435q151471j709352R208096
$$ plain form
41327 -9394925 -11958575 -17911032 -20901885 -15220711 -5491845 -653390 -1669192 -2444208
41319 -2444208 -709114 -453260 -4012632 -8311903 -9504034 -6447318 329911 8733410
41311 8733410 14881535 17103583 18864005 23073612 25442836 19428847 6587365 -4329018
41303 -4329018 -8098235 -6752349 -3284722 1321696 4418371 2278323 -3768910 -7543934
41295 -7543934 -5829058 -870744 5070452 11149274 13406536 6720683 -6181877 -14820410
41287 -14820410 -13317431 -6353589 -36401 5767287 11794741 13738681 8966965 3565289
41279 3565289 5438586 13388802 19233415 18716598 14916962 12205914 11536476 11336516 10088372
41270 10088372 8402234 9283516 13996519 17673459 14052024 5900553 4191201 13399297
41262A3399297J0731339J344912o815548o538012l381353k661673r74877M087733
41254I191818O676410K227217m176334n929359m233430k928832j183473J791029
41246A435046J683191l436400o702814k047711M969279N076662q5309j217658
41238c25714L277100N693604K495689p64636J50994J973868J694285K523934O623882
41229B3343006Q033534L31979j1300111j3465040j425761J2901186J3626330o56248
41221C1388875j4987432j4829272j746185R377575P142106m631338j1966513o081418
41213f333602P203562J3781710O937844n103906r396079l897982K099119K470169
41205G760835J471288L660560N040459J073184l350133j453871K585904m46510
$$ plain form
41262 13399297 24130636 25475548 18660000 12121988 8740635 6078962 5104085 9191818
41254 9191818 15868228 18095445 13919111 7989752 3756322 827490 -355983 1435046
41246 1435046 3118237 -318163 -7020977 -9068688 -4099409 977253 891944 -325714
41238 -325714 2951386 8644990 11140679 10376043 10527037 12500905 14195190 16719124 23343006
41229 23343006 31376540 31708519 20408408 6943368 5517607 18418793 32045123 31388875
41221 31388875 16401443 1572171 -174014 9203561 16345667 11714329 -252184 -6333602
41213 -6333602 869960 14651670 21589514 16485608 7089529 3191547 5290666 7760835
41205 7760835 9232123 12892683 17933142 19006326 15656193 14202322 16788226 16341716
41197A6341716q316288r101629j21041P198385M738333j328476k284691M08003
41189G534312R41680n82124j249759k072445m237655m247362P6923L946448L067313
41180C177331J563003M692758Q519391N711723j952935o280147n622065n589308
41172D219751p578611o182834O30532P078415P921603M812650J628197j140174
41164A1389529m383525o817872o359647k910518J602802M425695L541327J71799
41156F59590j478810K54603J198471k475145o890717m927243K772591P463334
41148c423326L901157l086344n430686j144301M830538O093175M92199o871850
41140d639438p141552J993030J1044053R438728K91342l233164L174737Q936787
$$ plain form
41197 16341716 8025428 -1076201 -1197242 6001143 10739476 9411000 7126309 7534312
41189 7534312 8475992 7893868 6644109 4571664 334009 -3913353 -3836430 110018 3177331
41180 3177331 4740334 9433092 17952483 23664206 21711271 15431124 9809059 4219751
41172 4219751 -3358860 -9541694 -8911162 -1832747 6088856 10901506 12529703 11389529
41164 11389529 7006004 188132 -6171515 -9082033 -7479231 -3053536 487791 659590
41156 659590 -819220 -564617 633854 -1841291 -8732008 -13659251 -10886660 -3423326
41148 -3423326 477831 -2608513 -8039199 -9183500 -4352962 1740213 2232412 -4639438
41140 -4639438 -11780990 -9787960 1256093 10694821 10986163 7752999 10927736 19864523
41132A9864523M990715k951080m382416O3248J839689q23555j733124J126535
41124A7994535K392652l74412k416124j212499j832846p243807j0281080l310271
41116f283852Q427692J2334681N872149r01516j150947l4755l598654p547837
41108G116961m444468L519871P382568M245010o56863l267034m388431m397214
41100E110400j830696J901645L104669K084200K556509M314178L469817L32796
41092B1043518j231736k816251r307266j5604863q682986J0680912K1627974R856180
41084B5565482j0358291j5025819l397329M635553l6896n445733j258154N458114
41076A36927L992777l344788p124995m965664j432633R21577L174934N517624
$$ plain form
41132 19864523 24855238 21904158 17521742 17584990 19424679 18601124 16868000 17994535
41124 17994535 20387187 20012775 17596651 16384152 14551306 7307499 -2973581 -6283852
41116 -6283852 2143840 14478521 20350670 19449154 18298207 18263452 14664798 7116961
41108 7116961 2672493 6192364 13574932 17819942 17163079 13896045 9507614 5110400
41100 5110400 3279704 5181349 8286018 10370218 12926727 17240905 20710722 21043518
41092 21043518 19811782 16995531 7688265 -7916598 -16599584 -5918672 15709302 25565482
41084 25565482 15207191 181372 -3215957 1419596 1382700 -4063033 -5321187 136927
41076 136927 4129704 784916 -6340079 -11305743 -12738376 -11816799 -8641865 -3124241
41068c124241O294078M210548o35641n723495n914714J315982J0023210J0806071
41060A7251798L006253l988167l346654J596402M628453M790313L744353J392712
41052B9075463j549322k110558m19820j092972n003818n621003J029713Q423780
41044B2731463Q165125J860903k852506m205848n958679p671219m607882K282629
41036I743986M873967o09968o892052m977394L318485P099522M05275r279870
41028C681951r368382J661836J0679755N837211p189709j1703952k300599P986724
41020g15165O229428l153401o696683j177724M607107M245478L38123k951382
41012G25781n284277o400252m155677R16588M450827M241384K947936K718105
$$ plain form
41068 -3124241 3169837 7380385 6744744 1021249 -4893465 -3577483 6445727 17251798
41060 17251798 20258051 16269884 12923230 14519632 19148085 23938398 27682751 29075463
41052 29075463 27526141 25415583 24995763 23902791 18898973 13277970 14307683 22731463
41044 22731463 30896588 32757491 29904985 25699137 19740458 12069239 7461357 9743986
41036 9743986 14617953 14007985 7115933 2138539 5457024 12556546 12961821 3681951
41028 3681951 -5686431 -4024595 6655160 12492371 5302662 -6401290 -8701889 -715165
41020 -715165 5514263 2360862 -4335821 -5513545 -906438 3339040 3677163 725781
41012 725781 -4558496 -10958748 -15114425 -14197837 -9747010 -5505626 -2557690 160415
41004A60415J761177j046510k673863q09926J348185l03181l637745k763030K861141
40995e103337O670768M003935q91342l26032N884315R215629L423750o748052
40987A6129634j1232411p287092k085319k452329o525184p717036l386254L469829
40979b1086162Q592435R260960M688276k714680p407497n483955O73939M955599
40971h521085M460292J642607o6060k56095o93513k103061k662322N9393N090822
40962c049022P098450K350171m576438m645893L427237R944147O726346k030384
40954A5244614o586832n079336l199081l261826j857787J853989L478078Q12846
40946A404665k555500l451958l277711l391906j710149K651613N904031M817450
$$ plain form
41004 160415 1921592 875082 -1798781 -2608707 -1260522 -1563703 -5201448 -7964478 -5103337
40995 -5103337 1567431 5571366 4680024 4353992 10238307 19453936 22877686 16129634
40987 16129634 4897223 -2389869 -4475188 -6927517 -13452701 -21169737 -24555991 -21086162
40979 -21086162 -12493727 -3232767 1455509 -1259171 -8666668 -14150623 -13476684 -8521085
40971 -8521085 -4060793 -2418186 -2484246 -2740341 -3433854 -5536915 -8199237 -8139844 -3049022
40962 -3049022 4049428 6399599 1823161 -2822732 604505 10548652 17274998 15244614
40954 15244614 8657782 3578446 379365 -2882461 -4740248 -2886259 591819 1404665
40946 1404665 -1150835 -4602793 -7880504 -11272410 -12982559 -10330946 -4426915 390535
40938C90535K043804K094979M390174M323168l4087n655697q318835o130591j01449
40929f997999O277984Q370114L855441m152349q651349m826690M819750J1869975
40921A0564877R736992L15768q254919j0346874p064128j872521L431223O548634
40913C059052M177861j775252k873887M304109J0195166M768039n933527p463723
40905H457838M54635L114835n261522j1806660n938107L778812M322194j330320
40897d208295j626790L501865M562183J81985j647062J237361K188228j259989
40889B929486l553776k168487j412536k735839j869638J279382M59896n073905
40881a2145417o921013j124531M525559L423480R19791L844831P664918M265619
$$ plain form
40938 390535 2434339 4529318 8919492 13242660 13208573 7552876 -765959 -6896550 -6997999
40929 -6997999 -720015 7650099 11505540 7353191 -1298158 -6124848 -1305098 10564877
40921 10564877 20301869 20617637 12362718 2015844 -5048284 -6920805 -3489582 3059052
40913 3059052 7236913 5461661 2587774 6891883 17087049 21855088 15921561 8457838
40905 8457838 8912473 12027308 6765786 -5040874 -10978981 -7200169 -2877975 -4208295
40897 -4208295 -5835085 -2333220 2228963 2410948 763886 2001247 4189475 2929486
40889 2929486 -624290 -2792777 -4205313 -6941152 -8810790 -7531408 -7071512 -12145417
40881 -12145417 -19066430 -20190961 -15665402 -12241922 -11322131 -7477300 187618 4453237
40873D453237l610773o616030l627866j644930k979863k911696L02866K611043
40865a4024012K229787K250667L842824M194179K654471K147868L188022L205503
40857I689309K910347N812215R647073O745326l319702r659520m493100N038486
40849B2370434O555075r78402q059929q894441o663218n324022l767665M2773
40841d719395M367188N763983L258955j014013l690592k439948J794699M796251
40833H117128L189179j398616l988060k136799J323660J752385j958783n855685
40825i55591m976912O58404N280587M407886J101187J457383M971345N281570
40817A7225859J151251o86492L046844N513004O43905n854140m818635J598699
$$ plain form
40873 4453237 842464 -5773566 -9401432 -11046362 -14026225 -16937921 -16635055 -14024012
40865 -14024012 -11794225 -9543558 -5700734 -1506555 1147916 3295784 6483806 9689309
40857 9689309 12599656 18411871 28058944 34804270 31484568 21825048 17331948 22370434
40849 22370434 28925509 27947107 19887178 10992737 4329519 -994503 -4762168 -4719395
40841 -4719395 -352207 5411776 8670731 7656718 3966126 1526178 3320877 8117128
40833 8117128 11306307 9907691 5919631 3782832 5106492 6858877 4900094 -955591
40825 -955591 -5932503 -5274099 6488 4414374 5515561 6972944 11944289 17225859
40817 17225859 18377110 17690618 20737462 26250466 26894371 21040231 16221596 17820295
40809A7820295L249563k173348o718905n368415j808157L12860K470189M909039
40801A2693121L967670m76581k806038j099082j014663n332624p589687k803313
40793d461197K828437J541132k514617K95689Q461260J0317917J811548o995914
40785A1284255o193124J267569N676975L654561k78994k086401k743985m528511
40777F052345o455252n196058K20238O051942P324018L507908r08268k082105
40769H514768j034974r06883k151084k692675j357795J207842L919231N373848
40761A0872278L751065j020186n708062o485602k807909K551982O151192N643928
40753A2948686J144433l574667l787779K16668K638942O47l884140l960180j166882
$$ plain form
40809 17820295 21069858 18896510 12177605 6809190 5001033 5313893 7784082 12693121
40801 12693121 16660791 16184210 13378172 12279090 11264427 5931803 -1657884 -4461197
40793 -4461197 -1632760 -91628 -2606245 -2310556 6150704 16468621 18280169 11284255
40785 11284255 5091131 6358700 12035675 15690236 15411242 13324841 10580856 6052345
40777 6052345 -402907 -5598965 -5378727 673215 7997233 11505141 10596873 8514768
40769 8514768 7479794 6572911 4421827 1729152 371357 1579199 5498430 10872278
40761 10872278 14623343 13603157 7895095 1409493 -1398416 1153566 7304758 12948686
40753 12948686 14093119 10518452 6730673 6947341 9586283 9586930 5702790 1742610 575728
40744E75728Q55508K522385N621228O788674J439777o732368q548802k835997
40736c13867J026412k716670p018572k819627O398154Q626748L42337q034287
40728d509372n988283K934452N791131k288851j1040046q474576K736917Q638454
40720a2200174K947367n076621m498495K902316P818133P131561M874547L447644
40712G346278K216882K395349M753091M208288l917988j2991763j0884135K052693
40704d821305J1374046P919859j314677n896489n416732m198066k039819J723113
40696b670070K633101j604326m446247r3906N733378M266809j730614k658998
40688e70873J739899K650560k196661n142727k570920r05606m334978o383181
$$ plain form
40744 575728 1431236 3953621 9574849 16363523 17803300 11070932 2522130 -313867
40736 -313867 712545 -2004125 -9022697 -11842324 -5444170 3182578 3524915 -4509372
40728 -4509372 -10497655 -7563203 -1772072 -4060923 -15100969 -23575545 -20838628 -12200174
40720 -12200174 -9252807 -14329428 -18827923 -15925607 -8107474 -975913 3898634 7346278
40712 7346278 9563160 11958509 16711600 20919888 17001900 4010137 -6873998 -4821305
40704 -4821305 6552741 14472600 13157923 7261434 1844702 -2353364 -4393183 -2670070
40696 -2670070 -36969 -1641295 -6087542 -6181448 -448070 3818739 2088125 -570873
40688 -570873 1169026 3819586 1622925 -3519802 -6090722 -6996328 -11331306 -17714487
40680a7714487m54330Q254540R262975J571557n383823m513662J164041M447430
40672c365759L295882J613463K385377L302246Q28274l288209l526390P42267
40664A987151K808960j848409p680758o088209K165568P848362N670657n41050
40656D322272n171339o858708o105836l197551n82371j519472m033657k119450
40648b5266112M388465P783964M238287N43159L167123P118744L995546l604130
40640B365046n571431j4299M651356L407498N62399O3128o04223k972732k758537
40631h71795J823402M198629j064425q479402r058212l349036J000790J618966
40623a4181083K552865M672721M300121J753669K103061N409851M868188j950147
$$ plain form
40680 -17714487 -18168817 -9914277 -651302 920255 -4463568 -8977230 -7813189 -3365759
40672 -3365759 -69877 1543586 3928963 7231209 8059483 4771274 1244884 1987151
40664 1987151 4796111 2947702 -4733056 -10821265 -8655697 -807335 4863322 4322272
40656 4322272 -849067 -7707775 -13813611 -17011162 -17593533 -19113005 -23146662 -25266112
40648 -25266112 -20877647 -13093683 -8855396 -8312237 -5145114 1973630 5969176 2365046
40640 2365046 -3206385 -3220684 1430672 4838170 5400569 5463697 4859474 1886742 -871795
40631 -871795 951607 5150236 4085811 -4393591 -13451803 -16800839 -15800049 -14181083
40623 -14181083 -11628218 -6955497 -2655376 -901707 1201354 6611205 11479393 9529246
40615I529246p990598p359236l772398k837156k571502J438000O690650P348412
40607D75418L741488R70386N46423L02795K73468J617680J784374j853649n301396
40598B556987k794555K894165L546787j515188m584702k275091M33406O76272
40590a061919K386864O833054P781628J571542n605647o421387k314479O62172
40582C831828L15420k122316n126951n175156J443895J0280744R984033j677432
40574A1754065j1224931p297811K805795M986872k29533j354126L457945M617367
40566G515643o47898l347017P93806L359322k294875r586315r276306l149655
40558a6633295J093686K490644N521366R628764Q952908K558585k126297J292528
$$ plain form
40615 9529246 1538648 -5820588 -9592986 -12430142 -15001644 -13563644 -6872994 475418
40607 475418 4216906 5187292 5733715 6036510 6309978 7927658 9712032 7858383 2556987
40598 2556987 -237568 2656597 6203384 4688196 103494 -2171597 -1738191 -1061919
40590 -1061919 1324945 8157999 15939627 17511169 11905522 5484135 3169656 3831828
40582 3831828 4147248 2024932 -3102019 -8277175 -6833280 3447464 13431497 11754065
40574 11754065 529134 -6768677 -3962882 1023990 794457 -559669 2898276 7515643
40566 7515643 6867745 3520728 4314534 7673856 5378981 -4207334 -13483640 -16633295
40558 -16633295 -15539609 -13048965 -7527599 2101165 11054073 13612658 11486361 12778889
40550A2778889R111461J1038151K048449j1473034j8498772j5019376o576834
40543a6591066L01279M736009P788403P540557K920222j543948j352206J79787
40535C979037k869096p759257n863316K937161Q007160L105632m582579n273828
40527h319086M74793N316331O008758M349656J335938k669603m181538J65708
40519B480957O858423P774604M84745p815419q551142j579858M958340L680273
40511H290923m089129r402854n068218N898889J2481366P568681l450105q380958
40503C848595k712777M560451K271043p706951j1939838l541567P507089P879251
40495A65296j62993k882076L566526P900109K695205l754412j993477K740056
$$ plain form
40550 12778889 21890350 32928501 34976950 23503916 5005144 -10014232 -16591066
40543 -16591066 -16289787 -11553778 -3765375 3775182 6695404 5151456 3799250 3979037
40535 3979037 1109941 -6649316 -12512632 -9575471 -1568311 1537321 -3045258 -8319086
40527 -8319086 -7844293 -2527962 3480796 7830452 9166390 6496787 2315249 2480957
40519 2480957 9339380 17113984 17598729 9783310 1232168 -347690 4610650 8290923
40511 8290923 4201794 -5201060 -10269278 -4370389 8110977 15679658 12229553 3848595
40503 3848595 1135818 5696269 7967312 260361 -11679477 -15221044 -7713955 165296
40495 165296 2303 -2879773 686753 8586862 11282067 7527655 5534178 8274234
40487H274234j9063q108700j0498354m472669K678942O237524P067569M504483
40479E663966k172987o857391l026528M099686L878775k420123l887328R41258
40471c780672K217338k741755n014193j491010o02728n358664o764603j225983
40463b4762270J469352l617700o169644Q08122P351626M269415j19033M095928
40455a6674204R331676M660796k726637K42216P891618M530677p816355j1865908
40447a2426121l036800N484403N736123L741944L475463M24108n200350n584287
40439g385517k21551J545401k531471l112309L040624N967845J37559n015664
40431g575083j045406N310963L985755k201054l668765N49605L158045l9022o313178
$$ plain form
40487 8274234 8255171 146471 -10351883 -14824552 -12145610 -5908086 1159483 5663966
40479 5663966 3490979 -3366412 -6392940 -2293254 1585521 -834602 -4721930 -3780672
40471 -3780672 -1563334 -4305089 -9319282 -10810292 -11413020 -16771684 -23536287 -24762270
40463 -24762270 -23292918 -26910618 -33080262 -32272140 -24920514 -20651099 -20770132 -16674204
40455 -16674204 -7342528 -2681732 -5408369 -5166153 2725465 7256142 -560213 -12426121
40447 -12426121 -15462921 -9978518 -4242395 -500451 2975012 3399120 -1801230 -7385517
40439 -7385517 -7607068 -6061667 -8593138 -11705447 -8664823 -2696978 -2559419 -7575083
40431 -7575083 -8620489 -3309526 676229 -1524825 -5193590 -4643985 -1485940 -1524962 -7838140
40422g838140j0311753p898452L49446P241364O047060M56914p5559M556832N049206
40413b423082m76449k285574L565667O786751m24527r989473j0614044l667312
40405a9528043L195805Q470228J2407648R737073j115160r567915o365900J388475
40397a377789J673395k761968r61207N358005M375147m484842q977516m923443
40389a2080218k218213o068951p523825K48923Q861336P085480k391267p860408
40381b1947143m907143K46763R24689k585799m698391m11369R106922J5943872
40373h327599J3626677O110291L467622P633354R131554J186114r558295j2010594
40365A1259124n554599P11060J129203j069555j386299p54723j995795l698742
$$ plain form
40422 -7838140 -18149893 -26048345 -25698899 -18457535 -12410475 -11953561 -12029120 -7472288 -2423082
40413 -2423082 -2899531 -5185105 -1619438 5167313 4742786 -5246687 -15860731 -19528043
40405 -19528043 -16332238 -7862010 4545638 14282711 13167551 3599636 -2766264 -1377789
40397 -1377789 295606 -2466362 -3427569 1930436 6305583 1820741 -7156775 -12080218
40389 -12080218 -14298431 -20367382 -27891207 -27642284 -18780948 -11695468 -14086735 -21947143
40381 -21947143 -26854286 -26607523 -25682834 -28268633 -32967024 -33378393 -24271471 -8327599
40373 -8327599 5299078 11409369 14876991 22510345 31641899 32828013 23269718 11259124
40365 11259124 5704525 6415585 7544788 6475233 5088934 4334211 2338416 -1360326
40357a360326j898343L084675N553432J931439l444818l572421J390013M337395
40349F021046J877474r00553O72302K784199l98280o310154p293433k383093J812285
40340d118207J748189Q64591J604031Q90253l304409o938575n575631p55859L175255
40331a2410362N082084O118517N803640L063296p01569l149798m284233n125436
40323e603861m348591K25682O718547Q910202K805102p293787j1349623m020427
40315a3956756P927701J1725197L627975n749954m811621L705063P059389N33394
40307A0060388p035229p195225l081290k131479m367509m645360k269022q17940
40299b1482666l14395K919407Q288730R599603L967641l200990n492537l946491
$$ plain form
40357 -1360326 -3258669 -173994 5379438 7310877 3866059 293638 1683651 6021046
40349 6021046 7898520 6997967 7670269 10454468 10056188 3746034 -3547399 -5930492 -4118207
40340 -4118207 -2370018 -1505427 98604 988857 -2315552 -9254127 -14829758 -15585617 -12410362
40331 -12410362 -7328278 -1209761 4593879 7657175 6955606 3805808 -478425 -5603861
40323 -5603861 -9952452 -9726770 -3008223 5901979 8707081 1413294 -9936329 -13956756
40315 -13956756 -6029055 5696142 9324117 3574163 -1237458 2467605 9526994 10060388
40307 10060388 3025159 -4170066 -7251356 -9382835 -13750344 -18395704 -20664726 -21482666
40299 -21482666 -21797061 -18877654 -10588924 -989321 2978320 -222670 -5715207 -9661698
40291i661698m026568o377323n768552K93143O596061O875885K597659O63733
40283h807660L094837M194717k41702n795338n625943m41898L090393K135494
40275h397100J2429p71783j458506k007185L95625N093920O136893Q29151m736079
40266d902635l724552J541629L314270m15162m294753m015121q25531K240820
40258a1081035L785721L235385Q35895r23389L27249K574136J431584k953065
40250b767519n254616k487494K140853M798656N990473O931968N261845q67817
40242A3746349p155062p186132j407189L072855K156042m78001J16864L064456
40234E930182L973765J453803k087797m637272o249176o937421n731115k351432
$$ plain form
40291 -9661698 -13688266 -20065589 -25834141 -25540998 -18944937 -12069052 -9471393 -8807660
40283 -8807660 -5712823 -1518106 -1759808 -7555146 -13181089 -13622987 -10532594 -8397100
40275 -8397100 -8384671 -9156454 -10614960 -12622145 -12226520 -7132600 -995707 -166556 -4902635
40266 -4902635 -8627187 -7085558 -3771288 -4186450 -8481203 -12496324 -13321855 -11081035
40258 -11081035 -7295314 -4059929 -3224034 -4147423 -3820174 -1246038 185546 -2767519
40250 -2767519 -8022135 -10509629 -8368776 -3570120 2420353 9352321 14614166 13746349
40242 13746349 6591287 -594845 -2002034 1070821 3226863 2748862 2865726 5930182
40234 5930182 9903947 11357750 9269953 4632681 -1616495 -8553916 -14285031 -16636463
40226a6636463J821956M780876N084333K771384K15028O18460L698020M663056
40218G016650O67136l478109r90185N966953P433916l33820q461305p477049l85624
40209d1437K610498j099690m625203l302838n36937n41681j950440j733320m76427
40200a1697475p5728K51148J849996K981368J114317k309695k782550J596722
40192i071897P550674R976355O569192q85880q497811j2760655j1686743n360284
40184b4167049K822465O559517K121295n531661o471373J500824Q446140N338709
40176i381133k955077m905068Q35094N163704L825756K108094K880885J468875
40168i58870l256303l916119K213924N365849j831583j0266872o919441M749752
$$ plain form
40226 -16636463 -14814507 -10033631 -4949298 -2177914 -1962886 -1344426 2353594 7016650
40218 7016650 7683786 4205677 3215492 9182445 16616361 16282541 7821236 344187 -41437
40209 -41437 2569061 1469371 -3155832 -6458670 -6995607 -7537288 -9487728 -11221048 -11697475
40200 -11697475 -11773203 -11522055 -9672059 -6690691 -5576374 -7886069 -10668619 -9071897
40192 -9071897 -1521223 8455132 15024324 14138444 5640633 -7120022 -18806765 -24167049
40184 -24167049 -21344584 -14785067 -12663772 -18195433 -24666806 -23165982 -14719842 -9381133
40176 -9381133 -12336210 -17241278 -16406184 -11242480 -7416724 -5308630 -2427745 -958870
40168 -958870 -4215173 -8131292 -5917368 -551519 -2383102 -12649974 -19569415 -14819663
40160a4819663J0179807N817485J785983L274237L638772j317040n396051l706309
40152e42779j296558l284031n341544j807219L655099L757485p61602k979607
40144h600756l00751L619184N334241M194706L22427m663083o386416k109817
40136h590265M609656P693391N790739K319094L2357q90705j123438j822431l924461
40127D093937n265546k050474L720178L830929l764009q312295m50613J2088544
40119C890651J3969616M429054k929817k051725j571208o631923q474822m56199
40111A73627Q003691N091861m485724p021363q06879L315333j37748n145361n776705
40102f789268l015918R73094N574186P264704J891675o485698q197774k071250
$$ plain form
40160 -14819663 -4639856 1177629 2963612 6237849 9876621 8559581 3163530 -542779
40152 -542779 -1839337 -5123368 -10464912 -12272131 -8617032 -4859547 -5621149 -8600756
40144 -8600756 -8901507 -5282323 51918 4246624 4569051 -94032 -6480448 -8590265
40136 -8590265 -3980609 3712782 9503521 11822615 11854972 10964267 9840829 8018398 4093937
40127 4093937 -1171609 -3222083 498095 4329024 565015 -7747280 -8197893 3890651
40119 3890651 17860267 22289321 19359504 17307779 15736571 9104648 629826 173627
40111 173627 8177318 13269179 8783455 1762092 955213 4270546 4132798 -1012563 -6789268
40102 -6789268 -9805186 -8832092 -3257906 4006798 5898473 -587225 -8784999 -10856249
40094a0856249K312608j58253k554284J159692N420268L090605j989816j865762
40086e441191K206390L222516P90911j95203j52462l391425p616487n788699J204814
40077a5160836M429181J291046l62019L980318P588426L886155k863952n230517
40069b442198l963918l723233k964252K630797R563194R044166L58429o618594
40061A884391m696440J248737K028476k976335n604730l91186Q152362J1301140
40053A0946415O604362n07031m845259o622739o643099j936508P782509J3354129
40045A8132779N421314r957638j5642976o310485L818647K048434m869195l694578
40037a1053698L674091N158809m50768k971153L574o45726p397898r238851M38961
$$ plain form
40094 -10856249 -8543641 -8701894 -11256178 -10096486 -4676218 -1585613 -3575429 -5441191
40086 -5441191 -3234801 -12285 778626 583423 430961 -2960464 -10576951 -16365650 -15160836
40077 -15160836 -10731655 -9440609 -9802628 -5822310 1766116 5652271 2788319 -2442198
40069 -2442198 -6406116 -10129349 -13093601 -10462804 -899610 8144556 8502985 1884391
40061 1884391 -2812049 -1563312 465164 -2511171 -8115901 -8507087 -354725 10946415
40053 10946415 17550777 17043746 12198487 5575748 -1067351 -3003859 4778650 18132779
40045 18132779 23554093 13596455 -2046521 -8357006 -4538359 -2489925 -7359120 -11053698
40037 -11053698 -7379607 -2220798 -2671566 -5642719 -5639145 -6284871 -13682769 -22921620 -22482659
40028b2482659J1613650J2213881N304812J906078L961200M871860K013678j640638
40020A7761862n333146j0050550j1928574n860714M259737P941143K360923l509494
40012d358813j581201N062908P823179L585595l325022o957924m972579k14842
40004d938699J914311k27898j494108L151576R768818R184444K3433q425485q492556
39995D63836l148236M85073P78174K20815n21497j528680l60354M054191O868268
39986G311590K966248m323795o540310j814506K882198K053974j563440k724993
39978a753034j319942r67399k898763m477260k700169K590558Q127539R265317
39970E866847M234384l052107o271893l445328J342181L342025K052949J08815
$$ plain form
40028 -22482659 -10869009 1344872 6649684 8555762 12516962 17388822 19402500 17761862
40020 17761862 12428716 2378166 -9550408 -15411122 -11151385 -3210242 -849319 -4358813
40012 -4358813 -5940014 -877106 6946073 10531668 7206646 248722 -4723857 -4938699
40004 -4938699 -3024388 -3252286 -4746394 -1594818 8174000 17358444 17381877 8956392 463836
39995 463836 -2684400 -2199327 -1421153 -1200338 -1721835 -3250515 -3610869 443322 7311590
39986 7311590 10277838 5954043 -586267 -2400773 481425 2535399 971959 -1753034
39978 -1753034 -3072976 -4040375 -6939138 -11416398 -14116567 -11526009 -3398470 5866847
39970 5866847 10101231 7049124 777231 -2668097 -1325916 2016109 4069058 4177873
39962D177873l21359J060393K782935K154749k179557p439594q935688n985396
39954a4685644k684260j581083k46698L503638O731231N601568J777293n4385
39946a638340M71382m70409l547895m031537J386452R075983J2328007R042072
39938B2615715L358055J8167j206580m303446j0303846j3924458r735837p32084
39930a4214314M062170J728785m86973L242427P662108M766259k997392o639490
39922b876420n009214m877763o989976l737310O082805J1664912O008910k281865
39914b015921j943390L766377L646967k610476m419118K003701P638298M654175
39906A0720613k927717o365677l104033L233156Q229604Q418991K370235o124247
$$ plain form
39962 4177873 3856514 4916907 7699842 9854591 7675034 235440 -8700248 -14685644
39954 -14685644 -17369904 -18950987 -19197685 -15694047 -8962816 -3361248 -1583955 -1638340
39946 -1638340 -1166958 -1637367 -5185262 -9216799 -7830347 1245636 13573643 22615715
39938 22615715 25973770 25991937 24785357 20481911 10178065 -3746393 -13482230 -14214314
39930 -14214314 -10152144 -8423359 -8910332 -5667905 1994203 6760462 3763070 -2876420
39922 -2876420 -7885634 -12763397 -19753373 -23490683 -17407878 -5742966 265944 -2015921
39914 -2015921 -3959311 -192934 3454033 843557 -3575561 -1571860 6066438 10720613
39906 10720613 7792896 1427219 -1676814 1556342 9785946 18204937 20575172 14450925
39898A4450925r546660m906262K153421M263446P92585l094124l353882l55961
39890D03488L068675M657327M555040M691186N246735L028549l508091r235645
39882A2907264p793682j592921M71476l700567o311142k635677J490305L41995
39874f822949j899763M21539L560869J462316k201962l00947L723562R69957n858516
39865f945894m926217M108654P100102j923980r562646l571818P481269P408212
39857h32318l048944q791159l474172L662581L821234o06867l680588m376367
39849a7326600l540880n6541N332801P710603L830741l093477p313024o331323
39841b0787700j070771O090911J1373132J1156150N971519M90024k002102k505091
$$ plain form
39898 14450925 4904265 -1997 2151424 6414870 7207455 4113331 759449 403488
39890 403488 3472163 8129490 12684530 17375716 22622451 25651000 22142909 12907264
39882 12907264 5113582 3520661 3992137 291570 -6019572 -8655249 -7164944 -6822949
39874 -6822949 -8722712 -8301173 -4740304 -3277988 -5479950 -5780897 -2057335 -1087378 -6945894
39865 -6945894 -11872111 -7763457 -663355 -2587335 -12149981 -15721799 -8240530 -832318
39857 -832318 -3881262 -12672421 -16146593 -12484012 -8662778 -9269645 -12950233 -17326600
39849 -17326600 -20867480 -20924021 -15591220 -7880617 -4049876 -7143353 -14456377 -20787700
39841 -20787700 -21858471 -15767560 -4394428 6761722 12733241 13223265 11221163 8716072
39833H716072k797281k535010j319858k03556N37339J867274K898075J113425
39825H276480k764101m351212k074583L38227J79720k73475Q90625J203212p23054
39816G01839j020356K711697N306724J280471n661987p784481n103654l820889
39808a3390636m643363j721553O199106J2184418J1207737O792170M251875L038524
39800B3918278k39223n112069p333068l954603L242783Q181569N423637k554006
39792B1573298n543358J843305J0649273Q403715k389773p047222o17267N150035
39784C2022006R99540n804274m688375J227527K094471j954447k949160L15783
39776B1263071J581051q41920k231079j284526j698179l191205n13310O438946
$$ plain form
39833 8716072 5918791 3383781 2063923 1860367 2397706 4264980 7163055 8276480
39825 8276480 5512379 1161167 -913416 -575189 -395469 -668944 221681 1424893 701839
39816 701839 -318517 2393180 7699904 8980375 3318388 -4466093 -9569747 -13390636
39808 -13390636 -18033999 -19755552 -13556446 -1372028 9835709 16627879 20879754 23918278
39800 23918278 23679055 18566986 11233918 7279315 10522098 18703667 24127304 21573298
39792 21573298 16029940 17873245 28522518 36926233 34536460 27489238 26871971 32022006
39784 32022006 33021546 27217272 22528897 23756424 25850895 23896448 20947288 21263071
39776 21263071 22844122 22002202 19771123 18486597 16788418 13597213 13083903 19522849
39768A9522849R862980M563209n122755j1403176j0616834l509652N844878J0079159
39760A9220658M416419n352805p777455j141035L808621K65511m210998n36678
39752H692238O216023M129057o359006j1692014m240319P445042J1006897N745707
39744B0943625K06551j207550k253825o158347r401021p172482j173578K490445
39736c726182J774222L57040P77173J084809J91496J163813N172796O881213J765190
39727A5441570n308109n891507m64656K649569L04584k101298j396070j582948
39719A651135m494379m378641K044713P413671L613461n112737p695629k193541
39711i151947K637741J190721k047601j102122L028511N785421N782231M365179
$$ plain form
39768 19522849 29385829 33949038 28826283 17423107 6806273 3296621 9141499 19220658
39760 19220658 23637077 18284272 10506817 9365782 13174403 13439914 9228916 8692238
39752 8692238 14908261 19037318 12678312 986298 -3254021 4191021 15197918 20943625
39744 20943625 21150176 19942626 17688801 11530454 2129433 -5043049 -6216627 -3726182
39736 -3726182 -1951960 -1594920 -817747 267062 458558 1622371 6795167 13676380 15441570
39727 15441570 10133461 4241954 3777298 6426867 6731451 4630153 3234083 1651135
39719 1651135 -2843244 -7221885 -5177172 2236499 5849960 737223 -6958406 -9151947
39711 -9151947 -6514206 -5323485 -7371086 -8473208 -5444697 340724 6122955 10488134
39703A0488134J923788j591991m474084m813635l227152j641964l54620J396529
39695b294995K821030K308588O48340N96733K445741K933357M03012j717173K03394
39686H348027L670977L156902j146650l061761k1614K623478k51430o036790q896784
39677a615645p428218l471719K165916P300906O317067k126908q967803n010112
39669a2836516N007711Q206265K213410k746279r48437J388153j021329l587482
39661d324504j451667J812265J899405J575637L422671K824026l380782q378840
39653f001789n022583J780129K386165k342297l600770P00907M621031N814368
39645a664839P537649R011615M556368n333283j1300696p379989Q69419M226982
$$ plain form
39703 10488134 12411922 10819931 6345847 1532212 -1694940 -3336904 -3691524 -2294995
39695 -2294995 526035 2834623 3482963 4079696 6525437 9458794 9861806 8144633 8348027
39686 8348027 12019004 15175906 14029256 10967495 10945881 13569359 13317929 7281139 -1615645
39677 -1615645 -9043863 -12515582 -10349666 -3048760 3268307 1141399 -7826404 -12836516
39669 -12836516 -7828805 377460 2590870 -155409 -1103846 284307 -737022 -4324504
39661 -4324504 -5776171 -3963906 -2064501 -488864 2933807 5757833 2377051 -6001789
39653 -6001789 -11024372 -9244243 -6858078 -9200375 -12801145 -12100238 -7479207 -1664839
39645 -1664839 5872810 14884425 19440793 14107510 2806814 -4573175 -3703756 523226
39637E23226O90423m618224o281354k728394L212441O128675L076190k410675
$$ plain form
39637 523226 1213649 -3404575 -9685929 -12414323 -9201882 -3073207 2983 -2407692
$$ [...]
##END NTUPLES=NMR SPECTRUM
##END=
