##TITLE=31Pdec_LR-688B-2(R)
 DMSO, 24 sc
 30.7.2019
##JCAMPDX= 6.0         $$ Bruker NMR JCAMP-DX V2.0
##DATA TYPE= NMR SPECTRUM
##DATA CLASS= NTUPLES
##ORIGIN= UXNMR, Bruker Analytische Messtechnik GmbH
##OWNER= root
$$ XWIN-NMR		Version 3.5
$$ Tue Jul 30 14:44:47 2019 Russian Standard Time (UT+4h)  she@DPX200
##.OBSERVE FREQUENCY= 81.013821
##.OBSERVE NUCLEUS= ^31P
##.ACQUISITION MODE= SIMULTANEOUS
##.ACQUISITION SCHEME= undefined
##.AVERAGES= 24
##.DIGITISER RES= 17
##SPECTROMETER/DATA SYSTEM= spect
##.PULSE SEQUENCE= zgpg30
##.SOLVENT NAME= CDCl3
##.SHIFT REFERENCE= (INTERNAL, CDCl3, 0, 182.463)
##AUDIT TRAIL= $$ (NUMBER, WHEN, WHO, WHERE, WHAT)
$$ ##TITLE= Audit trail, XWIN-NMR		Version 3.5
$$ ##JCAMPDX= 5.01
$$ ##ORIGIN= Bruker BioSpin GmbH
$$ ##OWNER= she
$$ F:/spectra/data/she/nmr/P31/1/pdata/1/auditp.txt
$$ ##AUDIT TRAIL=  $$ (NUMBER, WHEN, WHO, WHERE, WHAT)
(   1,<2019-07-30 14:43:45.87 +0400>,<she>,<DPX200>,
      <created by zg, POWCHK disabled, PULCHK disabled
       configuration hash MD5:
       00 E9 B6 7A A2 85 ED C7 34 08 36 98 17 FE 4E 26
       data hash MD5: 32K
       B1 F5 68 D9 84 8D 23 6C BC 9E 62 C2 10 E7 62 B3>)
(   2,<2019-07-30 14:43:48.14 +0400>,<she>,<DPX200>,
      <Start of raw data processing
       efp BC_mod = 2 LB = 1 FT_mod = 6 PKNL = 1 PHC0 = -408.5617 PHC1 = 101.2 SI = 64K 
       data hash MD5: 64K
       0D 7F 21 68 F2 91 3D 75 06 A5 15 DD BC 40 E7 44>)
(   3,<2019-07-30 14:44:02.34 +0400>,<she>,<DPX200>,
      <pk PHC0 = 1.118449 PHC1 = 0 
       data hash MD5: 64K
       82 BF 21 A4 1D A0 80 2F F9 D3 57 8E 74 F5 03 3E>)
(   4,<2019-07-30 14:44:05.76 +0400>,<she>,<DPX200>,
      <abs ABSG = 5 
       data hash MD5: 64K
       30 36 03 2C 81 9E 3A C7 0F B4 F3 D9 92 16 6B 14>)
$$ ##END=
$$ 
$$ hash MD5
$$ 2D F2 DF 63 96 AA 98 10 8A 7B AD DF 80 B5 2B 8B
##$RELAX= 
##$RELAX= 
##$RELAX= 
##$RELAX= 
##$RELAX= 
##$RELAX= 
##$RELAX= 
##$RELAX= 
$$ Bruker specific parameters
$$ --------------------------
##$DU= <F:/spectra>
##$EXPNO= 1
##$NAME= <P31>
##$PROCNO= 1
##$TYPE= <nmr>
##$USER= <she>
##$AMP= (0..31)
100 100 100 100 100 100 100 100 100 100 100 100 100 100 100 100 100 100 
100 100 100 100 100 100 100 100 100 100 100 100 100 100 
##$AQSEQ= 0
##$AQ_mod= 1
##$AUNM= <au_zg>
##$AUTOPOS= <>
##$BF1= 81.014009
##$BF2= 200.13
##$BF3= 200.13
##$BF4= 200.13
##$BF5= 200.13
##$BF6= 200.13
##$BF7= 200.13
##$BF8= 200.13
##$BYTORDA= 1
##$CFDGTYP= 0
##$CFRGTYP= 5
##$CHEMSTR= <none>
##$CNST= (0..31)
1 1 145 1 1 1 1 1 1 1 1 1 1 1 1 1 1 1 1 1 1 1 1 1 1 1 1 1 1 1 1 1 
##$CPDPRG= <waltz16>
##$CPDPRG1= <>
##$CPDPRG2= <waltz16>
##$CPDPRG3= <>
##$CPDPRG4= <mlev>
##$CPDPRG5= <mlev>
##$CPDPRG6= <mlev>
##$CPDPRG7= <mlev>
##$CPDPRG8= <mlev>
##$CPDPRGB= <>
##$CPDPRGT= <>
##$D= (0..31)
0 1 0 0 0 0 0 0 0 0 0 0.03 2e-05 3e-06 0 0 0 0 0 0 0 0 0 0 0 0 0 0 0 0 
0 0 
##$DATE= 1564483425
##$DBL= (0..7)
120 120 120 11 120 120 24 19 
##$DBP= (0..7)
150 150 150 150 150 150 150 150 
##$DBP07= 0
##$DBPNAM0= <>
##$DBPNAM1= <>
##$DBPNAM2= <>
$$ [...]
##$SUBNAM3= <"">
##$SUBNAM4= <"">
##$SUBNAM5= <"">
##$SUBNAM6= <"">
##$SUBNAM7= <"">
##$SUBNAM8= <"">
##$SUBNAM9= <"">
##$SW= 369.568048894756
##$SWIBOX= (0..15)
0 1 3 0 0 0 0 0 0 0 0 0 0 0 0 0 
##$SW_h= 29940.119760479
##$TD= 32768
##$TD0= 1
##$TE= 0
##$TE2= 300
##$TE3= 300
##$TEG= 300
##$TL= (0..7)
0 120 53 12 22 120 120 120 
##$TP= (0..7)
150 150 150 150 150 150 150 150 
##$TP07= 0
##$TPNAME0= <>
##$TPNAME1= <>
##$TPNAME2= <>
##$TPNAME3= <>
##$TPNAME4= <>
##$TPNAME5= <>
##$TPNAME6= <>
##$TPNAME7= <>
##$TPOAL= (0..7)
0.5 0.5 0.5 0.5 0.5 0.5 0.5 0.5 
##$TPOFFS= (0..7)
0 0 0 0 0 0 0 0 
##$TUNHIN= 0
##$TUNHOUT= 0
##$TUNXOUT= 0
##$USERA1= <user>
##$USERA2= <user>
##$USERA3= <user>
##$USERA4= <user>
##$USERA5= <user>
##$V9= 5
##$VALIST= <valist>
##$VCLIST= <CCCCCCCCCCCCCCC>
##$VD= 0
##$VDLIST= <DDDDDDDDDDDDDDD>
##$VPLIST= <PPPPPPPPPPPPPPP>
##$VTLIST= <TTTTTTTTTTTTTTT>
##$WBST= 1024
##$WBSW= 4
##$XGAIN= (0..3)
0 0 0 0 
##$XL= 0
##$YL= 0
##$YMAX_a= 30815
##$YMIN_a= -41891
##$ZGOPTNS= <>
##$ZL1= 120
##$ZL2= 120
##$ZL3= 120
##$ZL4= 120
##$ABSF1= 182.463
##$ABSF2= -187.1042
##$ABSG= 5
##$ABSL= 3
##$ALPHA= 0
##$AQORDER= 0
##$ASSFAC= 0
##$ASSFACI= 0
##$ASSFACX= 0
##$ASSWID= 0
##$AUNMP= <proc_1d>
##$AZFE= 0.1
##$AZFW= 0.5
##$BCFW= 0
##$BC_mod= 2
##$BYTORDP= 0
##$COROFFS= 0
##$CY= -3
##$DATMOD= 1
##$DC= 0
##$DFILT= <>
##$DTYPP= 0
##$F1P= 0
##$F2P= 0
##$FCOR= 1
##$FTSIZE= 65536
##$FT_mod= 6
##$GAMMA= 0
##$GB= 0
##$INTBC= 1
##$INTSCL= 5.30512e-09
##$ISEN= 30
##$LB= 1
##$LEV0= 0
##$LPBIN= 0
##$MAXI= 10000
##$MC2= 0
##$MEAN= 0
##$ME_mod= 0
##$MI= 50
##$NCOEF= 0
##$NC_proc= -6
##$NLEV= 6
##$NOISF1= 182.463
##$NOISF2= 159.3651
##$NSP= 0
##$NTH_PI= 0
##$NZP= 0
##$OFFSET= 182.463
##$PC= 4
##$PHC0= -407.4433
##$PHC1= 101.2
##$PH_mod= 1
##$PKNL= yes
##$PPARMOD= 0
##$PSCAL= 0
##$PSIGN= 0
##$REVERSE= no
##$SF= 81.0140089999434
##$SI= 65536
##$SIGF1= 159.3651
##$SIGF2= -187.1042
##$SINO= 113.3802
##$SIOLD= 16384
##$SREGLST= <1H.CDCl3>
##$SSB= 0
##$STSI= 65536
##$STSR= 0
##$SW_p= 29940.119760479
##$SYMM= 0
##$S_DEV= 0
##$TDeff= 32768
##$TDoff= 0
##$TI= <>
##$TILT= no
##$TM1= 0
##$TM2= 0
##$TOPLEV= 0
##$USERP1= <user>
##$USERP2= <user>
##$USERP3= <user>
##$USERP4= <user>
##$USERP5= <user>
##$WDW= 1
##$XDIM= 65536
##$YMAX_p= 446181926
##$YMIN_p= -13247456
$$ End of Bruker specific parameters
$$ ---------------------------------
##NTUPLES= NMR SPECTRUM
##VAR_NAME=  FREQUENCY,     SPECTRUM/REAL,   SPECTRUM/IMAG
##SYMBOL=    X,             R,               I
##VAR_TYPE=  INDEPENDENT,   DEPENDENT,       DEPENDENT
##VAR_FORM=  AFFN,          ASDF,            ASDF
##VAR_DIM=   65536,         65536,           65536
##UNITS=     HZ,            ARBITRARY UNITS, ARBITRARY UNITS
##FACTOR=    0.456856943014862, 1,           1
##FIRST=     14782.0589164792, 0,            0
##LAST=      -15158.0608439998, 0,           0
##MIN=       -15158.0608439998, -13247456,   0
##MAX=       14782.0589164792, 446181926,    0
$$ Real data points
##PAGE= N=1
##DATA TABLE= (X++(R..R)), XYDATA
$$ [...]
46818 -685375 -478477 544184 885320 -393076 -2185353 -2830229 -2284410 -1829989 -2094316
46809 -2094316 -2376515 -1859747 -683600 390993 962177 1398311 2305124 3598017 4276682
46800 4276682 3454522 1558630 61065 -37186 968467 2142804 2761365 2400086 962490
46791 962490 -910191 -2009322 -1716051 -708659 -79760 1503 301219 1320265 2497106
46782 2497106 2731344 1603446 -32047 -849278 -513756 -1083 -182487 -569447 -96274
46773 -96274 1207391 2193654 2118319 1296775 284403 -612066 -933169 -304780 567702 223109
46763 223109 -1619099 -3290025 -3025059 -994775 1061991 1716648 965930 34891 392747
46754 392747 2367408 4523169 5116187 4247585 3601487 3977115 4421841 4106819 3438405
46745 3438405 2650449 1080505 -1021730 -1702898 97369 2611577 3651230 3600183 4020362
46736 4020362 4563487 3747038 1942296 853506 401569 -1023477 -3095289 -3233935 -518400
46727 -518400 2597157 3551033 2526374 936407 -829410 -2625274 -3228375 -1607854 1408078
46718 1408078 4044370 5371198 5302154 3926143 1908578 516520 152926 -198444 -1143773
46709 -1143773 -1669110 -883517 242946 307159 -340452 -330716 580684 1555758 2165161 2388328
46699 2388328 1765718 63297 -1702159 -2333941 -2093794 -1925721 -1684525 -731448 294540
46690 294540 176746 -707741 -835296 -55206 294869 -127188 -115094 780788 1427444 1254717
46680 1254717 1256811 1866067 1686915 -229806 -2318101 -2385851 -666589 629592 318360
46671 318360 -664408 -1014296 -681187 -574492 -1389523 -2876817 -3933262 -3521462 -1720980
46662 -1720980 390835 1968808 2961530 3404801 3118475 2494552 2494563 3097125 2779005 633852
46652 633852 -1854015 -2539020 -1559609 -963259 -1546668 -1810481 -550367 1035718 958560
46643 958560 -643597 -1460083 132680 3025181 4551389 3351533 658720 -1247693
46635 -1247693 -1451876 -868407 -515685 -141749 966420 2428673 2987786 2286600 1561431
46626 1561431 2103870 3539584 4257133 3402867 1839352 958997 1067441 1394607 1348131
46617 1348131 1005315 411711 -633014 -1677786 -1522574 42145 1196598 165287 -2074170
46608 -2074170 -2772620 -1124562 728010 854458 -87270 -584835 -696570 -1219387 -1700681
46599 -1700681 -1169251 -191765 -322351 -1678576 -2707841 -2403574 -1316102 -278738 470497
46590 470497 697394 46700 -1134461 -1967691 -2270030 -2477077 -2264766 -762203 1455094
46581 1455094 2241462 662549 -1485912 -2065000 -1330808 -1002302 -1577180 -2128886 -2230683
46572 -2230683 -2481280 -3158657 -3679800 -3626991 -3326522 -3135767 -2909359 -2457013 -1990522 -1867743
46562 -1867743 -2204142 -2802747 -3228437 -3040497 -2195427 -1058657 126439 1354699 2203096
46553 2203096 1761899 -125560 -2132379 -2822702 -2374377 -2012138 -2018421 -1400220 423951
46544 423951 2565310 3545476 2652788 442224 -1491935 -1463903 641612 2696932 2344597
46535 2344597 -202772 -2402394 -2588909 -1748479 -1624825 -2263462 -2366361 -1317361 138542
46526 138542 904598 531478 -550873 -1372271 -1313023 -895509 -1143613 -1959900 -2030271 -822435
46516 -822435 353821 178637 -660931 -490974 848447 1828079 1393016 123894 -835453
46507 -835453 -1036477 -738888 -429426 -508617 -923582 -1093391 -626205 115222 644362 1071645
46497 1071645 1481129 1220817 -62217 -1212409 -885602 163651 -144181 -1985479 -3010944
46488 -3010944 -1609797 853059 2049644 1547470 481053 -478392 -1460712 -2463995 -3357902
46479 -3357902 -4324050 -5281254 -5437115 -4393173 -3072380 -2506004 -2350428 -1762605 -1081138
46470 -1081138 -1245266 -2018794 -2300456 -1971943 -1955207 -2481299 -2708706 -2144464 -1195895 -279094
46460 -279094 429485 486055 -218257 -552029 516926 1815764 1211638 -904124 -1736496
46451 -1736496 -325171 892844 51416 -1153846 -519949 796417 287334 -1438027 -1429984
46442 -1429984 769247 2237981 1116608 -772812 -875804 570185 1393750 574165 -877126
46433 -877126 -1415402 -385433 1570299 2903423 2398046 379658 -1753844 -3195105 -4105445
46424 -4105445 -4424431 -3646422 -2142190 -1284741 -1538415 -1759451 -1315751 -1464366 -3191670
46415 -3191670 -4924320 -4372758 -2021148 -616020 -1205605 -1854539 -889185 577701 589511
46406 589511 -708402 -1698533 -1931498 -2283021 -2758781 -2043548 257365 2400804 2488026
46397 2488026 806899 -726027 -884697 -21760 874905 1024409 55887 -1562913 -2414693
46388 -2414693 -1552958 -45532 97334 -1333621 -2490360 -2334091 -2032193 -2519366 -2480758
46379 -2480758 -589428 1618368 1542727 -444974 -1432809 -485941 12105 -1658628 -3815655
46370 -3815655 -4161765 -3184941 -2687787 -2454563 -883120 1738576 3076095 2023042 161910
46361 161910 -519627 176149 1286056 2112655 2222353 1110580 -1084999 -3054539 -3382744
46352 -3382744 -2047838 -406728 198169 -430034 -1401778 -1701240 -1209154 -826584 -1393371
46343 -1393371 -2552247 -3075778 -2348538 -1053315 -202294 54586 262192 571652 382633
46334 382633 -716765 -1952393 -1823371 197221 2774061 4030373 3558021 2407804 1226916
46325 1226916 -383353 -2256093 -2863306 -1419736 227740 -371244 -2689537 -3635993 -1865522
46316 -1865522 221493 -228782 -2731973 -4397116 -3713228 -1789147 -181409 859304
46308 859304 1670611 2040414 1590553 612644 -256231 -890153 -1577664 -2241038 -2397136 -1934733
46298 -1934733 -1326340 -855381 -213476 725414 1283258 823245 -138181 -515530 -178133
46289 -178133 79919 55278 426741 1266826 1582760 995108 592248 1142636 1670505 1098730
46279 1098730 206822 316620 900439 436662 -894638 -1513438 -1256939 -1619431 -2922708
46270 -2922708 -3524401 -2555870 -1371135 -1282993 -1707142 -1659156 -1357725 -1140154 -510443 364879
46260 364879 -29736 -2074097 -3518467 -2496042 -535961 -202720 -984043 -370504 1644768
46251 1644768 2258325 213728 -2349362 -3088801 -2138307 -787075 307452 538265 -985183
46242 -985183 -3799493 -5697351 -5379048 -4225174 -4145126 -4917247 -5101047 -4458368 -3773795
46233 -3773795 -3023492 -1502840 487840 1636400 1326329 171112 -1119338 -2268720
46225 -2268720 -2814194 -2155579 -599234 513840 194081 -1153395 -2310692 -2485921 -1867419
46216 -1867419 -1302807 -1449897 -1949778 -1633382 -16609 1668544 1676085 -70990 -1813472
46207 -1813472 -2116908 -1359889 -702846 -452258 -252751 -310051 -1234855 -2602839 -2776813
46198 -2776813 -839137 1912089 3230962 2449284 909277 -35780 -400318 -641206 -525767
46189 -525767 145218 541222 -165049 -1210427 -1155468 -290553 -500868 -2369279 -4065573
46180 -4065573 -3988704 -3024682 -2846305 -3157681 -2414428 -691272 118573 -911241 -2429353
46171 -2429353 -2851528 -2431410 -2449034 -3156524 -3470884 -2464395 -538642 921032 897928
46162 897928 -182656 -807430 -25500 1466461 2284720 2073559 1549190 1085706 314335
46153 314335 -734031 -1171376 -430046 938560 2152420 3082774 3685687 3451155 2304758
46144 2304758 1337552 1540281 2245117 1955757 485955 -889756 -1345071 -1329107 -1311216
46135 -1311216 -974370 -224936 82478 -696284 -1826097 -2082227 -1339472 -417239 290596
46126 290596 1083103 2004500 2598347 2730244 2837452 3112343 3130797 2594412 1814647 1115542
46116 1115542 392223 -278874 -271727 588390 1170702 252656 -1496109 -1875946 87189
46107 87189 2667458 3474152 2352239 1245613 1368259 1699267 749819 -1115751 -2104781
46098 -2104781 -1392127 -44496 569962 356362 25807 -149958 -348739 -471490 -323895
46089 -323895 -299244 -923714 -1722267 -1514123 -64634 1479789 2172272 2348704 2573590
46080 2573590 2469785 1553230 546980 663746 1787697 2428233 1547327 -338706 -1896089
46071 -1896089 -2123652 -819842 1334461 3076400 3583364 3272147 3094972 3219933 3078869
46062 3078869 2483925 1799433 1148941 470204 259996 1024082 1910094 1356000 -457551
46053 -457551 -1322843 -19496 1789919 1888713 539142 -379246 -425478 -871037 -2066884
46044 -2066884 -2454994 -904352 1226424 1384972 -1236421 -4733823 -6387508 -5234884
46036 -5234884 -2813454 -1484598 -2048989 -3103121 -2760416 -758593 1285405 1487515 -580162
46027 -580162 -3534947 -5423685 -5525081 -4890326 -4806911 -5029966 -4297439 -2428250 -758747
46018 -758747 -249186 -341469 -226269 -81613 -270796 -363001 88505 651858 808415 769901
46008 769901 619401 -299788 -1994288 -2906781 -1846566 50107 816300 279982 -421351
45999 -421351 -1011554 -1725130 -1528740 831401 4142009 5516169 4186020 2355940 1877500
45990 1877500 2163376 1930632 943098 -682736 -2893294 -4566058 -3932825 -1225472 849575
45981 849575 436680 -1229867 -1986370 -1534412 -870295 -441725 -207273 -262460 -239340 637222
45971 637222 1886793 1727084 -143254 -1460023 -598275 837798 428482 -1576556 -3118410
45962 -3118410 -3266572 -2264195 -72377 2752142 3963270 2126725 -579725 -819337
45954 -819337 1159476 2048031 514590 -1250314 -1313963 -466669 -109559 -191843 -402422
45945 -402422 -1374469 -3392348 -5369868 -6226677 -6161993 -5816582 -5308438 -4716236 -4368013
45936 -4368013 -4066042 -3092427 -1438969 25401 916957 1717067 2562669 2933876 2797911
45927 2797911 2720496 2587740 1657892 160431 -728399 -883155 -1536782 -3055841 -4090502
45918 -4090502 -3657679 -2494919 -1588158 -885938 -246774 -142001 -634089 -1133777 -1770797
45909 -1770797 -3231424 -4596589 -3591621 -188899 2293503 1374815 -1317480 -2846822
45901 -2846822 -3059417 -3532943 -4140246 -3530460 -2105705 -1701094 -2618962 -3418601 -3519176
45892 -3519176 -3754096 -4291606 -4118823 -2908511 -1647573 -1074752 -932078 -919732 -1006096
45883 -1006096 -711523 519491 2115138 2852760 2630090 2508969 2926204 3107140 2407001
45874 2407001 1150760 34020 -425001 30464 994955 1438853 1032538 789188 1354141
45865 1354141 1656409 744991 -189336 315441 1169954 435941 -898251 -100471 2418089
45856 2418089 2993566 332995 -2201297 -1525510 996638 2398005 2439681 2519949 2388143
45847 2388143 946720 -931255 -1277518 -105821 880169 1215619 1904129 2919945 2916616
45838 2916616 1734999 1048429 1835375 2947224 2999934 2260698 1722144 1432248 817399
45829 817399 -54242 -612680 -898668 -1608388 -2958359 -4183290 -4481533 -4058832 -3754055
45820 -3754055 -3786993 -3558007 -2894513 -2663790 -3377771 -3859815 -2582292 -123706 1190705
45811 1190705 360891 -1032044 -1231283 -542618 -212293 -345178 -285520 -181996 -648717
45802 -648717 -1287227 -1000856 221794 993394 209703 -1706369 -3401923 -3972629 -3730624
45793 -3730624 -3818742 -4802499 -5583677 -4460374 -1556251 873723 1253261 636687 730188
45784 730188 1090265 2166 -2463984 -4190579 -3805796 -2089393 -372174 949916 1870359
45775 1870359 2110991 1706815 1287316 1166579 930230 388654 112422 460973 820643
45766 820643 469927 -341694 -823331 -763213 -613310 -688014 -834317 -852046 -803747 -764176
45756 -764176 -470219 514837 2130455 3434373 3277383 1526850 -687612 -2129207 -2524234
45747 -2524234 -2327103 -1916996 -1363318 -561071 694457 2274468 3164784 2193513 -209095
45738 -209095 -1927877 -1612454 -307874 282344 155036 330512 718519 381445 -521677
45729 -521677 -829179 -323475 41553 -115611 -196401 -32554 -105880 -204822 445726 1403718
45719 1403718 1169730 -270571 -891399 396757 1871322 1453323 -245466 -922511 108752
45710 108752 1172059 636435 -1084539 -2133214 -1258941 870797 2351292 2142535 1184804
45701 1184804 917273 1247122 1101412 526221 546392 974528 328363 -1614638 -3157967
45692 -3157967 -3357210 -3355623 -3957250 -3917914 -2255992 -415737 -92148 -369109 674704
45683 674704 2543638 2955250 1384740 -341206 -882661 -741000 -639022 -360241 441475
45674 441475 1595954 2739473 3295569 2527210 840676 332580 2277884 4672743 4470475
45665 4470475 1970072 466570 1391107 2552108 2010584 982287 1312855 2281626 1961234
45656 1961234 282018 -1278357 -2079545 -2525092 -2578466 -1859141 -846525 -388629 -190850
45647 -190850 769767 2381066 3302809 2900394 2122120 2121667 2869493 3490862 3395817 2781894
45637 2781894 2317257 2351264 2278250 1120486 -798436 -1436368 672577 4065445 5602846
45628 5602846 4146672 1687675 466497 394049 209017 -101491 414991 1619230 2268021
45619 2268021 2098614 2288903 3340530 4033093 3481173 2952667 4174341 6645234 8353598
45610 8353598 8836361 9729808 12192587 15608557 19382709 24345220 31563007 41266327
45602 41266327 53706383 69028792 84640167 94584959 94270797 85271533 73256810 61745108
45594 61745108 50383968 38975504 29774430 24532411 21784743 18891191 15228289 11795289
45586 11795289 8977359 6408662 4218615 2842567 2060338 1447705 1321441 2127207 3332486
45577 3332486 3975146 3890253 3411203 2373047 576671 -1130193 -1508267 -593214 390479
45568 390479 787457 1144472 1960263 2796996 3033236 2826458 2858915 3403906 3925858 3616816
45558 3616816 2410479 1397793 1792792 3417123 4884907 5477367 5840857 6333184 5997178
45549 5997178 4375310 3175576 4246763 6425903 6531890 3672674 581438 16310
45541 16310 1595014 3218739 4044752 4495012 4388670 3006118 839245 -395624 83447
45532 83447 1088901 1137528 307551 -275382 -218057 -217930 -758656 -1305230 -1121955 -327318
45522 -327318 361468 608960 625617 533867 249662 45899 518161 1665249 2579067 2496432
45512 2496432 1734109 1147332 1080171 1340280 1776272 2233331 2269272 1679991 1160611 1673382
45502 1673382 3132082 4390128 4607633 3968895 2911402 1389728 -632297 -2427298
45494 -2427298 -2846037 -1432826 1024123 3087346 3810409 3388924 2728643 2406791 2228963
45485 2228963 1824411 1287096 937707 780670 631413 577171 845076 1309920 1568396 1498181
45475 1498181 1432327 1794221 2719333 3850663 4370334 3651198 2195728 1434885 2077406
45466 2077406 3100383 2992260 1571030 -146920 -1432864 -2251256 -2479803 -1848555 -694821
45457 -694821 202445 678548 1212249 1817837 1868205 1253242 772556 979531 1424068 1457443
45447 1457443 1093680 668597 282655 -15334 -50613 139057 327188 686141 1689226
45438 1689226 3152327 4101962 3990506 3376316 2997308 2839289 2559347 2171531 1834272
45429 1834272 1573625 1653572 2524521 3885956 4522801 3731220 2307648 1495356 1549510
45420 1549510 1966179 2435054 2779515 2612383 1989610 1861252 2830618 3862619 3347432
45411 3347432 1277928 -676332 -1200887 -460064 771984 2020558 2922008 3109618 2803922
45402 2803922 2919770 4105111 5941946 7294439 7232429 5703210 3721015 2773642 3430921
45393 3430921 4535695 4414052 2949422 1734345 1963202 2960094 3279357 2610198 1843609
45384 1843609 1578914 1421696 893902 356087 503989 1193838 1397466 566706 -393385
45375 -393385 -67860 1643671 3259239 3456096 2529483 1751754 1756780 2103428 2146591 1738006
45365 1738006 1153207 825831 1127905 1989845 2748684 2737033 2007836 1180046 665415 390245
45355 390245 178878 27220 27296 308672 943165 1639562 1788191 1217993 629501 706385
45345 706385 1008280 461963 -1072971 -2456654 -2636462 -1752814 -706651 -213310 -515480
45336 -515480 -1437767 -2332218 -2412915 -1590035 -722714 -707859 -1513204 -2346048 -2511215 -1810096
45326 -1810096 -359240 1529226 3290084 4290635 4297453 3732390 3358759 3615846 4251999
45317 4251999 4708077 4821468 4878761 4945534 4662223 4044049 3911598 4807937 5891270 5906744
45307 5906744 5106994 4928352 5461541 4677965 1215129 -3075961 -4819905 -2984873 292436
45298 292436 2594052 3405792 3172086 1911387 -79093 -1319116 -519545 1549817 2905430
45289 2905430 2847107 2310876 1904150 1207535 269198 -3666 233281 -822283 -3844263
45280 -3844263 -6396311 -5637557 -2202267 670335 1489306 1816884 3157462 4802368 5483515
45271 5483515 5232381 4539797 3263306 1579411 686332 1223910 2028030 1753386 848729
45262 848729 613088 1053829 1066325 253213 -673178 -964200 -348648 1057566 2492945
45253 2492945 2831720 1967256 1094089 772905 -28641 -1715185 -2421477 -611077 1930636
45244 1930636 2265368 708484 194784 1493962 2216782 1079987 8048 682473 1730905
45235 1730905 1224300 -132863 -394160 590091 1615718 2455203 3597875 4363289 3444866
45226 3444866 1267387 -27441 683261 2098843 2346422 1353099 728149 1607875 3163460
45217 3163460 3510184 1999889 64225 -607762 -85025 464932 792793 1482308 2186335
45208 2186335 1817528 707719 631063 2034729 3134418 2692567 1793772 1564733 1011533
45199 1011533 -1021193 -3225529 -3386680 -1720700 -505917 -775314 -1348434 -1096679 -419963
45190 -419963 -205682 -633663 -1346903 -1939263 -2095222 -1760979 -1055452 205673 2165967
45181 2165967 3760805 3187272 477104 -1710092 -1182950 1076799 2729272 3216858 3203831
45172 3203831 2279033 -129339 -2305739 -1689077 1143924 2588353 617643 -2945068
45164 -2945068 -5290816 -5645126 -4776693 -3506203 -2589271 -2450308 -2310909 -1088524 406506
45155 406506 771 -2511340 -4524575 -4017866 -1970700 -402521 155303 28638 -952288
45146 -952288 -2621885 -3681670 -3235038 -2032923 -1040096 -72826 984372 1215139 432546
45137 432546 267984 1615975 2528737 986895 -1462500 -1572428 778409 2525960 2101455
45128 2101455 1266918 1747392 2801588 3337115 4029807 5511861 6212440 4273103 806747
45119 806747 -948820 278070 2356897 2844728 1929228 1257234 996209 -180880 -2299624
45110 -2299624 -3131987 -1061151 2311742 3962784 3273472 2340886 2623681 3330186 3657710
45101 3657710 4420869 5992577 6455820 4051567 508203 -510961 1848058 4605214
45093 4605214 4930027 3144490 1137592 -269979 -1148931 -1123212 120663 1612036 1865311
45084 1865311 787163 -248550 -261955 294046 535722 407712 479564 915462 1206811
45075 1206811 921383 323272 -2298 -6665 -324312 -1423862 -2836640 -3491094 -2762391
45066 -2762391 -1027867 717885 1619408 1502160 989968 1020137 1874057 2657153 2133008
45057 2133008 232864 -1645130 -2158919 -1521518 -948447 -799454 -177781 1247029 2012624
45048 2012624 659071 -1693265 -2241554 -340882 1284271 287569 -1885359 -2176562 -415400
45039 -415400 841674 634769 902625 2766936 4234072 3254807 1000458 -14984 395464
45030 395464 630714 521426 1383680 3063595 3499250 1837676 -42428 -97010 1277446
45021 1277446 2260753 2130899 1638830 1539835 1817570 2101936 2053381 1409069 219739 -936054
45011 -936054 -1334569 -764760 338841 1358732 1931085 1968043 1499817 743748 271690
45002 271690 626920 1440645 1440778 92334 -1156963 -440532 1778613 2986488 2023865
44993 2023865 625194 732122 1898480 2694951 3158189 3958176 4338435 3253860 1943437
44984 1943437 2809043 5684409 7615747 6832252 4787492 3572890 3371622 3484623 3981434
44975 3981434 4939034 5489804 5092770 4678731 5153602 5644543 4612205 2096145 -370311
44966 -370311 -1588529 -1353752 182647 2593642 4854264 6007105 6144109 6046751 6065717
44957 6065717 6038343 6047034 6474532 7343810 8145675 8304996 7600086 6440473 5915817 6972511
44947 6972511 9195710 11087880 11946393 12579069 13603900 14240008 13941336 14169447 16798264
44938 16798264 21226692 24986988 27327724 30315593 35725321 42587219 49206170 56475373
44930 56475373 67364833 83454683 103954997 128696145 159882084 198322042 238128685
44923 238128685 267902827 279114491 272538293 255235762 232552871 205443225 174853870
44916 174853870 144848129 119458734 98828613 80967338 65912394 55368164 48805536
44909 48805536 42966055 35952479 29481863 25821478 24206808 21960417 18220256 14812824
44901 14812824 13542282 13963081 14182053 12996816 10723679 8378074 6628208 5547813
44893 5547813 5016210 5097263 5990680 7653544 9532171 10830908 11240458 11329376 11877064
44884 11877064 12774776 13079622 12406439 11649049 11743945 12298913 12327658 11887455 11837161 12245485
44874 12245485 12448791 12671682 13915571 15795644 16218597 14170114 11367524 10009248
44866 10009248 10236835 11136906 12818003 15578201 18000428 18135131 16325476 14880561
44858 14880561 14957546 15594833 15906974 16283124 16927794 17021435 16176427 15291210 15042376 14739442
44848 14739442 13662220 12518733 12482375 13498366 14609034 15480447 16577211 18024113
44840 18024113 19212303 19669264 19770270 20368563 21916665 24086306 26283299 28461358
44832 28461358 31104812 34271533 37243343 39744203 43069051 49137464 58616070 70829164
44824 70829164 85406746 103235582 126083995 156149892 194950070 240055938 282343776
44817 282343776 309219597 313374302 298452473 275034989 251252660 227933479 201895874
44810 201895874 172023566 141488917 114991778 94822557 79820708 67711086 57553137
44803 57553137 49359474 42256411 34776045 27156288 21591290 19213704 18143927 15808875
44795 15808875 12194574 9318988 8198932 8051192 8206489 8967488 10220502 10743432 9660424
44786 9660424 7597928 5744817 4591965 4186280 4695450 5783726 6127118 4779380 2815957
44777 2815957 2416342 4125777 6088441 6415111 5269722 3857707 2396679 499777
44769 499777 -1011961 -586405 1508774 2933890 2443423 1697504 2607176 4315926 4681167
44760 4681167 3719058 3280010 3760415 3657679 2564982 2069413 2887472 3461886 2681061
44751 2681061 1916871 2711878 4217772 4886887 5224293 6539639 7988620 7471093 5135769
44742 5135769 3414578 3300951 2978110 976300 -1342151 -1792968 -472044 681492 702578
44733 702578 515389 1125307 2073092 2178131 1297688 676421 1348557 2618936 2822375
44724 2822375 1604864 516649 815449 1620813 1294758 656 -483095 720371 2654851
44715 2654851 4199189 5273597 5970619 5782830 4494127 2939465 2022258 1557441 839120
44706 839120 -108237 -621114 -507294 -374059 -816050 -1675284 -2185204 -1723003 -474736
44697 -474736 618178 720879 -103533 -1119801 -1748261 -1829689 -1327602 -385156 423094
44688 423094 621189 655640 1408259 2711927 3229888 2297472 1157815 1663489 4131235
44679 4131235 7055809 8636541 8057041 5601160 2290604 -504239 -1708836 -1255204
44671 -1255204 -121324 526271 347352 -5873 174669 597115 182643 -1494838 -3399974
44662 -3399974 -4115656 -3448909 -2443323 -2038584 -2318910 -2857234 -3048448 -2218140 -235097
44653 -235097 1954429 3161802 3282710 2956214 2099328 87105 -2457385 -3585872 -2444859
44644 -2444859 -506185 465030 479263 385032 150206 -489214 -711967 254372 1287931
44635 1287931 615956 -1245853 -1770886 47318 2278478 2871707 2259040 2082637 2629328
44626 2629328 2902587 2455846 1760820 1093785 267394 -624681 -1224497 -1680904 -2457534
44617 -2457534 -3251222 -3050105 -1646267 -282512 -176650 -933804 -1136592 -227561 984360
44608 984360 1707076 2224747 3077999 3719302 2876411 415040 -1856103 -1869571 374445
44599 374445 2738695 3301593 2290736 1415207 1752898 2879160 3890283 4525448 4981297
44590 4981297 5145302 4588363 3255579 1782432 1015644 1316835 2307814 3268592 3948006
44581 3948006 4991287 7154726 9869334 11148660 9608436 6306330 3771858 3261061
44573 3261061 3800398 3976926 3597710 3125299 2498345 1413683 191570 -526696 -607415
44564 -607415 -240894 665136 2107329 3342625 3506911 2709899 1768016 1117663 787051
44555 787051 1031136 1901113 2481657 1865182 793924 916580 2339532 3479937 3628308
44546 3628308 3872812 4793957 5147276 4143688 3371282 4626098 7005073 8196904 7924855
44537 7924855 7922292 8770984 9031981 7807079 6090270 4890642 3861334 2787054 2758815
44528 2758815 4410029 6162511 5913196 3895669 2307548 2324330 2974602 3079132 2843028
44519 2843028 2904593 2929576 2166670 858562 38620 -40072 -331242 -1452507 -2401243 -1622932
44509 -1622932 769147 2697752 2441503 664761 -527136 -226293 467523 317961 -360536
44500 -360536 -503617 -108435 -258058 -1416436 -2578425 -2452431 -950989 885868 2066036
44491 2066036 2277928 1615003 322037 -1046791 -1705268 -1255536 -100347 999156 1665499
44482 1665499 1988618 2035467 1711115 1198637 1089675 1671619 2295749 2009381 907022
44473 907022 273169 942748 1975718 1773081 405879 -241800 883687 2281370 1933226
44464 1933226 403508 293672 2536935 4882925 4824471 2718804 883327 552749 1049221
44455 1049221 1339167 988387 -138422 -1740934 -2683270 -1986156 -293123 769877 686653
44446 686653 312161 135689 -201748 -522086 9456 1099690 1209234 91296 -321806
44437 -321806 1182972 3013432 3268473 2820242 3723185 5585918 6074733 4678294 3396538
44428 3396538 3422585 3583636 2912886 2595755 3937671 5945301 6570223 5470442 4049707
44419 4049707 3299273 3020524 3003367 3671958 5307099 7476201 9510456 10960736 11410779
44410 11410779 10494942 8556830 6903022 6798090 8145259 9505640 9542703 8195028 6330168
44401 6330168 4673782 3483887 2900623 2871407 2792609 2028499 937112 606060 1356318
44392 1356318 2352792 2928851 3177068 2789286 817443 -2303953 -3944641 -2267231 935186
44383 935186 2453356 2127226 2738740 5529144 8432671 9482636 9532842 10166487 10837749
44374 10837749 9983881 7755937 5691737 4281504 2633899 403525 -1443425 -1966432
44366 -1966432 -1325123 -336216 343252 552374 699016 1391842 2512457 2960225 1984216
44357 1984216 483892 145269 1345198 2735873 3047533 2568731 2482655 3252434 4195084
44348 4195084 4530911 4370528 4386650 4713177 4692029 3911802 2970070 2672617 2880501 2886666
44338 2886666 2642875 2704074 3118014 3409525 3618416 4183360 4741896 4406252 3474158 3324793
44328 3324793 4087448 4069502 2398353 620238 482874 1667526 3142588 5167729 8018583
44319 8018583 10073121 9572174 7516855 6423425 6709729 6791194 6387093 6827410 7843326
44310 7843326 7117732 4069994 1331340 869934 1040859 -443246 -2512926 -2201195 1007973
44301 1007973 4709389 6909723 7612494 7300987 6069509 4648812 4432736 5659679 6779200
44292 6779200 6359697 4729332 3128471 2078318 1303212 644649 266330 247206 606941
44283 606941 1582771 3312190 5209013 6109868 5296412 3251983 1246878 191335 -6090
44274 -6090 9018 -147038 -422605 -716324 -959033 -819390 125748 1688666 2978721 3338720
44264 3338720 3022968 2630882 2277074 1766436 1206698 846776 545711 39350 -396698
44255 -396698 -206818 550634 1207117 1413593 1429282 1421227 1200318 856582 902873 1404337
44245 1404337 1658195 1238584 705416 649348 678379 218428 -192252 467166 1959835 2875308
44235 2875308 2613403 2180660 2619114 3648567 4452797 4893573 5126753 4760300 3453028
44226 3453028 1988438 1740981 3154031 5526438 8165074 10870670 13259756 14510061
44218 14510061 14143320 12574874 10697546 9281515 8733386 8909207 9133265 8864938 8275611
44209 8275611 7701820 6835372 5246991 3487258 2652511 2889570 3408113 4022252 5414064
44200 5414064 7567742 9264117 9710297 9456945 9025315 7904082 5855232 4011536 3446422
44191 3446422 3598901 3409348 3178565 3834800 4967713 5165478 4032074 2444127 984678
44182 984678 -468449 -1646629 -1807661 -967821 -33729 564100 1368847 2797680 4442756
44173 4442756 5691163 6308505 6351015 6209702 6608513 7702388 8373114 7463472 5604095
44164 5604095 4694869 5574518 7289300 8621108 9128700 8650566 7101140 5033796 3337389
44155 3337389 2268771 1768695 2358916 4151062 5304200 3718482 536797 -485523
44147 -485523 2014467 4995017 5345520 3988298 3785727 5287695 6868288 7640680 7681145
44138 7681145 6333943 3064333 -322196 -1001329 1032180 2716929 2018868 208073
44130 208073 -660462 -529893 -420198 -375978 45743 208593 -976180 -3087880 -4235093
44121 -4235093 -3278906 -1126372 504961 977334 981155 1339248 2175266 3229274 4397149
44112 4397149 5613840 6565487 6971638 6911927 6383192 4865478 2157508 -506504 -1295920
44103 -1295920 -35460 1400834 1434306 563529 208709 831274 2174348 4489994 8170267
44094 8170267 12442631 15588833 16510028 15393739 13039370 10262006 7758926 5781710
44086 5781710 3961685 1965439 132252 -961261 -1171060 -559179 889201 2667188
44078 2667188 3590414 3201100 2726745 3534006 5151788 6121234 6414163 7451222 9710488
44069 9710488 11874151 12752866 12694544 12393342 11413687 8921136 5375642 2564022 1863554
44060 1863554 2842270 3702056 3089813 1437813 362901 783653 2028874 2838937 2613424
44051 2613424 1486351 5870 -836783 -177413 1482865 2499692 2230085 1920601 2632176
44042 2632176 3539548 3478070 2862022 2524770 2002456 968687 1093283 3841527 7222036
44033 7222036 7730373 5353262 3573256 4117403 4882468 3957081 2553626 2311253 2373439
44024 2373439 1273702 -280938 -717584 -233498 -55108 -146406 453766 1815500 3251991
44015 3251991 4523716 5506575 5487480 4194147 2756597 2344280 2663818 3010182 3720512
44006 3720512 5102714 6012367 5300481 3864774 3404281 3771061 3455703 2201333 1126968
43997 1126968 505571 -526277 -1949842 -2456495 -1435377 180836 1412802 2204537 2611378
43988 2611378 2379913 1733497 1399359 1500188 1456908 1172930 1178633 1426959 1193746 479771
43978 479771 267131 938867 1591004 1417802 734470 142680 -262616 -313527 533623 2218988
43968 2218988 3705647 4286499 4410904 4503392 3925406 2179381 449750 626425 2909243
43959 2909243 5444031 6474495 6039966 5303035 4927599 4668030 4189345 3602444 3081999
43950 3081999 2514093 1971908 2172541 3665961 5523391 5745275 3517711 412715 -1328435
43941 -1328435 -1180126 -265915 504927 1102387 1399067 816132 -703532 -2258708 -2977450
43932 -2977450 -2874520 -2423466 -1816819 -994650 4744 1071526 2182023 3297640 4162600
43923 4162600 4228769 2869613 100150 -2729026 -3618757 -1958185 550172 1715868 1244500
43914 1244500 541686 589330 1089062 1516863 1839611 2048432 2001684 1982578 2554736 3604310
43904 3604310 4241959 3827828 2483835 701489 -707835 -491187 1893940 4804595 5462051
43895 5462051 3088115 -91535 -1590591 -1318138 -737999 -536596 -385819 -305959 -760738
43886 -760738 -1433290 -1179911 324317 1671569 1154400 -1061545 -2777266 -2039519 698971
43877 698971 3138500 3729453 3018625 2277353 1785208 1198375 776088 1105909 2048763
43868 2048763 3022751 3937510 4783229 4873542 3905269 3206506 4079332 5216550 4041212
43859 4041212 809132 -1108234 159997 2509464 3310300 2994576 3263321 3724637 2912648
43850 2912648 1410468 1134610 1966975 1845801 435647 168372 2642147 5871066 6547076
43841 6547076 4061874 1003418 26701 1212061 2571004 2505700 1291819 164383 -486056
43832 -486056 -1285415 -2356530 -2673362 -1461734 542887 1929221 2105891 1361973 184883
43823 184883 -670072 -191908 1689712 3408275 3392518 2082638 1264068 1708482 2627962
43814 2627962 3259865 3712810 4136792 4187980 3639536 2750121 1855577 1239014 1369940 2524691
43804 2524691 4189036 5537837 6389844 6972896 7045839 6234735 5027855 4326838 4113389
43795 4113389 3711668 3247124 3448721 3952026 3426151 1832343 931996 1728730 2889184
43786 2889184 2847182 2219573 2701478 4447242 6088833 6816289 6878465 6267604 4532968
43777 4532968 2103745 361468 -123053 -291289 -959453 -1550292 -1262568 -548735 -288299
43768 -288299 -140737 863952 2289516 2404830 732223 -896575 -691698 740579 1495353
43759 1495353 1029290 386676 231664 177818 76727 506767 1593033 2538993 2809154
43750 2809154 2741213 2551369 1842153 661091 -86177 -29021 -81356 -927708 -1745009 -1433769
43740 -1433769 -259646 787622 1489167 2147232 2556939 2391347 2021995 1861730 1515622
43731 1515622 692502 239419 984017 2192275 2523705 1908867 1125332 273062 -720062
43722 -720062 -878160 536930 2097131 1820252 425509 554817 2717981 4579746 4689861
43713 4689861 4267328 4399328 4105008 2673557 1652130 2560610 4273271 4667219 3724546
43704 3724546 3113441 3472174 3835859 3332984 2086423 726112 -38264 206416 939058
43695 939058 1137507 887213 1440402 2988465 3902711 3365398 3102056 4688407 6549313
43686 6549313 6023440 3612743 2548148 4192123 6374791 6855878 6256295 6434782 7529222
43677 7529222 8041377 7144970 5726689 5219132 5972281 6812877 6137157 3600498 656077
43668 656077 -815369 -242289 1462854 3002072 3531123 2963249 2186569 2614047 4713835
43659 4713835 7191916 8316152 7777124 6539589 5233914 3643522 1659496 -138091
43651 -138091 -924939 -160725 2056595 4589316 5714996 4881618 3638941 3837742 5219108
43642 5219108 5891331 4966226 3465194 2604248 2438751 2445890 2313186 1769954 620912
43633 620912 -597013 -803293 323176 1855683 2748985 2832069 2427760 1722240 963011
43624 963011 718001 1399511 2756502 4114888 4936817 5040921 4514387 3542574 2294041
43615 2294041 1065679 429049 696563 1172558 766113 -336786 -691907 86076 365400
43606 365400 -950059 -2251215 -1427647 796174 2021872 2061403 2961334 5114926 6243588
43597 6243588 5132363 3777284 4320901 5907540 6320173 5174099 3720897 2699682
43589 2699682 2103481 2106731 2577638 2492014 1414943 776916 2012855 4131119 4951912
43580 4951912 4259433 3738753 3970130 3637549 2130539 972235 1681224 3579430 4840316
43571 4840316 4860662 4532355 4623078 4851473 4539721 3562112 2473406 1954540 2311054 3480736
43561 3480736 5285359 7389305 9198379 10395190 11552960 13355828 15000886 14551821
43553 14551821 11616022 8498476 7473565 7891337 7583847 6340073 5844203 6394866 6173322
43544 6173322 4444927 3225809 4375656 6711936 7688014 6770144 5392610 4393803 3439368
43535 3439368 2665378 2921214 4068959 4629806 3747741 2385034 1970786 2741039 3925637
43526 3925637 4757169 4780442 3959172 3061229 3203734 4383126 5168134 4571070 3521102
43517 3521102 3597786 4942513 6524651 8000861 9956869 12369452 14152062 14529954 13834616
43508 13834616 12643610 11148738 9740995 9135918 9270368 8981194 7562312 5945208
43500 5945208 5549375 6539092 8008218 9397195 10887315 12694001 14677761 16421566
43492 16421566 17212515 16412436 14397979 12543860 11607244 10816800 9387105 8092001 8068240
43483 8068240 8693474 8239140 6435025 4830398 4531160 5038012 5561670 6067463 6574679
43474 6574679 6685558 6341091 5961335 5432442 4172673 2719479 2895606 5485300 8823004
43465 8823004 10734263 11119095 11673650 13671530 16838989 19836834 21120636 19969665
43457 19969665 17442399 15704458 15660257 15905776 14796507 12737386 11319037 10816829 9917284
43448 9917284 7804930 5364782 4127016 4707812 6342541 7514629 7271551 6360573 6594643
43439 6594643 8481934 10078694 9108959 5788515 2538616 1227279 1772757 3189947
43431 3189947 4655156 5406810 4931626 3848146 3701857 5233805 7423863 8752297 8905855
43422 8905855 8727289 8893987 9264310 9401044 9189594 8767486 8139183 7201854 6220769
43413 6220769 6005485 7262823 9784178 12583884 14865843 16536175 17795260 18704915
43405 18704915 19230896 19203618 18160285 15843657 12984836 10845713 9725415 8708807
43397 8708807 7225228 5945220 5611829 5922971 6295770 6859606 7818235 8614590 8705132
43388 8705132 8496605 8555034 8598714 8366643 8759691 10735695 13493069 15155150 15116348
43379 15116348 14511269 14494223 15181695 16139482 16772356 16338168 14668539 12774606 11759332
43370 11759332 11436000 11112193 11203938 12502667 14137361 14136285 12223269 10341128 9963535
43361 9963535 10439732 10523659 10029821 9262476 8149060 6766500 5642092 4828310 3726942
43352 3726942 2477548 2391388 4172956 6625844 7907265 7317965 5339261 2902270 1258226
43343 1258226 1462359 3048820 4063559 3315102 1888732 1664189 3113251 5373893 7681068
43334 7681068 9724556 11197860 11970707 12329204 12388967 11878046 11180653 11758404 14462689
43325 14462689 17969606 19971877 19601763 17772591 15561346 13358636 11389038 9878465
43317 9878465 8533461 6766140 4744618 3567583 4028822 5599437 7000926 7668679
43309 7668679 8346295 10049162 12569777 14499207 14965553 14727282 14899787 15222271 14668230
43300 14668230 13340687 12348321 11959015 11508982 11233910 12253672 14149378 14576402 12473514
43291 12473514 9916126 9275159 10016895 10060920 9044086 8173646 7681720 6668849 5233060
43282 5233060 4695857 5523342 6709659 7577845 8816137 11275172 14711934 18000177 19845823
43273 19845823 19375443 16935046 14233252 12769797 12219388 11230521 9478131 7768062
43265 7768062 6419453 5036576 3939662 4278508 6227465 8271744 8890629 8098895 6933042
43256 6933042 6265783 6465578 7332527 7963845 7515719 6503112 6505993 8111356 9963270
43247 9963270 10476644 9849341 9711946 11224775 14090547 17060752 18810109 18531249 16294594
43238 16294594 12992122 9745131 7280984 5808933 5292636 5700874 6950524 8537650
43230 8537650 9372881 8489882 6174681 3946721 2993670 2952782 2654642 1698858 768402
43221 768402 684654 1694429 3448122 5173632 6104931 6206800 6246107 6810675 7669700
43212 7669700 8435943 9180844 9809991 9594195 8261009 7032503 7526748 9793704 12191246
43203 12191246 13008363 11702661 9046985 6690974 5987263 6573917 6791112 6099704 6015772
43194 6015772 7726021 10041032 11098126 10944443 10787475 10762150 10359894 10127209 10801608
43185 10801608 11579462 11537804 11909757 14192057 16695133 16330565 13692783 12644976 14306374
43176 14306374 15429154 14228290 13864638 17422722 22542139 24468634 22515193 20101170
43168 20101170 19461678 19512000 18595457 16556613 13894603 11019050 8730301 7876582 8237403
43159 8237403 8832385 9256831 9664552 9729142 8880235 7497272 6769127 7312485 8679179
43150 8679179 10094315 11062293 11578426 12350774 14336662 17400587 19935547 20437344 18932643
43141 18932643 16446878 13960835 12424509 12582525 13812340 14183863 12701982 10488597
43133 10488597 8798736 7189909 4961595 3027378 2598360 3096104 3275769 3502840 4830227
43124 4830227 6509291 6694774 5340334 4206050 4033710 3826895 3093077 2733809 3260250
43115 3260250 3981057 4599982 6025605 8835677 12152817 14663171 15785196 15540892 14374625
43106 14374625 13361614 13409637 13883134 13095401 10511007 7466010 5452263 4699847 4670672
43097 4670672 4882280 4931099 4633993 4394022 4640757 4962636 4750333 4495799 5204495 6636803
43087 6636803 7558578 7777485 8458830 10268458 12634828 14933575 16834624 17466712 16199445
43078 16199445 14513824 14819259 16677848 16592654 12847241 8257714 6211969 5954429 4336445
43069 4336445 985752 -1153170 -217715 2173726 3436116 3057385 2319205 2238264 2674035
43060 2674035 2891527 2424352 1588093 1242221 1799600 2643446 2927616 2676765 2499994
43051 2499994 2455982 1998096 1063227 425297 661928 1355557 1801762 2186739 3427706
43042 3427706 5712946 7728259 7922014 6434433 5057246 5056127 5833890 6322079 6793844
43033 6793844 8083831 9525070 9303434 7096226 4911006 4621265 5726308 6347057 5653569
43024 5653569 4453476 3873045 4255649 5162463 5882878 5960807 5444309 4568368 3325099
43015 3325099 1729245 357549 13364 838216 2253863 3638617 4493976 4321953 3254192
43006 3254192 2473257 2856636 3459169 2723746 1033614 364792 1275821 2128223 1785358
42997 1785358 1131858 1043921 785741 -253590 -900234 96328 1943988 3034883 3317436
42988 3317436 3867711 4919470 5886842 6681936 7495193 7822262 7172953 6262562 6068290
42979 6068290 6141969 5317934 3771815 2923243 3437029 4601024 5560205 6012805 5871062
42970 5871062 5363883 5282072 6049245 6805263 6465578 5343834 4615086 4576319 4640672 4622599
42960 4622599 4703680 4529867 3780315 3280716 4011175 5286415 5549555 4749998 4168343
42951 4168343 4029958 3316254 2100201 1902989 3116273 4088851 3709827 3112731 3672840
42942 3672840 4858555 5370964 5168173 5031774 5127795 5276820 5777763 6661048 6864016
42933 6864016 5545840 3751163 3365412 4553530 5487548 4771102 3154375 2489008 3576557
42924 3576557 5414492 6347781 5768860 4643807 4305712 4926740 5591847 5720026 5633592
42915 5633592 5562216 4987916 3562822 2007851 1326797 1467338 1474063 843636 143617 268288
42905 268288 1479407 3232917 4673322 5184608 4583519 3014297 948229 -715959 -1106572
42896 -1106572 -363404 280463 12819 -378434 334802 1832537 2536157 1840927 883795
42887 883795 859950 1673053 2625764 3406192 3898280 3973613 4008559 4666967 5576691 5216976
42877 5216976 2927144 160141 -1176723 -908918 -214321 201920 422448 350634 -274407
42868 -274407 -1036307 -1153767 -703367 -584406 -1110919 -1473866 -901991 264710 1031431
42859 1031431 961221 682721 1266660 3067132 5137711 6092634 5713558 5227719 5611595
42850 5611595 6177300 5549129 3657032 1861493 1198598 1393249 1724423 2003430 2313861
42841 2313861 2452769 2192379 1770919 1673360 2095326 2916131 3976782 5038144 5651130
42832 5651130 5522093 4998363 4749750 4838540 4554106 3506109 2479803 2563005 3532829
42823 3532829 3885534 2721907 903008 -166064 -297122 -314781 -490143 -145940 1132317
42814 1132317 2696502 3527839 3237924 2186875 1008443 195695 -109627 -17961 453259
42805 453259 1296268 1898516 1251493 -477071 -1279782 524670 3804264 5756651 5499152
42796 5499152 4879062 5392354 6131062 5754085 4844239 4723503 4985228 4045419 1802699
42787 1802699 67920 148290 1286151 1968743 1914898 2133821 3357566 4917730 5332622
42778 5332622 4018137 2205619 1726219 2903681 4305626 4759602 4756833 5290076 6105130
42769 6105130 6092565 5058101 4113679 4261361 5245157 5903147 5262142 3333640 1187385
42760 1187385 150949 621685 1755747 2492673 2605097 2521268 2506264 2394702 1866267
42751 1866267 708234 -889465 -2105696 -2031903 -775562 415526 466296 -499300 -1679723
42742 -1679723 -2557408 -2970588 -2816538 -2176203 -1322023 -291366 1063403 2455260 3363278
42733 3363278 4048932 5299704 6685579 6317852 3302533 -555391 -2623390 -2308209 -1032759
42724 -1032759 -91376 287795 282966 86744 -76382 -364884 -1291137 -2566075 -2795688 -1336557
42714 -1336557 406900 776904 156326 87192 871900 1669276 2369386 3578366 5055760
42705 5055760 5888901 6014032 5951045 5385253 3859320 2550922 3165997 5039364 5653829
42696 5653829 4419395 3580015 4608659 6049709 6238042 6136486 7721692 10881898 13602639
42687 13602639 14438822 13498719 11649195 9841395 8663768 7737573 6145163 3995591
42679 3995591 2661305 2875805 3712244 4215814 4824104 6107841 7231319 6985940 5555238
42670 5555238 3992237 2600131 1059178 -362649 -901672 -268685 1311904 3469915
42662 3469915 5299414 5474727 3893169 2380248 2395462 2786478 1509772 -885403 -1477284
42653 -1477284 1136319 4882159 6682651 5535227 2570937 -628576 -2830405 -3224963
42645 -3224963 -1927143 -201617 636223 592084 810349 2025622 3620993 4401903 4017351
42636 4017351 3209408 2621652 1878942 353047 -1487190 -2355924 -1878153 -1151217 -1177657
42627 -1177657 -1557801 -1375417 -636821 89409 949113 2558428 4522715 5276246 3840277
42618 3840277 1150940 -835602 -1131837 -480294 -182192 -479777 -442158 499608 1461842
42609 1461842 1189735 -63629 -723783 -95337 674520 368404 -499373 -545980 397424
42600 397424 1079142 549881 -711122 -1435157 -785135 1103924 3365702 5013174 5469316
42591 5469316 4700958 3166981 1860183 1903884 3359668 4700189 4394071 2857570 1748238
42582 1748238 1504888 1103190 319822 279695 1073231 894456 -1089028 -2823087 -2170651
42573 -2170651 -213218 395396 -619986 -1213889 -553462 -73430 -832760 -1902425 -1980191
42564 -1980191 -1121002 -312525 -373695 -1474134 -2790148 -2765969 -835701 1404800 2062085
42555 2062085 1545574 1610453 2214469 1589493 -448218 -1742252 -1075198 128145 482856
42546 482856 788597 1919119 2589638 1372330 -450640 -371402 1759481 3808369 4617179
42537 4617179 5047930 5752286 5954609 5069548 3981918 3862035 4682987 5615332 6154972
42528 6154972 6246604 5886904 5225562 4696480 4556425 4525117 4214007 3670981 3222272 3034492
42518 3034492 3121633 3503287 3956203 3829921 2697401 1265432 1053665 2729396 5040229
42509 5040229 5909704 4550118 2063864 10889 -1004324 -1173889 -687955 278684 1237572
42500 1237572 1813134 2341406 3318898 4283558 4060362 2431774 887792 1068621 2703495
42491 2703495 3766833 2847162 842835 -205938 292045 924996 574298 225784 1439231
42482 1439231 3671678 4694501 3651371 2057630 1347539 1104447 554212 174104 561251
42473 561251 1137899 1447326 2324778 3958108 4161752 1055666 -3343135 -4932578 -2742966
42464 -2742966 240010 1479164 1368217 947638 133667 -639162 251593 2904026 4676349
42455 4676349 3569389 1049782 -372950 -676171 -1272062 -1925064 -1325361 93501 543542
42446 543542 -132306 -242055 840986 1699287 1308481 636656 1041037 2397436 3564028
42437 3564028 3746476 2887272 1569515 909200 1630737 2875382 2889265 1361926 79317
42428 79317 566173 2019307 2585882 2026848 1825859 2792170 3844055 3598319 2188884
42419 2188884 762369 -163163 -854424 -1232340 -791779 240061 882905 999289 1665101
42410 1665101 3094417 3462881 1264411 -2056852 -3658207 -3042786 -2292215 -2660837 -3100776
42401 -3100776 -2594834 -1781140 -1271448 -263646 1762150 3410101 2979707 784710 -1411639
42392 -1411639 -2465028 -2277684 -1093744 430786 1234844 1055484 923358 1544365 2130731
42383 2130731 1853842 1367352 1638455 2285466 2402235 2050053 1623608 879817 34510
42374 34510 430239 2234275 2887511 296713 -3483094 -4512149 -2246484 334188 1435908
42365 1435908 2017238 2539644 1695694 -553173 -1784507 -552348 1502130 2566649 3264279
42356 3264279 4486428 4952119 3398254 1503897 1906084 4252846 5804813 5489115 4912032
42347 4912032 5355429 6046596 5984787 5711009 6310077 7682734 8699417 8696996 8364416 9184143
42337 9184143 11836444 14945469 15957476 13947435 11073066 10215456 11377079 11657591
42329 11657591 9074230 5209504 3216912 3924802 5089577 4469688 2513485 1365368
42321 1365368 1931227 3031707 3386336 3222298 3316783 3388253 2509493 730980 -760218
42312 -760218 -1076408 -423805 511654 1213677 1350434 855028 103817 -460853 -778114 -809511
42302 -809511 -185855 1053553 1898589 1581877 909559 1164464 2091072 2425349 2099550
42293 2099550 2147527 2486954 1813964 52358 -1117036 -841431 -265955 -257192 66465 1345108
42283 1345108 2426433 2337149 2098192 2767003 3156410 1638731 -817230 -1653046 -220742
42274 -220742 1759585 2895620 3314646 3302635 2696113 1874716 1733190 2251723 2338769 1424019
42264 1424019 194574 -409884 -5540 1387930 3259096 4413383 4009362 2841788 2495529
42255 2495529 3173813 3543413 2901602 2247951 2700628 3803229 4049393 2646399 462280
42246 462280 -548253 889500 3670222 4890291 3047613 153025 -619025 1022459
42238 1022459 2461265 2111511 1301689 1551203 1994547 1090636 -399313 -132740 2388953
42229 2388953 4802623 4706313 2422190 315043 19193 1187500 2814306 4715054 6978962
42220 6978962 8668038 8484351 6867250 5937336 6583765 6997189 5399300 3002609 2342481
42211 2342481 3395660 3660311 2058309 422768 500799 1558504 2003294 1681101 1336396
42202 1336396 1184080 1313958 2351337 4409986 6420504 7805308 9729733 13063743
42194 13063743 16013100 15822236 12585328 9478222 9092774 11224426 14509757 18353801
42186 18353801 22275315 24790148 24443424 21540221 17855141 14787416 12452054 10378286
42178 10378286 8400942 6758729 5702065 5164949 4783565 4327782 4096255 4568974 5569047
42169 5569047 6218359 6078432 5971107 7120266 9618584 12315543 14249419 15587551 16887660
42160 16887660 17968157 18058515 16836821 14751338 12349125 9846851 7501469 5835533
42152 5835533 5074622 4709566 4128658 3520903 3590342 4352419 4833291 4312051 3393355 3211424
42142 3211424 3697309 3408433 1427264 -1189324 -2577349 -2386794 -2001663 -2369901 -2699023
42133 -2699023 -1927746 -578466 -91793 -801473 -1672212 -1808828 -1153592 106732 1577740
42124 1577740 2154116 902516 -1318528 -2512501 -2107336 -1303473 -514218 1421445 4407705
42115 4407705 5758997 3745872 713605 70533 1366716 1377687 -477739 -1207653 816385
42106 816385 3259141 3567009 2636277 2736469 3744560 3797097 2529900 1332544 856549
42097 856549 376720 -342624 -355497 837761 2300447 2922938 2789163 2659078 2673492 2250410
42087 2250410 1125911 -2216 -116410 864844 1729947 1237899 -256095 -914779 573882
42078 573882 3464215 5759581 6256424 5412962 4454784 4152945 4473628 4927989 4979258
42069 4979258 4327550 3173336 2280180 2443776 3545956 4309966 3540456 1656680 382350
42060 382350 699914 1787345 2343760 2176819 1847149 1549175 1293032 1533738 2447510
42051 2447510 3040992 2285646 897943 622776 1775294 2874645 2894268 2518522 2739985
42042 2739985 3380112 3567678 2829529 1316569 -255169 -655016 935730 3678322 5513361
42033 5513361 5113377 2840353 -35829 -2124331 -2195952 -52716 2794761 4539914 5160362
42024 5160362 5830646 6558865 6214227 4859751 3936402 3795982 3240150 2069429 1738705
42015 1738705 2552485 2605152 875556 -836752 -692272 484104 1069706 1361622 2454210
42006 2454210 4001367 5104913 6012524 6975929 6855234 4968174 3047519 3201724 5013732
41997 5013732 6630301 7481442 7884746 7393601 5920103 5188956 6554167 8616687 9624228
41988 9624228 10831919 14363636 18921233 21201902 20980213 21192765 23200191 25525274
41980 25525274 27396393 30051048 34043482 38412061 43121910 49697413 59331438 73010668
41972 73010668 93042968 121458672 158062722 203840074 263534991 336843950 406697545
41965 406697545 446181926 443020870 411467476 374563037 340115986 300810622 252745017
41958 252745017 203545345 162274761 130201018 104440338 84520029 71320385 63094915
41951 63094915 56333782 49246027 42295710 36393635 31981133 28990159 26686325 24118475
41943 24118475 21088434 18094474 15503927 13619208 13028274 13656805 14023486 12877406
41935 12877406 11047473 10144986 10084538 9673934 8993954 9044967 9445238 8804781 7278762
41926 7278762 6425064 6430136 5806533 4146296 2868937 2723546 2766099 2471094 2672695 3531007
41916 3531007 3639521 2306224 979655 1196183 2498164 3418472 3287397 2235958 672304
41907 672304 -506637 -447375 317913 401260 -179858 10382 1097225 1299015 26040
41898 26040 -658991 825057 3017807 3849506 3850059 4739927 6227935 6664946 6043555 5947055
41888 5947055 6896659 7918336 8601208 9557187 10699022 10862097 9565433 7858969 7106784
41879 7106784 7846732 9753211 11692380 12064243 10327490 8039748 7182631 7687692 7950722
41870 7950722 7484574 7332012 7800163 7657156 6149153 4253713 3207429 3099116 3593089
41861 3593089 4700746 5991641 6331763 5483477 4885817 5681827 6929412 7074689 6356953
41852 6356953 6173088 6582504 6236979 4766764 3460371 3101314 2735644 1527926 556057
41843 556057 1393648 3610939 5158408 5077231 4470517 4571499 5119859 5299827 5292367 5929535
41833 5929535 7370491 9097333 10897499 12870011 14681798 15988260 17652221 21221185
41825 21221185 26623151 31498931 33697228 33590264 32947351 32313680 30849128 28310891
41817 28310891 25579315 23071542 20126026 16546972 13535184 12201550 12000527 11557623
41809 11557623 10424786 9087301 7778337 6416342 5452350 5555153 6350202 6578728 5834947
41800 5834947 5138041 5289365 5666990 5465341 5252337 6047775 7273913 7079181 4915954
41791 4915954 2545372 1856281 2624919 3281631 3210511 3163976 3606339 3840146 3187598 2223099
41781 2223099 2082540 2806768 3100667 1987183 294625 -38329 1768394 4225953 5187793
41772 5187793 4316988 3243437 3246967 3730526 3539342 2917703 3040757 3978481 4429937 3659817
41762 3659817 2546588 2186871 2401759 2382462 2109850 2199838 2744496 3293452 3879142 5135620
41752 5135620 7272304 9702804 11888440 13838158 15591975 17129780 19260597 23513127
41744 23513127 29980604 35900373 37877417 35542239 31672555 28513811 25529637 21432589
41736 21432589 16742611 12881726 9985013 7497238 6145904 7078513 9234079 9951866
41728 9951866 8622074 7464839 7848510 8121046 6542128 4322680 3734530 4696396 5442381
41719 5442381 5492236 5640440 5753849 5031341 4105316 4456074 5755055 6128705 5242002
41710 5242002 4791968 5566023 6402319 6746356 7831858 10228364 12401806 13058717 12997541
41701 12997541 13211077 12977330 11420770 9290904 7489894 5414027 2607337 569260
41693 569260 821082 2393735 3359752 3726772 4552312 5282957 4607711 3232325 3027148
41684 3027148 3797327 3752372 3069272 3907933 6474315 8190774 7809170 7423822 8801099
41675 8801099 10260436 9305637 6454379 4195166 3429418 3111667 2549182 2001461 1473652
41666 1473652 736325 314627 900123 1923094 2108946 1375701 883989 1225889 1834873
41657 1834873 2310103 3072773 4286777 5122324 4728821 3409130 2310829 2183159 2747982
41648 2747982 3215354 3244581 3243849 3564421 3650284 2647420 925244 118682 1185890 3196572
41638 3196572 4668131 5301365 5518095 5060447 3366514 1038618 -371369 -132292 1087016
41629 1087016 2399030 3431769 3846626 3301660 2264778 1871634 2494839 3271957 3479430
41620 3479430 3494160 3823721 4068309 3675975 3041177 2876284 2950814 2520189 1792780 1830181
41610 1830181 2846990 3654867 3261027 2206043 1650735 1708353 1524906 784654 235838
41601 235838 532895 1271972 1647350 1645992 2007780 3108904 4410900 5135399 5112064 4740533
41591 4740533 4346030 3852287 3061021 2070880 1334079 1281851 1863156 2466283 2373321 1371142
41581 1371142 3583 -709522 51288 2163413 4408677 5425160 5042651 4349086 4220489
41572 4220489 4324068 4053594 3801328 4336845 5277149 5373325 4320809 3069669 2158274
41563 2158274 1120096 60987 320206 2474382 4916420 5843779 5734585 6197649 7031532
41554 7031532 6440647 4111606 2039273 1741471 2370459 2460559 2092457 2142241 2464052
41545 2464052 2221155 1507088 1377012 2352719 3754537 4504272 4071130 2817248 1843652
41536 1843652 2140842 3413231 4174065 3503987 2142991 1225748 712165 78036 -179897
41527 -179897 772483 2239696 2518833 1469473 896763 1792497 2788644 2400818 1472950
41518 1472950 1895714 3667225 4846208 4264085 2919370 2510388 3607760 5496776 6973177
41509 6973177 7038660 5552652 3541277 2363596 2373851 2827707 3066056 3115955 3095506 2907335
41499 2907335 2826018 3528999 5003962 6139112 6062095 5314037 4954473 4969140 4459416 3207733
41489 3207733 2147084 2167136 3137383 4301129 5089167 5275810 4713715 3264711 986467
41480 986467 -1604983 -3429967 -3336340 -1153904 1797828 3668227 3611428 2183423 461346
41471 461346 -709015 -721424 696586 2935029 4495670 4163158 2239078 293291 -447728
41462 -447728 -293410 -448234 -1221264 -1328746 555243 3792364 6119839 6198598 5051708
41453 5051708 4495611 4883948 5169549 4617398 3489975 2382046 1848505 2393132 3725955
41444 3725955 4263691 2728853 314336 -217077 1965580 4545977 5043467 3704047 2437412
41435 2437412 2069069 2039370 2076346 2601032 3624571 4512671 4951391 5232036 5515612 5596126
41425 5596126 5441338 5292498 5214329 5114711 5068911 4986133 4209395 2350154 463743 396635
41415 396635 2691645 5877698 8090989 8759861 8500134 8083625 7903527 7911707 7670729
41406 7670729 6785347 5461197 4268937 3334323 2350992 1487975 1519139 2698710 4195043
41397 4195043 5133414 5636899 6305945 7188257 7879897 8204521 8100046 7198798 5346998
41388 5346998 3362431 2373449 2311952 1891334 380498 -1315302 -1817750 -971032 217206
41379 217206 954952 1281038 1439431 1404468 1247028 1414923 2269150 3614510 4937592
41370 4937592 5846911 6094696 5561352 4564219 3823332 3684292 3688964 3389343 3194574 3712155
41360 3712155 4554444 4699795 3946014 3072058 2565607 2250889 2299614 3329846 4998972
41351 4998972 5756485 4857585 3594654 3533712 4421147 4963661 4906241 5036800 5675946 6513444
41341 6513444 7616313 9302287 11205228 12647876 13715726 14796791 15429778 15017967
41333 15017967 14337715 14606542 15168677 14098412 11370117 9294701 9049210 8890986 7158896
41324 7158896 5220776 5553253 8029650 10061228 9886537 8038660 5877989 4336540
41316 4336540 4198076 6135798 9838668 13810037 16534496 17725493 18475144 20264957
41308 20264957 23438809 26496990 27549580 26729333 26234430 27460143 29221051 29742160
41300 29742160 29243989 29114392 29409008 28997336 27802717 26986864 26803499 26044470 24100283
41291 24100283 22040748 20918366 20254997 19130635 17862262 17593631 18676792 20284384
41283 20284384 21509517 22433110 24187857 27974045 33563733 38702173 40600894 38356720
41275 38356720 33576866 28574112 24471489 21147275 18301004 16106040 15136823 15900142
41267 15900142 18195226 20941701 23043317 24372813 25417356 26103582 25726366 24073844
41259 24073844 21842374 19774913 18075714 16766818 15862818 15133173 14591635 15277305 18338760
41250 18338760 22955108 26434229 27108406 26008440 24783839 23146677 19783595 15075200
41242 15075200 11268687 9956591 10583895 11572878 11938092 11556113 10641932 9399645 7936278
41233 7936278 6433212 5464137 5729085 7109443 8475890 8949421 8790274 8390607 7167494
41224 7167494 4622579 1960997 1133734 2312469 3787630 4562841 5474867 7120330 8201851
41215 8201851 7176644 4636076 2724847 2596623 3562201 4553170 5342316 6165625 6958922
41206 6958922 7371981 7236657 6845896 6859071 7804127 9519781 11335356 12991872 15029669
41197 15029669 18045584 22117912 27328191 33984027 41315831 46534433 46672664 41594472
41189 41594472 34155812 27234810 21704557 17493146 14991340 14271110 14026141 12832655
41181 12832655 11084242 10354046 10981525 11580771 11088855 10112813 9792528 10244456 10727071
41172 10727071 10755099 10512809 10493069 10989420 11609208 11310570 9598336 7729307 7766715
41163 7766715 10090274 12828260 14244733 14520319 14337550 13070323 10047054 6802061
41155 6802061 5946707 7695972 9347878 8742729 6699398 5299900 5216089 5839980 6878444
41146 6878444 8337950 9547476 9698226 9228563 9383319 10275599 10553053 9382498 7766944
41137 7766944 7196594 7663561 7897631 7317567 6821931 7398851 8636378 9198247 8483658
41128 8483658 7143782 5955892 4931180 3900991 3302571 3607692 4290978 4247581 3250641
41119 3250641 2226064 1962609 2295258 2768037 3320794 3961322 4514963 5175911 6536068
41110 6536068 8391702 9255231 8047759 5872347 5035057 6372037 8477524 9625100
41102 9625100 9519047 8886487 8248083 7750017 7705032 8495898 9863589 10741111 10117610
41093 10117610 8091700 5898214 4683580 4326103 3848218 3041922 3027070 4674125 6993135
41084 6993135 7993661 7079609 5709702 5428088 5989725 5967411 4759294 3335859 3027267
41075 3027267 4008968 5152247 5229983 4150709 2998974 2931993 4159812 6002205 7678159
41066 7678159 8825881 9460435 9801402 10167469 10786670 11629160 12504868 13267526 13874589
41057 13874589 14456404 15421723 17093548 18911485 19452983 17932608 15481819 14108091
41049 14108091 14262725 14258199 12536613 9845091 8391402 9107796 10620166 11135887 10609887
41040 10609887 10365460 10926152 11233248 10306923 8723946 7549446 6447429 4256360 1404417
41031 1404417 142664 1637512 4095304 4888746 3672922 2199910 1754469 2150368 2798323
41022 2798323 3243511 2784799 1078942 -736853 -921003 599355 2120039 2593865 2753036
41013 2753036 3330197 3698930 3213954 2602050 2782429 3189147 2549913 844581 -614190
41004 -614190 -784740 263011 1859731 3381090 4545552 5483258 6235671 6134289 4513571
40995 4513571 2258616 1391285 2455212 3640785 3494317 3057113 3842134 5071540 5012800
40986 5012800 4116461 4351794 5762238 6254610 5045437 3844049 3940073 4453684 4533524
40977 4533524 5053216 6524052 7201496 5374181 2381225 1199769 2570765 4464209
40969 4464209 5188638 5215285 5728487 6917831 8209130 9071084 9077999 8020916 6462211
40960 6462211 5568118 5943442 7016675 7823152 8012231 7896350 7890855 8123665 8341028 8080997
40950 8080997 7167126 6081592 5645572 6329903 8000615 10119050 11905715 12604214 12138459
40941 12138459 11459731 11750397 13213142 14953856 15984191 15974109 15136099 13867338 12558948
40932 12558948 11392505 10284437 9248125 8621097 8594467 8790223 8778097 8703910 8799893
40923 8799893 8652760 7874530 7262260 8072746 9977742 10979382 9906715 7938857 6888787
40914 6888787 6881618 6740072 6046335 5620247 6050522 6726521 6559120 5152360 3140420
40905 3140420 1663321 1474353 2329714 3354924 4074851 4712046 5398501 5794239 5828196
40896 5828196 5983685 6213986 5466150 3311378 1310659 1379001 3156205 4471618 4342750
40887 4342750 3992275 4674573 6027447 7163212 8034151 8857204 9248188 8872955 8178707
40878 8178707 7648334 7066037 6365051 6512366 8637395 12790290 18253946 24280517 29535857
40869 29535857 31677528 29071996 22877615 16303056 11817354 9884999 9945639 11208014
40861 11208014 12464240 12543914 11479043 10394163 10003173 9999501 9975469 9925667 9646322 8700511
40851 8700511 7353265 6582519 6731525 7011695 6738494 6188432 5814915 5501904 5057608
40842 5057608 4588449 3963519 2865905 1814792 1984160 3347522 4227541 3616423 2748623
40833 2748623 3165977 4305073 4499457 3552251 2635342 2135721 1353850 210606 -385755
40824 -385755 -27105 698819 1342250 1960381 2230442 1481327 -142220 -1694153 -2763388
40815 -2763388 -3613223 -3924521 -2865762 -728685 1029870 1904746 2957726 4587851 5312226
40806 5312226 3958064 1723218 616733 829622 1093691 836753 436892 -79666 -951346
40797 -951346 -1539426 -845944 772305 1789452 1630413 1395020 2124602 3400657 4149521
40788 4149521 4044288 3610564 3451116 3678484 3734471 2740499 576463 -1418713 -1594944
40779 -1594944 -9182 1477563 1460909 637355 645514 1791767 2705760 2252519 1164282
40770 1164282 1244552 2934589 4283647 3102664 -12458 -1955650 -854094 1665797
40762 1665797 2921145 2698653 2714432 3366901 3232346 1787924 429068 153408 173822
40753 173822 -229303 -269788 664828 1476738 1067782 303573 512357 1060875 457872 -741407
40743 -741407 -329135 2269842 5066766 6191126 5834622 5072248 4304068 3570592 3154588
40734 3154588 3073764 2868742 2440572 2212668 2079441 1301888 -31595 -644618 98551
40725 98551 1191169 1701255 2236969 3446192 4225426 3201823 1342201 1065233 2735484
40716 2735484 3927381 2765907 492816 -237367 1383865 3780371 5113656 4926919
40708 4926919 3846885 2547084 1316026 240125 -612169 -1264188 -1875445 -2451547 -2596000
40699 -2596000 -1978117 -1075538 -802786 -1154012 -1081706 -345393 -452916 -2479726 -4704514
40690 -4704514 -4268280 -1096343 1810538 2462908 2254729 3155473 4377595 3728400 1208450
40681 1208450 -851183 -962275 38001 757119 895933 776957 572312 532200 979535
40672 979535 1651008 1918232 1898176 2279587 2770466 2069452 48153 -1402823 -791551
40663 -791551 867580 1712345 1794178 2425517 3393091 2976940 895320 -821031 -653485
40654 -653485 409400 783190 741960 1500983 2867580 3468943 2784406 1368599 -562816
40645 -562816 -3005116 -4719357 -3933701 -1025184 1346436 1686375 1485820 2314548 2897775
40636 2897775 1234485 -1559145 -2242373 -107460 1981679 1751828 341016 -137284 262422
40627 262422 303921 147758 879087 2256203 2926247 2648251 2575052 3275768 3984710 4048930
40617 4048930 3795246 3569290 3053740 2072358 1198529 1029655 1484355 2207099 3087717
40608 3087717 4018807 4632845 4625297 4048355 3189221 2446088 2174479 2222436 1921670 1139471
40598 1139471 843270 1653061 2348572 1259092 -1079299 -2369168 -1779840 -842446 -614633
40589 -614633 -16307 1869836 3727313 3928250 3116898 2951076 3238016 2376012 185747
40580 185747 -1625715 -1762271 -554833 1022247 2125782 2009269 744830 -71264 1102913
40571 1102913 3364140 4078197 2225579 -406363 -1650410 -1137873 265432 1654715
40563 1654715 2174465 1403148 386884 953848 3208603 4967780 4504888 2585362 893379
40554 893379 -156270 -842798 -769789 262564 990771 160560 -1214533 -873204 1516245
40545 1516245 3837176 4333098 3449276 2498594 1864548 1297096 1040707 1656674 2957444
40536 2957444 3806722 3176376 1291833 -410268 -683075 157745 636742 -9182 -935491
40527 -935491 -956221 -34937 997434 1571370 1588117 1110595 562262 647406 1347535 1691886
40517 1691886 1319012 1300857 2238275 2632383 973279 -1338636 -1494797 484885 1552495
40508 1552495 127953 -1714433 -1651386 -441200 -177940 -971473 -1389935 -1123617 -1207209
40499 -1207209 -2108859 -3243294 -4027107 -4063149 -2780993 -337029 1607474 1598547 568896
40490 568896 655024 2021273 2687991 1645474 204235 -346228 -597118 -1455322 -2162172
40481 -2162172 -1328104 805811 2442122 2265737 514173 -1668825 -3103841 -3019271 -1480046
40472 -1480046 495642 1695755 1690413 935677 115308 -424879 -789457 -1207046 -1439501
40463 -1439501 -758935 910840 2119618 1285825 -905014 -1828079 -206582 2275481 3546587
40454 3546587 3908275 4761426 5815164 5665771 4566250 4292514 5155832 5360628 3919083
40445 3919083 2192275 1595281 1589929 1213186 971857 1585579 2119345 1293914 -97128
40436 -97128 -28617 1805745 3657883 4229091 3811968 2937299 1719930 900297 1671476
40427 1671476 3619597 4413409 2710756 193324 -548874 719819 2026510 1992552 1188207
40418 1188207 951788 1964339 3909105 5681877 6044662 4804929 3201346 2531185 2753040
40409 2753040 3077728 3319981 3698387 3914134 3706816 3832292 4944554 5847246 4768312
40400 4768312 2426489 1661385 3370792 4965811 4065405 1770374 591193 803296 1006283
40391 1006283 1077527 2041380 3526760 3890107 2962998 2421762 3027673 3555791 3073747
40382 3073747 2358585 2222072 2188120 1798148 1579506 1653770 1059648 -236733 -364459 1671622
40372 1671622 3716000 3133240 714332 -461721 529329 1668337 1544253 1139194 1545597
40363 1545597 2160315 2097826 1620766 1187894 613961 102523 576599 1906698 2300012
40354 2300012 752645 -1216030 -1697956 -1001653 -460416 188565 2063486 4375025 4764082
40345 4764082 2592425 -56603 -1181021 -1098619 -1298301 -2424349 -4113989 -5696928 -6272796
40336 -6272796 -5019150 -2255676 428873 1770699 2000677 1911582 1451884 14250 -2266798
40327 -2266798 -4225386 -4624808 -3152592 -696983 1252206 1899375 1933534 2491371 3367756
40318 3367756 3209776 1728465 506483 844265 1876265 1965867 1175163 936680 1643987
40309 1643987 2044156 1115569 -689279 -2340341 -3295098 -3314415 -2253051 -650264 252756
40300 252756 -192700 -1202481 -1585120 -1164403 -610535 -314621 -190304 -331919 -1000367
40291 -1000367 -1894350 -2199305 -1631641 -829008 -342669 197643 1343744 2651410 3025338
40282 3025338 2204233 1167341 877324 1293332 1969656 2912840 4139731 4880593 4194609
40273 4194609 2317397 518991 -500185 -1210520 -1948249 -1926518 -322123 2158343 3710865
40264 3710865 3432851 2268142 1815062 2601427 3731093 3977652 2968280 1335335 -21175
40255 -21175 -547727 -16304 1535667 3449522 4490417 3997055 2870324 2667264 3687789
40246 3687789 4720020 4764819 4137534 3609933 3380118 3337008 3473976 3469584 2675260 1176972
40236 1176972 98633 147917 646171 774513 911585 1735346 2804287 3211443 2976562
40227 2976562 2569310 1774087 491206 -17804 1466274 3798957 4541670 3372051 2417703
40218 2417703 2920702 3706851 3673856 3667720 4613750 5537393 5024185 3379059 1795812 458136
40208 458136 -925816 -1621899 -739041 881146 1429355 689390 271317 1179251 2528352
40199 2528352 2971090 2255284 1005994 -110685 -648606 -561466 -427491 -891510 -1721855
40190 -1721855 -2031749 -1528367 -862599 -612908 -640056 -673215 -841929 -1263087 -1617388 -1497642
40180 -1497642 -852288 83196 932565 1205299 705143 71226 364168 1821079 3438858
40171 3438858 4058848 3508241 2483222 1744080 1682004 2225552 2790271 2649604 1745360
40162 1745360 905243 941111 1764195 2689822 3313589 3640838 3572891 2883439 1810750 1192915
40152 1192915 1683050 2957586 3892888 3524184 1850312 -158616 -1311070 -1130017 -175352
40143 -175352 639073 1084999 1789188 3236617 4846564 5393086 4322212 2365729 835850
40134 835850 556761 1407935 2476472 2598250 1272943 -682312 -1779287 -1404383 -326964
40125 -326964 507515 1075571 1805856 2696627 3462084 3925366 3695970 2290335 363173
40116 363173 -247669 989025 1780370 -172553 -3579519 -5094466 -4117869 -3333988 -4158277
40107 -4158277 -4680912 -3337807 -1725549 -1739345 -2330567 -1665463 -615229 -1140262 -2471665
40098 -2471665 -2097193 5913 1272035 703711 130877 766068 1257450 262893 -1281956
40089 -1281956 -1802213 -1306053 -723346 -390795 -331708 -847031 -1714568 -1804488 -564228 897397
40079 897397 1145227 225994 -577562 -256896 1140489 2643080 2981275 1809115 449311
40070 449311 503977 1673833 2170062 1390843 665543 1026762 1970845 2994652 4433808
40061 4433808 5808806 5342678 2643861 175362 270521 2053639 3139601 3067905 2948102
40052 2948102 2825262 1884972 718450 901065 2366361 3378640 3215510 2850087 2807152
40043 2807152 2400761 1478604 903397 701055 -291945 -2046986 -2478965 -256061 2953974
40034 2953974 4432193 3564207 1786696 334800 -542858 -765238 -283732 419150 827463
40025 827463 1268792 2331360 3553262 3709582 2436271 627568 -912748 -2254031 -3417935
40016 -3417935 -3614082 -2183492 191873 2067336 2852339 3070044 3071597 2512581 1516686
40007 1516686 1329478 2768608 4589329 4717069 3039194 1608287 1763589 2441801 2077860
39998 2077860 874629 -4510 -476695 -1229317 -1931119 -1429192 284313 1747224 1895454
39989 1895454 1068435 -50516 -1263228 -2252061 -2366816 -1670659 -1218128 -1560447 -1810003
39980 -1810003 -1016790 225220 553953 -136722 -468126 564073 2268706 3141185 2699650
39971 2699650 2021841 2367500 3505940 3848763 2408080 132907 -1215660 -1138602 -597393
39962 -597393 -375959 -243749 135954 477704 503494 513181 789536 1057703 1068836 1149117
39952 1149117 1574782 1886379 1468395 441964 -654309 -1745356 -3045624 -4146796 -4052548
39943 -4052548 -2337313 156252 1991806 2378999 1793767 1542957 2544638 4244119 4916017
39934 4916017 3483870 975429 -390329 258204 1378845 988394 -682863 -1395253 69359
39925 69359 2014611 1837014 -519594 -2301950 -1317815 1520425 3622485 3807845 3052481
39916 3052481 2720052 3158309 3944799 4527556 4383701 3214448 1334489 -385820 -1095733
39907 -1095733 -482964 954133 1995423 1620177 207224 -835006 -1078943 -1750170 -3553310
39898 -3553310 -4979032 -4308155 -2473404 -1933408 -2992560 -3414307 -1974801 -292163 -295053
39889 -295053 -1602525 -2484293 -2111191 -852810 543216 1164515 383611 -1065875 -1505497
39880 -1505497 -564159 159789 -503147 -1606147 -1884589 -1807056 -2308917 -2672819 -1537488
39871 -1537488 650443 1991659 1641152 439970 -700519 -1592921 -2105746 -2076908 -1896436
39862 -1896436 -2055152 -2221015 -1806401 -1186279 -1179259 -1564599 -1388302 -594442 -40077 77057
39852 77057 488398 1425856 2088127 1706481 221861 -1984714 -3994053 -4288812 -2210354
39843 -2210354 618112 1826377 1261902 826206 1355809 1704326 1396452 1914645 4058050
39834 4058050 5922817 5328247 2995268 1402503 1278623 1191633 284401 -569182 -630427
39825 -630427 -647088 -1512120 -2595287 -2403302 -597741 1350915 1658389 171082 -1346422
39816 -1346422 -1020752 1039506 2773768 2442058 484934 -1201940 -1443115 -680994 47299
39807 47299 301038 309281 467482 1088108 2291749 3787818 4925629 5239630 4856759 4190226
39797 4190226 3431685 2651555 2179041 2306357 2604590 2235643 1241508 803353 1651101
39788 1651101 2917208 3418133 3375629 3579852 3378494 1383284 -1686278 -2944402 -1061272
39779 -1061272 1689371 2420421 1216175 145875 -36007 -171389 -410092 155131 1593974
39770 1593974 2731994 2908283 2707403 2739794 2965993 3339334 3872667 4024664 3318170
39761 3318170 2592183 3235053 5057144 6343272 6184534 5350810 4744724 4538882 4942205
39752 4942205 6010995 6456806 4733601 1876463 973392 2803442 4387613 3476018 2135796
39743 2135796 3447627 6404839 7190363 4827453 2441668 2583840 3985814 4067309 2703767
39734 2703767 1902001 2696548 3920111 3977691 2779273 1510055 996819 916658 627351
39725 627351 130466 -274311 -802436 -1835038 -2968296 -3317646 -2739622 -1884712 -1117261
39716 -1117261 -375210 23024 -333595 -898547 -785822 -360906 -528688 -537330 1178367 3621993
39706 3621993 3566605 457900 -1925729 -724907 1780231 1917327 258696 53503 1621279
39697 1621279 2254022 1137923 482509 1466646 2576377 2781685 3221323 4515328 5130901
39688 5130901 3955862 2337660 2026663 2810472 3514880 3755812 3465825 2282019 727304
39679 727304 477544 1994595 3241127 2287417 24895 -1302334 -1216014 -893734 -714879
39670 -714879 159732 1957253 3689199 4509838 4465725 3806827 2642098 1442932 921737
39661 921737 1105922 1247896 940905 729078 1247977 2177137 2528495 1937751 1308293 1886781
39651 1886781 3748513 5560132 6001075 5021107 3400242 1610561 -251239 -1834378
39643 -1834378 -2682871 -2820553 -2477106 -1579179 -353227 98841 -892201 -2033331 -1438005
39634 -1438005 513592 1423766 267713 -1294331 -1652878 -1488655 -2174014 -3461073 -4137973
39625 -4137973 -3875601 -3084358 -1849456 -328821 561125 188308 -644386 -796148 -471830
39616 -471830 -595106 -1035113 -809730 223557 1165395 1476959 1465763 1392808 1133975 847864
39606 847864 1117817 2193019 3591697 4502824 4257493 2663559 327194 -1637090 -2633647
39597 -2633647 -2977220 -2975001 -2317680 -926606 386702 922624 1073634 1431086 1641389
39588 1641389 1222279 808325 1194343 1575734 325679 -2450069 -4582103 -4419131 -2624760
39579 -2624760 -983827 -356448 -341568 -277335 52134 470424 789870 1063117 1359655 1350131
39569 1350131 627020 -351685 -354175 1044097 2635541 3052456 2448842 1884518 1652394
39560 1652394 1282149 801861 871649 1779779 3128924 4263723 4308603 2404746 -1008539
39551 -1008539 -3687340 -3665126 -1557390 406622 1240286 1654408 1997108 1537014 39226
39542 39226 -1479573 -2032646 -1575635 -453298 858866 1338026 139323 -1905839 -2808372
39533 -2808372 -1864536 -425775 93706 -241761 -660404 -682979 62211 1687573 3201312
39524 3201312 3129004 1530795 94399 -283502 -482370 -1037384 -775234 1188396 3520041
39515 3520041 4255423 3354805 2271460 1736381 1330140 708348 3453 -672697 -1198933
39506 -1198933 -1265450 -855477 -316984 520808 2271377 4340696 4715818 2646431 318471
39497 318471 233106 1802305 2288237 503983 -2195794 -4169484 -4877480 -4220188 -2409471
39488 -2409471 -707131 -595575 -1786133 -2441377 -1747513 -915199 -1172097 -2070598 -2441638
39479 -2441638 -1953229 -1021084 -21759 754270 1050949 1095014 1484408 2163768 2132103 718043
39469 718043 -1301490 -2374182 -1762782 -218460 744425 213968 -1205859 -1941210 -1234041
39460 -1234041 -90385 83358 -633182 -1038112 -748463 -578322 -933654 -1087012 -455041
39451 -455041 496870 1219173 2024870 3323969 4568006 4752561 3670913 2116707 1029997
39442 1029997 758370 940596 926129 513771 253813 701529 1585795 2278218 2792728 3455805
39432 3455805 3829294 3160706 1916918 1487193 2046291 2175875 1231638 568852 1349691
39423 1349691 2475259 2175608 750301 105432 997738 2240082 2532828 1811850 743631
39414 743631 -68720 -314922 -259410 -714059 -1903565 -2583761 -1326805 1406048 3570329
39405 3570329 3973567 3337412 2799405 2512608 2155817 1830128 1790866 1891158 1806829 1445593
39395 1445593 933891 610412 964962 1919100 2344783 1331730 -127361 -100616 1383757
39386 1383757 2046961 714275 -765459 -313605 1201348 1511518 534019 -13837 -10511
39377 -10511 -1080700 -3034625 -3157782 -512812 1602677 -91842 -3819513 -4921699 -2462938
39368 -2462938 -496568 -2132294 -5190642 -5504060 -2596913 267267 831200 191745 235194
39359 235194 819028 553541 -852510 -2302412 -2893940 -2740170 -2267418 -1486485 -199440
39350 -199440 1452074 2871970 3403931 2914224 2026734 1508965 1254762 267180 -1928563
39341 -1928563 -4173913 -4624437 -2791678 -86779 1733860 2141225 1777267 1489795 1793119
39332 1793119 2788754 4093784 5041335 5302422 5146469 4896711 4483306 3821798 3181397
39323 3181397 2722559 2134261 1363771 1248031 2495675 4280641 4938456 4103227 3042171
39314 3042171 2662637 2450288 1937107 1892953 2961116 4114926 3874561 2487641 1478655
39305 1478655 1363124 1296143 904752 913909 1712372 2756451 3811593 5338209 7027629
39296 7027629 7416891 5892399 3785820 2419375 1352095 -120827 -1051177 -272980 1197240
39287 1197240 1393505 604552 1040650 3258995 5250784 5611211 5379577 5765126 6113231
39278 6113231 5517644 4695011 4587003 4520257 3569549 2552524 2649425 2987671 1891226
39269 1891226 3490 -284399 1492353 3138347 3090302 2168297 1407936 471482 -643200
39260 -643200 -502093 1442526 3146779 2601429 945989 852070 2609932 4001063 3678755
39251 3678755 2535129 1714343 1298572 1294159 2068435 3200837 3467813 2644928 1936061
39242 1936061 1963816 1762228 573433 -787032 -1429746 -1952170 -3173941 -4366926 -4257467
39233 -4257467 -3083634 -2143127 -1756370 -1167165 -219077 329266 173219 -104593 -54168
39224 -54168 246706 787750 1529031 1783907 921322 -304277 -454703 404728 624731 -581918
39214 -581918 -2059719 -2623504 -2582536 -2532594 -2056992 -821705 194228 -30598 -863864
39205 -863864 -998136 -523255 -566841 -1229476 -1363851 -380170 1035746 2130792 2868284
39196 2868284 3307809 3226752 2634701 1824391 747554 -775752 -2071882 -1883346 -68858
39187 -68858 1848879 2402253 1773822 1175392 1308896 2033929 2945369 3522219 3101622 1529138
39177 1529138 -252579 -930449 -219736 903753 1419724 1285732 1079156 998123 684082
39168 684082 88864 56653 1452229 3668351 4702134 3312729 726940 -595322 159298
39159 159298 1317107 960038 -735301 -1886706 -1172620 827686 2381381 2302840 956344
39150 956344 -245332 -364785 83596 -118163 -1308614 -2580247 -2984493 -2488241 -1528768
39141 -1528768 -268767 1217786 2469324 2967860 2813699 2598316 2605251 2448851 1573532
39132 1573532 1338 -1456647 -1854790 -1143317 -339311 -302676 -611958 -331310 326211
39123 326211 213555 -683788 -731282 983631 2891141 2826060 954475 -669611 -1119845
39114 -1119845 -1497561 -2643552 -3600583 -3150002 -1674657 -466318 20079 169334 40412
39105 40412 -654263 -1677740 -2509403 -3393103 -4957081 -6570544 -6352207 -3583419 -172677
39096 -172677 1335368 660418 -401363 -691005 -852460 -1680946 -2671605 -2850164 -2067863
39087 -2067863 -759173 741926 1853448 1564585 -312699 -2302819 -2824459 -2128495 -1467269
39078 -1467269 -820067 911261 3505302 5039479 4418614 2721280 1292349 -29287
39070 -29287 -1742206 -3058047 -2872649 -1573840 -500064 -52841 416386 1138058 1516307
39061 1516307 1123968 195570 -826183 -1542120 -1578381 -969486 -317297 -16833 230300
39052 230300 550364 282765 -852296 -1720108 -1149142 206884 754317 297221 23422
39043 23422 456574 1011566 1415012 1830315 1585489 -272238 -2816455 -3605669 -1878612
39034 -1878612 419294 1531514 1898615 2339141 2348803 1698714 1716699 2984828 3504250
39025 3504250 1578040 -888927 -854616 989547 1105480 -1254877 -2796497 -1435981 488262
39016 488262 136153 -1329880 -770008 2000406 4114327 3909130 2724616 2283548 2397432
39007 2397432 2018908 1121021 566061 808836 1407364 1511572 595857 -985421 -2178954
38998 -2178954 -2340727 -1943163 -1645023 -1099936 335762 2043083 2666341 2235274 2200997
38989 2200997 2926832 2835351 1028798 -818289 -668041 1011777 2345180 3033311 4132557
38980 4132557 5444683 5577432 4639460 4386351 5116832 4881116 2884155 1333074 2171694
38971 2171694 3921213 3914976 2212905 930297 743044 644934 559098 1417667 2674530
38962 2674530 2471485 783666 -124083 770256 1636756 940215 -10367 645574 2270984
38953 2270984 2989164 2731514 2911280 3787627 4201859 3688991 3087174 3038908 3344318 3857213
38943 3857213 4694963 5387712 4985529 3323694 1360656 99191 -172703 345147 1181494
38934 1181494 1655558 1440524 954971 620093 155347 -645422 -1105708 -752288 -518071
38925 -518071 -1322587 -1977203 -485322 2619534 4377500 3313296 1222882 286979 397682
38916 397682 509312 736372 1444824 1762376 919110 20333 537030 1810815 2074315
38907 2074315 1402895 1463899 2507255 2931810 2216914 2013661 3305351 4371482 3101017
38898 3101017 126307 -1947557 -1796248 -406546 808590 1452591 1530396 680204 -1200113
38889 -1200113 -3161766 -3918012 -3375325 -2815128 -3182750 -3658950 -2715397 -533976 696916
38880 696916 -493103 -2738407 -3499293 -2244045 -651104 40513 261622 542129 423442
38871 423442 -335513 -911187 -779032 -737406 -1441081 -1971574 -1193862 343920 1370382
38862 1370382 2050419 3417455 4952339 4655724 1893110 -1366876 -2769999 -1967205 -347444
38853 -347444 618157 308716 -870660 -1754396 -1508808 -661291 -308045 -351603 311327 1720791
38843 1720791 2417390 1606665 358032 -170144 -400977 -1182019 -2092847 -2170890 -1501629
38834 -1501629 -850440 -362403 209947 590708 449147 216217 283153 -23758 -1414885
38825 -1414885 -3113072 -3684961 -2969323 -1893250 -905958 -83266 -236744 -2036385 -4204280
38816 -4204280 -4533735 -2859680 -1186919 -673785 -487458 -93869 -479806 -2051962 -3242035
38807 -3242035 -2631397 -1041870 -129093 -94347 -117144 87747 540888 1708156 3342691
38798 3342691 3580346 1077984 -2446572 -3682770 -1674877 1260387 2574006 1956011
38790 1956011 635094 -267112 -142758 1123929 2779314 3469403 2537612 741126 -615399
38781 -615399 -911903 -433284 168607 333338 -190549 -1244508 -2333093 -2846914 -2361246
38772 -2361246 -1017079 364951 946279 767406 560497 598966 396250 -209669 -476527
38763 -476527 183349 1196784 1501969 763171 -551657 -1753684 -2159564 -1420834 -152482
38754 -152482 446151 63873 -417868 -438798 -389152 -205841 1030773 3013851 3454248 1105673
38744 1105673 -1955150 -3129564 -3008847 -3764988 -4972270 -4211050 -1446522 602969 850006
38735 850006 1254799 2861499 3688973 2397659 1216233 2605382 4934193 4404814 428665
38726 428665 -3555019 -4517832 -2965028 -1282829 -619198 -244430 746843 1970328 2258830
38717 2258830 1472001 1036493 1909573 2683030 1276423 -1663189 -3051188 -1524308 714028
38708 714028 1149325 84486 -850208 -1424128 -2132146 -2277646 -1008837 565261 504026
38699 504026 -1091181 -2268977 -2089124 -1498489 -1386455 -1422710 -1021844 -167216 850744
38690 850744 1491399 932800 -905932 -2566860 -2468888 -891988 566927 1084707 866838
38681 866838 -120421 -1950682 -3509989 -3290464 -1541454 -69951 194820 -60831 -191625
38672 -191625 -305071 -266998 243012 595175 13576 -430065 1090792 3752041 4450470
38663 4450470 2494385 1088330 2494917 4455272 3886435 1838105 1534413 2915064
38655 2915064 2786920 115221 -2347423 -2394922 -1371925 -1541866 -2749343 -3389803 -3137284
38646 -3137284 -2913451 -2997920 -2802429 -2268630 -2263086 -3447960 -5336623 -6489970 -5540539
38637 -5540539 -2499875 740089 1915575 819933 -492736 -369900 566374 1005198 1251977
38628 1251977 2410101 3924562 3906693 2047357 404830 642311 1972364 2731454 2675735
38619 2675735 2543480 2412617 1916487 1389525 1330592 1160561 -23279 -1707557 -2456065
38610 -2456065 -2038170 -1536108 -1295011 -459590 1081141 2020120 1688898 1274815 1936876
38601 1936876 2929224 2770481 1391028 45903 -228936 730067 2323640 3281078 2615751
38592 2615751 1124407 680167 1352137 987160 -1195266 -2730047 -1620069 126682 -462091
38583 -462091 -2302049 -1850557 1013118 2685613 1655625 598505 1441439 2116347 438497
38574 438497 -1880116 -1984769 -491548 -232558 -1630707 -2358072 -1185557 495340 1175570
38565 1175570 1119645 1213019 1439331 1204009 393175 -293547 201235 2258806 4654232
38556 4654232 5292046 3530094 1130940 153329 608549 1079384 874056 431056 205630
38547 205630 360145 1100818 2184561 2551449 1591762 283847 -149274 -168154 -1050138
38538 -1050138 -2519358 -2931059 -1759523 -251336 599238 1175158 1936276 2412408 2121949
38529 2121949 1399697 715593 61870 -511481 -601143 -118852 517712 1148185 1949624 2510909
38519 2510909 1938792 413478 -446007 418746 1966623 2393841 1406732 303154 217104
38510 217104 1093898 2141269 2582524 2108658 1136300 471878 314328 -82754 -1223554
38501 -1223554 -2217051 -1628966 571442 2736844 3436740 2935767 2380511 2131414 1627920
38492 1627920 612422 -417886 -1099126 -1650697 -1967279 -1130000 1179702 3273715 2798894
38483 2798894 -376579 -3739255 -4925644 -3928550 -2158300 -559867 502270 608872
38475 608872 -174507 -709670 60919 1683264 2875301 3236401 3252553 3016822 2174724
38466 2174724 978698 197493 -54959 -374723 -938906 -1285032 -1198653 -867622 -226081
38457 -226081 819199 1580895 1182411 20385 -556007 -177325 178732 31346 283092
38448 283092 1642662 3246695 3657705 2582937 1016600 148679 425879 1180290 1100578
38439 1100578 -305935 -1818306 -1910473 -843877 -150461 -134517 527563 2374791 3977592
38430 3977592 3910099 2571462 1247031 568963 714425 1902170 3691848 4797826 4555819
38421 4555819 3697152 2905172 1702746 -269557 -1951931 -2023787 -617848 1076792 2176754
38412 2176754 2304483 1403733 216202 -66500 558871 796089 346772 684492 2370430
38403 2370430 3498401 2613951 1358007 1809812 2738567 1473891 -1414293 -2545420 -633549
38394 -633549 2125857 3785796 4765306 5619651 5569523 4364848 3191563 2542385 1390623
38385 1390623 -345347 -798143 901914 2819495 3127304 2892491 3925066 5581027 6134341
38376 6134341 6057375 7239020 9563731 10947963 10769581 10794501 12154373 13460555 12864395
38367 12864395 10535936 8105539 6633908 6036906 5862445 5820799 5814569 5901682 6060231
38358 6060231 5908938 5088581 4007026 3598767 4019289 4099075 2652597 163008 -1361261
38349 -1361261 -424632 2242577 4311196 4295745 3058030 2499080 3068417 3423581 2649417
38340 2649417 1713165 1964949 3012341 3232951 2087563 777822 564866 1448138 2726789
38331 2726789 3877717 4368195 3467775 1173114 -1011812 -1176668 866823 3105071 3379070
38322 3379070 1691808 27858 -89358 737961 971341 482737 728941 2442717 4171042
38313 4171042 3894967 1533261 -1106531 -2602040 -3082778 -3067778 -2317848 -549319 1442445
38304 1442445 2347394 1893212 1084372 817729 889556 643082 101116 -36214 647515 1760136
38294 1760136 2559019 2646585 2185430 1686184 1609879 1882075 1739204 432718 -1710580
38285 -1710580 -3266700 -3055785 -1302050 733638 1957016 2058596 1429278 935110 1354956
38276 1354956 2460182 3026251 2375534 1416703 1301635 1607393 1136943 176431 251186
38267 251186 1476380 1992829 747146 -902093 -1456798 -1516204 -2173739 -2607374 -1420634
38258 -1420634 421812 412663 -1797702 -3739008 -3559295 -2136221 -1087832 -607945 -406507
38249 -406507 -1090202 -2926318 -4313511 -3350620 -560937 1551424 1638801 826032 720429
38240 720429 1400776 1926043 1873654 1626469 1672937 2268672 3434506 4692101 5044531 3854192
38230 3854192 1708089 -131935 -1174261 -2008714 -2992353 -3340379 -2212844 -327251 482459
38221 482459 -497164 -1868456 -1880166 -626013 187815 -604440 -2404020 -3715686 -3593282
38212 -3593282 -2130213 -120516 1452761 1963564 1536254 822564 327684 130046 217833
38203 217833 695263 1468298 2039237 1942184 1348744 1056405 1743194 3117369 3870174 2847733
38193 2847733 456143 -1545213 -2042364 -1844458 -2283412 -3061767 -2666088 -801068 966110
38184 966110 1335362 712471 -140489 -1516988 -3624065 -5130770 -4557708 -2666750 -1765329
38175 -1765329 -2639414 -3778968 -3908107 -3620769 -3737361 -3501938 -1700221 1291413 3881190
38166 3881190 5228756 5684072 5623726 5125727 4747590 5333998 6706909 7574932 7198014
38157 7198014 6264506 5634784 5143737 4370950 3703757 3543195 3091432 1358485 -761953
38148 -761953 -968814 1395849 4033771 4332367 2490588 992122 1500828 3404379 5204305
38139 5204305 6108511 6006514 4958264 3373319 2067880 1480632 1190174 736371 530778
38130 530778 1263690 2619018 3384231 2965414 2133848 1967054 2550591 3123297 3142761 2741382
38120 2741382 2326185 2168073 2285670 2358273 1895805 944384 444790 1193796 2436957
38111 2436957 2380396 490131 -1555398 -1897957 -787492 74454 -111946 -797436 -1683196
38102 -1683196 -3171612 -4887843 -5266420 -3518209 -963576 590234 1007051 1351017 1979079
38093 1979079 2303125 2008723 1305120 222656 -1182707 -2156628 -2060290 -1777048 -2894807
38084 -2894807 -5272788 -6814477 -6142873 -4220817 -2652991 -1605258 -375531 933867
38076 933867 1498180 1060931 215103 -318969 -91769 931525 2034396 2142017 1214344
38067 1214344 582254 1122743 1891284 1651893 1006672 1479417 2852334 3179619 1677878
38058 1677878 -7567 -90177 1059032 1765528 1285469 231403 -647360 -1163758 -1429484
38049 -1429484 -1674104 -2278829 -3430314 -4713372 -5412554 -5230074 -4480689 -3652067 -2993408
38040 -2993408 -2466965 -1892418 -1137666 -272535 465547 855599 791221 286461 -447028 -1004938
38030 -1004938 -1113269 -939091 -872449 -1018180 -1101466 -844997 -273507 264665 233904 -698226
38020 -698226 -2127350 -2994723 -2561266 -1165736 195800 714051 -10998 -1872488 -3740230
38011 -3740230 -3800349 -1555681 922468 1047086 -1096331 -2933552 -2782569 -1552882 -745846
38002 -745846 -359326 361219 1348136 1966701 2019165 1591118 617034 -604939 -1199868 -817675
37992 -817675 -252527 -229263 -357543 -81318 193551 -144682 -835686 -1395838 -2036472 -2917848
37982 -2917848 -3330294 -2716863 -1657766 -746733 432705 1917960 2300229 860123 -529798
37973 -529798 36281 1118908 -89654 -3152072 -4992616 -4852670 -4973567 -5906647 -5159142
37964 -5159142 -2010089 177227 -1042185 -3117484 -2559744 -480306 -403023 -2334496 -3064348
37955 -3064348 -1638012 -546634 -1214569 -1843212 -779252 754214 701104 -957026 -2637836
37946 -2637836 -3164349 -2441824 -1169843 -440656 -713303 -1009812 -146876 1384639 2132186
37937 2132186 2012119 2109931 2234418 919410 -1699955 -3355211 -2954610 -2283983 -3105438
37928 -3105438 -4474683 -4500356 -3125487 -1462877 196211 1862292 2559866 1582540 187813
37919 187813 54138 659495 153771 -1605492 -2917304 -2962540 -2641152 -2551415 -2095978 -1097908
37909 -1097908 -542231 -888849 -1075004 -199684 870770 699814 -547118 -1213525 -297270
37900 -297270 1300861 1853974 763442 -859896 -1607565 -1464882 -1573392 -2350263 -2741729
37891 -2741729 -1830159 -290239 657423 1047131 1771956 2835071 3277691 2704561 1685202
37882 1685202 686935 -205244 -512499 355104 1736510 1870754 -6812 -2559802 -3808537
37873 -3808537 -3058085 -1170407 355425 421204 -797894 -1917514 -1960123 -1660979 -2152149
37864 -2152149 -2776298 -1872089 322636 1583990 1010376 332682 939608 1637373 895606
37855 895606 -451149 -703724 -143963 -164341 -466616 446233 2298704 2951485 1553500
37846 1553500 -282684 -1068269 -1416772 -2479815 -3754780 -3670068 -1737852 795992 2235568
37837 2235568 1934231 749636 188524 809690 1494492 746189 -1372289 -3202744 -3385923
37828 -3385923 -2161716 -733461 37295 186261 414259 1352651 2636013 2885070 1229429
37819 1229429 -1337042 -2877010 -2678832 -1721834 -1098934 -909014 -743066 -330913 427942
37810 427942 1242549 1235206 -64555 -1575683 -1770163 -1057934 -1540688 -3790907 -5419212
37801 -5419212 -4035431 -556517 1845002 1564526 70334 -250875 1263876 3177152
37793 3177152 3629159 2266502 610101 295613 1091394 1419193 821592 621969 1577171
37784 1577171 2265172 1021941 -1498064 -3154633 -3148217 -2534229 -2150504 -1489609 149908
37775 149908 2424141 4127445 4028834 1668401 -1973424 -4835400 -5592897 -4889358 -4080962
37766 -4080962 -3366357 -2259935 -1289570 -1597860 -2998540 -4051608 -4181875 -4165827 -4335804
37757 -4335804 -3985846 -2955211 -2062844 -1381814 63401 2000535 2301228 99392 -2278047
37748 -2278047 -2376327 -1124296 -1031078 -1991169 -1602276 670135 2400313 1746122 -208250
37739 -208250 -1482527 -1678648 -1430678 -982150 -474354 -410616 -714372 -381563 873192
37730 873192 1676346 870971 -653466 -1343208 -1301706 -1622356 -2048181 -1240375 655392
37721 655392 1611569 445677 -1543059 -2458155 -2173881 -1880998 -2118344 -2364157 -2235397
37712 -2235397 -2108466 -2455056 -3114534 -3400926 -2771284 -1396117 -71873 613434 964460
37703 964460 1683442 2783709 3576548 3775677 3859287 4046034 3690963 2269234 368067
37694 368067 -954191 -1371214 -1264337 -971805 -773688 -1190203 -2372038 -3347405 -2782581
37685 -2782581 -607399 1779217 3039080 3115398 2907251 3239701 4187364 4998358 4748123
37676 4748123 3431145 2144465 1737581 1751885 1412990 1075366 1502783 2116006 1499817
37667 1499817 -330597 -1797968 -2231479 -2776941 -4131742 -5033212 -4152523 -2109947 -272834
37658 -272834 1226941 2744891 3503379 2604735 968104 281273 399643 -181856 -1396838
37649 -1396838 -1371931 480459 2254943 2310759 1415928 992783 803941 -141873 -1538538
37640 -1538538 -2265289 -2245840 -2295840 -2479547 -2069275 -1094999 -646489 -1375943 -2633628 -3388509
37630 -3388509 -3323662 -2773007 -2136166 -1626531 -1232070 -738636 -11421 719958 1058307 867601
37620 867601 360838 -60672 42534 744688 1294974 698974 -753763 -1274255 245105
37611 245105 2446905 3115256 2210114 1782222 2761176 3507236 2342869 120233 -1025929
37602 -1025929 -622329 -101517 -471813 -1203319 -1566034 -1803991 -2438930 -3290866 -3868421
37593 -3868421 -4196930 -4610762 -5028629 -5011240 -4399842 -3459323 -2511485 -1814349 -1644949 -2021491
37583 -2021491 -2394943 -2103542 -1195171 -399477 -249813 -641072 -1230288 -1698966 -1562650
37574 -1562650 -486263 894155 1260403 296719 -644473 -334044 560375 522643 -553061
37565 -553061 -1461291 -1698127 -1791711 -1634087 -331316 1719779 2456510 1040288 -386833
37556 -386833 598630 3351580 5256643 5375398 5016259 5039702 4743936 3693705 2736658
37547 2736658 2517372 2496014 2190735 2070758 2409593 2461892 1691007 773307 476799 522570
37537 522570 462334 626467 1124029 993055 -267522 -1269442 -518924 1021485 1004714
37528 1004714 -973530 -3003154 -3758177 -3796475 -3716598 -3091179 -1961538 -1431961 -1644177
37519 -1644177 -945622 1404560 3257893 2290168 -359398 -1417450 651 1495806
37511 1495806 1126928 -210800 -898529 -1090030 -1712221 -2345172 -1823640 -395434 286981
37502 286981 -639029 -2204884 -2996219 -2726424 -2065668 -1509144 -929650 -67283 916175
37493 916175 1490668 1338524 795239 530089 732249 834421 198616 -1096696 -2282049
37484 -2282049 -2507035 -1358995 796996 2681991 2754336 650295 -2123129 -3545165 -3220598
37475 -3220598 -2641653 -3144852 -4182433 -4141230 -2583575 -943433 -752042 -1689440 -2012955
37466 -2012955 -817997 879627 1673779 1685638 2101447 3137435 3650870 3040868 2445642
37457 2445642 3310051 5446093 7306838 7741811 6766180 5018321 3279208 2279367 2194396
37448 2194396 2409999 2284331 1815898 1079437 -279442 -2077629 -2883102 -1655227 374035
37439 374035 1059566 346892 107370 943559 1252321 64664 -1232126 -1114333 -132882
37430 -132882 388465 329660 33425 -913989 -2442345 -2865406 -1037032 1332885 1718793
37421 1718793 479688 178416 1480345 2168655 526316 -2470763 -4888798 -5883588 -5404095
37412 -5404095 -3620428 -1432861 -64015 551365 1601131 3193210 4041537 3935054 4441609
37403 4441609 6023514 6558369 4495491 1706914 959197 1829712 1703711 194970 -148190
37394 -148190 2217475 5485198 6862333 5640402 3136248 918241 -49275 456392 1672030
37385 1672030 2321689 2031457 1843555 2822813 4584738 5697044 5231933 3521508 1610185
37376 1610185 282787 -492539 -1306369 -2375878 -2960782 -2123688 -126626 1448532 1317233
37367 1317233 -33306 -833758 46764 1875679 2800294 1744697 -513390 -2156478 -2022156
37358 -2022156 -331684 1907173 3595411 3762030 2055967 -510432 -2014622 -1477251
37350 -1477251 136732 1222162 1284428 848433 328747 -107935 -46198 767078 1738235
37341 1738235 2117116 2222658 3008473 4456341 5387346 4992976 3713073 2464558 1752392
37332 1752392 1606174 1617738 1006680 -499521 -1803975 -1445542 319711 1455504 602460
37323 602460 -1265032 -2171648 -1428200 -28364 702955 333603 -459941 -579331 295303
37314 295303 1137040 706400 -757652 -1717190 -1312605 -310460 201222 212648 440671
37305 440671 1272402 2487046 3446634 3308826 1778862 -89091 -698274 134261 939638
37296 939638 702153 136622 293192 1034756 1734316 2386225 2974628 2764489 1510730
37287 1510730 500386 876529 1561703 569679 -1885775 -3397614 -2668868 -1156109 -865097
37278 -865097 -1914659 -3107991 -3777105 -3957666 -3449410 -1975129 -181758 580064 -151994
37269 -151994 -1227542 -1288291 -530601 -324901 -1083725 -1447105 -191890 1827022 2738287
37260 2738287 2246314 1784652 2097242 2236089 1433501 396375 -192582 -1046649 -2836752
37251 -2836752 -4490167 -4471113 -3068970 -1943740 -1902578 -2506226 -3367315 -4328038 -4685110
37242 -4685110 -3742140 -1956194 -255790 1309032 2729546 2577370 -342354 -4044792
37234 -4044792 -4690407 -1510743 1909604 2294505 504747 -627639 -323089 162857 212427
37225 212427 420748 1063758 1630329 1620344 709028 -1355112 -3921156 -5147494 -3822887
37216 -3822887 -1046648 1054678 1793066 1917750 1772163 1036424 62029 -208246 147395
37207 147395 -78424 -1361715 -2726006 -3319482 -3535025 -3934858 -4102219 -3427484 -2313642
37198 -2313642 -1638427 -1367062 -608030 935807 2278114 2244036 976261 -25739 490469
37189 490469 2033758 2811931 1800020 -2594 -784818 -153537 453982 -357980 -2253583
37180 -2253583 -3703321 -3828386 -3153962 -2555413 -2059586 -1168626 -107535 31249 -1287842
37171 -1287842 -3062714 -3806062 -3233445 -2246030 -1560831 -1222168 -1238148 -1567801 -1449627
37162 -1449627 -37452 1949025 2538699 1118285 -550246 -779898 -133971 14430 -161132
37153 -161132 357995 1300678 1535172 1105822 945078 843820 -272169 -2003998 -2492084
37144 -2492084 -1198465 257743 703173 975205 1980148 3012106 3259473 3361043 3957198
37135 3957198 4123532 3004005 1789429 2022229 2824298 2139058 291411 -240276 1199515
37126 1199515 2230067 1075655 -828297 -1316961 -770568 -984212 -1954669 -2013835 -784492
37117 -784492 131894 -260203 -862333 -400421 472834 146839 -1550368 -3075472 -3168579
37108 -3168579 -2251473 -1646333 -1957184 -2556955 -2478259 -1540381 -524202 -292217 -888766
37099 -888766 -1644185 -2030699 -2110737 -2162010 -2251506 -2324743 -2376109 -2303214 -1845427 -900053 252092
37088 252092 1135204 1310384 522569 -876306 -1652960 -638228 1693023 3348311 3083718
37079 3083718 1828728 1164733 1174402 811075 -268199 -1514624 -2654008 -3574256 -3334174
$$ [...]
##END NTUPLES=NMR SPECTRUM
##END=
