##TITLE=31Pdec_LR-688B-1(R)
 , 24 sc
 29.7.2019
##JCAMPDX= 6.0         $$ Bruker NMR JCAMP-DX V2.0
##DATA TYPE= NMR SPECTRUM
##DATA CLASS= NTUPLES
##ORIGIN= UXNMR, Bruker Analytische Messtechnik GmbH
##OWNER= root
$$ XWIN-NMR		Version 3.5
$$ Mon Jul 29 16:22:56 2019 Russian Standard Time (UT+4h)  she@DPX200
##.OBSERVE FREQUENCY= 81.014009
##.OBSERVE NUCLEUS= ^31P
##.ACQUISITION MODE= SIMULTANEOUS
##.ACQUISITION SCHEME= undefined
##.AVERAGES= 24
##.DIGITISER RES= 16
##SPECTROMETER/DATA SYSTEM= spect
##.PULSE SEQUENCE= zgpg30
##.SOLVENT NAME= CDCl3
##.SHIFT REFERENCE= (INTERNAL, CDCl3, 0, 250.885)
##AUDIT TRAIL= $$ (NUMBER, WHEN, WHO, WHERE, WHAT)
$$ ##TITLE= Audit trail, XWIN-NMR		Version 3.5
$$ ##JCAMPDX= 5.01
$$ ##ORIGIN= Bruker BioSpin GmbH
$$ ##OWNER= she
$$ F:/spectra/data/she/nmr/P31/1/pdata/1/auditp.txt
$$ ##AUDIT TRAIL=  $$ (NUMBER, WHEN, WHO, WHERE, WHAT)
(   1,<2019-07-29 16:21:51.50 +0400>,<she>,<DPX200>,
      <created by zg, POWCHK disabled, PULCHK disabled
       configuration hash MD5:
       00 E9 B6 7A A2 85 ED C7 34 08 36 98 17 FE 4E 26
       data hash MD5: 32K
       BA 26 7F ED 98 B7 CF 71 F2 60 82 86 FE 68 FF 26>)
(   2,<2019-07-29 16:21:54.31 +0400>,<she>,<DPX200>,
      <Start of raw data processing
       efp BC_mod = 2 LB = 1 FT_mod = 6 PKNL = 1 PHC0 = -578.7606 PHC1 = 130.4 SI = 64K 
       data hash MD5: 64K
       CC 86 2D 08 4B 2D 46 26 91 23 8B BF 0B 22 A6 1B>)
(   3,<2019-07-29 16:22:17.85 +0400>,<she>,<DPX200>,
      <pk PHC0 = 8.42009 PHC1 = -19 
       data hash MD5: 64K
       73 4C AA 79 30 53 A1 0B 23 57 D8 D3 46 51 11 58>)
(   4,<2019-07-29 16:22:21.65 +0400>,<she>,<DPX200>,
      <abs ABSG = 5 
       data hash MD5: 64K
       47 86 DF 73 C9 81 53 E8 0D E7 CF 16 60 7E AF F0>)
$$ ##END=
$$ 
$$ hash MD5
$$ 77 EB 80 B2 20 2B 08 9F C2 0F 9D 02 02 4C 36 C4
##$RELAX= 
##$RELAX= 
##$RELAX= 
##$RELAX= 
##$RELAX= 
##$RELAX= 
##$RELAX= 
##$RELAX= 
$$ Bruker specific parameters
$$ --------------------------
##$DU= <F:/spectra>
##$EXPNO= 1
##$NAME= <P31>
##$PROCNO= 1
##$TYPE= <nmr>
##$USER= <she>
##$AMP= (0..31)
100 100 100 100 100 100 100 100 100 100 100 100 100 100 100 100 100 100 
100 100 100 100 100 100 100 100 100 100 100 100 100 100 
##$AQSEQ= 0
##$AQ_mod= 1
##$AUNM= <au_zg>
##$AUTOPOS= <>
##$BF1= 81.014009
##$BF2= 200.13
##$BF3= 200.13
##$BF4= 200.13
##$BF5= 200.13
##$BF6= 200.13
##$BF7= 200.13
##$BF8= 200.13
##$BYTORDA= 1
##$CFDGTYP= 0
##$CFRGTYP= 5
##$CHEMSTR= <none>
##$CNST= (0..31)
1 1 145 1 1 1 1 1 1 1 1 1 1 1 1 1 1 1 1 1 1 1 1 1 1 1 1 1 1 1 1 1 
##$CPDPRG= <waltz16>
##$CPDPRG1= <>
##$CPDPRG2= <waltz16>
##$CPDPRG3= <>
##$CPDPRG4= <mlev>
##$CPDPRG5= <mlev>
##$CPDPRG6= <mlev>
##$CPDPRG7= <mlev>
##$CPDPRG8= <mlev>
##$CPDPRGB= <>
##$CPDPRGT= <>
##$D= (0..31)
0 1 0 0 0 0 0 0 0 0 0 0.03 2e-05 3e-06 0 0 0 0 0 0 0 0 0 0 0 0 0 0 0 0 
0 0 
##$DATE= 1564402910
##$DBL= (0..7)
120 120 120 11 120 120 24 19 
##$DBP= (0..7)
150 150 150 150 150 150 150 150 
##$DBP07= 0
##$DBPNAM0= <>
##$DBPNAM1= <>
##$DBPNAM2= <>
$$ [...]
##$SUBNAM3= <"">
##$SUBNAM4= <"">
##$SUBNAM5= <"">
##$SUBNAM6= <"">
##$SUBNAM7= <"">
##$SUBNAM8= <"">
##$SUBNAM9= <"">
##$SW= 501.770088973933
##$SWIBOX= (0..15)
0 1 3 0 0 0 0 0 0 0 0 0 0 0 0 0 
##$SW_h= 40650.406504065
##$TD= 32768
##$TD0= 1
##$TE= 0
##$TE2= 300
##$TE3= 300
##$TEG= 300
##$TL= (0..7)
0 120 53 12 22 120 120 120 
##$TP= (0..7)
150 150 150 150 150 150 150 150 
##$TP07= 0
##$TPNAME0= <>
##$TPNAME1= <>
##$TPNAME2= <>
##$TPNAME3= <>
##$TPNAME4= <>
##$TPNAME5= <>
##$TPNAME6= <>
##$TPNAME7= <>
##$TPOAL= (0..7)
0.5 0.5 0.5 0.5 0.5 0.5 0.5 0.5 
##$TPOFFS= (0..7)
0 0 0 0 0 0 0 0 
##$TUNHIN= 0
##$TUNHOUT= 0
##$TUNXOUT= 0
##$USERA1= <user>
##$USERA2= <user>
##$USERA3= <user>
##$USERA4= <user>
##$USERA5= <user>
##$V9= 5
##$VALIST= <valist>
##$VCLIST= <CCCCCCCCCCCCCCC>
##$VD= 0
##$VDLIST= <DDDDDDDDDDDDDDD>
##$VPLIST= <PPPPPPPPPPPPPPP>
##$VTLIST= <TTTTTTTTTTTTTTT>
##$WBST= 1024
##$WBSW= 4
##$XGAIN= (0..3)
0 0 0 0 
##$XL= 0
##$YL= 0
##$YMAX_a= 31745
##$YMIN_a= -42980
##$ZGOPTNS= <>
##$ZL1= 120
##$ZL2= 120
##$ZL3= 120
##$ZL4= 120
##$ABSF1= 250.885
##$ABSF2= -250.8851
##$ABSG= 5
##$ABSL= 3
##$ALPHA= 0
##$AQORDER= 0
##$ASSFAC= 0
##$ASSFACI= 0
##$ASSFACX= 0
##$ASSWID= 0
##$AUNMP= <proc_1d>
##$AZFE= 0.1
##$AZFW= 0.5
##$BCFW= 0
##$BC_mod= 2
##$BYTORDP= 0
##$COROFFS= 0
##$CY= -3
##$DATMOD= 1
##$DC= 0
##$DFILT= <>
##$DTYPP= 0
##$F1P= 0
##$F2P= 0
##$FCOR= 1
##$FTSIZE= 65536
##$FT_mod= 6
##$GAMMA= 0
##$GB= 0
##$INTBC= 1
##$INTSCL= 5.30512e-09
##$ISEN= 30
##$LB= 1
##$LEV0= 0
##$LPBIN= 0
##$MAXI= 10000
##$MC2= 0
##$MEAN= 0
##$ME_mod= 0
##$MI= 50
##$NCOEF= 0
##$NC_proc= -5
##$NLEV= 6
##$NOISF1= 182.463
##$NOISF2= 159.3651
##$NSP= 0
##$NTH_PI= 0
##$NZP= 0
##$OFFSET= 250.885
##$PC= 4
##$PHC0= -570.3405
##$PHC1= 111.4
##$PH_mod= 1
##$PKNL= yes
##$PPARMOD= 0
##$PSCAL= 0
##$PSIGN= 0
##$REVERSE= no
##$SF= 81.0140089999434
##$SI= 65536
##$SIGF1= 159.3651
##$SIGF2= -187.1042
##$SINO= 113.3802
##$SIOLD= 16384
##$SREGLST= <1H.CDCl3>
##$SSB= 0
##$STSI= 65536
##$STSR= 0
##$SW_p= 40650.406504065
##$SYMM= 0
##$S_DEV= 0
##$TDeff= 32768
##$TDoff= 0
##$TI= <>
##$TILT= no
##$TM1= 0
##$TM2= 0
##$TOPLEV= 0
##$USERP1= <user>
##$USERP2= <user>
##$USERP3= <user>
##$USERP4= <user>
##$USERP5= <user>
##$WDW= 1
##$XDIM= 65536
##$YMAX_p= 449870340
##$YMIN_p= -18220231
$$ End of Bruker specific parameters
$$ ---------------------------------
##NTUPLES= NMR SPECTRUM
##VAR_NAME=  FREQUENCY,     SPECTRUM/REAL,   SPECTRUM/IMAG
##SYMBOL=    X,             R,               I
##VAR_TYPE=  INDEPENDENT,   DEPENDENT,       DEPENDENT
##VAR_FORM=  AFFN,          ASDF,            ASDF
##VAR_DIM=   65536,         65536,           65536
##UNITS=     HZ,            ARBITRARY UNITS, ARBITRARY UNITS
##FACTOR=    0.620285442955139, 1,           1
##FIRST=     20325.1992029276, 0,            0
##LAST=      -20325.2073011374, 0,           0
##MIN=       -20325.2073011374, -18220231,   0
##MAX=       20325.1992029276, 449870340,    0
$$ Real data points
##PAGE= N=1
##DATA TABLE= (X++(R..R)), XYDATA
$$ [...]
44243A321100l21795j43192k98087k6928N69321L54735n43504n15657P34159J398233
$$ 1321100 999305 856113 558026 531098 1100419 1455154 911650 395993 1130152 2528385
44233B528385M33460r25414j435976j494372j514828q24602O32958J493087J069694
$$ 2528385 2961845 2036431 600455 -893917 -2408745 -3233347 -2600389 -1107302 -37608
44224c7608L93756J51525l38877j083913p33327P65126J333145J62356o34208
$$ -37608 356148 507673 168796 -915117 -1648444 -883318 449827 612183 -22025
44215b2025L35267J124410j27359j714555j239202K37715K29671p46808l67305
$$ -22025 313242 1437652 1310293 -404262 -1643464 -1405749 -1176078 -1922886 -2290191
44206b290191J083880J199816k32864r54346j57787N52329K75813p4821m3892
$$ -2290191 -1206311 -6495 -239359 -1193705 -1351492 -799163 -523350 -598171 -642063
44197f42063k43608l96309N37532J894363J663222j37434j087389j45307P60039
$$ -642063 -885671 -1281980 -744448 1149915 2813137 2675703 1588314 1443007 2203046
44188B203046k6757j396814j533576n07085N14275J032458J002291K71452o78901
$$ 2203046 2176289 779475 -754101 -1261186 -746911 285547 1287838 1559290 880389
44179H80389p21591K42488Q23527J77878p47211q10098k84851m4935k42219n51344
$$ 880389 158798 401286 1224813 1402691 655480 -154618 -439469 -484404 -726623 -1277967
44169a277967p59958n96597M0180M52731j7247m75738N14394K252770K327446
$$ -1277967 -2037925 -2634522 -2594342 -2141611 -2158858 -2634596 -2120202 132568 2460014
44160B460014K57167j563793j479593p76822r35646j040503J43983J520594J369650
$$ 2460014 2717181 1153388 -326205 -1103027 -2038673 -3079176 -2935193 -1414599 -44949
44151d4949K23659k52526n5736k31486m83791J89673J157763Q63859m74379j138790
$$ -44949 178710 -73816 -129552 -361038 -844829 -655156 502607 1366466 892087 -246703
44141b46703p17304m60366q40216q93123k33766K69818K52498M72514J157660
$$ -246703 -964007 -1424373 -2264589 -3157712 -3391478 -3121660 -2869162 -2396648 -1238988
44132a238988J393099P78635K01172K77033L68218j27845o98876o72809k50889
$$ -1238988 154111 932746 1133918 1410951 1779169 1651324 952448 279639 28750
44123B8750P6596K49802K26211k25575p71018m98005P03957J622549J254901R2565
$$ 28750 105346 355148 581359 355784 -415234 -913239 -209282 1413267 2668168 2760733
44113B760733p58969r66169p81439k56438M66774O53885k34760j482759j703941
$$ 2760733 2001764 1035595 254156 -2282 464492 1118377 883617 -599142 -2303083
44104b303083n15195R76385J467298Q48221J29967J48075N95443N71571k6985
$$ -2303083 -2818278 -1841893 -374595 473626 603593 751668 1347111 1918682 1891697
44095A891697k98018J94458N49304p3813r11556o77772K94019N12846k42063o77809
$$ 1891697 1593679 1788137 2337441 2263628 1352072 674300 968319 1481165 1239102 561293
44085E61293l16782j95324p05248o83446L60184R78611J76048o12532K34060J640651
$$ 561293 244511 49187 -656061 -1339507 -979323 -712 175336 -437196 -203136 1437515
44075A437515J382625l34477j206202m61546J74826n37000j478183j099172K78931
$$ 1437515 2820140 2485663 1279461 817915 992741 455741 -1022442 -2121614 -1842683
44066a842683J095095O29501l43165o03468J66992R45953N16592p00320q13760
$$ -1842683 -747588 -118087 -461252 -1064720 -897728 48225 564817 -135503 -949263
44057i49263P65222J908143O82806j394830j321010P69364J735887L01181j214088
$$ -949263 -184041 1724102 2406908 1012078 -308932 460432 2196319 2497500 1283412
44048A283412q69602J15650P7187k64576K59244P47031M2245p46581j17006R11393
$$ 1283412 413810 529460 606647 342071 601315 1348346 1390591 644010 527004 1438397
44038A438397M72379p48114o81623M44481O60132q6991o2952O75792K81178j057704
$$ 1438397 1910776 1162662 481039 925520 1585652 1498661 1435709 2111501 2392679 1334975
44028A334975q93750J011496J634455l58610k083102j074322O97804L11571j249947
$$ 1334975 441225 1452721 3087176 2728566 645464 -428858 268946 580517 -669430
44019f69430j142443L55510O52736m32913n38653R34823J886860J173470Q3794
$$ -669430 -1811873 -1456363 -803627 -1236540 -1775193 -840370 1046490 2219960 2303754
44010B303754l75174p85329j203353n56714Q71126J084732k42705p26353P91985
$$ 2303754 1928580 1143251 -60102 -616816 254310 1339042 1096337 369984 1161969
44001A161969J951774O80834j204970j024231J97582l74615k219315k104418L57221
$$ 1161969 3113743 3794577 2589607 1565376 1762958 1388343 -830972 -2935390 -2578169
43992b578169J764183L51200j275656n47124J003200N83465j179793j411392L51746
$$ -2578169 -813986 -462786 -1738442 -2285566 -1282366 -698901 -1878694 -3290086 -2938340
43983b938340J703849J310440N19830N73031O31086k76294j155044m94526J174605
$$ -2938340 -1234491 75949 595779 1168810 1799896 1523602 368558 -125968 1048637
43974A048637J774237M84658j209307j473314k87637P52707M19490p90733j360557
$$ 1048637 2822874 3307532 2098225 624911 337274 1089981 1509471 718738 -641819
43965f41819o54286K60360K3125j086183j392095j25584J376920J374200Q593
$$ -641819 -1296105 -1035745 -1012620 -2098803 -3490898 -3616482 -2239562 -865362 -856769
43956h56769r60310m59880P40724J253354O87995k54095p50387n12821J86132
$$ -856769 -1817079 -2276959 -1536235 -282881 405114 151019 -599368 -1112189 -926057
43947i26057P26771N42392l27949j110415r88167L6905J141814J545127J169027
$$ -926057 -199286 343106 15157 -1095258 -2083425 -2046520 -904706 640421 1809448
43938A809448M10125m08789j050789j097899k99837P23914Q25217j96545j068488
$$ 1809448 2219573 1810784 759995 -337904 -637741 86173 911390 714845 -353643
43929c53643o76667L06952M13909l52361n44161L80498J162300P05168l58808
$$ -353643 -1030310 -723358 -309449 -661810 -1205971 -825473 336827 1041995 683187
43920F83187q59198p14874m37994n3669M01686K84491n03512p00616N12368J756371
$$ 683187 -176011 -890885 -1328879 -1382548 -980862 -696371 -1199883 -1900499 -1388131 368240
43910C68240J248906l27668p83044J39899N28271m71210j484187j387892p55084
$$ 368240 1617146 1289478 506434 646333 1174604 703394 -780793 -2168685 -2923769
43901b923769j62826P68709J744323J375574l64965j323352l12028Q45265J96409
$$ -2923769 -3086595 -2317886 -573563 802011 437046 -886306 -1198334 -353069 -156660
43892a56660j211558j222606o2171N04633L70055P90169J545637J099344n14071
$$ -156660 -1368218 -2590824 -2652995 -2148362 -1778307 -988138 557499 1656843 1142772
43883A142772j436298q66776l3907P0753m7190J48739L00039K35778M00521P17322
$$ 1142772 -293526 -1160302 -1194209 -1123456 -1170646 -1021907 -721868 -486090 -85569 631753
43873F31753M82177k35171n39896l21773l48346n49355l1719Q57120N60380r17256
$$ 631753 1113930 878759 338863 17090 -331256 -880611 -912330 -55210 505170 -412086
43863d12086j438959k2100J392602R26883l73701m84113L73407N62130j5758m4105
$$ -412086 -1851045 -1873145 -480543 446340 72639 -411474 -38067 524063 508305 464200
43853D64200O52686P68575k73988j407404j436520l88662P49358R56563P4531
$$ 464200 1116886 1885461 1611473 204069 -1232451 -1621113 -871755 84808 159339
43844A59339p25092n2758J556608J778999k27982k096758j416857O40076J052156
$$ 159339 -565753 -618511 938097 2717096 2489114 392356 -1024501 -384425 667731
43835F67731n55565j724852j196380l79660l88507k39963R17974J954766J574922
$$ 667731 112166 -1612686 -2809066 -3188726 -3577233 -3817196 -2899222 -944456 630466
43826F30466L93857k41873k75668m12695o00405m07524j24084j89631j91042L25296
$$ 630466 1024323 782450 506782 94087 -506318 -913842 -1037926 -1227557 -1418599 -1093303
43816a093303O70586J40r72871p22093P53847J738351J121758k77301j050487
$$ -1093303 -422717 -422577 -1395448 -2117541 -1363694 374657 1496415 1219114 168627
43807A68627q31344j28182N93031J027353Q42072M8180p46762r86794q55868q70700
$$ 168627 -662717 -790899 -197868 829485 1671557 1719737 972975 -13819 -869687 -1740387
43797a740387r89298o62786K32974J030571J057301M75460N0791K25308O94510
$$ -1740387 -2729685 -3392471 -3159497 -2128926 -1071625 -596165 -545374 -320066 374444
43788C74444Q75456N45218n1394n39780p28354o55186m13985K7240P09305J296931
$$ 374444 1249900 1795118 1743724 1203944 475590 -179596 -593581 -566341 142964 1439895
43778A439895J092551j32869j450149j571241n07021K70921k40051j159161r87427
$$ 1439895 2532446 2399577 949428 -621813 -1128834 -857913 -1097964 -2257125 -3244552
43769c244552K14305R47701M52531l39611l01730L90030Q18294O94578M50986
$$ -3244552 -3030247 -2082546 -1630015 -1969626 -2271356 -1881326 -1063032 -368454 82532
43760H2532L44064J87013j12236l08845j81527K13050O65963R08498O14793l01024
$$ 82532 426596 613609 501373 192528 11001 224051 890014 1798512 2413305 2112281
43750B112281j280206j392947l44777R74577J342384N90370k72244m35049k67064
$$ 2112281 832075 -560872 -905649 68928 1411312 2001682 1729438 1294389 1027325
43741A027325n20653j052750j109027o48145m00032n14019k25508O92971J218521
$$ 1027325 506672 -546078 -1655105 -2303250 -2703282 -3217301 -3442809 -2749838 -1531317
43732a531317O24574j57666J74723J261316J574915O43543m78013q85341p65561
$$ -1531317 -906743 -1064409 -889686 371630 1946545 2590088 2112075 1226734 461173
43723D61173n55090l02368j46365m05607q14988n69442M55156J300084J155182
$$ 461173 -93917 -396285 -542650 -948257 -1763245 -2332687 -1877531 -577447 577735
43714E77735L38012k92009l05349J29110M49139l63j166961j844412r71560O60699
$$ 577735 915747 623738 318389 447499 896638 896275 -270686 -2115098 -3086658 -2425959
43704b425959J193237K73148n59413l21030K02566K66005M23885R80600Q86404
$$ -2425959 -1232722 -959574 -1518987 -1840017 -1637451 -1371446 -947561 33039 919443
43695I19443m13593j508823j058526l9636j13174q10727m53842Q49295J385055
$$ 919443 505850 -1002973 -2061499 -2101135 -2214309 -3025036 -3478878 -2629583 -1244528
43686a244528P06088J13984K48738K90369j51813l04682J28643L54522R0602J44958
$$ -1244528 -538440 -424456 -175718 114651 -37162 -341844 -213201 141321 231923 376881
43676C76881P49048Q95069J24868n11006k32677P6532o06325j595972j415364
$$ 376881 1125929 2020998 2145866 1634860 1402183 1478715 872390 -723582 -2138946
43667b138946Q4247J564862J791270O83302q43844j610183j139520j55559L48314
$$ -2138946 -2054699 -489837 1301433 1984735 1140891 -469292 -1608812 -1764371 -1416057
43658a416057M44817Q22767J190598N31194q94791j439729n21771M31625K91395
$$ -1416057 -971240 -148473 1042125 1573319 678528 -761201 -1282972 -851347 -559952
43649e59952j47011R6999M23762O555m94683j51758M58402L21111j85871j63603
$$ -559952 -706963 -609964 -186202 -179647 -674330 -826088 -367686 -46575 -232446 -396049
43639c96049O5219k12605m64308M8742M89107k42090j190266o50425P83051J002431
$$ -396049 -330830 -543435 -1007743 -959001 -469894 -711984 -1902250 -2552675 -1769624 -767193
43629g67193m3756k94080P72627J257743K55167o13277j81419L00913l00609q11052
$$ -767193 -810949 -1105029 -332402 925341 1180508 567231 385812 686725 386116 -424936
43619d24936K0147J001181M19415q98387p80046Q24688J783537R11792p17116
$$ -424936 -404789 596392 1015807 117420 -662626 162062 1945599 2857391 2140275
43610B140275j594496j377549n43420L21170O86358M19848N2031J00459L28553
$$ 2140275 545779 -831770 -1375190 -1054020 -367662 52186 104217 204676 533229
43601E33229K47342o5965l05377n44752p61130m07984O25028J315428Q41280o0556
$$ 533229 780571 714606 409229 -135523 -896653 -1304637 -679609 635819 1477099 1416543
43591A416543k59320l6879k97712o59541j21558P80093N25488p01006r91982K25955
$$ 1416543 1157223 1120344 822632 163091 41533 821626 1347114 646108 -345874 -119919
43581a19919J174948N29057o53310q56058k99448N9765K82479P49791Q78106R9333
$$ -119919 1055029 1584086 930776 74718 -224730 -164965 117514 867305 1745411 1844744
43571A844744p35036m88557L58633M63304k18287n58259k26523J0999j63813k69950
$$ 1844744 1109708 621151 979784 1443088 1224801 666542 440019 451018 287205 17255
43561A7255k28488m61025o77916o3317J037865J142488r4878j058386m42856Q93508
$$ 17255 -211233 -672258 -1350174 -1413491 -375626 766862 671984 -386402 -829258 64250
43551F4250J333747P06645k7737m38253p27710p66941k89123K57122J86366k64442
$$ 64250 1397997 2104642 2076905 1638652 910942 144001 -145122 112000 298366 33924
43541C3924k68026K54630O10812N18039L05200L3904n06255r41056o04726J79815
$$ 33924 -234102 20528 631340 1149379 1454579 1488483 982228 41172 -563554 -383739
43531c83739K95014m21288q13892k23620N41394O51100M78165N59866M61595k56091
$$ -383739 -88725 -510013 -1323905 -1547525 -1006131 -355031 123134 683000 1144595 888504
43521H88504q63180m69577M63788Q17382M67342Q4132j75668n15082n32650J76401
$$ 888504 25324 -444253 19535 836917 1304259 1388391 1212723 697641 164991 341392
43511C41392Q13512K77713r40253j323769o52805p4782P6898N60364J122639L90941
$$ 341392 1154904 1432617 492364 -831405 -1484210 -1558992 -1482094 -921730 200909 591850
43501E91850j403846j928062k81462J160969L02589j216299n70246J638288K249031
$$ 591850 -811996 -2740058 -3021520 -1860551 -1557962 -2774261 -3344507 -1706219 542812
43492E42812M76587j025446l38780J158607J339431K72275o68928j021400j119613
$$ 542812 1019399 -6047 -344827 813780 2153211 2425486 1756558 735158 -384455
43483c84455q61270j3837Q42029Q65164J67548l69276k62552J99300M84301K34212
$$ -384455 -1245725 -1259562 -417533 447631 615179 245903 -16649 182651 666952 901164
43473I01164n21640j167286r25932J13896Q75443O39720k0196j95479K9955l6608
$$ 901164 379524 -787762 -1713694 -1599798 -724355 -84635 -104831 -300310 -270355 -306963
43463c06963l90456l21233L60822R12941O74488o3125m81301k29830K44848K81627
$$ -306963 -697419 -1018652 -657830 255111 929599 866474 385173 155343 400191 681818
43453F81818k14649o60405n28866l8179J92266M6681l6383Q0666P548l21759l16838
$$ 681818 467169 -193236 -722102 -760281 -568015 -521334 -557717 -477051 -469503 -791262 -1108100
43442a108100K55005O05204K6914q16539o30190O36138J550237J004844m18100
$$ -1108100 -853095 -247891 -220977 -1037516 -1667706 -1031568 518669 1523513 1105413
43433A105413j233574q26139o6030j71150j124056j507698k33808J795003K523385
$$ 1105413 -128161 -954300 -1020330 -1191480 -2315536 -3823234 -4057042 -2262039 261346
43424B61346J365954k0177j46306K44968l18620j410483j345983j12514L94584
$$ 261346 1627300 1607123 1460817 1705785 1387165 -23318 -1369301 -1481815 -1087231
43415a087231n41893j139001L8839J587155J283461m86261j304904l26825P15623
$$ -1087231 -1629124 -2768125 -2729286 -1142131 141330 -344931 -1649835 -1976660 -1261037
43406a261037L68434n15547m63007L11181N39158J2780l00524N2892M60813M36975
$$ -1261037 -892603 -1408150 -1871157 -1559976 -1020818 -1008038 -1308562 -1255670 -794857 -357882
43396c57882K74002K06118j22167q04137j054882k13423J098109J617937J019849
$$ -357882 -83880 122238 71 -804066 -1858948 -2072371 -974262 643675 1663524
43387A663524R2903n05464q25958r12108m41834N13828J114072P14455k67062
$$ 1663524 1756427 1250963 425005 -487103 -928937 -415109 698963 1413418 1146356
43378A146356r71203j137944r62413l77321P16043J709923J645636M29101r23961
$$ 1146356 175153 -962791 -1925204 -2302525 -1586482 123441 1769077 2198178 1274217
43369A274217j407142r29477o8498N49478N27721q9251o66293m86641L61635R76061
$$ 1274217 -132925 -1062402 -1130900 -581422 -53701 -142952 -809245 -1295886 -934251 41810
43359D1810P11213q5046n91133m44304L5828K92339M5713m48791o30910k99128
$$ 41810 753023 667977 76844 -367460 -331632 -39293 6420 -442371 -1073281 -1372409
43349a372409J13187K12903K63091N83198P36934J95460m92834l61363K80113
$$ -1372409 -1259222 -1046319 -783228 -200030 536904 732364 239530 -121833 158280
43340A58280K56411k67889J97728J639281J742467o78793l218605k854436j69399
$$ 158280 414691 146802 344530 1983811 3726278 3047485 -171120 -3025556 -3194955
43331c194955J664969J343496L87576k0737m74371j242929j272146k32025N24647
$$ -3194955 -1529986 -186490 201086 180349 -294022 -1536951 -2809097 -3041122 -2516475
43322b516475J91855j07007N95602J310718Q20519k27681n28484k29225k21598
$$ -2516475 -2324620 -2431627 -1836025 -525307 295212 67531 -460953 -690178 -911776
43313i11776l50344K995M27624K82712J90978R23712J530661O33493r46812j148750
$$ -911776 -1262120 -1259125 -831501 -548789 -357811 565901 2096562 2730055 1783243 634493
43303F34493n1184J93130r53039j404614j2599J347504P71675o17603n90732O50488
$$ 634493 583309 776439 -176600 -1581214 -1593813 -246309 525366 -92237 -682969 -32481
43293c2481J071813J65177n34099j66073K65303j24031n98057j89026N52848L61867
$$ -32481 1039332 1204509 670410 504337 769640 645609 47552 -141474 411374 773241
43283G73241p02320j196528l85394N72530J69505j252701j824447o88030Q45569
$$ 773241 70921 -1125607 -1511001 -938471 -768966 -2021667 -3846114 -4534144 -3688575
43274c688575J219761P15823N65958P52379K39691q37958r95435K08742J230208
$$ -3688575 -2468814 -1752991 -1187033 -434654 -194963 -1032921 -2028356 -1819614 -589406
43265e89406Q20199j36482j87363M14508M02091k81822m90343J50600O91468M21964
$$ -589406 230793 94311 -93052 321456 723547 441725 -48618 101982 793450 1215414
43255A215414j54458k59494P2168K73844R7686k06338l03787j06991K17850M56159
$$ 1215414 1060956 801462 873630 1147474 1245160 1038822 735035 628044 845894 1302053
43245A302053N16469L53636j22215p73659j031298m83760L75590O44693K86799
$$ 1302053 1818522 2172158 2049943 1276284 244986 -238774 136816 781509 1068308
43236A068308J23309M37648N49714R3386l50536m34859p45547j524223j764160
$$ 1068308 1191617 1629265 2178979 2272365 1921829 1486970 741423 -782800 -2546960
43227b546960o60558R00765J490851J083695O60360N21243L21352K49708O89720
$$ -2546960 -3207518 -2306753 -815902 267793 928153 1449396 1770748 2020456 2710176
43218B710176J005818J96309j288526j836348r44549R8956R2213o47762j057873
$$ 2710176 3715994 3912303 2623777 787429 -157120 -58164 34049 -613713 -1671586
43209a671586o00231M95643J440237J232919l04402j771112j453085M84546K028953
$$ -1671586 -2271817 -1776174 -335937 896982 592580 -1178532 -2631617 -2147071 -118118
43200a18118J757860K99727r07299j330535j309560j064087m19012O65920J614817
$$ -118118 1639742 1939469 1032170 -298365 -1607925 -2672012 -3091024 -2425104 -810287
43191h10287J447825j30886j791651j605306M51119K045064J456272j45815p00593
$$ -810287 637538 506652 -1284999 -2890305 -2439186 -394122 1062150 916335 215742
43182B15742k91234k84104n10507J96961J240508Q49889o08787q47765M09428
$$ 215742 -75492 -359596 -870103 -673142 567366 1417255 808468 -39297 370131
43173C70131P26682q87045k108463j084304O53416R84300M99605P40919J175272
$$ 370131 1096813 209768 -1898695 -2982999 -2329583 -1345283 -845678 -104759 1070513
43164A070513M80289o55735o07069L37255N90758l0264m41883m64083p03469q11701
$$ 1070513 1550802 895067 287998 625253 1216011 1185747 743864 279781 -423688 -1235389
43154a235389O698J108415J059159n4736q11391p20731n32607n25783k66192J10694
$$ -1235389 -1228691 -120276 938883 884147 72756 -647975 -1180582 -1706365 -1972557 -1861863
43144a861863P2748o5919K95964O13889P2545n82059r8693Q23902M60477p89676
$$ -1861863 -1789115 -1855034 -1559070 -945181 -872636 -1454695 -1553388 -729486 -269009 -1058685
43134a058685p84199O74217J300526J43388p77591J58680J585179J497328K28965
$$ -1058685 -1842884 -1168667 131859 275247 -502344 -343664 1241515 2738843 2967808
43125B967808o22410o82635n21307j44051N79427R35211L21083n62759p55652
$$ 2967808 2345398 1662763 1141456 997405 1576832 2512043 2833126 2270367 1514715
43116A514715n32584o82747j046989r60379m83378p5038L16214P91712Q48337
$$ 1514715 982131 299384 -747605 -1707984 -2191362 -2266400 -1950186 -1158474 -310137
43107c10137K74285n1226N31543J060066K52724j288569j683065m27140R22270
$$ -310137 -35852 -87078 444465 1504531 1757255 468686 -1214379 -1641519 -719249
43098g19249Q50507l71962j253195p11907Q86746J912601J020506j062195j999833
$$ -719249 131258 -240704 -1493899 -2205806 -1319060 593541 1614047 551852 -1447981
43089a447981p63495Q70029Q19865l05517l61865Q78962J493920N29899p26437
$$ -1447981 -2211476 -1341447 -521582 -827099 -1188964 -310002 1183918 1713817 987380
43080I87380j012557p20261n19434p1433Q30633J266978N71803m00235o09854
$$ 987380 -25177 -745438 -1264872 -1336305 -505672 761306 1333109 932874 323020
43071C23020m34248o17603n77821N90278K033000J903171Q8359j560690j870279
$$ 323020 -111228 -728831 -1306652 -716374 1316626 3219797 3308156 1747466 -122813
43062a22813j499561j082232q2378J524916K128557O33406j381858j500395J13213
$$ -122813 -1622374 -2704606 -2786984 -1262068 866489 1499895 118037 -1382358 -1269145
43053a269145J036176K07739p52106k98016Q04344J011030L24382k58582n90494
$$ -1269145 -232969 -25230 -777336 -1075352 -271008 740022 1064404 805822 215328
43044B15328j108021j313558k16122J737740K703588J785592J25342q50135j151143
$$ 215328 -892693 -2206251 -2422373 -684633 2018955 3804547 3929889 3079754 1928611
43035A928611j466543j659146j115635r8151M11032J78111M9688N76911J117485
$$ 1928611 462068 -1197078 -2312713 -2410864 -1999832 -1821721 -1772033 -1195122 -77637
43026g7637Q10213r7338n58268j56063M30781M50288k0664m48539o18315o03669
$$ -77637 732576 635238 76970 -79093 351688 801976 781312 332773 -285542 -889211
43016h89211l36353K17915O56533N45199J55749J46751N09957N69620J28946k30415
$$ -889211 -1225564 -1007649 -351116 194083 349832 496583 1006540 1576160 1705106 1474691
43006A474691k62219n24458j194161j348240k98857J071302J357317N53658j58616
$$ 1474691 1212472 688014 -506147 -1854387 -2153244 -1081942 275375 829033 670417
42997F70417k53354l17690o90346p87831j12503Q98958J421917J115225K40721
$$ 670417 417063 99373 -590973 -1378804 -1491307 -592349 829568 1944793 2185514
42988B185514o31170r43992o19366j99669j28785r5619L42187P79847M45152n02489
$$ 2185514 1554344 610352 -9014 -208683 -337468 -433087 -90900 688947 1134099 631610
42978F31610j098162r78080o73335m35525J16491Q83408R54037j0601r78457q61281
$$ 631610 -466552 -1444632 -2117967 -2553492 -2437001 -1553593 -599556 -610157 -1588614 -2449895
42968b449895M9749O71398N99142K68786N5269n9602j03739M879K19196L50575
$$ -2449895 -2400146 -1728748 -1129606 -860820 -805551 -865153 -968892 -964013 -744817 -394242
42958c94242K49789j41585p08872j008660n29228O45703J675232J702971O59425
$$ -394242 -144453 -286038 -994910 -2003570 -2532798 -1887095 -211863 1491108 2150533
42949B150533p06443j412272r42180K84318J138779Q11304l70177j366638j493734
$$ 2150533 1444090 31818 -910362 -626044 512735 1324039 953862 -412776 -1906510
42940a906510p67586M38212J502744J636183O11174o96090j183728q18030l81016
$$ -1906510 -2674096 -2235884 -733140 903043 1514217 818127 -365601 -1183631 -1564647
42931a564647j75636J47772O26238Q07125N52631J97704n1650j39373J41508O03472
$$ -1564647 -1740283 -1592511 -966273 -159148 393483 591187 539537 400164 541672 1145144
42921A145144L25083r45917j659262m14615J412691J170017r91990k039899n98521
$$ 1145144 1470227 524310 -1134952 -1549567 -136876 1033141 41151 -1998748 -2597269
42912b597269J043295O79184n21939l52223P62912P59978n82918j476053r18250
$$ -2597269 -1553974 -874790 -1396729 -1748952 -986040 -226062 -808980 -2285033 -3203283
42903c203283K65216J011422J125837Q34640L59425n2935l06068m16926q7811
$$ -3203283 -2938067 -1926645 -800808 33832 393257 340322 34254 -382672 -470483
42894d70483Q69712J519714O27670j058429j210586N26245J553557L17553j068157
$$ -470483 399229 1918943 2546613 1488184 277598 803843 2357400 2674953 1606796
42885A606796l56010R53583K34709j562631j445748M31782J030589l60954j110120
$$ 1606796 1250786 2204369 2439078 876447 -569301 -137519 893070 532116 -578004
42876e78004M9474J045582L72987m46592J024M23674n37167j553547q81583N29473
$$ -578004 -528530 517052 890039 443447 444471 868145 330978 -1222569 -2104152 -1574679
42866a574679O72216j75088k12211O90882R62195Q1592p58915p11694k47300L9323
$$ -1574679 -902463 -1077551 -1289762 -598880 363315 444907 -314008 -1025702 -1273002 -1233679
42856a233679J66425J52955j38490l93861j01155M77333N23877m2135m10716j96290
$$ -1233679 -1067254 -914299 -1052789 -1446650 -1547805 -1070472 -546595 -588730 -999446 -1195736
42846a195736n432l30707o33003q9979J137718J911436J322092l41933j797386
$$ -1195736 -1201168 -1531875 -2164878 -2254857 -1117139 794297 2116389 1774456 -22930
42837b2930j873086n46454J019341J541607P97058k83517o93177m00684j89502
$$ -22930 -1896016 -2442470 -1423129 118478 915536 632019 -61158 -461842 -651344
42828f51344n11294q32518l81525P00862J453120J310315O82899K01581k3093
$$ -651344 -1162638 -1995156 -2376681 -1675819 -222699 1087616 1770515 1972096 1949003
42819A949003j13196J2838L42425M82624J18266n78776j268621j701449j473164
$$ 1949003 1835807 1848645 2191070 2673694 2791960 2213184 944563 -756886 -2230050
42810b230050k91205J149118J481955M81734l87582k3550P11377M78729m05856
$$ -2230050 -2521255 -1372137 109818 591552 203970 180420 891797 1370526 964670
42801I64670o60049j10533L49865L33248Q0837m74182j313157j490803k77913
$$ 964670 304621 194088 543953 877201 958038 483856 -829301 -2320104 -2598017
42792b598017J216034J217294j33783j008597n35213M02380Q75702P98516K27898
$$ -2598017 -1381983 -164689 -298472 -1307069 -1842282 -1439902 -564200 234316 462214
42783D62214o17585q46334j5368O70098J06700m67353O20489K040676J088806
$$ 462214 -155371 -1001705 -1017073 -346975 -240275 -707628 -87139 1953537 3042343
42774C042343j488792k029252J59607J448275j85652j884970r02467P95749J24128
$$ 3042343 1553551 -475701 -316094 1132181 946529 -938441 -1840908 -1045159 -921031
42765i21031j820975j767480L74713J878179J707297J187763R30388L38471k25288
$$ -921031 -2742006 -4509486 -4134773 -2256594 -549297 638466 1568854 1907325 1682037
42756A682037K25223R91559M47982j039196j553237q50130n05921q76610o46018
$$ 1682037 1907260 2898819 3346801 2307605 754368 -95762 -601683 -1478293 -2124311
42747b124311L46923N54465m25473r74288k23931O22197O38333O23553J115192
$$ -2124311 -1777388 -1222923 -1648396 -2622684 -2846615 -2224418 -1586085 -962532 152660
42738A52660J046216k48796j436011j069092K72342J073394R62264M86350r0004
$$ 152660 1198876 950080 -485931 -1555023 -1282681 -209287 752977 1239327 1149323
42729A149323n45798k60913P48745J220868K95264j000192j149824l37986R6835
$$ 1149323 603525 342612 1091357 2312225 2607489 1607297 457473 119487 216322
42720B16322j53586k04273K34293M03601q037k60590O7938K22813m49113j168434
$$ 216322 62736 -141537 92756 496357 488320 227730 295668 518481 69368 -1099066
42710a099066o90819P42375J516527Q39562j75694j77206M83565M13859o58698
$$ -1099066 -1789885 -1047510 469017 1308579 1132885 955679 1439244 1853103 1194405
42701A194405j539874j360850n68773J34484P14993J138282Q40983l00448j269850
$$ 1194405 -345469 -1706319 -2275092 -2140608 -1425615 -287333 553650 253202 -1016648
42692a016648j087167j32851N00022M74756K82217L18176O01079R89142J121441
$$ -1016648 -2103815 -2236666 -1736644 -1261888 -979671 -661495 -60416 928726 2050167
42683B050167O59403j981m4156L50422P328j202435j738065p70575L08790P5164
$$ 2050167 2709570 2707589 2663433 3013855 3021183 1818748 80683 -689892 -381102 -305938
42673c05938p31348p83333m11140l60969J01110J463656J891735j34242k333268
$$ -305938 -1037286 -1820619 -2231759 -2592728 -2491618 -1027962 863773 729531 -1603737
42664a603737j346974J725726K503231O0020j738818n06072J279645Q98605m56729
$$ -1603737 -2950711 -1224985 1278246 1338266 -400552 -906624 373021 1271626 814897
42655H14897n98798j18822l75632m54500P34889J571951K72770j447012p77715
$$ 814897 216099 97277 -278355 -732855 2034 1573985 1846755 399743 -377972
42646c77972J362839J592214m46168j551147j11553J604090J201385n43599j415185
$$ -377972 984867 2577081 2130913 579766 468213 2072303 3273688 2730089 1314904
42637A314904q00630K58751P19055K72592o32510j009620m15791J54269m10591
$$ 1314904 514274 773025 1492080 1764672 1132162 122542 -293249 -138980 -549571
42628e49571j307646p45326J052725J747888L57680j158652q64500L71769N77338
$$ -549571 -1857217 -2602543 -1549818 198070 555750 -602902 -1467402 -1095633 -518295
42619e18295k30014n18375J9098K24428k37136l10329L64430N71061l53559r64351
$$ -518295 -748309 -1266684 -1247586 -1023158 -1260294 -1570623 -1206193 -635132 -988691 -1953042
42609a953042K19751J966708J604818r80500k672744j336932J072466J301644
$$ -1953042 -1733291 233417 1838235 857735 -1815009 -3151941 -2079475 -777831
42601g77831n41423j434403j29266J237440P79401l72145l27019N22471O35395
$$ -777831 -1319254 -2753657 -2882923 -1645483 -866082 -1238227 -1565246 -1042775 -407380
42592d07380J17318K06178P34535L35515r84937j523000m24499J089707J522886
$$ -407380 -290062 -83884 650651 986166 1229 -1521771 -1946270 -856563 666323
42583F66323Q25851j44019p57709p10214O0649J013557J261541N96679k78074
$$ 666323 1492174 1348155 590446 -119768 -59119 954438 2215979 2812658 2534584
42574B534584p06999o82513m39860j43932m7389k82247m76862k45396P3952l2121
$$ 2534584 1827585 1145072 705212 561280 513891 231644 -245218 -490614 -416662 -448783
42564d48783j95625K92194J045325R52086L871o04257l80342j05172j84692j6011
$$ -448783 -644408 -352214 693111 1645197 1649068 1044811 664469 559297 374605 358594
42554C58594M52511K33305p34742q67689N07421J523839M72216j272877j249970
$$ 358594 811105 1044410 309668 -558021 -50600 1473239 1945455 672578 -577392
42545e77392J40253L15527j175034j857747l81175J306266J110828o5990j56769
$$ -577392 -437139 -121612 -1296646 -3154393 -3535568 -2229302 -1118474 -1184464 -1341233
42536a341233P00964P75508j83933p12653k36662J37894k85504o65593j90189
$$ -1341233 -640269 135239 -48694 -761347 -998009 -860115 -1145619 -1811212 -2001401
42527b001401O34088J009543J031497J038115P30301j80695j183108j631809j548821
$$ -2001401 -1367313 -357770 673727 1711842 2442143 2261448 1078340 -553469 -2102290
42518b102290j067376O3930J524343J928756O01233r10161o75793P33964J018319
$$ -2102290 -3169666 -3105736 -1581393 347363 948596 38435 -637358 96606 1114925
42509A114925l20767j218893k85542J094993R44628m47087j173009m18795P04388
$$ 1114925 794158 -424735 -710277 384716 1329344 882257 -290752 -709547 -5159
42500e159P50425m42440j635099j413135K15510J547515J131509k89334q56249
$$ -5159 745266 302826 -1332273 -2745408 -2529898 -982383 149126 -140208 -996457
42491i96457l20863n8717l80015J5792J295424J552762o4367j466480p34700P29847
$$ -996457 -1317320 -1376037 -1756052 -1740260 -444836 1107926 1043559 -422921 -1157621 -427774
42481d27774M41639j222363j843672p76106M39721R26105J215823J378831P89341
$$ -427774 13865 -1208498 -3052170 -3828276 -3388555 -2462450 -1246627 132204 921545
42472I21545k04915n10045k15189l10460o16000j50309N74914P7797j176675j027941
$$ 921545 716630 206585 -8604 -319064 -935064 -1085373 -510459 -432662 -1609337 -2637278
42462b637278P35035J661047M56913j028765q77749J46354M06710k4804k00012
$$ -2637278 -1902243 -241196 215717 -813048 -1690797 -1544443 -1137733 -1162537 -1362549
42453a362549r2629l5966K71715Q55606Q50109j0632o12963k84822K7968m56362
$$ -1362549 -1455178 -1491144 -1219429 -363823 486286 475654 -137309 -422131 -394163 -850525
42443h50525q96203l86392M89588R09613J121688J280862O28895q03281j416990
$$ -850525 -1746728 -2133120 -1643532 -733919 387769 1668631 2297526 1494245 77255
42434G7255n09180K66498m01222j192299n39610N73630N06010r9253J63914N89683
$$ 77255 -431925 -165427 -566649 -1758948 -2298558 -1724928 -1218918 -1318171 -1154257 -564574
42424e64574j59256j067536l24992J210182J282381J33073j53256M40768N9537
$$ -564574 -723830 -1791366 -2116358 -906176 376205 509278 356022 796790 856327
42415H56327j243356j448320l07188L51005K38586R49156K252980J818398m65086
$$ 856327 -387029 -1835349 -2142537 -1791532 -1552946 -603790 1649190 3467588 3002502
42406C002502j614785l42187Q56389N8246j083567p30817k62k95644m37123Q10730
$$ 3002502 1387717 1045530 1901919 1960165 876598 145781 145519 -150125 -587248 223482
42396B23482J868495R21517o92372n98586P82444J305290N53603m02817j306475
$$ 223482 2091977 3013494 2321122 1722536 2504980 3810270 4363873 3961056 2654581
42387B654581k184288j924822m9697J437815P08864p43090n05427O37858L41957
$$ 2654581 470293 -1454529 -1504226 -66411 642453 -100637 -606064 31794 373751
42378C73751q02337l08374J365609J251526p97111j485103L87223J812894N08627
$$ 373751 -428586 -736960 628649 1880175 1083064 -402039 -14816 1798078 2306705
42369B306705j626484j941009q75789j82162J47586Q30713J236621O98072K31737
$$ 2306705 680221 -1260788 -2136577 -2318739 -2171153 -1340440 -103819 594253 825990
42360H25990P90241J257293K86307j194213j442438o96115l42112l36662K48933
$$ 825990 1616231 2873524 3159831 1965618 523180 -172935 -515047 -851709 -602776
42351f02776R10585L74498q41177r32493J94635P34041p644o25043j76160L44573
$$ -602776 307809 682307 -158870 -1091363 -896728 -162687 -170331 -795374 -971534 -626961
42341f26961k700m32452L6572P66135N79529k85670o57566k71633J39687K69225
$$ -626961 -629661 -1062113 -1025541 -259406 320123 34453 -623113 -894746 -755059 -485834
42331d85834N16287Q68149O25766m20252j352936j175836n9144Q89991Q61769
$$ -485834 30453 898602 1524368 1104116 -248820 -1424656 -1483800 -593809 267960
42322B67960M1419p20860o58051L04625J382221J523850N06295o89087r56401
$$ 267960 309379 -411481 -1069532 -764907 617314 2141164 2647459 1958372 1001971
42313A001971l82178J0295k56693n75663l35034J97942M61766M23560K99890J5792
$$ 1001971 619793 630088 373395 -202268 -537302 -339360 122406 545966 845856 861648
42303H61648m49995o58180l04879J83290K95147K40941M25217O07098L95346R1296
$$ 861648 411653 -246527 -551406 -368116 -72969 167972 593189 1200287 1595633 1686929
42293A686929J35590K29906K0940N1944P69857J205045K49752j210654j337213
$$ 1686929 1822519 2052425 2073365 2125309 2895166 4100211 4349963 3139309 1802096
42284A802096k66077J33328n67154q21968j17798J22221n08086l06018J241960
$$ 1802096 1536019 1669347 1102193 280225 162427 284648 -223438 -529456 712504
42275G12504J823391M7853j716894r74588O26468P371j954701j689435J060326
$$ 712504 2535895 2583748 866854 -107734 518734 526105 -1428596 -3118031 -2057705
42266b057705K615560J159372o91228l89160Q09455N75417o48295q99331l8200
$$ -2057705 557855 1717227 1025999 636839 1446294 2021711 1373416 474085 435885
42257D35885N26611L95542L10268L24031k21879j082996j146259k34490M48282
$$ 435885 962496 1358038 1668306 1992337 1770458 687462 -458797 -693287 -245005
42248b45005O3609o27903l44818R17140J781940J182396k93445j149100r17889
$$ -245005 -181396 -809299 -1154117 -236977 1544963 2727359 2433914 1284814 366925
42239C66925o26099j046669j389759n68326R45703J701973J282319M87570j66048
$$ 366925 -259174 -1305843 -2695602 -3263928 -2318225 -616252 666067 1153637 987589
42230I87589p65874j022708m72991L73753N80513M11044P80718J222220M45797
$$ 987589 221715 -800993 -1273984 -900231 -319718 91326 872044 2094264 2540061
42221B540061j010024j131690J03659L45291j074432j659751k2107J343884J26757
$$ 2540061 1530037 398347 502006 847297 -227135 -1886886 -1908993 -565109 -438352
42212d38352j576634n04874K166626K427754k16871k073461j070487N92831N89137
$$ -438352 -2014986 -2519860 -353234 2074520 1857649 -215812 -1286299 -693468 -104331
42203a04331j23548K65179J189086J015048j01946o83014k95634J73922J09811
$$ -104331 -227879 37300 1226386 2241434 2139488 1456474 1160840 1334762 1444573
42194A444573j70924r6658N02054J171348J073415l9684j156245j156019m59755
$$ 1444573 1273649 1176991 1679045 2850393 3923808 3884124 2727879 1571860 1112105
42185A112105l23555o60571k34738Q72403J019765j68134q54937L0204R22144
$$ 1112105 788550 127979 -106759 765644 1785409 1617275 762338 792542 1714686
42176A714686K96639o65654j76360Q88044L25185j623140k472298j274199K88227
$$ 1714686 2011325 1345671 1169311 2057355 2382540 759400 -1712898 -2987097 -2698870
42167b698870Q58672J126243J821674K047149Q86239p53035j310509p18818j26137
$$ -2698870 -1840198 -713955 1107719 3154868 4041107 3288072 1977563 1258745 1132608
42158A132608o3789p8506J12926K15003J12679J47399M26408N15142J50088j63441
$$ 1132608 1068819 990313 1103239 1318242 1430921 1578320 2004728 2519870 2669958 2506517
42148B506517L11204J493910K298006J690625o5351j473505j403507n16322n33004
$$ 2506517 2817721 4311631 6609637 8300262 8234911 6761406 5357899 4841577 4308573
42139D308573j872084k730427j326767J349822K326085M74275j774720j566855
$$ 4308573 2436489 -293938 -1620705 -270883 2055202 2529477 754757 -812098
42131h12098N45564J531180K09591j344975j126658M1210K63578m43766o50019
$$ -812098 -266534 1264646 1474237 129262 -997396 -956186 -692608 -1136374 -1786393
42122a786393q9277J24860m31584q90799n96560J78057J056337J807449J798364
$$ -1786393 -1875670 -1750810 -2182394 -3073193 -3669753 -3491696 -2435359 -627910 1170454
42113A170454O00328q10912r44828n893L67965k64100o17669j73233r7536q38667
$$ 1170454 1770782 959870 15042 9149 377114 113014 -504655 -677888 -775424 -1614091
42103a614091r55875L10397J318572O45685l58864J93176J386292R32313r42483
$$ -1614091 -2569966 -2259569 -940997 -295312 -654176 -461000 925292 1857605 915122
42094I15122j719402m41406J137167J411212P37617K4485n07988o29038P1870
$$ 915122 -804280 -1245686 -108519 1302693 2040310 2064795 1556807 927769 999639
42085I99639J027018R12707l43308j200177p58283K5731O6926k63233j35265L19498
$$ 999639 2026657 2939364 2596056 1395879 637596 663327 730253 467020 331755 651253
42075F51253N12690M09360K11250j90799p44162r35454n59504r7270J13763K97514
$$ 651253 1163943 1573303 1784553 1593754 849592 -85862 -645366 -742636 -628873 -331359
42065c31359M74617K55553j79013P174Q58670J252590O34252r9221k52409m99537
$$ -331359 143258 398811 219798 226972 1085642 2338232 2972484 2873263 2620854 2121317
42055B121317j254661j249786N78190K727058K620548J59854k002188j839242
$$ 2121317 866656 -383130 195060 2922118 5542666 5702520 3700332 1861090
42047A861090j13894J116126Q71645l33215j436946j581219n39374J043815K087561
$$ 1861090 1747196 2863322 3734967 3401752 1964806 383587 -155787 888028 2975589
42038B975589K033977J266624N56020K54600N9445m25764q31074j08490J895216
$$ 2975589 5009566 6276190 6832210 7086810 7146255 6720491 5889417 5780927 7676143
42029G676143L367323K376133j08453p49237J838865N029626N757318M460590
$$ 7676143 11043466 13419599 13311146 12561909 14400774 19430400 25187718 29648308
42021B9648308L483625K952061J000949k393850m752466m690772l674481l342598
$$ 29648308 33131933 36083994 37084943 34691093 29938627 25247855 21573374 18230776
42013A8230776l272075k541048j619770j301140j215469q11632o11122j128385
$$ 18230776 14958701 12417653 10797883 9496743 8281274 7469642 6858520 5730135
42005E730135j612069j224898n25623m20026n56933k06930J62879j74084m82117
$$ 5730135 4118066 2893168 2367545 1947519 1390586 1183656 1346535 1172451 690334
41996F90334L49159J540706J316965j42910q30304j54094J96188p20121j415692
$$ 690334 1039493 2580199 3897164 3754254 2923950 2769856 2966044 2245923 830231
41987H30231n41661P64083P49391j57339l06651L84488O09540J33430M7223N92254
$$ 830231 288570 1052653 1802044 1644705 1338054 1722542 2332082 2465512 2512735 3104989
41977C104989O50973j94091p86787k88307M71057M23588j21940l39919m17408
$$ 3104989 3755962 3561871 2775084 2486777 2957834 3381422 3259482 2919563 2502155
41968B502155j002289j719119j510384k72538R16647J205864P62499J59469k45444
$$ 2502155 1499866 -219253 -1729637 -2002175 -1085528 120336 882835 1042304 796860
41959G96860k55373J36714N40042N34931K84825K74761N22006O32131N15844L67992
$$ 796860 541487 678201 1218243 1753174 2037999 2312760 2834766 3466897 3982741 4350733
41949D350733P8330n15656r11563m86855K37349N5431r73830j306557j49137J320493
$$ 4350733 4429063 3913407 3001844 2514989 2752338 2807769 1833939 527382 378245 1698738
41939A698738J705496J203632P34119L49658k73050o41838j45113O25406O13902
$$ 1698738 3404234 4607866 5341985 5691643 5418593 4776755 4631642 5257048 5870950
41930E870950k5666l09469j41369k55608o49387n64147n6936j00474q52529j222854
$$ 5870950 5845284 5535815 5394446 5138838 4489451 3925304 3868368 3767894 2915365 1692511
41920A692511o17525J33531J50702k95429n66915o45139o55063k59348P21171
$$ 1692511 1074986 1208517 1359219 1063790 496875 -148264 -803327 -1062675 -341504
41911c41504J674846J814138J045324n9014o95534k30824J081770J843535J006249
$$ -341504 1333342 3147480 4192804 4133790 3438256 3207432 4289202 6132737 7138986
41902G138986m12882m80147P07913J018016k90078j222879k95571R46342M76458
$$ 7138986 6726104 6245957 6953870 7971886 7681808 6458929 6163358 7109700 7586158
41893G586158q48213q01435M95578R48236k91q12812o98921n25100o47350k41008
$$ 7586158 6737945 5936510 6432088 7380324 7380033 6567221 5868300 5343200 4695850 4454842
41883D454842O11218M43068j020599j845126o98824R96774J114713l25805j716799
$$ 4454842 5066060 5509128 4488529 2643403 1944579 2941353 4056066 3730261 2013462
41874B013462k114373j585384l43518J040939J411308M02185o38226l80921N66912
$$ 2013462 -100911 -1686295 -2029813 -988874 422434 824619 186393 -194528 372384
41865C72384Q08636M08445L98300P09498M36865k09950j55502M43488L28034m85899
$$ 372384 1181020 1589465 1987765 2697263 3134128 2924178 2768676 3212164 3540198 3054299
41855C054299n10848N47628R98347o1322j117639o81947L42630L65993k22665
$$ 3054299 2543451 3091079 4089426 4028104 2910465 2228518 2571148 2937141 2714476
41846B714476l3168O83324N40202l37730m33668L63441L08090j244230k417566
$$ 2714476 2681308 3364632 3904834 3567104 3133436 3496877 3804967 2560737 143171
41837A43171j489154N41111J478474R79681M74598N95758L96040p27319j771744
$$ 143171 -1345983 -804872 673602 1653283 2127881 2723639 3119679 2392360 620616
41828F20616j500124k29260O10563L96631k550L92728J211650J213708Q2841r74579
$$ 620616 -879508 -1108768 -498205 -101574 -104124 288604 1500254 2713962 2796803 1822224
41818A822224p92984J70151N63812J29021r2957L97762P12180J32937n74538l98527
$$ 1822224 1029240 1199391 1763203 1892224 1799267 2197029 2909209 3042146 2467608 2069081
41808B069081K07492J29392m12853j79646Q91444J404483P61103J45191M67975
$$ 2069081 2276573 2405965 1993112 1813466 2704910 4109393 4870496 5015687 5483662
41799E483662P19852l60241j944044k028554l42635J185625J013271k24357r18707
$$ 5483662 6203514 5843273 3899229 1870675 1528040 2713665 3726936 3502579 2583872
41790B583872m96670L50942P54269L85052m57048r97531n90469M43857R72066
$$ 2583872 2087202 2438144 3192413 3577465 3120417 2122886 1532417 1976274 2948340
41781B948340M19424m53418o12846j09469K91698M23251P27142J080739O76602
$$ 2948340 3367764 2914346 2301500 2192031 2483729 2906980 3634122 4714861 5391463
41772E391463o16767j676823j497616n08454J38068J22128M3952K54680M52078
$$ 5391463 4774696 3097873 1600257 1091803 1229871 1351999 1395951 1650631 2102709
41763B102709M08487L01372J71412k28004p78414q68016l08626K19894J43753
$$ 2102709 2511196 2812568 2983980 2755976 1977562 1109546 800920 1020814 1164567
41754A164567j28856N0342M09050J86170m86992n93689K45892J110354J023448
$$ 1164567 1035711 1086053 1495103 1681273 1194281 600592 846484 1956838 2980286
41745B980286K25432l07315j83811J07521J6013m35235p77279n54084K64059J075586
$$ 2980286 3205718 2898403 2714592 2822113 2838126 2402891 1625612 1071528 1335587 2411173
41735B411173J009716j49246j449908j577884l01381J159813J418640M14843o48828
$$ 2411173 3420889 3271643 1821735 243851 -57530 1102283 2520923 2935766 2286938
41726B286938q30984n10658o17020j124803j043249k6363Q61614O45615K7140
$$ 2286938 1455954 945296 328276 -796527 -1839776 -1866139 -1004525 -358910 -331770
41717c31770L88473J518062J694078K61210j237877j209679j38537M44744K02265
$$ -331770 56703 1574765 3268843 3530053 2292176 1082497 943960 1388704 1590969
41708A590969q1202j82926n66425j028924p33654K24326O51717Q2468m48653n3279
$$ 1590969 1509767 1326841 760416 -268508 -1002162 -777836 -126119 -43651 -492304 -545583
41698e45583O94421Q59425N91129N16104M75926j1305n50922l20587N03119Q77997
$$ -545583 148838 1008263 1599392 2115496 2591422 2580117 2029195 1708608 2211727 3089724
41688C089724M31939j38620k79408k12046j51686J53258O92247Q40883L09320
$$ 3089724 3521663 3383043 3103635 2891589 2739903 2893161 3585408 4426291 4735611
41679D735611k15656l8354M25262K43671n76808j021109m97306L06719L10631
$$ 4735611 4519955 4481601 4906863 5150534 4573726 3552617 3055311 3362030 3672661
41670C672661n49666j186594o47256P08203J555981J133481Q2935m76906l75689
$$ 3672661 3122995 1936401 1289145 1997348 3553329 4686810 4769745 4292839 3917150
41661C917150l22709n82102n44199J40155P79207N78713j45260l75295K28679
$$ 3917150 3594441 3012339 2468140 2608295 3387502 3966215 3820955 3445660 3674339
41652C674339R72927J055930L60657o12694j201652j050102m60905j40793l01870
$$ 3674339 4647266 5703196 6063853 5451159 4249507 3199405 2738500 2597707 2295837
41643B295837l21287K80475R13981O60640k98976q21664l76627K95677K89470
$$ 2295837 1974550 2255025 3169006 3829646 3530670 2709006 2332379 2628056 2917526
41634B917526l43170q44926o60508J31637R32740J036625K51028q26885j390728
$$ 2917526 2574356 1729430 1068922 1200559 2133299 3169924 3420952 2594067 1203339
41625A203339j166104l52716P49243J577621J347575Q5766q73308m68575M79858
$$ 1203339 37235 -315481 433762 2011383 3358958 3444724 2571416 2102841 2582699
41616B582699N20806o3389J27129Q95216N57114r35713j396387J08360J455816
$$ 2582699 3103505 3040116 3167245 4062461 4619575 3683862 2287475 2395835 3851651
41607C851651O64598j087486j500453n53017K01254L66901N06228L15660o30535
$$ 3851651 4516249 3428763 1928310 1375293 1576547 1943448 2449676 2765336 2134801
41598B134801j156217K9619J709685J571439r7117p69263L04202J154201N18121
$$ 2134801 978584 1008203 2717888 4289327 4192210 3422947 3727149 4881350 5399471
41589E399471m26119m65092j01309J811J82296M50473J3643r29475r06711L39827
$$ 5399471 4973352 4508260 4406951 4408762 4591058 5041531 5055174 4125699 3218988 3558815
41579C558815J104095N08869p0368L77399O76433j29128o99881K51384J412922
$$ 3558815 4662910 5171779 5101411 5478810 6155243 6026115 5326234 5577618 6990540
41570F990540R47274m44249r32935p18670j165352j764419q00127J328253K185787
$$ 6990540 7937814 7493565 6560630 5841960 4676608 2912189 2112062 3440315 5626102
41561E626102Q92112o96264q43183j9494M60065K96797J8644L3455L78046P11818
$$ 5626102 6518214 5821950 4978767 4959273 5419338 5716135 5734779 5768234 6146280 6858098
41551F858098N04932j28766j74997Q23342J658307J031618l47529p40529j6489
$$ 6858098 7363030 7234264 7059267 7882609 9540916 10572534 10225005 9484476 9467987
41542I467987L92338k7652k57206K30804N53226o19q55245j148099p66022l909
$$ 9467987 9860325 9832673 9575467 9806271 10359497 10358878 9503633 8355534 7589512 7585603
41532G585603Q49257J311337R94414L05211Q6085N04399J004889J188108R71038
$$ 7585603 8434860 9746197 10740611 11045822 11131907 11636306 12641195 13829303 14800341
41523A4800341K67503n65560n14802O98382J642201J028769o6936L92482K210725
$$ 14800341 15067844 14502284 13987482 14685864 16328065 17356834 17289898 17682380 19893105
41514A9893105L188432K473862J599180J899871K870433L612048M151770M670776
$$ 19893105 23081537 25555399 27154579 29054450 31924883 35536931 39688701 44359477
41506D4359477M943837N202763O287108Q451802J1156059J4220125J7956541K2205714
$$ 44359477 49303314 54506077 60793185 69244987 80401046 94621171 112577712 134783426
41498A34783426K6762205L2627820M0840028M9651431N4576457N1676795L9631322
$$ 134783426 161545631 194173451 235013479 284664910 339241367 390918162 430549484
41491D30549484J9320856n976602k9975060m6167016n2605245n2123107m7615288
$$ 430549484 449870340 443893738 413918678 367751662 315146417 263023310 215408022
41484B15408022l9881173l0567168k3353483j9974361j7863508j4172308r859819
$$ 215408022 175526849 144959681 121606198 101631837 83768329 69596021 59736202
41477E9736202p433332o815627o185725n230120m772461m413649l204108j769991
$$ 59736202 52302870 45487243 39301518 34071398 29298937 24885288 21681180 19911189
41469A9911189j365700j572627j139767l50803m00870j099922j277118q73569
$$ 19911189 18545489 16972862 15833095 15482292 15081422 13981500 12704382 11830813
41461A1830813o82057o15704j22042L14374n8891o42365m57379l4059m78736j391757
$$ 11830813 11148756 10533052 10411010 10725384 10666493 10024128 9566749 9532690 9053954 7662197
41451G662197j613100j287887j228689j021416J09780J285061J083581R5215N6517
$$ 7662197 6049097 4761210 3532521 2511105 2620885 3905946 4989527 5084742 5141259
41442E141259R01542J014212R5170n67190n07150m90424o09418j57105O38162
$$ 5141259 6042801 7057013 7152183 6584993 6077843 5587419 4978001 4820896 5459058
41433E459058Q02941M26720L24307K46707m57198r07610J17869J498854J040518
$$ 5459058 6261999 6688719 7013026 7259733 6802535 5894925 6012794 7511648 8552166
41424H552166p86335j355741j98241L72837n86869j124708j7363J104578O88117
$$ 8552166 7765831 6410090 6211849 6584686 5997817 4873109 4855746 5960324 6648441
41415F648441k71188k64376L68149N94754L80014m4454q60981j566716r99961
$$ 6648441 6377253 6112877 6481026 7075780 7455794 7411340 6550359 4983643 3983682
41406C983682N46949J122322J5559j073328p79825K6847J98563R7345J94225o5715
$$ 3983682 4530631 5652953 5668512 4595184 3815359 3842206 4040769 4138114 4332339 4266624
41396D266624o54647k69487J278863K008273P23969r01334r32281J8759M24183
$$ 4266624 3611977 3342490 4621353 6629626 7353595 6452261 5519980 5538739 5962922
41387E962922M42301Q28902R19748m8391r55571l89751Q70906J104536M08480
$$ 5962922 6405223 7234125 8153873 8105482 7149911 6760160 7631066 8735602 9144082
41378I144082J51534N47004Q08743R45175J392697J569161Q13055J70572J174204
$$ 9144082 9295616 9842620 10651363 11596538 12989235 14558396 15371451 15542023 16716227
41369A6716227L173135L856780K394398L98222k80116O03781J984406K550462
$$ 16716227 19889362 23746142 26140540 26538762 26258646 26862427 28846833 31397295
41361C1397295J694470K33035k66076M40798P21832n92012k446804l221351k933396
$$ 31397295 33091765 33324800 33058724 33499522 34221354 33629342 31182538 27961187 25027791
41352B5027791k512627k114138j631533j677337k423096k605726j378573j850
$$ 25027791 22515164 20401026 18769493 17092156 14669060 12063334 10684761 10682911
41344A0682911O5521m94884l82220k06423j168212k349541j925020k90624O12968
$$ 10682911 10748432 10253548 9871328 9664905 8496693 6147152 4222132 3931508 4544476
41335D544476M76062N17746P77253K55101o25779n26731O6301m84930j665632
$$ 4544476 5020538 5538284 6315537 6570638 5944859 5418128 5484429 4999499 3333867
41326C333867j295479M90103J042141l66143j197813R4770J565578J130868k74854
$$ 3333867 2038388 2528491 3570632 3204489 2006676 2101446 3667024 4797892 4523038
41317D523038p63195m21772k18009Q2174Q83881J249440L94561n97030m08030
$$ 4523038 3759843 3338071 3120062 3202236 4086117 5335557 5730118 5133088 4725058
41308D725058K99543J10161p01576q00634j44416R8574m00750p59253m41883P3537
$$ 4725058 5024601 5134762 4433186 3632552 3488136 3586710 3185960 2426707 1984824 2058361
41298B058361J95264j20549n56451o70896j64279O34003R13394L89308l24517
$$ 2058361 2253625 2133076 1576625 905729 741450 1375453 2288847 2678155 2353638
41289B353638o17599m76906N2318J053431J972292J715362J74329j260666j399197
$$ 2353638 1736039 1259133 1311451 2364882 4337174 6052536 6226865 4966199 3567002
41280C567002o27660L4390L42956N73980P17270O99391P10577P15383L93762r680
$$ 3567002 2939342 2973732 3316688 3890668 4607938 5307329 6017906 6733289 7127051 7117371
41270G117371J96872P35562L85397q82685j332040j21344J006858K64715j273824
$$ 7117371 7314243 8049805 8435202 7552517 6220477 6099133 7105991 7370706 6096882
41261F096882j267460K72362J120887K63660r25857j084254n71133k57819r0524
$$ 6096882 4829422 5101784 6222671 6486331 5560474 4476220 3905087 3647268 3556744
41252C556744L71322R52716J111618O79994j1701l97444n5285P16429Q90620p3110
$$ 3556744 3928066 4880782 5992400 6672394 6660693 6263249 6207964 6924393 7815013 7741903
41242G741903j245683j299427l52813L04631K62154M71545J373262J891735J142869
$$ 7741903 6496220 5196793 4843980 5148611 5410765 5882310 7255572 9147307 10290176
41233A0290176Q7914K68694J472264K024087J331113P41619J380976K338443K070143
$$ 10290176 10378090 10646784 12119048 14143135 15474248 16215867 17596843 19935286 22005429
41224B2005429Q68462M97068J461174K157701J301507j11382l27822N78533R78475
$$ 22005429 22873891 23370959 24832133 26989834 28291341 28179959 27852137 28430670 29409145
41215B9409145J11329j087220j502721j038390k49154K13315k40302j552580k582707
$$ 29409145 29520474 28433254 26930533 25892143 25642989 25856304 25616002 24063422 21480715
41206B1480715k241428j019898l38758n37640q12219r73504j568356k155801j448002
$$ 21480715 19239287 18219389 17880631 17342991 16530772 15557268 13988912 11833111 10385109
41197A0385109L01844J077210J29595q02039m72042j87507j179204j963721p21746
$$ 10385109 10686953 11764163 11893758 11091719 10619677 10432170 9252966 7289245 6567499
41188F567499J223156J112432q99031j968589q86063N97358R64272Q17758R15544
$$ 6567499 7790655 8903087 8004056 6035467 5149404 5746762 6711034 7528792 8444336
41179H444336P10752q9868n06575l9978K43587l44397o33501M50748J766371J545491
$$ 8444336 9155088 9065220 8558645 8518667 8762254 8417857 7784356 8235104 10001475 11546966
41169A1546966K06852k90205N40303J191601O57603k64267n55866l88765k51623
$$ 11546966 11753818 11463613 12003916 13195517 13853120 13588853 13032987 12644222 12392599
41160A2392599J30476J038830J770501J521462P93899P85823J526979J738387
$$ 12392599 12523075 13561905 15332406 16853868 17647767 18433590 19960569 21698956
41152B1698956O98937p62815j502407j377145q31925m9508P75055J107469R20777
$$ 21698956 22397893 21635078 20132671 18755526 17923601 17874093 18649148 19756617 20677394
41143B0677394J167046K330495L172003K323276P01533O20184K488296M196295
$$ 20677394 21844440 24174935 27346938 29670214 30371747 30991931 33480227 37676522
41135C7676522M218055L569688L861981N024799O191014P571848J0009260J3465520
$$ 37676522 41894577 45464265 49326246 54351045 60542059 68113907 78123167 91588687
41127I1588687J7282079K1389996K6129120L1300870L6206069L9827878M0038047
$$ 91588687 108870766 130260762 156389882 187690752 223896821 263724699 303762746
41120C03762746L3808771K0030524J764293j5805098k9395443l8374248m2365241
$$ 303762746 337571517 357602041 359366334 343561236 314165793 275791545 233426304
41113B33426304m0574870l3963697k6027938k0120809j6822680j4586157j2058767
$$ 233426304 192851434 158887737 132859799 112738990 95916310 81330153 69271386
41106F9271386r114048o413775m723651m237367m172178l521570k419890k017900
$$ 69271386 60157338 53743563 49019912 44782545 40610367 37088797 34668907 32651007
41098C2651007k667055l114074k180609n39899R2907p91155j947284k045795j108406
$$ 32651007 29983952 26869878 24689269 24149370 24242277 23451122 21503838 19458043 18349637
41089A8349637n1121N81261R11704J053156P79643J4566q40206j401290j775522
$$ 18349637 18298516 18879777 19791481 20844637 21624280 21638846 20798640 19397350 17621828
41080A7621828k118558k093775j411817o31868n69248r86554q39538P0135P10219
$$ 17621828 15503270 13409495 11997678 11365810 10796562 9810008 8970470 9040605 9750824
41071I750824L68613m08023q03589o84005j77897O25915J133978O13607l52799
$$ 9750824 10119437 9711414 8907825 8223820 8045923 8671838 9805816 10419423 10066624
41062A0066624j34997J505870K718170K206603R81427L47004m5128o02309j88533
$$ 10066624 9931627 11437497 14155667 16362270 17343697 17690701 17645573 17043264 16854731
41053A6854731J721389K984138J526575j147412k043853j231631j161290k181697
$$ 16854731 18576120 21560258 23086833 21939421 19895568 18663937 17502647 15320950
41045A5320950k273343j074915m88226q76824l37699J356656J736230l5557j283879
$$ 15320950 13047607 11972692 11484466 10607642 10269943 11626599 13362829 13327272 12043393
41036A2043393j74313J264129P75638l66272N7928J359859J659478J430547K154704
$$ 12043393 11869080 13133209 13908847 13542575 13600503 14960362 16619840 18050387 20205091
41027B0205091K964210J913239l38161j235022k35517P70924O18500j07124q78789
$$ 20205091 23169301 25082540 24744379 23509357 23273840 24044764 24663264 24556140 23677351
41018B3677351j588869j375444M21591K292177K024325P2356j026674n59845k91843
$$ 23677351 22088482 20713038 21134629 23426806 25451131 25523487 24496813 23936968 23645125
41009B3645125j061882j597484j271819j156387j418643n69285J356642J724593
$$ 23645125 22583243 20985759 19713940 18557553 17138910 16569625 17926267 19650860
41001A9650860o72537l038994k413934j4624R72294L19889L64144J577801J877852
$$ 19650860 18978323 15939329 13525395 13510771 14483065 14802954 15167098 16744899 18622751
40992A8622751M48416p72193k84633P41166P16978K15576O80688J813846K001142
$$ 18622751 19071167 18298974 18014341 18755507 19472485 19688061 20368749 22182595 24183737
40983B4183737P95848n90108j196558j396532j806896k209599k158286j909860
$$ 24183737 24979585 24389477 23192919 21796387 19989491 17779892 15621606 13711746
40975A3711746j927751j821237p36386J089461K056479J059901r19133j825017
$$ 13711746 11783995 9962758 9226372 10315833 12372312 13432213 12513080 10688063
40967A0688063r21397N50440J066700M25980n01729r19288o22386R5472O38087
$$ 10688063 9766666 10317106 11383806 11809786 11308057 10388769 9766383 9861855 10499942
40958A0499942N67794J67312J40084N30111N58570p1376m77950L9251O48239J40279
$$ 10499942 11067736 11235048 11375132 11905243 12463813 12392437 11914487 11953738 12601977 12742256
40948A2742256r69670r39333N16961J547302Q04232n36607m81326R81330K101886
$$ 12742256 11772586 10833253 11350214 12897516 13701748 13165141 12683815 13665145 15767031
40939A5767031J865426Q53483j91614j161447j745679j305535k15207L516j154759
$$ 15767031 17632457 18485940 18294326 17132879 15387200 14081665 13866458 13869974 12715215
40930A2715215k024095j032355Q07628J267971J96002m35916L19490J217371J300739
$$ 12715215 10691120 9658765 10466393 11734364 11930366 11494450 11813940 13031311 14332050
40921A4332050J513311K638297L338291K046726k66223j232552m79151J62130
$$ 14332050 15845361 18483658 21821949 23868675 23602452 22369900 21890749 22052879
40913B2052879k38055n10631J97582Q10185K04516q92601j287085j335595j931312
$$ 22052879 21814824 21304193 21501775 22311960 22516476 21623875 20336790 19001195 17069883
40904A7069883k414299j471166L02418Q83712L3052j31747J432275K680922J396251
$$ 17069883 14655584 13184418 13486836 14370548 14403600 14271853 15704128 18385050 19781301
40895A9781301j352228k576928j411274K14080O59653L24670N0078l07674q85619
$$ 19781301 18429073 15852145 14440871 14654951 15314604 15639274 15689352 15381678 14496059
40886A4496059r23792J5021J004897J033935M55618R1800k40915r96495j420197
$$ 14496059 13572267 13587288 14592185 15626120 16081738 16173538 15932623 14936128 13515931
40877A3515931m50206J176076J443621q5532j477524j037918N79875J635705J595824
$$ 13515931 13065725 14241801 15685422 15599890 14122366 13084448 13664323 15300028 16895852
40868A6895852J198957R75743P52458K90970m32718j391776k248327k161169o75745
$$ 16895852 18094809 19070552 19823010 20113980 19681262 18289486 16041159 13879990 13204245
40859A3204245J219498J798959O91782m25522J62688J931222K704200J542142
$$ 13204245 14423743 16222702 16914484 16488962 16651650 18582872 21287072 22829214
40851B2829214M5156J26604J288137J381456j38581j300793m73230J324822K046694
$$ 22829214 22874370 23000974 24289111 25670567 25531986 24231193 23757963 25082785 27129479
40842B7129479J406885O13145J42467m80954j077227q34920j8524Q6860o99453
$$ 27129479 28536364 29149509 29291976 28811022 27733795 26898875 26880351 26967211 26267758
40833B6267758r86322j8582J136323J308407P52189J56722n33293j345273j572439
$$ 26267758 25281436 25262854 26399177 27707584 28459773 28616495 28083202 26737929 25165490
40824B5165490r66958n53345j030475j337636k01398J628553K168707Q31134j053369
$$ 25165490 24198532 23645187 22614712 21277076 21075678 22704231 24872938 25704072 24650703
40815B4650703k102272k099036j495373p73419l38080l04239m27556o29875j117916
$$ 24650703 22548431 20449395 18954022 18180603 17842523 17538284 17110728 16480853 15362937
40806A5362937j571315j111488J70040P20727k84039j308632n63978J115398J402924
$$ 15362937 13791622 12680134 12850174 13570901 13286862 11978230 11414252 12529650 13932574
40797A3932574j7326j182755j011110n68155p76124q89629j46897O77183M89947
$$ 13932574 13915248 12732493 11721383 11153228 10377104 9487475 9340578 10017761 10507708
40788A0507708m39655j015091p58724J1695P65094R56917L39950m80880n32114
$$ 10507708 10068053 9052962 8294238 8305933 9071027 10027944 10367894 9887014 9354900
40779I354900J51149M78343n3359o85541p85616p51971q88266n53700O17543J636796
$$ 9354900 9506049 9984392 9931033 9245492 8459876 7707905 6819639 6265939 6883482 8520278
40769H520278J396860K53279o58658r79838r23573k71256J047669J900849J102707
$$ 8520278 9917138 10170417 9511759 8531921 7608348 7337092 8384761 10285610 11388317
40760A1388317n01406p87660N12829J131621m27175k387929k023282L91084J819344
$$ 11388317 10886911 10099251 10612080 11743701 11316526 8928597 6905315 7296399 9115743
40751I115743O39521j277683j435120j05558O16575J93412Q2804R30146J436025
$$ 9115743 9755264 8477581 7042461 6936903 7553478 7746890 7829694 8759840 10195865
40742A0195865P39121L9891M86544R67021r5367j766742j735636q9092N23627
$$ 10195865 10934986 10974877 11461421 12428442 12333075 10566333 8830697 8741605 9265232
40733I265232j048303k568875j766323L17854J052067O0831o43030O4733R30018
$$ 9265232 8216929 5648054 3881731 4199585 5251652 5312483 4669453 4734186 5664204
40724E664204M68147q03936j138094P5215J555377J748304O46985l64358k80227
$$ 5664204 6132351 5328415 4190321 4265536 5820913 7569217 8216202 7851844 7571617
40715G571617M93555J047056J204982J220476Q22648l62177j658321j824918q34903
$$ 7571617 8065172 9112228 10317210 11537686 12360334 11998157 10339836 8514918 7680015
40706G680015k9980j89763n73069l57635R7887J46345O113J45176L19172J42025
$$ 7680015 7650035 7460272 6887203 6529568 6627455 6773800 6779913 6925089 7244261 7386286
40696G386286n7687J26755K98280k4276l69037p5586L54821q7903j112346j281645
$$ 7386286 7328599 7455354 7753634 7729358 7360321 7284735 7639556 7551653 6439307 5157662
40686E157662j70086Q14799L13963j116171j751253q94586M12332Q57776M20703
$$ 5157662 4987576 5802375 6116338 5000167 3248914 2354328 2766660 3624436 4045139
40677D045139P6014K48480K69647l89529j046873p03974L96626J065401Q68543
$$ 4045139 4121153 4369633 4639280 4249751 3202878 2498904 2895530 3960931 4829474
40668D829474M74058K55234k43624j095061j429361p18378L53672R27708R52170
$$ 4829474 5303532 5558766 5315142 4220081 2790720 2072342 2426014 3353722 4305892
40659D305892N69033l69331j432671j465671k97493N55849L4723q00650n88934
$$ 4305892 4874925 4505594 3072923 1607252 1309759 1865608 1900331 1099681 510747
40650E10747J07227J21476M2653J029404K108181J288408q89905j701833m30956
$$ 510747 617974 739450 782103 1811507 3919688 5208096 4318191 2616358 2185402
40641B185402N61842j91384r58887j3040J250431N99018j300815j917306p21143
$$ 2185402 2747244 2555860 1596973 1583933 2834364 3433382 2132567 215261 -505882
40632e05882M16240M05384K29240P39575J123852M22536p60165j084979k95231
$$ -505882 -89642 315742 544982 1284557 2408409 2830945 2070780 985801 690570
40623F90570O67863J014635Q57277O61645M64444r0406r91783j430242n59768
$$ 690570 1358433 2373068 3230345 3891990 4356434 4266028 3274245 1844003 1284235
40614A284235J209572K211499J300562o87497j838220j349625j76792M59903M34001
$$ 1284235 2493807 4705306 6005868 5318371 3480151 2130526 1953734 2413637 2847638
40605B847638L01809K03081k07213r57158j455112j107701m472J105202J448185
$$ 2847638 3149447 3352528 3145315 2188157 733045 -374656 -379128 726074 2174259
40596B174259Q86995N7217k12059K40379O82781L32899n97816j032263l70475
$$ 2174259 3061254 3118471 2906412 3146791 3829572 4162471 3564655 2532392 2161917
40587B161917O28751P28247j90623r98219q76595l43411k69665m50035k583R91726
$$ 2161917 2790668 3518915 3328292 2330073 1453478 1110067 840402 390367 387784 1379510
40577A379510J292676L14081p46221m10088R29012J417540L20398q99972o31539
$$ 1379510 2672186 2986267 2240046 1829958 2758970 4176510 4496908 3596936 2965397
40568B965397O27097J052212J15764q14879o10374J12940K26418j90019l33443
$$ 2965397 3592494 4644706 4760470 3945591 3335217 3448157 3674575 3484556 3151113
40559C151113j71372k62891m84409k27414K48353J7106q02249r20084J01631J043940
$$ 3151113 2979741 2716850 2232441 2005027 2253380 2270486 1468237 548153 649784 1693724
40549A693724R32256M50539N13891O48073N8579o76646m91108K57208L29362l25753
$$ 1693724 2625980 3076519 3590410 4238483 4297062 3620416 3129308 3386516 3715878 3390125
40539C390125n90534m8408O83769J345821K141533K475126J365293n98803j525188
$$ 3390125 2799591 2751183 3434952 4780773 6922306 9397432 10762725 10163922 8638734
40530H638734r73854o10149j323102j651254l92420J045150P74085m69915n63523
$$ 8638734 7664880 7054731 5731629 4080375 3687955 4733105 5507190 5037275 4473752
40521D473752N25799Q77847n6591o54922P3098J040091J123411P87602P53799
$$ 4473752 4999551 5877398 5820807 5165885 5238983 6279074 7402485 8190087 8943886
40512H943886O98832L98303O78009J833419K355860R29903j161018j492219N7058
$$ 8943886 9642718 10041021 10719030 12552449 14908309 15838212 14677194 13184975 13242033
40503A3242033J219430P07811k05029M3259J107552J673346J330609N28564l83460
$$ 13242033 14461463 15169274 14964245 15007504 16115056 17788402 19119011 19647575 19264115
40494A9264115j093990j105278n47776m96526j441611k149968j289284L95775
$$ 19264115 18170125 17064847 16517071 16020545 14578934 12428966 11139682 11535457
40486A1535457J014039L28482l3943P50758J562134J412023J034104J344960J584184
$$ 11535457 12549496 12877978 12844035 13594793 15156927 16568950 17603054 18948014 20532198
40477B0532198M15141j782083l139466k686142j369839n85847n78325o07802j18937
$$ 20532198 20947339 19165256 16025790 13339648 11969809 11383962 10805637 10197835 10078898
40468A0078898O61527J111142R80650P16828R17696J505099J736103J111917o6764
$$ 10078898 10740425 11851567 12832217 13549045 14466741 15971840 17707943 18819860 18753096
40459A8753096j166354j854943k115727k044457j849662j700776j439682q29034
$$ 18753096 17586742 15731799 13616072 11571615 9721953 8021177 6581495 5752461
40451E752461j14698J96777J29818J26029J56204j36212l56096L64001J705894
$$ 5752461 5637763 5834540 5964358 6090387 6246591 6110379 5754283 6118284 7824178
40442G824178K194144J500863J195917K184478K960076J955512L19143L75799
$$ 7824178 10018322 11519185 12715102 14899580 17859656 19815168 20134311 20510110
40434B0510110K168237L644592L825035L568600L230156J818634r10376l352041
$$ 20510110 22678347 26322939 30147974 33716574 36946730 38765364 37854988 34502947
40426C4502947l955646l032623j973153j621713j923981k307041k037811r68653
$$ 34502947 30547301 27514678 25541525 23919812 21995831 19688790 17650979 16682326
40418A6682326k6550r8586n63448r8157J193888J929953J732809J656971K038933
$$ 16682326 16655776 16557190 15993742 15895585 17089473 19019426 20752235 22409206 24448139
40409B4448139J782983N13546l06830N14469K070570K736511K203296J112617
$$ 24448139 26231122 26744668 26437838 26952307 29022877 31759388 33962684 35075301
40401C5075301j79672j383818j873561j609855j531168k020259k019926p84170
$$ 35075301 34895629 33511811 31638250 30028395 28497227 26476968 24457042 23672872
40393B3672872N64284N59495m20185r05913n78794l43786o86547j282105j830398
$$ 23672872 24237156 24796651 24376466 23470553 22891759 22547973 21861426 20579321 18748923
40384A8748923k105548j644160n35351M0734o82713j599633j198287K3494K53645
$$ 18748923 16643375 14999215 14463864 14504598 13821885 12222252 11023965 11047459 11301104
40375A1301104p81250j432119p43387K14263J48182o64833j109648q11967k65645
$$ 11301104 10519854 9087735 8344348 8558611 8706793 8041960 6932312 6120345 5854700
40366E854700N2324J13181J16617J25317r0940o77166j109517n85229O72288J319295
$$ 5854700 5907024 6020205 6136822 6262139 6171199 5494033 4384516 3799287 4471575 5790870
40356E790870P59538J88935P79188J738082J557277M47762j37988O2678J6955
$$ 5790870 6550408 6739343 7518531 9256613 10813890 11261652 11123664 11186342 11203297
40347A1203297m56987l83334L70843O91490K35868M0888N22450O68882N9325q7462
$$ 11203297 10746310 10362976 10733819 11425309 11661177 11702065 12224515 12893397 12952722 12865260
40337A2865260R58298J855283J198811j66236m71486K69333N86140l174n76826
$$ 12865260 13823558 15678841 16877652 16711416 16239930 16509263 17095403 17092229 16515403
40328A6515403o10137o07333q41123q10016k42653M23956Q81452J352898J819462
$$ 16515403 15905266 15297933 14456810 13646794 13404141 13828097 14709549 16062447 17881909
40319A7881909J667011N77797q00906j526673j338868o95079k04203k55854q22623
$$ 17881909 19548920 20126717 19325811 17799138 16460270 15765191 15560988 15305134 14482511
40310A4482511j355932j229428n74439l14352r76704j782363j478519J1174J374857
$$ 14482511 13126579 11897151 11322712 11008360 10031656 8249293 6770774 6781948 8156805
40301H156805J522414Q89606P38414J484148K252749K041213Q27068n78887j373038
$$ 8156805 9679219 10568825 11307239 12791387 15044136 17085349 17912417 17333530 15960492
40292A5960492j257874m53461M65009Q84389N73459j83374q71232j071869o25793
$$ 15960492 14702618 14249157 14714166 15598555 16172014 15988640 15117408 14045539 13419746
40283A3419746K25162Q69432Q18247J74800o39796j410657j909222j513259K2130
$$ 13419746 13644908 14514340 15332587 15507387 14867591 13456934 11547712 10034453 10056583
40274A0056583J552535J530177K16665m10523N41321J587759J204325O011o32442
$$ 10056583 11609118 13139295 13355960 12945437 13486758 15074517 16278842 16284853 15652411
40265A5652411p67400j084784j093234j14126P80850R6189j282227j043120Q34025
$$ 15652411 14885011 13800227 12706993 12592867 13373717 13469906 12187679 11144559 11978584
40256A1978584J837477P98688m85149l46521L99114M53488K65559O48737R23913
$$ 11978584 13816061 14614749 14129600 13783079 14182193 14635681 14901240 15549977 16473890
40247A6473890K44785n97066n00868m7982l51966r23085o01324J76693O3723p68779
$$ 16473890 16718675 16121609 15620741 15572759 15220793 14297708 13696384 13873077 13936800 13168021
40237A3168021r09625j36936M03495L36227M03496O17865Q8108r76975j087408
$$ 13168021 12258396 12121460 12524955 12861182 13264678 13882543 13970651 12993676 11906268
40228A1906268N6017P45103j98397j694001k199159j730300r91606M6357J340043
$$ 11906268 11962285 12707388 12508991 10814990 8615831 6885531 5893925 5940282 7280325
40219G280325J831832Q85847l37806n24339k64805p10821j109414M5577J907217
$$ 7280325 9112157 9998004 9660198 9135859 8871054 8160233 7050819 7096396 9003613
40210I003613J959959j5071j332973n34498N11454K6664o84995J57716J317122
$$ 9003613 10963572 10948501 9615528 9081030 9592484 9619148 8934153 9091869 10408991
40201A0408991N44920j256100j219315O02560J073946q22160k080739m50067J889584
$$ 10408991 10953911 9697811 8478496 9081056 10155002 9332842 7252103 6802036 8691620
40192H691620J711711m21362j438196m68265N91019N82532L89993O53586O09290
$$ 8691620 10403331 9981969 8543773 8075508 8666527 9249059 9639052 10292638 10901928
40183A0901928j86445q32178n49410J60095M61784K54721j42462m59610l95142
$$ 10901928 10715483 9883305 9333895 9493990 9955774 10210495 10068033 9608423 9213281
40174I213281M1952J01280p50908j558069q93567Q58910J786863J188222L74800
$$ 9213281 9255233 9356513 8605605 7047536 6153969 7012879 8799742 9987964 10362764
40165A0362764L70578N81318M25637N03344J110339J185868J1053j327833j454840
$$ 10362764 10733342 11314660 11740297 12243641 13353980 14539848 14550901 13223068 11768228
40156A1768228o24826K2680J01184k03193q37014j304315o14317R69334J476283
$$ 11768228 11143402 11166082 11267266 11064073 10227059 8922744 8308427 9277761 10754044
40147A0754044L619j474160r32805M03533m3221j960223k534752q10077J073283
$$ 10754044 10757663 9283503 8350698 8754231 8711010 6750787 4216035 3405958 4479241
40138D479241J292645N33681R4411k1587j63383o907M50980L59318m66787p93880
$$ 4479241 5771886 6305567 6399978 6378391 6215008 6208101 6659081 7018399 6551612 5757732
40128E757732J65813J265040R89991l17571j004937l84155N88603P24259p1722
$$ 5757732 5923545 7188585 8178576 7861005 6856068 6471913 7060516 7784775 7713053
40119G713053q96050r14433l08852o2403n56330p97336K13452J717681J976916
$$ 7713053 6817003 5902570 5593718 5531315 4974985 4177649 4391101 6108782 8085698
40110H085698P41349l97723l60161R1414q5077n86883n32115R3926N93476N14895
$$ 8085698 8827047 8429324 8069163 8160577 8075500 7488617 6956502 7050428 7643904 8158799
40100H158799j26018r60300j228862m03563Q39939J178040M51429j68537j24994
$$ 8158799 8032781 7072481 5843619 5440056 6279995 7458035 7909464 7740927 7615933
40091G615933k15589q62715j190086o82010k23059l83688k18033Q56399J527333
$$ 7615933 7400344 6537629 5347543 4665533 4442474 4058786 3840753 4697152 6224485
40082F224485O82697l64890J25863J221108O77413j236105j938308m99945J130815
$$ 6224485 6907182 6542292 6668155 7889263 8566676 7330571 5392263 4892318 6023133
40073F023133J242302L88332l36666r06495j315742q16381O13099J513875Q32141
$$ 6023133 7265435 7653767 7317101 6410606 5094864 4278483 4891582 6405457 7237598
40064G237598o01336j423084j396673q43971K50447J440239J391894l26056j983640
$$ 7237598 6636262 5213178 3816505 2972534 3222981 4663220 6055114 5729058 3745418
40055C745418j685517P4464J270906J160877P20353O26176M16944k17811o68632
$$ 3745418 2059901 2134365 3405271 4566148 5286501 5912677 6329621 6111810 5443178
40046E443178l64053L69971P98165O10073Q7324k19345j1391L16365M7572p83323
$$ 5443178 5079125 5449096 6247261 6857334 6944658 6725313 6713922 7030287 7077859 6294536
40036F294536j251890q93018m26344m65980l90121M77591J380348J173467K61142
$$ 6294536 5042646 4149628 3723284 3257304 2867183 3344774 4725122 5898589 6159731
40027F159731l0064L80684M30997j5638K3166P15166J095205R40802J105815J521446
$$ 6159731 6129667 6510351 6941348 6925710 6948876 7664042 8759247 9700049 10805864 12327310
40017A2327310Q57484r89997k063391j235033r9830m08920j280919r31316J78178
$$ 12327310 13184794 12194797 10131406 8896373 8796543 8387623 7106704 6175388 6353566
40008F353566K47006o51048p44375L04466Q36112J7119q74023n45113O61360J827700
$$ 6353566 6600572 5949524 5205149 5509615 6345727 6362846 5488823 4943710 5605070 7432770
39998G432770K619539K745684J732243O614j082030j080422j038996j578193j727354
$$ 7432770 10052309 12797993 14530236 14536850 13454820 12374398 11335402 9757209 8029855
39989H029855p01092M84864M98820k35345l85151J57040M64959L12186J93737
$$ 8029855 7328763 7813627 8312447 8077102 7691951 7848991 8313950 8626136 8819873
39980H819873J8909o47143j241781p34801M49884O81045l78783j113505m28878
$$ 8819873 8838782 8191639 6949858 6215057 6664941 7345986 6967203 5853698 5424820
39971E424820O06446N71578j19999j37378N40389P82330L02953R4882Q23137J910371
$$ 5424820 6031266 6602844 6482845 6345467 6885856 7668186 7971139 8066021 8889158 10799529
39961A0799529K439336K101637J053557l56705j454292j593235r99028n98349
$$ 10799529 13238865 15340502 16394059 16037354 14583062 12989827 11990799 11392450
39953A1392450o90923n42944K43634Q11662L11412o02380o44499P5014J48000
$$ 11392450 10701527 10158583 10402217 11213879 11525291 10922911 10278412 10353426 10501426
39944A0501426r44590j954325j645767m93492J19522k25384o96469n02197K19683
$$ 10501426 9556836 7602511 5956744 5463252 5582774 5357390 4660921 4158724 4378407
39935D378407P62265O50801M8437m44376m38504k08243k65795n65896o08068l01691
$$ 4378407 5140672 5791473 5839910 5395534 4957030 4748787 4482992 3917096 3309028 3007337
39925C007337n5781O7885M32503Q31808M81351m85292o93693M15283J367781P50186
$$ 3007337 2951556 3019441 3451944 4283752 4765103 4279811 3586118 4001401 5369182 6119368
39915F119368n24377o69299R0056J11942o12477l57230J187516K033856R97565
$$ 6119368 5594991 4925692 5015748 5127690 4515213 4157983 5345499 7379355 8376920
39906H376920m39656o31399k73025p27938j342134n51723J147782J599011K91172
$$ 8376920 7937264 7305865 7032840 6304902 4962768 4411045 5558827 7157838 7449010
39897G449010p61982j0744J377099J306407j66451q70124M62448K341537K375123
$$ 7449010 6687028 6676284 8053383 9359790 9193339 8323215 8785663 11127200 13502323
39888A3502323M64377r79647l05003J079013P91871r71625j791001p59983K44768
$$ 13502323 13966700 12987053 12682050 13761063 14552934 13581309 11790308 11030325 11275093
39879A1275093l22472j345696j161935k71845r7617l46449J61695Q44561O8997
$$ 11275093 10952621 9606925 8444990 8173145 8075528 7729079 7890774 8735335 8804332
39870H804332j616526j575872R24135L162344K731380J004162J009657L055753
$$ 8804332 7187806 5611934 6536069 9698413 12429793 13433955 14443612 17499365
39862A7499365M626702M237759L157527K784976K263674J09175k964308m698786
$$ 17499365 22126067 26363826 29521353 32306329 34570003 34679178 31714870 27016084
39854B7016084m488493m036348m386399m141462j887169J043947K108845J120621
$$ 27016084 22527591 18491243 14104844 9963382 8076213 9120160 11229005 12349626
39846A2349626K67961Q35189J961700K694669L021913K446759R205l259423m365356
$$ 12349626 12617587 13452776 15414476 18109145 21131058 23577817 23587022 20327599 15962243
39837A5962243k432797m88021j127563k570803j721710O61447J274889k76096
$$ 15962243 13529446 13041425 11913862 9343059 7621349 8282796 9557685 9281589
39829I281589j100556k7490P41365k00355j023683M2926J686645J694241J76265
$$ 9281589 8181033 8153543 8894908 8694553 7670870 7713796 9400441 11094682 11270947
39820A1270947j251822j942996k110246j579808m27241J89105m60729j164791
$$ 11270947 10019125 8076129 5965883 4386075 3958834 4147939 3687210 2522419
39812B522419l89173J298040K066521J565226J131539J460551J686320R83642
$$ 2522419 2133246 3431286 5497807 7063033 8194572 9655123 11341443 12325085
39804A2325085k10304r87113j109201r65693r05873q85263n71513J62247P75582
$$ 12325085 12114781 11127668 10018467 9052774 8146901 7261638 6690125 6852372 7627954
39795G627954N09517m71882j003673m46191L46165K14734p40864j548446j764600
$$ 7627954 8137471 7665589 6661916 6215725 6561890 6776624 6035760 4487314 2722714
39786B722714j585994r93122J50399J288559J489640O93849j46060l24382j17677
$$ 2722714 1136720 143598 293997 1582556 3072196 3766045 3619985 3295603 3177926
39777C177926q9698k61927k71780J1753L05268K30566k37514o04546l11955N14022
$$ 3177926 3088228 2826301 2554521 2566274 2871542 3102108 2864594 2260048 1948093 2462115
39767B462115J035412O37379l74923j196830j282340n10148Q34556J866123J540564
$$ 2462115 3497527 4134906 3759983 2563153 1280813 770665 1605221 3471344 5011908
39758E011908m3205j309163r80528K23367O13969m1008l07228O31959J713702
$$ 5011908 4968703 3659540 2679012 2902379 3516348 3475340 3168112 3800071 5513773
39749E513773J553879L18807p25990r12360n89055k27841J6210l6904n36410j068730
$$ 5513773 7067652 7386459 6660469 5748109 5159054 4931213 4947423 4910519 4374109 3305379
39739C305379q92883J7749P76937P69319M15437K75304P3461n62077r61276k19491
$$ 3305379 2412496 2430245 3207182 3976501 4391938 4667242 4740703 4178626 3217350 2997859
39729B997859J061125J235060L6124q73924l46549O40346P12787J53509j6376
$$ 2997859 4058984 5294044 5330168 4456244 4109695 4750041 5462828 5616337 5599961
39720E599961J06260r9547k04271M92223J210351O60112n47328n46339O84574
$$ 5599961 5706221 5606674 5402403 5894626 7104977 7765089 7217761 6671422 7355996
39711G355996J065845k52814j456998r26912L81640P66827M59874Q72131K184368
$$ 7355996 8421841 8169027 6712029 5785117 6166757 6933584 7393458 8265589 10449957
39702A0449957L280761L523335L209023K545985J331506l88003k096660l226176
$$ 10449957 13730718 17254053 20463076 23009061 24340567 23952564 21855904 18629728
39694A8629728l441068k807582j926474j427358j179199o59426j30191l92417
$$ 18629728 15188660 12381078 10454604 9027246 7848047 7188621 7058430 6666013
39686F666013j186709j197606j67290M54798j89617q86651l46031O72536P37427
$$ 6666013 5479304 4281698 4114408 4569206 4379589 3492938 3146907 3819443 4556870
39677D556870J69997L47358J251706J496095N74815m54259n75356P4009P26953
$$ 4556870 4726867 5074225 6325931 7822026 8396841 7942582 7367226 7441235 8168188
39668H168188P11217k30385j522024j894239p50272Q83696J515594R12355m3380
$$ 8168188 8879405 8649020 7126996 5232757 4482485 5366181 6881775 7794130 7750750
39659G750750o65818p90781l74286K79310M13281j33316l62770M50561J476150
$$ 7750750 7084932 6294151 5919865 6199175 6612456 6479140 6116370 6566931 8043081
39650H043081J565578J023607Q69043J040251P87150K46186M1857k03019j247992
$$ 8043081 9608659 10632266 11501309 12541560 13328710 13574896 13616753 13413734 12165742
39641A2165742k415527k185484o02900O11361N26592k1883k23976n08222j357927
$$ 12165742 9750215 7564731 6961831 7573192 8099784 8077901 7853925 7345703 5987776
39632E987776k124763j783002k51820J439062K001261J047605k51266k57440Q68834
$$ 5987776 3863013 2080011 1828191 3267253 5268514 6316119 6064853 5807413 6676247
39623F676247J055548n66704j850630o66082J556296J761937q4221j197094n75662
$$ 6676247 7731795 7165091 5314461 4648379 6204675 7966612 7882391 6685297 6109635
39614F109635k11129j141497j456223L36447K530009K686816J053394l29804n86800
$$ 6109635 5898506 4757009 3300786 3637233 6167242 8854058 9907452 9577648 8990848
39605H990848l77415l05229m52683q06094j023730m91638N38157P92284j80258
$$ 8990848 8613433 8308204 7855521 7049427 6025697 5534059 6072216 6864500 6684242
39596F684242j064037o78508K19476J96040o94773j262033j027279m97747l5216
$$ 6684242 5620205 4941697 5161173 5357213 4662440 3400407 2373128 1875381 1840165
39587A840165M35773Q16511Q06224L94004j32879m84245m38569l8760J66246k98490
$$ 1840165 2275938 3092449 3898673 4292677 4159798 3675553 3236984 3198224 3364470 3065980
39577C065980r50531q73141j69927J43329j93504l49319N9461M59257O48059J097990
$$ 3065980 2115449 1242308 1072381 1215710 1022206 672887 732348 1191605 1839664 2937654
39567B937654J475727N88361j408770k462031j349710N56286J370591J047455
$$ 2937654 4413381 5001742 3592972 1130941 -218769 337517 1708108 2755563
39559B755563M83219j66506q46633p35264L72015J057643K83318p72464n34469
$$ 2755563 3238782 3072276 2225643 1490379 1862394 2920037 3203355 2430891 1896422
39550A896422M60758O64708P3133k28590j79912m32301o65654k10785K66176k80253
$$ 1896422 2357180 3021888 3095021 2866431 2686519 2254218 1588564 1377779 1643955 1363702
39540A363702j133800o81272R04482J831913J338282L18261m43237q13664m04606
$$ 1363702 229902 -451370 453112 2285025 3623307 3941568 3498331 2684667 2280061
39531B280061Q84410J670967N65771j295906j438815K34280J283221N13960n60391
$$ 2280061 3164471 4835438 5401209 4105303 2666488 2900768 4183989 4697949 4137558
39522D137558n92099k57662l27145j71695O01405J013633M73153j02894r7254
$$ 4137558 3545459 3287797 2960652 2788957 3390362 4403995 4877148 4774254 4677000
39513D677000l17659j070486j034517L75151J380842N22330o65868M6454J847299
$$ 4677000 4359341 3288855 2254338 2629489 4010331 4532661 3866793 3913247 5760546
39504E760546K035175K74119r47498j50066J231269J354823M71701j958L82457
$$ 5760546 7795721 8069840 7122342 6972276 8203545 9558368 10030069 10028111 10410568
39495A0410568Q37487N17313o00785j601110j340939J32848J091673K7458k074994
$$ 10410568 11248055 11765368 11164583 9563473 8222534 8355382 9447055 9474513 7399519
39486G399519k654482r61702Q79626Q17406m70248r39492j62300N18950L45090
$$ 7399519 4745037 3783335 4662961 5480367 5010119 4070627 3908327 4427277 4772367
39477D772367R9508N59577J262185J370556R15961M95098K50879j45786p23864
$$ 4772367 4871875 5431452 6693637 8064193 8980154 9475252 9726131 9580345 8856481
39468H856481j037475p75545j50021L72260M83262K00006j74489l05528k03553
$$ 8856481 7819006 7043461 6893440 7265700 7748962 7948968 7774479 7468951 7265398
39459G265398k11694m48628n41051k44132j6110m14572j104273j179838n12818
$$ 7265398 7053704 6605076 6064025 5819893 5803783 5389211 4284938 3105100 2592282
39450B592282k8238l53722q36873m13170Q97159J863936J390717k42107j549373
$$ 2592282 2564044 2210322 1373449 960279 1857438 3721374 5112091 4869984 3320611
39441C320611j355926j40513N35551J10822k42677M02296J018950K59904j009292
$$ 3320611 1964685 1824172 2359723 2470545 2227868 2630164 3649114 3909018 2899726
39432B899726q52169L59897K42693j499672k049007J34456K528334K257629L68636
$$ 2899726 2047557 2407454 2650147 1150475 -898532 -764076 1764258 4021887 4390523
39423D390523k61025M72534N14598l09808l52891K60465k72457j581707j075098
$$ 4390523 4129498 4602032 5116630 4806822 4453931 4714396 4441939 2860232 1785134
39414A785134J374876K328050M7078k415381j779374N72874J214089P0199k30370
$$ 1785134 3160010 5488060 5535138 3119757 1340383 1913257 3127346 3197545 2967175
39405B967175P88911Q79944p43552j945836j176278J97068L17272l69219k78395
$$ 2967175 3756086 4636030 3892478 1946642 770364 967432 1284704 915485 637090
39396F37090O48494J076204N01271r6125J30353O66726M95147l33230o45629K32605
$$ 637090 1285584 2361788 2863059 2766934 2897287 3564013 4059160 3725930 3080301 3312906
39386C312906J359597J271821k5869j015012p42278J1910J35630j84359j11649
$$ 3312906 4672503 5944324 5918455 4903443 4161165 4173075 4308705 4124346 4012697
39377D012697K59209Q4601p52847j349529r21977M33612J941677K531081J449093
$$ 4012697 4271906 4356507 3603660 2254131 1332154 1765766 3707443 6238524 7687617
39368G687617p40100k224002j899728p85194m70147p80037l91507P09760J191733
$$ 7687617 6947517 4723515 2823787 2038593 1568446 788409 396902 1106662 2298395
39359B298395P15360L81338N71941L41320m52683m98938M69189O26489r51002
$$ 2298395 3013755 3395093 3967034 4308354 3855671 3356733 3825922 4452411 3501409
39350C501409k181402r51449J359864J832099L99106n07637j55007k67571j414485
$$ 3501409 1320007 368558 1728422 3560521 3959627 3451990 3296983 3029412 1614927
39341A614927j746247l39475R43803M99059l92802J31018J426569J687625R60146
$$ 1614927 -131320 -470795 473008 972067 579265 710283 2136852 3824477 4784623
39332D784623N17002K39244r01107k236589j811475M44832K142935J578953k73737
$$ 4784623 5301625 5540869 4639762 2403173 591698 1036530 3179465 4758418 4484681
39323D484681j486010j377292m11446P23178J238788O09310n49251r33294l17454
$$ 4484681 2998671 1621379 1209933 1933111 3171899 3781209 3231958 2298664 1981210
39314A981210K00556O1493L0185N70098Q46446K16312n54216n84382k75784l16433
$$ 1981210 2181766 2243259 2273444 2843542 3689988 3906300 3352084 2767702 2491918 2175485
39304B175485l10472L53932J088785Q68874j34268q47947q00190l34907J98348
$$ 2175485 1865013 2218945 3307730 4176604 4042336 3194389 2394199 2059292 2257640
39295B257640N28417K47451n65790j034856o54556j21339j25754j54989M33868
$$ 2257640 2786057 3033508 2467718 1432862 778306 656967 531213 376224 810092
39286H10092J049690Q70642L60667L38878L53645l92472j253567j084030l16328
$$ 810092 1859782 2730424 3091091 3429969 3783614 3391142 2137575 1053545 737217
39277G37217j46709k54079M75763J449181J103932q0495q3282J039140J040328
$$ 737217 590508 336429 812192 2261373 3365305 3284810 3201528 4240668 5280996
39268E280996m63138j019198M37808J591280P37565k68374N32830J529899L53493
$$ 5280996 4817858 3798660 4236468 5827748 6565313 6296939 6829769 8359668 8713161
39259H713161j784511k024289o57650l12793j170254q61568Q96784J431904k81440
$$ 8713161 6928650 4904361 4246711 3933918 2763664 1902096 2798880 4230784 3949344
39250C949344j638524n82846J150320J007313m38080q63618J7413M79946j99728
$$ 3949344 2310820 1727974 2878294 3885607 3447527 2583909 2601322 3081268 2881540
39241B881540r53093r02908l43007K95056R94693J474293J105206j59172j484260
$$ 2881540 1928447 1025539 682532 977588 1972281 3446574 4551780 4392608 2908348
39232B908348j944667j196013L78905J627217J220920p83518k366234j659618
$$ 2908348 963681 -232332 146573 1773790 2994710 2211192 -155042 -1814660
39224a814660N63456J775353J014452j32050j21269N44520O40623J28278l39645
$$ -1814660 -1251204 524149 1538601 1406551 1285282 1829802 2470425 2598703 2259058
39215B259058o82753r23492m16281J028220K020711J224477m01676p58717K65411
$$ 2259058 1576305 652813 236532 1264752 3285463 4509940 4108264 3349547 3614958
39206C614958P71427M032o03328j01038L90675j09957n51071K40429J239200P29539
$$ 3614958 4386385 4390417 3787089 3686051 4076726 3966769 3415698 3656127 4895327 5624866
39196E624866q30640j451906o53756L2489m53882j361821j484486n81542P79837
$$ 5624866 4794226 3342320 2688564 2721053 2267171 905350 -579136 -1160678 -380841
39187c80841J820087J915327J231980Q66183J495084K258888K035223J294730
$$ -380841 1439246 3354573 4586553 5452736 6947820 9206708 11241931 12536661
39179A2536661J245508J545863O81859j387297k832632k552754j461607p25218
$$ 12536661 13782169 15328032 16009891 14622594 11789962 9237208 7775601 7050383
39171G050383l87449l25277q61523j620008j381391k3097R15534N97694K30073
$$ 7050383 6662934 6337657 5476134 3856126 2474735 2451638 3367172 3964866 4194939
39162D194939Q29879J281946K63496j264803j445152m49782K0608m13185n37663
$$ 4194939 5024818 6306764 6570260 5305457 3860305 3410523 3431131 3017946 2480283
39153B480283M6636K54560m68271j160210r28422k11067J61002J65126K38958
$$ 2480283 2526919 2781479 2313208 1152998 224576 13509 174511 339637 578595
39144E78595M50047N38832L23141k39702r65414j264625n65030Q55524J863434
$$ 578595 1028642 1567474 1890615 1650913 685499 -579126 -1144156 -288632 1574802
39135A574802J558104J87340j096015j269732l36592O55381O59841j74533o77748
$$ 1574802 3132906 3320246 2224231 954499 617907 1273288 1933129 1758596 1080848
39126A080848j77383O60565Q35849L09762k05154k83961m9098K40986L33243M4212
$$ 1080848 903465 1564030 2399879 2709641 2504487 2220526 2171428 2412414 2745657 2789869
39116B789869l79568l80300M7197J99753j76505l50058J20052M49531q9688p90810
$$ 2789869 2410301 2030001 2077198 2276951 2100446 1750388 1870440 2319971 2230283 1439473
39106A439473o20924J184k5524m56569j10661Q86310J044880p5384j064189q03676
$$ 1439473 818549 819733 794209 337640 226979 1113289 2158169 2082785 1018596 214920
39096B14920N5026M59052M67213N04732K62041n56153j222041q82677P4900O20434
$$ 214920 269946 728998 1196211 1700943 1962984 1406831 184790 -697887 -622987 -2553
39086b553O15877O67451P44079J77159r03479j326208n08311O10087Q93373N35153
$$ -2553 613324 1280775 2024854 2202013 1298534 -27674 -535985 74102 967475 1502628
39076A502628M46899O53273L38119o57068j465772j520246j219113q60109J1266
$$ 1502628 1949527 2602800 2940919 2283851 818079 -702167 -1921280 -2781389 -2770123
39067b770123J394205J999795Q99241o75194p29944N76672J118797l538j247660
$$ -2770123 -1375918 623877 1523118 847924 117980 694652 1813449 1809911 562251
39058E62251j165283m27320k75604m13866J31481J032228J085508J50353o78102
$$ 562251 -603032 -1030352 -1305956 -1719822 -1588341 -556113 529395 679748 1646
39049A646o41874k6312N63906P77481M93894q8608m99434n92969p29147r63971
$$ 1646 -640228 -666540 -102634 674847 1168741 1080133 580699 -12270 -741417 -1705388
39039a705388p08415K48433J112995J173917P75218M95786K17437j75788j62825
$$ -1705388 -2413803 -2165370 -1052375 121542 896760 1392546 1609983 1434195 1271370
39030A271370L31300K75202p80365j420903l68003J154505R50492q20766j834883
$$ 1271370 1602670 1877872 1097507 -323396 -691399 463106 1413598 592832 -1242051
39021a242051r13145P22370J493978J070138j05883j267717j268705L20967J987071
$$ -1242051 -2155196 -1432826 61152 1131290 1025407 -242310 -1511015 -1190048 797023
39012G97023J718124k52140j725589j566357p14889j12311M45969J012174R41917
$$ 797023 2515147 2263007 537418 -1028939 -1743828 -1856139 -1410170 -397996 543921
39003E43921K75572N667L50035L10391m93534j115835r56976n64102k39768M70490
$$ 543921 819493 825160 1175195 1485586 992052 -123783 -1080759 -1644861 -1884629 -1414139
38993a414139J325048J199598O6064o12105k13814J49360j33253q1130P16148
$$ -1414139 -89091 1110507 1176571 564466 350652 500012 366759 285629 1001777
38984A001777R84469J29759m06731K64619O58019m11623j367014m17446J169821
$$ 1001777 1986246 2116005 1709274 1973893 2631912 2220289 853275 435829 1605650
38975A605650R94140n93271j291404o15161p3606j59418P2889O45082N14704j65914
$$ 1605650 2599790 2006519 715115 99954 26348 -133070 -60181 584901 1099605 933691
38965I33691j25030N23445K68292r62501j349852j84889R43921Q20125L56887
$$ 933691 808661 1332106 1600398 637897 -711955 -896844 47077 867202 1224089
38956A224089O02589Q79100K39648p44125j054997r04351r91769j053699m68830
$$ 1224089 1826678 2705778 2945426 2201301 1146304 241953 -749816 -1803515 -2272345
38947b272345M07196P45939N73572N07270N82319L73809O200N7815N32430P44452
$$ -2272345 -1865149 -1119210 -545638 -38368 543951 917760 923960 981775 1514205 2258657
38937B258657L04683l66681o27003l34960J05381K33526M3312K5222N51780J249318
$$ 2258657 2563340 2196659 1569656 1234696 1340077 1573603 1616915 1642137 2193917 3443235
38927C443235J304441M64263o16385j141893r49345l91350J76608N62365O67276
$$ 3443235 4747676 5211939 4595554 3453661 2504316 2112966 2289574 2851939 3519215
38918C519215N11245K38466R221n5359Q4812K40282O2494m59404p66857l79259
$$ 3519215 4030460 4268926 4278147 4222788 4307600 4547882 4610376 4150972 3384115 3004856
38908C004856L85444P72497N44268R9947k43900n34992p48037o22609r7294M57907
$$ 3004856 3390300 4162797 4707065 4807012 4563112 4028120 3280083 2657474 2560180 3018087
38898C018087N75735R5814o61741r65532k66508R33946J278942K02126j078624
$$ 3018087 3593822 3689636 3027895 2062363 1795855 2729801 4008743 4210869 3132245
38889C132245j008800K30964J072707P50164J1801l51810m91577p09482p68248
$$ 3132245 2123445 2354409 3427116 4177280 4189081 3837271 3345694 2636212 1867964
38880A867964n02377k68659k69284j47428K63957M93417K55628P9290N18292J235558
$$ 1867964 1365587 1096928 827644 680216 944173 1437590 1693218 1772508 2290800 3526358
38870C526358J433929Q27848k37619j241605j697114j349296n45209J298J18558
$$ 3526358 4960287 5788135 5550516 4308911 2611797 1262501 717292 718590 837148
38861H37148L79017J107626J763234J698371J004312K22369k49551j51045N55712
$$ 837148 1216165 2323791 4087025 5785396 6789708 7012077 6762526 6611481 7167193
38852G167193J219011R24945j04439m58015M24729J177320M92227p86774r64876
$$ 7167193 8386204 9311149 9206710 8748695 9173424 10350744 10842971 10056197 9091321
38843I091321j83045j14089j254265k272396k191655j574636j121074o04716J38749
$$ 9091321 8908276 8794187 7539922 5267526 3075871 1501235 380161 -224555 -85806
38834h5806N15833K98053K78946Q86349J186262L41831q27968r70502k10561K64422
$$ -85806 430027 728080 1007026 1893375 3079637 3421468 2593500 1622998 1412437 1676859
38824A676859J75469L07364Q29674Q56372m8649j034923j103947l57996K91311
$$ 1676859 1852328 2159692 2989366 3845738 3797089 2762166 1658219 1300223 1591534
38815A591534J96389m60950q49504k85370Q04782J076223J9725j020420n83507
$$ 1591534 1787923 1326973 477469 192099 996881 2073104 2092829 1072409 488902
$$ [...]
##END NTUPLES=NMR SPECTRUM
##END=
