##TITLE=31Pdec_LR-688A-C2KCF
 DMSO-d6, 24 sc
 1.6.2020
##JCAMPDX= 6.0         $$ Bruker NMR JCAMP-DX V2.0
##DATA TYPE= NMR SPECTRUM
##DATA CLASS= NTUPLES
##ORIGIN= UXNMR, Bruker Analytische Messtechnik GmbH
##OWNER= root
$$ XWIN-NMR		Version 3.5
$$ Mon Jun  1 12:15:50 2020 Russian Standard Time (UT+4h)  she@DPX200
##.OBSERVE FREQUENCY= 81.013821
##.OBSERVE NUCLEUS= ^31P
##.ACQUISITION MODE= SIMULTANEOUS
##.ACQUISITION SCHEME= undefined
##.AVERAGES= 24
##.DIGITISER RES= 17
##SPECTROMETER/DATA SYSTEM= spect
##.PULSE SEQUENCE= zgpg30
##.SOLVENT NAME= CDCl3
##.SHIFT REFERENCE= (INTERNAL, CDCl3, 0, 182.463)
##AUDIT TRAIL= $$ (NUMBER, WHEN, WHO, WHERE, WHAT)
$$ ##TITLE= Audit trail, XWIN-NMR		Version 3.5
$$ ##JCAMPDX= 5.01
$$ ##ORIGIN= Bruker BioSpin GmbH
$$ ##OWNER= she
$$ F:/spectra/data/she/nmr/P31/1/pdata/1/auditp.txt
$$ ##AUDIT TRAIL=  $$ (NUMBER, WHEN, WHO, WHERE, WHAT)
(   1,<2020-06-01 12:14:59.96 +0400>,<she>,<DPX200>,
      <created by zg, POWCHK disabled, PULCHK disabled
       configuration hash MD5:
       00 E9 B6 7A A2 85 ED C7 34 08 36 98 17 FE 4E 26
       data hash MD5: 32K
       CA 1A 8D 3C EF 58 41 66 EE 6D C3 37 41 50 4B 41>)
(   2,<2020-06-01 12:15:04.48 +0400>,<she>,<DPX200>,
      <Start of raw data processing
       efp BC_mod = 2 LB = 1 FT_mod = 6 PKNL = 1 PHC0 = -1884.506 PHC1 = 566.002 SI = 64K 
       data hash MD5: 64K
       C0 9E 09 8C 59 6D 95 8B 1D 98 94 9C A5 3A 2D D8>)
(   3,<2020-06-01 12:15:17.60 +0400>,<she>,<DPX200>,
      <pk PHC0 = 16.64372 PHC1 = 0 
       data hash MD5: 64K
       AC 22 B5 C5 DF 97 74 DF 12 A4 49 48 A4 4F E2 44>)
(   4,<2020-06-01 12:15:20.92 +0400>,<she>,<DPX200>,
      <abs ABSG = 5 
       data hash MD5: 64K
       3B 4D DD 86 92 AD B1 2E C6 C8 91 A6 AD E0 0E 8F>)
$$ ##END=
$$ 
$$ hash MD5
$$ B7 87 E6 99 2C EE D3 7B 4E EC 9C 03 CD 69 38 2D
##$RELAX= 
##$RELAX= 
##$RELAX= 
##$RELAX= 
##$RELAX= 
##$RELAX= 
##$RELAX= 
##$RELAX= 
$$ Bruker specific parameters
$$ --------------------------
##$DU= <F:/spectra>
##$EXPNO= 1
##$NAME= <P31>
##$PROCNO= 1
##$TYPE= <nmr>
##$USER= <she>
##$AMP= (0..31)
100 100 100 100 100 100 100 100 100 100 100 100 100 100 100 100 100 100 
100 100 100 100 100 100 100 100 100 100 100 100 100 100 
##$AQSEQ= 0
##$AQ_mod= 1
##$AUNM= <au_zg>
##$AUTOPOS= <>
##$BF1= 81.014009
##$BF2= 200.13
##$BF3= 200.13
##$BF4= 200.13
##$BF5= 200.13
##$BF6= 200.13
##$BF7= 200.13
##$BF8= 200.13
##$BYTORDA= 1
##$CFDGTYP= 0
##$CFRGTYP= 5
##$CHEMSTR= <none>
##$CNST= (0..31)
1 1 145 1 1 1 1 1 1 1 1 1 1 1 1 1 1 1 1 1 1 1 1 1 1 1 1 1 1 1 1 1 
##$CPDPRG= <waltz16>
##$CPDPRG1= <>
##$CPDPRG2= <waltz16>
##$CPDPRG3= <>
##$CPDPRG4= <mlev>
##$CPDPRG5= <mlev>
##$CPDPRG6= <mlev>
##$CPDPRG7= <mlev>
##$CPDPRG8= <mlev>
##$CPDPRGB= <>
##$CPDPRGT= <>
##$D= (0..31)
0 1 0 0 0 0 0 0 0 0 0 0.03 2e-05 3e-06 0 0 0 0 0 0 0 0 0 0 0 0 0 0 0 0 
0 0 
##$DATE= 1590999299
##$DBL= (0..7)
120 120 120 11 120 120 24 19 
##$DBP= (0..7)
150 150 150 150 150 150 150 150 
##$DBP07= 0
##$DBPNAM0= <>
##$DBPNAM1= <>
##$DBPNAM2= <>
$$ [...]
##$SUBNAM3= <"">
##$SUBNAM4= <"">
##$SUBNAM5= <"">
##$SUBNAM6= <"">
##$SUBNAM7= <"">
##$SUBNAM8= <"">
##$SUBNAM9= <"">
##$SW= 369.568048894756
##$SWIBOX= (0..15)
0 1 3 0 0 0 0 0 0 0 0 0 0 0 0 0 
##$SW_h= 29940.119760479
##$TD= 32768
##$TD0= 1
##$TE= 0
##$TE2= 300
##$TE3= 300
##$TEG= 300
##$TL= (0..7)
0 120 53 12 22 120 120 120 
##$TP= (0..7)
150 150 150 150 150 150 150 150 
##$TP07= 0
##$TPNAME0= <>
##$TPNAME1= <>
##$TPNAME2= <>
##$TPNAME3= <>
##$TPNAME4= <>
##$TPNAME5= <>
##$TPNAME6= <>
##$TPNAME7= <>
##$TPOAL= (0..7)
0.5 0.5 0.5 0.5 0.5 0.5 0.5 0.5 
##$TPOFFS= (0..7)
0 0 0 0 0 0 0 0 
##$TUNHIN= 0
##$TUNHOUT= 0
##$TUNXOUT= 0
##$USERA1= <user>
##$USERA2= <user>
##$USERA3= <user>
##$USERA4= <user>
##$USERA5= <user>
##$V9= 5
##$VALIST= <valist>
##$VCLIST= <CCCCCCCCCCCCCCC>
##$VD= 0
##$VDLIST= <DDDDDDDDDDDDDDD>
##$VPLIST= <PPPPPPPPPPPPPPP>
##$VTLIST= <TTTTTTTTTTTTTTT>
##$WBST= 1024
##$WBSW= 4
##$XGAIN= (0..3)
0 0 0 0 
##$XL= 0
##$YL= 0
##$YMAX_a= 9996
##$YMIN_a= -10716
##$ZGOPTNS= <>
##$ZL1= 120
##$ZL2= 120
##$ZL3= 120
##$ZL4= 120
##$ABSF1= 182.463
##$ABSF2= -187.1042
##$ABSG= 5
##$ABSL= 3
##$ALPHA= 0
##$AQORDER= 0
##$ASSFAC= 0
##$ASSFACI= 0
##$ASSFACX= 0
##$ASSWID= 0
##$AUNMP= <proc_1d>
##$AZFE= 0.1
##$AZFW= 0.5
##$BCFW= 0
##$BC_mod= 2
##$BYTORDP= 0
##$COROFFS= 0
##$CY= -3
##$DATMOD= 1
##$DC= 0
##$DFILT= <>
##$DTYPP= 0
##$F1P= 0
##$F2P= 0
##$FCOR= 1
##$FTSIZE= 65536
##$FT_mod= 6
##$GAMMA= 0
##$GB= 0
##$INTBC= 1
##$INTSCL= 5.30512e-09
##$ISEN= 30
##$LB= 1
##$LEV0= 0
##$LPBIN= 0
##$MAXI= 10000
##$MC2= 0
##$MEAN= 0
##$ME_mod= 0
##$MI= 50
##$NCOEF= 0
##$NC_proc= -7
##$NLEV= 6
##$NOISF1= 182.463
##$NOISF2= 159.3651
##$NSP= 0
##$NTH_PI= 0
##$NZP= 0
##$OFFSET= 182.463
##$PC= 4
##$PHC0= -1867.862
##$PHC1= 566.002
##$PH_mod= 1
##$PKNL= yes
##$PPARMOD= 0
##$PSCAL= 0
##$PSIGN= 0
##$REVERSE= no
##$SF= 81.0140089999434
##$SI= 65536
##$SIGF1= 159.3651
##$SIGF2= -187.1042
##$SINO= 113.3802
##$SIOLD= 16384
##$SREGLST= <1H.CDCl3>
##$SSB= 0
##$STSI= 65536
##$STSR= 0
##$SW_p= 29940.119760479
##$SYMM= 0
##$S_DEV= 0
##$TDeff= 32768
##$TDoff= 0
##$TI= <>
##$TILT= no
##$TM1= 0
##$TM2= 0
##$TOPLEV= 0
##$USERP1= <user>
##$USERP2= <user>
##$USERP3= <user>
##$USERP4= <user>
##$USERP5= <user>
##$WDW= 1
##$XDIM= 65536
##$YMAX_p= 536087719
##$YMIN_p= -36470298
$$ End of Bruker specific parameters
$$ ---------------------------------
##NTUPLES= NMR SPECTRUM
##VAR_NAME=  FREQUENCY,     SPECTRUM/REAL,   SPECTRUM/IMAG
##SYMBOL=    X,             R,               I
##VAR_TYPE=  INDEPENDENT,   DEPENDENT,       DEPENDENT
##VAR_FORM=  AFFN,          ASDF,            ASDF
##VAR_DIM=   65536,         65536,           65536
##UNITS=     HZ,            ARBITRARY UNITS, ARBITRARY UNITS
##FACTOR=    0.456856943014862, 1,           1
##FIRST=     14782.0589164792, 0,            0
##LAST=      -15158.0608439998, 0,           0
##MIN=       -15158.0608439998, -36470298,   0
##MAX=       14782.0589164792, 536087719,    0
$$ Real data points
##PAGE= N=1
##DATA TABLE= (X++(R..R)), XYDATA
$$ [...]
43865E523743m68590l642426l767830j441061P74743J507632J371858J315144
$$ 5523743 5055153 1412727 -2355103 -3796164 -3021421 -1513789 -141931 1173213
43857A173213J245127M08864j330127k866449k622888j51683K966549M140509
$$ 1173213 2418340 2827204 1497077 -1369372 -3992260 -4143943 -1177394 2963115
43849B963115K134593j483482l603613k572524K29672K020458J493496l23188
$$ 2963115 5097708 3614226 10613 -2561911 -2332239 -311781 1181715 858527
43841H58527j609341j337098L52323K202818K337575N7480k658864k965109q35465
$$ 858527 -750814 -2087912 -1735589 467229 2804804 2862284 203420 -2761689 -3597154
43832c597154Q69213O93639N99874K131498L072041Q17812k596127k541359J468527
$$ -3597154 -2727941 -2034302 -1434428 697070 3769111 4586923 1990796 -550563 917964
43823I17964M643986L185104j246049m366970m171593j776143O54935J562869
$$ 917964 5561950 8747054 7501005 3134035 -1037558 -2813701 -2158766 -595897
43815e95897R42407L61780Q25946Q38168j230916l232242j283475L616171N335746
$$ -595897 346510 708290 1534236 2372404 1141488 -2090754 -3374229 241942 5577688
43806E577688J173972l551664l097941K26737K79543k744250k779309J813598
$$ 5577688 6751660 3199996 102055 328792 608335 -2135915 -4915224 -3101626
43798c101626N045066K394895k461456l580888j254433p1532j106496j154193
$$ -3101626 1943440 4338335 1876879 -1704009 -2958442 -3029974 -4136470 -5290663
43790e290663R81411K382138J168028l15748M31641J836691R29043j662106k628880
$$ -5290663 -4309252 -1927114 -759086 -1074834 -643193 1193498 2122541 460435 -2168445
43781b168445j133375K52962j4780k71145R04909J948372J194808K26398J370872
$$ -2168445 -3301820 -3048858 -3063638 -3334783 -2429874 -481502 713306 939704 2310576
43772B310576L273894K448655j127778l571657k844483j446795j820963k292548
$$ 2310576 5584470 8033125 6905347 3333690 489207 -957588 -2778551 -5071099
43764e071099k66830K834042L219474L93491k057222j465566P92209J906218J254084
$$ -5071099 -5337929 -2503887 715587 1109078 -948144 -2413710 -1621501 284717 1538801
43755A538801K05146k80328l65328j84221O44257K025659K715663J458142j236523
$$ 1538801 1743947 1463619 1098291 914070 1558327 3583986 6299649 7757791 6521268
43746F521268l251704l239317k114119j459636j272437n26260P26143J492385
$$ 6521268 3269564 30247 -2083872 -3543508 -4815945 -5342205 -4616062 -3123677
43738c123677J594478J336893n1022k992929m827326k082140L690386O290836
$$ -3123677 -1529199 -192306 -243328 -3236257 -8063583 -10145723 -6455337 -164501
43730a64501L100263q65462k08254K989648K833757j277513m253588l069142n1156
$$ -164501 2935762 2070300 1862046 4851694 7685451 6407938 2154350 -914792 -965948
43721i65948J709989J895768J161010m39365k106282k394783j559777j168140
$$ -965948 744041 2639809 3800819 3361454 1255172 -1139611 -2699388 -3867528
43713c867528j036967L60280K134213J360499j832957l437283j434502J226984
$$ -3867528 -4904495 -4544215 -2410002 -1049503 -2882460 -6319743 -7754245 -6527261
43705f527261J596381R60929J387011J542894l43049k083487m19294L222293M177838
$$ -6527261 -4930880 -3969951 -2582940 -1040046 -1383095 -3466582 -3885876 -663583 3514255
43696C514255J294644j687675j795361m14112k21604j245891j564279m01620R31685
$$ 3514255 4808899 3121224 1325863 911751 690147 -555744 -2120023 -2521643 -1589958
43687a589958P71212q76664k083711j099767J169260J825606j87619k229933j270417
$$ -1589958 -818746 -1695410 -3779121 -4878888 -3709628 -1884022 -2071641 -4301574 -5571991
43678e571991K086251M575539M376985K325168k54077k587906l481487j747897
$$ -5571991 -3485740 1089799 5466784 7791952 7537875 4949969 1468482 -279415
43670b79415J686344L936354L335798J173839m68892j329098k383017l643900
$$ -279415 1406929 5343283 8679081 9852920 9384028 8054930 5671913 2028013
43662B028013l910064k535428l61306J440949K741503L982072M658242L418542
$$ 2028013 -1882051 -4417479 -4778785 -3337836 -596333 3385739 8043981 11462523
43654A1462523K29937k572859k656872o10343R03693N69945o54005j770368k719178
$$ 11462523 11692460 9119601 6462729 5852386 6756079 7326024 6672019 4901651 2182473
43645B182473k940887j486244O67163J024485m85881p71941J445753K928416R11500
$$ 2182473 -758414 -2244658 -1577495 -553010 -1038891 -1810832 -365079 2563337 3474837
43636C474837k032147j889620K15032Q227k483602k750140N28924K819985P32009
$$ 3474837 1442690 -446930 -231898 -223671 -2707273 -5457413 -4928489 -2108504 -1376495
43627a376495k609256k213982J719684M764620M500729K519870R53624k9010r83818
$$ -1376495 -3985751 -6199733 -4480049 284571 4785300 7305170 8258794 8229784 7245966
43618G245966j614301j332678m17958J11265l66236j230392j095726N01478K113781
$$ 7245966 5631665 4298987 3881029 3992294 3626058 2395666 1299940 1801418 3915199
43609C915199J903262J30690r96094l22606N93973k80341k383158l005618q58595
$$ 3915199 5818461 5949151 4953057 4630451 5224424 4944083 2560925 -444693 -1303288
43600a303288J848987J790773j126385l009384p19331L436349M008858k99684
$$ -1303288 545699 2336472 1210087 -1799297 -2518628 917721 4926579 4626895
43592D626895m425529l659361J04051J754611N35116J22297J910863K868132J040068
$$ 4626895 201366 -3457995 -3353944 -1599333 -1064217 -941920 968943 3837075 4877143
43583D877143r42254p4808K275888K512846p5453k811672l391102k231066j279672
$$ 4877143 3934889 3860081 6135969 8648815 8573362 5761690 2370588 139522 -1140150
43574a140150j533449j806643j73153K821966L586067J25568l854913k909986
$$ -1140150 -2673599 -4480242 -4653395 -1831429 1754638 1880206 -1974707 -4884693
43566d884693K269221N066069K003850k694745l665661j387543M56399R63981
$$ -4884693 -2615472 2450597 4454447 1759702 -1905959 -3293502 -2837103 -1873122
43558a873122J430555J516949K98146o82589M04076J757301L42206k740669l471341
$$ -1873122 -442567 1074382 1372528 689939 1094015 2851316 3193522 452853 -3018488
43549c018488j049387J300981J674188J614609K340200K507849Q57405j711023
$$ -3018488 -4067875 -2766894 -1092706 521903 2862103 5369952 6227357 4516334
43541D516334l574894l710329j522393K139403M126917K230740j018753j309517
$$ 4516334 941440 -2768889 -4291282 -2151879 1975038 4205778 3187025 1877508
43533A877508R39043J263535j409350k955051r63544J559703J665201Q62097J026665
$$ 1877508 2816551 4080086 2670736 -284315 -1247859 311844 1977045 2839142 3865807
43524C865807M17258k313672m034188j717886J841401J810637j314209l019840
$$ 3865807 4283065 1969393 -2064795 -3782681 -1941280 -130643 -1444852 -4464692
43516d464692j875114l45876M30230J566699K520522J370994p42927m61213J738007
$$ -4464692 -6339806 -6685682 -6255452 -4688753 -2168231 -797237 -1540164 -2001377 -263370
43507b63370J351453k700481n335706k640326K263482M049249K632519J961787
$$ -263370 1088083 -1612398 -6948104 -9588430 -7324948 -3275699 -643180 1318607
43499A318607L461758M534213K820074j038323m616687n613364l057344J531747
$$ 1318607 4780365 9314578 12134652 11096329 6479642 866278 -2191066 -659319
43491f59319M666953M123378J181695j345922k224252j824162o71979L28560k19919
$$ -659319 4007634 8131012 9312707 7966785 5742533 3918371 3246392 3574952 3355033
43482C355033k073532k557361j88012K377135J737674j169581k578610j605539
$$ 3355033 1281501 -1275860 -1463872 913263 2650937 1481356 -1097254 -2702793
43474b702793q43385j504343j794010o77395L34087K38930K01706R59359J571636
$$ -2702793 -3546178 -5050521 -6844531 -7521926 -7187839 -6948909 -6747203 -5787844 -4216208
43465d216208J883144K985921L964263K005224k229107l530764L31604M000469
$$ -4216208 -2333064 652857 4617120 6622344 4393237 862473 1194077 5194546
43457E194546J902805l081688l960222m54163J132035j552520l441389q11193
$$ 5194546 7097351 4015663 55441 -398722 733313 -819207 -4260596 -5071789
43449e071789K693437K181849j007884k100690m8730K232727K859334K376393
$$ -5071789 -2378352 -196503 -1204387 -3305077 -3353807 -1121080 1738254 4114647
43441D114647J269868m83465j818365j370155K54147J144164P05589k55155j379496
$$ 4114647 5384515 4901050 3082685 1712530 1966677 3110841 3816430 3561275 2181779
43432B181779k576844k683083p43996J684357K004380L19849p43175j22402L82725
$$ 2181779 -395065 -3078148 -3822144 -2137787 -133407 186442 -556733 -679135 -296410
43423b96410m64387j217979l81651R48092P93219p54853j937468j716307l43186
$$ -296410 -760797 -1978776 -2360427 -1412335 -619116 -1373969 -3311437 -5027744 -5370930
43414e370930J566681L043358K596047j77997l029794k906982K15254K850572
$$ -5370930 -3804249 -760891 1835156 1657159 -1372635 -4279617 -4064363 -1213791
43406a213791K185873m67291j709329o94260K39823l38468n69021J492282M068565
$$ -1213791 972082 504791 -1204538 -1898798 -1658975 -1997443 -2566464 -1074182 2994383
43397B994383L666280K63466k386342j958418k05328N90104Q51299J481635J111407
$$ 2994383 6660663 6924129 4537787 2579369 2374041 2964145 3815444 5297079 6408486
43388F408486j572175m642040n212496l578912j950091l63864K399457M771481
$$ 6408486 4836311 194271 -5018225 -8597137 -10547228 -10911092 -8511635 -3740154
43380c740154L751748L28436j155009J12348O4023k905287m357917q81751L716798
$$ -3740154 11594 340030 -814979 -702631 -638608 -3543895 -7901812 -8783563 -5066765
43371e066765L847288M87023j111327O5180K67567j736569k606834m99108J828961
$$ -5066765 -1219477 -732454 -1843781 -1778601 -1511034 -3247603 -5854437 -6353545 -4524584
43362d524584J853716J137405J891438K895428J731632j001062k473916j473960
$$ -4524584 -2670868 -1533463 357975 3253403 4985035 3983973 1510057 36097
43354C6097O61354K056518J587604q19945l547917l924155j180584K099239L123414
$$ 36097 697451 2753969 4341573 3521628 -26289 -3950444 -5131028 -3031789 91625
43345I1625K478924K579899L424449K567931o59351l566352l626755j521562N23219
$$ 91625 2570549 5150448 8574897 11142828 10483477 6917125 3290370 1768808 2292027
43336B292027J685245K284336J961164J67107k058229k774953j735620o68498
$$ 2292027 3977272 6261608 8222772 8389879 6331650 3556697 1821077 1152579
43328A152579o07933n28257N33192J445142O04295j174862j258705J128667L414415
$$ 1152579 544646 16389 549581 1994723 2599018 1424156 165451 1294118 4708533
43319D708533K732852n12546l253178l457324k030976r68168p83998n21351L83843
$$ 4708533 7441385 6928839 3675661 218337 -1812639 -2780807 -3564805 -4086156 -3702313
43310c702313J348940J733865J657739J300740K94178j339863k300422j286784
$$ -3702313 -2353373 -619508 1038231 2338971 2633149 1293286 -1007136 -2293920
43302b293920J053188K713785K797792J958628M51545k103540m410737l643464
$$ -2293920 -1240732 1473053 4270845 6229473 6681018 4577478 166741 -3476723
43294c476723K41326K809221P29116k819496k196618K232028M369747J506242
$$ -3476723 -3235397 -426176 302940 -2516556 -4713174 -2481146 1888601 3394843
43286C394843j855922j312111R43379N15143j809810j729330J376767L664122
$$ 3394843 1538921 226810 1170189 1685332 -124478 -1853808 -477041 3187081
43278C187081K813652O17642p79144j547032k137474j704021J4059J516477J619561
$$ 3187081 6000733 6618375 5839231 4292199 2154725 450704 464763 1981240 3600801
43269C600801J015898P35346N79864o4305j250928k862457m452896m402814j315510
$$ 3600801 4616699 5352045 5931909 5867604 4616676 1754219 -2698677 -7101491 -8417001
43260h417001L032567M462227J522873k116911k153677J058081L604480L156054
$$ -8417001 -5384434 -922207 600666 -1516245 -3669922 -2611841 992639 4148693
43252D148693R10866q82510j261411n11940N64374J147100J159404J443959K352364
$$ 4148693 5059559 4177049 2915638 2403698 2968072 4115172 5274576 6718535 9070899
43243I070899K591573O37443k894553n496182n532329l812580k134348j070916
$$ 9070899 11662472 12299915 9405362 3909180 -1623149 -5435729 -7570077 -8640993
43235h640993J72964J980335L166622K271313j04911j405928l66426J002500L26623
$$ -8640993 -8468029 -6487694 -3321072 -1049759 -1154670 -2560598 -2927024 -1924524 -1597901
43226a597901j186180m08963K223216K411669j441834m840897l275262R35619
$$ -1597901 -2784081 -3193044 -969828 1441841 7 -4840890 -8116152 -7180533
43218g180533J870437j291443l378073j215382K042000K346081O79816M32179
$$ -7180533 -5310096 -6601539 -9979612 -11194994 -9152994 -6806913 -6127097 -5694918
43210e694918J434309O75491j789292j853046K427246O802669N749038l3396m141241
$$ -5694918 -4260609 -3585118 -5374410 -7227456 -4800210 2002459 7751497 7718101 3576860
43201C576860k627994J240913J901887j063614l102504j389979J797292K932856
$$ 3576860 948866 2189779 4091666 3028052 -74452 -1464431 332861 3265717
43193C265717J677531l0664j174234j851930j649187j20939J672463K142455J438117
$$ 3265717 4943248 4912584 3738350 1886420 237233 116294 1788757 3931212 5369329
43184E369329R18822N67972r98970l597576m588962k140541J827796L404830J190279
$$ 5369329 6288151 6856123 5857153 2259577 -2329385 -4469926 -2642130 762700 1952979
43175A952979j986466k266501P19983L344406K415503p86799k389373j367261
$$ 1952979 -33487 -2299988 -1580005 1764401 4179904 3393105 1003732 -363529
43167c63529n94279j735692k061703J199796N525349N704481J119929l118814
$$ -363529 -957808 -2693500 -4755203 -3555407 1969942 7674423 8794352 5675538
43159E675538k782223O55332K742199J284137k238710m717177l948008n33425
$$ 5675538 2893315 3548647 6290846 7574983 5336273 619096 -3328912 -3862337
43151c862337K255134J922921J4904q0775J619351J711712p53905k155978n526
$$ -3862337 -1607203 315718 330622 249847 1869198 3580910 2827005 671027 665501
43142F65501K619547J554439j919264k902004j79097K188966Q15883k675956m330727
$$ 665501 3285048 4839487 2920223 18219 -160878 2028088 2843971 168015 -4162712
43133d162712k660422N11521K670556K861372J850648Q80871M22112J53184p2530
$$ -4162712 -6823134 -6311613 -3641057 -779685 1070963 1951834 2373946 2527130 2454600
43124B454600L0922L74468L89575M352l66559r64071k207971k830064r06960K264925
$$ 2454600 2485522 2859990 3249565 3253917 2887358 1923287 -284684 -3114748 -4021708 -1756783
43114a756783K278367k248746o426951n107431J34919L788577M259811M267628
$$ -1756783 521584 -1727162 -8154113 -13261544 -13126625 -9338048 -5078237 -810609
43106h10609M511445K591041j180680k493052K79864K850213J434274j582349
$$ -810609 3700836 6291877 5111197 2618145 2898009 5748222 7182496 5600147
43098E600147j961071l03289j91855j869795k358333r67168l57904j874312l346069
$$ 5600147 3639076 3335787 3143932 1274137 -1084196 -2051364 -2409268 -4283580 -7629649
43089g629649k438515L06551K627896L000353J515680k22752p6131K277793M275375
$$ -7629649 -10068164 -9761613 -7133717 -4133364 -2617684 -2840436 -2916567 -638774 3636601
43080C636601L428859Q07836n65417k30775l98463j616259j657316L09373J605697
$$ 3636601 7065460 7873296 7307879 7077104 6678641 5062382 3405066 3714439 5320136
43071E320136j3446k737159l287048j476617O2656k97516j564079j738223K46222
$$ 5320136 5306690 2569531 -717517 -2194134 -2131478 -2428994 -3993073 -5731296 -5485074
43062e485074L443412M942487K487669j912731l155739L63605L749374K027634
$$ -5485074 -2041662 2900825 5388494 3475763 320024 683629 4433003 6460637
43054F460637k707795m568638k639575j282866k032971j271127K325822M072866
$$ 6460637 3752842 -815796 -3455371 -4738237 -6771208 -8042335 -5716513 -1643647
43046a643647Q68154k494348j36343N104314N277512n72831m852129k816690J008048
$$ -1643647 -775493 -3269841 -3406184 1698130 6975642 6402811 1550682 -1266008 -257960
43037b57960O65498k389323k747355K57723K523430K208699J662884K270297J884384
$$ -257960 407538 -1981785 -4729140 -4471417 -1947987 260712 1923596 4193893 6078277
43028F078277j081975m268352m290578j241610J744887K450628J386048J67372
$$ 6078277 4996302 727950 -3562628 -4804238 -3059351 -608723 777325 944697
43020I44697k99074J11537J187023K163845J744573n89766l195363l331521n11810
$$ 944697 645623 757160 1944183 4108028 5852601 5262835 2067472 -1264049 -1775859
43011a775859K087142J192279j968531k907181j32406K587479J828476l86350
$$ -1775859 311283 1503562 -464969 -3372150 -3504556 -917077 911399 525049
43003E25049j09815J946423J575925j783811l762673j924529M37761k78811k357349
$$ 525049 415234 2361657 3937582 2153771 -1608902 -3533431 -3095670 -3374481 -5731830
42994e731830j894690Q76631K257797R88983j99333R83234L311759M041272K064334
$$ -5731830 -7626520 -6749889 -4492092 -3503109 -3702442 -2719208 592551 4633823 6698157
42985F698157j349202l625501k810691K81154K381945J657125J92341N71266J475973
$$ 6698157 5348955 1723454 -1087237 -806083 1575862 3232987 3425328 3996594 5472567
42976E472567j1261k774996k784722N4413J217601q20058j580339J737750M605322
$$ 5472567 5461306 2686310 -98412 -43999 1173602 353544 -1226795 510955 5116277
42967E116277K022014k913132l454596J52690J429322j616666l769117j757102
$$ 5116277 7138291 4225159 770563 923253 2352575 735909 -3033208 -4790310
42959d790310Q42327O35456J9141J587614K420654n37107l622656j518910L426002
$$ -4790310 -3947983 -3312527 -3293386 -1705772 714882 177775 -3444881 -4963791 -1537789
42950a537789L951464r50583m575823k827404N58044J061369j94280j48853Q78301
$$ -1537789 2413675 1463092 -3112731 -5940135 -5382091 -4320722 -4515002 -4663855 -3785554
42941c785554J289733J850669L290793L261649j91639m329948m954465k313951
$$ -3785554 -2495821 -645152 2645641 5907290 5715651 1385703 -3568762 -5882713
42933e882713J11122J277440K794984M328290L330574k96418l196042l122685
$$ -5882713 -5771591 -4494151 -1699167 2629123 5959697 5663279 2467237 -655448
42925f55448j439651k75993L7159m9596l41003k62711N16741N98914j441900l843478
$$ -655448 -2095099 -2371092 -2333933 -2383529 -2724532 -2987243 -2470502 -1871588 -3313488 -7156966
42915g156966l275745N5619K447543K387859K177885K795351J775007j520793
$$ -7156966 -10432711 -10377092 -7929549 -5541690 -3363805 -568454 1206553 -314240
42907c14240l130233n03054K629805J641370j903281l223255j815537q06199o85822
$$ -314240 -3444473 -3947527 -1317722 323648 -1579633 -4802888 -6618425 -7424624 -8110446
42898h110446O22670K306160J192133j975521k504209P52614L182680J709977
$$ -8110446 -7487776 -5181616 -3989483 -5965004 -8469213 -7716599 -4533919 -2823942
42890b823942o07552o7102J917248K069451Q56814R27267K300810K885100K177120
$$ -2823942 -3431494 -3498596 -1581348 488103 1344917 2272184 4572994 7458094 9635214
42881I635214J103599m11267k486059l250166j233671J244364P35293j912813
$$ 9635214 10738813 10327546 7841487 4591321 3357650 4602014 5337307 3424494
42873C424494k630603m96351J043088p0017j637640j595724j402092k620238l399431
$$ 3424494 793891 297540 1340628 1270611 -367029 -1962753 -3364845 -5985083 -9384514
42864i384514j544136J305668K102328J362318J889781L421139K780693l03347
$$ -9384514 -10928650 -9622982 -7520654 -6158336 -4268555 -847416 1933277 1629930
42856A629930j769710O63329L459005K133606k161927m242234k033253J158742
$$ 1629930 -139780 523549 3982554 6116160 3954233 -288001 -2321254 -1162512
42848a162512J679842O0659o04451R39489K817481K653665N44362r10031K98894
$$ -1162512 517330 577989 -26462 913027 3730508 6384173 6928535 6018504 6317398
42839F317398K708097K766916l73687l094212j918394J540637K666771L665l517954
$$ 6317398 9025495 11792411 11418724 8324512 6406118 7946755 10613526 10617191 7099237
42830G099237n117180m694394k751313M81248K921765J585681k495755m088715
$$ 7099237 1982057 -2712337 -5463650 -4982402 -2060637 -474956 -2970711 -7059426
42822g059426j001006K282213J579848k07697J813642N660575M995445n74806
$$ -7059426 -8060432 -5778219 -4198371 -4406068 -2592426 3068149 8063594 7488788
42814G488788m320661k333154J290098J342047j363590k785380j868074n86730
$$ 7488788 3168127 834973 2125071 3467118 2103528 -681852 -2549926 -3136656
42806c136656j22945R565L45224J030336J951420K190653Q28274j065376j333999
$$ -3136656 -3259601 -3250036 -2904812 -1874476 76944 2267597 3095871 2030495 696496
42797F96496k21653k36034j672156j598138J094464L118697J719662r53715j382320
$$ 696496 474843 238809 -1433347 -3031485 -1937021 1181676 2901338 1947623 565303
42788E65303M6322N43395m07086j171354j140787p52290J98627J510486J482911
$$ 565303 611625 1155020 747934 -423420 -1564207 -2316497 -2117870 -607384 875527
42779H75527m11556j687174n86734O09066n29031j864037k73593K219884J280122
$$ 875527 463971 -1223203 -1809937 -1200871 -1729902 -3593939 -3867532 -1647648 -367526
42770c67526k050761k458286R41656L078152J181461j216691o62279J018136Q62663
$$ -367526 -2418287 -4876573 -3934917 -856765 324696 -891995 -1554274 -536138 326525
42761C26525j76022J80730J161589P34338n77888j024591j039943k148318l585760
$$ 326525 150503 331233 1492822 2227160 1649272 624681 -415262 -2563580 -6149340
42752f149340k987170r0070K594201K948290J568607O64977J432092K784943K751598
$$ -6149340 -9136510 -9226580 -6632379 -3684089 -2115482 -1450505 -18413 2766530 5518128
42743E518128J102660l29033n93198j261868l403977m755965k859548L81173J059297
$$ 5518128 6620788 6291755 5698557 4436689 1032712 -3723253 -6582801 -6201628 -5142331
42734e142331o24130r17256J052005K158072J022074j00265j44943p67980j636283
$$ -5142331 -5766461 -6683717 -5631712 -3473640 -2451566 -2551831 -2696774 -3464754 -5101037
42725e101037J82665L965997M442449K82439k606804m24692K038347k49589l572318
$$ -5101037 -4918372 -952375 3490074 3772513 1165709 741017 2779364 2529775 -1042543
42716a042543j918223K290286K196325j808270l072757N8866K414221J237817
$$ -1042543 -2960766 -670480 1525845 -282425 -3355182 -3296316 -882095 355722
42708C55722n80209j065179j633544k132632m57728J812896N24915l008761k619800
$$ 355722 -224487 -1289666 -2923210 -5055842 -5513570 -3700674 -3175759 -6184520 -8804320
42699h804320K154806M244472Q26214j607646J251628L398581j062019o527999
$$ -8804320 -6649514 -2405042 -1578828 -3186474 -1934846 1463735 401716 -6126283
42691f126283m023015M001056O904775J900019k799604j257467K422260K122341
$$ -6126283 -10149298 -6148242 756533 2656552 -143052 -1400519 1021741 3144082
42683C144082j268145k658600l43254K794562L455376R65333k542204l958888
$$ 3144082 1875937 -782663 -1125917 1668645 5124021 6089354 3547150 -411738
42675d11738k419516n87095r61387j735555O34735N077448O046815J126609m925536
$$ -411738 -2831254 -3418349 -4379736 -6115291 -5480556 -403108 5643707 6770316 1844780
42666A844780n783735r96956M117468M640877N90834l844383m586560j557582
$$ 1844780 -3938955 -4935911 -818443 3822434 4413268 568885 -4017675 -5575257
42658e575257J635664K251725J414872J177192N86108k056646m409024k329408
$$ -5575257 -3939593 -1687868 -272996 904196 1490304 -566342 -4975366 -7304774
42650g304774K906554M847490J115056k587008q65769L414043M030924Q28200
$$ -7304774 -4398220 449270 1564326 -1022682 -1888451 1525592 5556516 6384716
42642F384716j234296m90973r9199j483430k020907m39633N47816p94584j845510
$$ 6384716 5150420 4659447 4560248 3076818 1055911 616278 1164094 369510 -1476000
42633a476000n4061K638200L047367J709048R82767L42024k198046n082472m327301
$$ -1476000 -1530061 1108139 4155506 5864554 6847321 7189345 4991299 -91173 -4418474
42624d418474L7891K964615J299258j907156k143459N00775K717672L060956K418577
$$ -4418474 -4380583 -1415968 -116710 -2023866 -4167325 -3666550 -948878 2112078 4530655
42615D530655R87124j594834l647152k618539P06988K372203O13076j743174j591718
$$ 4530655 5517779 3922945 275793 -2342746 -1635758 736445 1349521 -393653 -1985371
42606a985371L68936J740497K265311L011812L341837J655833j397183l122835
$$ -1985371 -1616435 124062 2389373 5401185 8743022 10398855 9001672 5878837
42598E878837k307571m82031M99998L00763o68425j986295k721127j871127K0654
$$ 5878837 3571266 3089235 3589233 3889996 3221571 1235276 -1485851 -3356978 -3336324
42589c336324J081416N81734r9213L66937J420366J730112R77175l57242j904324
$$ -3336324 -2254908 -1673174 -1772387 -1405450 14916 1745028 2722203 2364961 460637
42580D60637l109417k959519j143233J122002K349724K299003J488046P2156j701175
$$ 460637 -2648780 -5608299 -6751532 -5629530 -3279806 -980803 507243 579399 -1121776
42571a121776k687269j897439l4428J250475J396660J087274P00946N4448l51370
$$ -1121776 -3809045 -5706484 -5740912 -4490437 -3093777 -2006503 -1305557 -1251109 -1602479
42562a602479N52160K512761L517590K124869n87879k233829j740458o0386J300704
$$ -1602479 -1050319 1462442 4980032 7104901 6517022 4283193 2542735 2482349 3783053
42553C783053J676863J275524N37742j84619n46258l08724J19400l97675k355219
$$ 3783053 5459916 6735440 7273182 7088563 6542305 6233581 6352981 5955306 3600087
42544C600087m144293l362112k73068J729734O75298p31336Q91086L703683K809450
$$ 3600087 -544206 -3906318 -4179386 -2449652 -1774354 -2505690 -1614604 2089079 4898529
42535D898529j719379l816378k70560M015830L095656j489188l880893k815392
$$ 4898529 3179150 -637228 -907788 3108042 6203698 4714510 833617 -1981775
42527a981775j776975j788139k90004K710821L580349J561897N84020K257433
$$ -1981775 -3758750 -5546889 -5836893 -3126072 454277 2016174 2600194 4857627
42519D857627K564574j130156m792537l771185J5246J784821J312139J344709
$$ 4857627 7422201 6292045 1499508 -2271677 -2256431 -471610 840529 2185238
42511B185238J481643m49826k820772k153943L71299M61166j720877j781276R62039
$$ 2185238 3666881 3217055 396283 -1757660 -1386361 -925195 -2646072 -4427348 -3465309
42502c465309K280301P92395L54613K715111M119174K074797m26402q28016j403441
$$ -3465309 -1185008 -392613 -38000 2677111 6796285 8871082 8444680 7616664 6213223
42493F213223l680780m076621j92388L474363K015440j755884k014529N75956
$$ 6213223 2532443 -1544178 -1736566 1737797 3753237 1997353 -17176 558780
42485E58780R75055j044229j201464R30602J230503j187474k310970l22255J711921
$$ 558780 1533835 489606 -711858 218744 1449247 261773 -2049197 -2371452 -659531
42476f59531J535216N90743n1312j279278k129803M4765L873864M114321k01076
$$ -659531 875685 1466428 1415116 135838 -1993965 -1949200 1924664 6038985 5837909
42467E837909l415239j930027M29516n58688k616074j868577J29387j06256j196026
$$ 5837909 2422670 492643 922159 363471 -2252603 -4121180 -3991793 -4098049 -5294075
42458e294075L45870L175072L052757J31988j529057q32729m17776r35563n6443
$$ -5294075 -4948205 -1773133 1279624 1411612 -117445 -950174 -1367950 -2303513 -2359956
42449b359956K406569L433997J782986l51478j520226k613436l374850j806658
$$ -2359956 46613 3480610 5263596 4912118 3391892 778456 -2596394 -4403052
42441d403052J466428K592881K91843j753527o63426J341462J287446M09898J083449
$$ -4403052 -2936624 -343743 -51900 -1805427 -2468853 -1127391 160055 569953 1653402
42432A653402J869732R4004k609263k126419J429038L348230J055324k604566
$$ 1653402 3523134 3617138 1007875 -1118544 310494 3658724 4714048 2109482
42424B109482l725775j812327J222028L645537M060307J517385k646827m982779
$$ 2109482 -1616293 -3428620 -2206592 1438945 5499252 7016637 4369810 -612969
42416f12969l755766j082641L01143N65365J067393J075873p45815k765203j929145
$$ -612969 -4368735 -5451376 -5150233 -4584868 -3517475 -2441602 -3187417 -5952620 -7881765
42407g881765J177909K452004K93228j896539q59195J928234L082918K172203
$$ -7881765 -6703856 -4251852 -3958624 -5855163 -6714358 -4786124 -1703206 468997
42399D68997R99013J08611q88935j084271L08773J457107L33824j302466k81915
$$ 468997 1468010 1576621 687686 -396585 -87812 1369295 1703119 400653 118738
42390A18738K217579J874783j584343l429144j497328L51200j145204l343138
$$ 118738 2336317 4211100 2626757 -802387 -2299715 -1948515 -3093719 -6436857
42382f436857k593122l03616L65642N37309L094466O315628N673268J174912k394894
$$ -6436857 -9029979 -9333595 -8967953 -8430644 -5336178 979450 6652718 7827630 5432736
42373E432736k598933j811070k004218j846581m09017M25672o69395j895513j181722
$$ 5432736 2833803 1022733 -981485 -2828066 -3237083 -2811411 -3480806 -5376319 -6558041
42364f558041Q37303K333168K621721J787361J77821q24526n783J006430o05530
$$ -6558041 -5720738 -3387570 -765849 1021512 1199333 374807 369024 1375454 769924
42355G69924l571637k847632K722663P123742M974200p40334l084235r38442O71614
$$ 769924 -2801713 -5649345 -2926682 4197060 9171260 8430926 5346691 4408249 5079863
42346E079863j033312l130083k573612p03428k92115j294240j789956j159763
$$ 5079863 4046551 916468 -1657144 -2360572 -2652687 -3946927 -5736883 -6896646
42338f896646k40611M91764J152753J494605J072622J39936m66659k29887O60051
$$ -6896646 -7137257 -6645493 -5492740 -3998135 -2925513 -2785577 -3252236 -3482123 -2822072
42329b822072J572596J825669J113272j88029j288513j646805j295403o70979
$$ -2822072 -1249476 576193 1689465 1501436 212923 -1433882 -2729285 -3400264
42321c400264k66440j90430L0576P50231J247802L80403j422656j998562k41418
$$ -3400264 -3666704 -3857134 -3826558 -3076327 -1828525 -1448122 -2870778 -4869340 -5110758
42312e110758K025373K372599J113721N19750J168570J325139K29517l60783Q63122
$$ -5110758 -3085385 -712786 400935 920685 2089255 3414394 3643911 3283128 4146250
42303D146250K189922J283822r98092j668622l30278j27212k852349n455145l884266
$$ 4146250 6336172 7619994 6621902 4953280 4623002 4495790 1643441 -3811704 -7695970
42294g695970P95623L278343J199080j734693j228223J823106L544225K859255
$$ -7695970 -6900347 -3622004 -2422924 -4157617 -5385840 -3562734 -18509 2840746
42286B840746J699843P81602q78418k532500j948460K46827N52782j664339k513292
$$ 2840746 4540589 5322191 4443773 1911273 -37187 209640 762422 -901917 -3415209
42277c415209N4234K259859L54914k998179k761136M38901J552148o34911j947823
$$ -3415209 -3360975 -1101116 -746202 -3744381 -6505517 -6066616 -4514468 -5149379 -7097202
42268g097202K3530K322799J948153N74416J254989L317283L569764J075780j874023
$$ -7097202 -7073672 -4750873 -2802720 -2228304 -973315 2343968 5913732 6989512 5115489
42259E115489k975049k237088j207291r91503j229894q38917K45491P36849N8218
$$ 5115489 2140440 -96648 -1303939 -2295442 -3525336 -4364253 -4118762 -3381913 -3323695
42250c323695l93534M94400J263255J56069j366070n28465J804652J865968r20341
$$ -3323695 -3717229 -3222829 -1959574 -1803505 -3169575 -3698040 -1893388 -27420 -947761
42241i47761k614984q58375J661078J932644J060337J111108R57388j000651k634282
$$ -947761 -3562745 -4421120 -2760042 -827398 232939 1344047 2301435 1300784 -1333498
42232a333498r50650K438286L115807M89739j506528m25261J671845J820200k54636
$$ -1333498 -2284148 154138 3269945 3759684 2253156 1827895 3499740 5319940 5065304
42223E065304k875706m232427k962313O52921L635239K921614m31126k105416
$$ 5065304 2189598 -2042829 -5005142 -4352221 -716982 2204632 1773506 -331910
42215c31910k44262K203305J863821o77640k265622j179267J550749L562698L075484
$$ -331910 -576172 1627133 3490954 2813314 547692 -631575 919174 4481872 7557356
42206G557356N14860j524619j284317l81727j160612k228841l00596L407399L430019
$$ 7557356 8072216 6547597 5263280 4881553 3720941 1492100 1191504 4598903 8028922
42197H028922j465679m976006k071625L046896K901053k124266m604411j160260
$$ 8028922 6563243 1587237 -484388 2562508 5463561 3339295 -1265116 -2425376
42189b425376L275848L200258n38096l568063l855403k288219j90378J350313
$$ -2425376 850472 4050730 3512634 -55429 -3910832 -6199051 -6389429 -5039116
42181e039116J508151R02208J251998K656482L050654J514786m7271J2493O05131
$$ -5039116 -3530965 -2628757 -1376759 1279723 4330377 5845163 5797892 5810385 6415516
42172F415516L28431N5243P14608O37978j763814m179251k857084J630465M623324
$$ 6415516 6743947 6799190 7513798 8151776 6387962 2208711 -648373 982092 5605416
42163E605416L646848J172426J94229P7780j359611l769400m573951k536505P12888
$$ 5605416 9252264 10424690 10618919 10696699 9337088 5567688 993737 -1542768 -829880
42154h29880K582328K006779J76129p21355K80960J795429J639720m55814k489245
$$ -829880 1752448 3759227 3935356 3214001 3494961 5290390 6930110 6474296 3985051
42145C985051k690533j484997n89169r09311j770518j754347j64532J912705K350067
$$ 3985051 1294518 -190479 -779648 -1688959 -3459477 -5213824 -5378356 -3465651 -1115584
42136a115584O04244r98350q2636K133485K177166o04538k865581k032885L10064
$$ -1115584 -511340 -1509690 -1592326 541159 2718325 2113787 -751794 -2784679 -2474615
42127b474615J414454J395959J976282K979303K777483J194668n55111k025204
$$ -2474615 -1060161 335798 2312080 5291383 8068866 9263534 8708423 6683219
42119F683219l228867l133060j304837k23924k394375n360978l791342K523791
$$ 6683219 3454352 321292 -983545 -1207469 -3601844 -8962822 -12754164 -10230373
42111a0230373P023633M939792l05553k486077j130659l48158j208205o30840
$$ -10230373 -3206740 1733052 1427499 -1058578 -2189237 -2537395 -3745600 -4376440
42103d376440K262967L880493J863126j073940j515572l66899m43565j455915
$$ -4376440 -2113473 1767020 3630146 2556206 1040634 673735 230170 -1225745
42095a225745j068927L80532K31628j571394j818571P01799K801187J698656o97732
$$ -1225745 -2294672 -1914140 -1682512 -3253906 -5072477 -4370678 -1569491 129165 -568567
42086e68567j019252L07932M34605o60103k80047J760942K152240m58921k721469
$$ -568567 -1587819 -1279887 -845282 -1505385 -1785432 -24490 2127750 1668829 -1052640
42077a052640j576464R64824J077742r76111j804039n70357K00421n34835o04379
$$ -1052640 -2629104 -1664280 -586538 -1562649 -3366688 -3937045 -3736624 -4271459 -4875838
42068d875838J138571K277227O42769j918315k246200o37341K8523r24253j205131
$$ -4875838 -3737267 -1460040 -817271 -2735586 -4981786 -5619127 -5590604 -6514857 -7719988
42059g719988K15113J157507q0392j458623j4264L213873L919315M60534l464648
$$ -7719988 -7504875 -6347368 -6427760 -7886383 -7900647 -4686774 -767459 -306925 -3771573
42050c771573l460259O6121L067247L376012K464578J931460J177590l93688j369424
$$ -3771573 -7231832 -7165711 -4098464 -722452 1742126 3673586 4851176 4457488 3088064
42041C088064m22499J184198J184211n53665k143520k124308m21688K031587L271132
$$ 3088064 2665565 3849763 5033974 4480309 2336789 212481 -209207 1822380 5093512
42032E093512J444029k253449l634929q94200K132059J268004j531970j416389
$$ 5093512 6537541 4284092 649163 -245037 1887022 3155026 1623056 206667
42024B06667J231439J530015j339642k612063j88495J921169R43064K4260J809538
$$ 206667 1438106 2968121 1628479 -983584 -1172079 749090 1692154 1716414 3525952
42015C525952K987123K28806l206468k603103L14322Q53692m24623K44607J959911
$$ 3525952 6513075 6741881 3535413 932310 1246632 2100324 1675701 1920308 3880219
42006C880219P70318k162678j860722J184444J086127k982624m510130l85119
$$ 3880219 4650537 2487859 627137 1811581 2897708 -84916 -4595046 -4980165
41998d980165L701413K436799j284460k390034j535766j606122j451583Q42281
$$ -4980165 -1278752 1158047 -126413 -2516447 -4052213 -5658335 -7109918 -6267637
41990f267637K563241O12899k133681j266529J076568k39140l509589j967496
$$ -6267637 -3704396 -3091497 -5225178 -6491707 -5415139 -5654279 -9163868 -11131364
41982a1131364M548339P817761L332526k912809l438037N50040K669729R88833
$$ -11131364 -6583025 1234736 4567262 1654453 -1783584 -1233544 1436185 2425018
41974B425018j089385j311806q26302n08091N61376K242915K345102k1264k350252
$$ 2425018 1335633 23827 -802475 -1310566 -749190 1493725 3838827 3817563 1467311
41965A467311j877582M26225J041549j188222l406364k802648n36153K19534r69612
$$ 1467311 -410271 15954 1057503 -130719 -3537083 -6339731 -6875884 -6656350 -7625962
41956g625962j563171l05071J269714K178723L552126N271393M439946J1464l960381
$$ -7625962 -9189133 -9494204 -8224490 -6045767 -2493641 2777752 7217698 7229162 3268781
41947C268781l412839m20374P5048j851077j581721J964183M089792J516606k654709
$$ 3268781 -144058 -564432 -489384 -2340461 -3922182 -1957999 2131793 3648399 993690
41938I93690l422773j39886L779137M945455K248141k595649n458903l264309
$$ 993690 -2429083 -2568969 1210168 6155623 8403764 5808115 349212 -2915097
41930b915097J766043L914990J130990k535023k866770m92584J737319K788844
$$ -2915097 -1149054 2765936 3896926 1361903 -1504867 -1997451 -260132 2528712
41922B528712K520136K77000k637163k463004J523068M159574J223291l622439
$$ 2528712 5048848 5325848 2688685 225681 1748749 5908323 7131614 3509175
41914C509175l665469Q98974L347846K90252m163695m892666j992259R61902J546961
$$ 3509175 -156294 742680 4090526 4380778 217083 -4675583 -6667842 -5705940 -4158979
41905d158979j11871k147446k056096J079880M897404N970120L697201K40698
$$ -4158979 -4270850 -6418296 -8474392 -7394512 -2497108 3473012 7170213 7410911
41897G410911k656202m331883l663500k68254L131941L236119J111065P99213
$$ 7410911 4754709 422826 -3240674 -3508928 -376987 2859132 3970197 4769410
41889D769410K759103L083086K25140k206696j459430j5591r37759k610066j892420
$$ 4769410 7528513 10611599 10836739 8630043 7170613 7155022 6217263 3607197 1714777
41880A714777L18492Q13913m59446p78710L78448O18612j039878k406432j498076
$$ 1714777 2033269 2847182 2387736 1609026 1987474 2606086 1566208 -840224 -2338300
41871b338300O44703J618212Q02132j63261L34695J690162J647510o01116k735506
$$ -2338300 -1693597 -75385 726747 563486 898181 2588343 4235853 3634737 899231
41862H99231k136048K83490J351037M88087K50033J533468J793968l88995k404822
$$ 899231 -1236817 -953327 397710 885797 1135830 2669298 4463266 4074271 1669449
41853A669449j683001K96054Q76786M61306O97907Q28732n29914j856309q49924
$$ 1669449 -13552 282502 1159288 1620594 2318501 3147233 2617319 761010 -88914
41844h8914J268726J474441n5150n89394K08210R4081j200615j348409K43452
$$ -88914 1179812 2654253 2599103 2009709 2217919 2312000 1111385 -237024 6428
41835F428J262125L91684r56458j553780j831043j718528j87750K088421K575651
$$ 6428 1268553 1660237 703779 -850001 -2681044 -4399572 -4587322 -2498901 76750
41826G6750M52869k206699l497129l250894j277309K537466N696408M591618M2726
$$ 76750 529619 -1677080 -5174209 -8425103 -9702412 -7164946 -1468538 3123080 3165806
41817C165806k496552l41992K542474J792502p92156p00408J866719K483475n34609
$$ 3165806 669254 327262 2869736 4662238 3870082 3169674 5036393 7519868 6985259
41808F985259l706556l350218r2726K590440K719354J568403J378057K041549
$$ 6985259 3278703 -71515 -164241 2426199 5145553 6713956 8092013 10133562
41800A0133562J200073j753399l609000j693093J226668L31508l502341m366365
$$ 10133562 11333635 9580236 5971236 4278143 5504811 5836319 2333978 -2032387
41792b032387n08868K766589J726209l3015J469341L123591N5087n270742o041745
$$ -2032387 -2541255 225334 1951543 1918528 3387869 6511460 6566547 1295805 -4745940
41783d745940j448472K484022K002577l40891j150948l78847R24632K463810L089100
$$ -4745940 -6194412 -3710390 -1707813 -2048704 -3199652 -3578499 -2653867 -190057 2899043
41774B899043J233068j918851l091143j509476M10010J197036J476252Q96320
$$ 2899043 4132111 2213260 -877883 -2387359 -1977349 -780313 695939 1592259
41766A592259j668444m238705k875226J914451M660455K715510j28303j39306
$$ 1592259 -76185 -4314890 -7190116 -5275665 -615210 2100300 1971997 1832691
41758A832691J050435P92215M40475J895365L000751J095758j813906k245722
$$ 1832691 2883126 3675341 4115816 6011181 9011932 10107690 8293784 6048062
41750F048062j189729j856086l352068k056728J539971K849839L68833k023162
$$ 6048062 4858333 3002247 -349821 -2406549 -866578 1983261 2352094 328932
41742C28932j045763J745899L116125K195349r3476k794681m524587l597869j43448
$$ 328932 -716831 1029068 4145193 6340542 6247066 3452385 -1072202 -4670071 -4813519
41733d813519L339386M427165K638980j003398m402529m698163q31328L985983
$$ -4813519 -1474133 2953032 5592012 4588614 186085 -4512078 -5343406 -1357423
41725a357423N135361K364931k03053l07252k12717j870972l262729k050913L38590
$$ -1357423 3777938 6142869 5939816 5632564 5419847 3548875 286146 -1764767 -1426177
41716a426177J334250J290203J645518J380647q16870k707576j318200J421794
$$ -1426177 -91927 1198276 2843794 4224441 3407571 699995 -618205 803589
41708H03589Q08058k868957l947892j89563L208271J449240k265138j488160L672968
$$ 803589 1611647 -1257310 -5205202 -5394765 -2186494 -737254 -3002392 -4490552 -817584
41699h17584O659696L827398j029917k555257m88542J528433J248019m71864j933250
$$ -817584 5842112 9669510 8639593 6084336 5595794 7124227 8372246 7900382 5967132
41690E967132k394926j961001j158249o23691m81944k96652j7017j74235n58226
$$ 5967132 3572206 1611205 452956 -170735 -652679 -949331 -966348 -1140583 -1698809
41681a698809J37008K183088L403416J635921j940783l898553k923397j077559
$$ -1698809 -1561801 621287 4024703 5660624 3719841 -178712 -3102109 -4179668
41673d179668l29673l375J119963K039008R32037j552402k576531p86394J956057
$$ -4179668 -4509341 -4512716 -3392753 -1353745 -421708 -1974110 -4550641 -5337035 -3380978
41664c380978K995154J805516j17788j275592j194140q4650J450576K412790J966042
$$ -3380978 -385824 1419692 1301904 26312 -1167828 -1252478 198098 2610888 4576930
41655D576930L78415r96345j073878k52093O4359q23289k012822k085098q59239
$$ 4576930 4955345 3959000 2885122 2633029 2697388 1874099 -138723 -2223821 -3083060
41646c083060M39743Q30252P64315J165037J755842J311722l62829j720688j308500
$$ -3083060 -2643317 -1813065 -1048750 116287 1872129 3183851 2821022 1100334 -208166
41637b08166M27432J892506K188278J247267j017776l982323n201924k539715
$$ -208166 219266 2111772 4300050 5547317 4529541 547218 -4654706 -7194421
41629g194421K046779L566135M75981k466895n69170L701187L938859p70799m309091
$$ -7194421 -5147642 -1581507 -1105526 -3572421 -4141591 -440404 3498455 2727656 -1581435
41620a581435k216088K425997L917086J269181k109497l415259k258269M83567
$$ -1581435 -3797523 -1371526 2545560 3814741 1705244 -1710015 -3968284 -3484717
41612c484717K835385K488709o7495j150667P71483J975197o69389l559323j303940
$$ -3484717 -649332 1839377 1771882 621215 1392698 3367895 2698506 -860817 -2164757
41603b164757M043994N143775N68959k968254j130694J935189J221142j285062
$$ -2164757 1879237 7023012 7591971 4623717 3493023 5428212 6649354 5364292
41595E364292j112339P33250n71l102322m040076j106162K251351K566382M24582
$$ 5364292 4251953 4985203 4984632 1882310 -2157766 -3263928 -1012577 1553805 1978387
41586A978387j193973m04526K052845L477298J911856r70166j350880J212767
$$ 1978387 784414 379888 2432733 5910031 7821887 6851721 5500841 6713608
41578F713608K500170N2379k439953r66553J599305m10806n783955p240128k288065
$$ 6713608 9213778 9266157 6826204 5859651 7458956 7048150 1264195 -5975933 -8263998
41569h263998K971039K998040L70818O92612L939989N234793K217345k342384
$$ -8263998 -5292959 -2294919 -1924101 -1231489 2708500 7943293 10160638 7818254
41561G818254m721927m027330j733888L84771J384472J417675J337400J666684
$$ 7818254 3096327 -931003 -2664891 -2280120 -895648 522027 1859427 3526111
41553C526111J976686J429650k23035k089984k495649o30935J734206J556225
$$ 3526111 5502797 6932447 6709412 4619428 2123779 1492844 3227050 4783275
41545D783275j352736l224057j322822J817502K152290M76627Q07419L168691
$$ 4783275 3430539 206482 -1116340 701162 2853452 3330079 4137498 7306189
41537G306189L115537p88065m137155l313860l49304J412937K085455K396186
$$ 7306189 10421726 9633661 5496506 2182646 1833342 3246279 5331734 7727920
41529G727920M64125m081637o408780k456956L764520M811686N29487k055376
$$ 7727920 8192045 4110408 -2298372 -4755328 -990808 3820878 4350365 2294989
41521B294989M25226L287191J914450j421286k028057J66618J824792J653446
$$ 2294989 2720215 6007406 7921856 6500570 4472513 4639131 6463923 8117369
41513H117369R12670J55461j090262k182585j848145n91635l22063j577957k915921
$$ 8117369 9030039 9185500 8095238 5912653 4064508 3472873 3150810 1572853 -1343068
41504a343068l026394j947660l10063J170269J563010N58632n30497L6384K094455
$$ -1343068 -4369462 -6317122 -6627185 -5456916 -3893906 -3335274 -3865771 -3829387 -1734932
41495a734932L647631L390703J955877N43122l50845n47362Q8282R75659J052062
$$ -1734932 1912699 5303402 7259279 7802401 7451556 6904194 6992476 7968135 9020197
41486I020197K16530o01309j184695k257738l321511k334589R24654L157032J585885
$$ 9020197 9236727 8635418 7450723 5192985 1871474 -463115 461539 3618571 5204456
41477E204456j706200k350257J98587K286834J605020k48333j184819j218756
$$ 5204456 3498256 1147999 1346586 3633420 5238440 4990107 3805288 2586532
41469B586532o46289R85396K598378J696510j230273j977213R46061K861645j47417
$$ 2586532 1940243 2925639 5524017 7220527 5990254 4013041 4959102 7820747 7673330
41460G673330m224279l037136K110662L849463m6305l570930j879020K212004
$$ 7673330 3449051 411915 2522577 6372040 6325735 2754805 875785 3087789
41452C087789L686080K278797N91291p58760k271834k717021r59273J221933J385113
$$ 3087789 6773869 9052666 9643957 8885197 6613363 3896342 2937069 4159002 5544115
41443E544115j3482j070821j746873k802452l023492p82143K590045M059484K930720
$$ 5544115 5530633 4459812 2712939 -89513 -3113005 -3895148 -1305103 2754381 5685101
41434E685101R67870p54655k263556k554906k63755L315253M632693J993099k601850
$$ 5685101 6652971 5898316 3634760 1079854 816099 4131352 8764045 10757144 8155294
41425H155294n914938o080995l067589J264099L634373K255076m90101n86334
$$ 8155294 2240356 -3840639 -6908228 -5644129 -2009756 245320 -244781 -831115
41417h31115K064665L260729N84323k830005k589155Q27029K910191J476706n56380
$$ -831115 1233550 4494279 5078602 2248597 -340558 486471 3396662 4873368 4316988
41408D316988L71725L170924L367803o04159m630364l800110J331537N543246
$$ 4316988 4688713 7859637 11227440 10623281 5992917 2192807 3524344 9067590
41400I067590N500652K933323R33359q1807j226379k289799k213256j100741J15939
$$ 9067590 14568242 17501565 18434924 18353117 17126738 14836939 12623683 11522942 11638881
41391A1638881J040892J460158Q89873k19549m28423J69734n36350k847613l524638
$$ 11638881 12679773 14139931 15029804 14810255 14381832 14551566 14015216 11167603 7642965
41382G642965o29423K418358J382351k072369k622470P26523L542029K786319
$$ 7642965 7013542 9431900 10814251 8741882 6119412 6845935 10387964 13174283
41374A3174283K59470j382633j888499j599300j33600J729542K091461J091305
$$ 13174283 13433753 12051120 10162621 8563321 8429721 10159263 12250724 13342029
41366A3342029R11745J640900P12242k102126l008976J45747L905672L785779
$$ 13342029 14253774 15894674 16606916 14504790 11495814 11641561 15547233 19333012
41358A9333012K35201k827041l274760j812863L04245J759293R96413j621553
$$ 19333012 19568213 16741172 13466412 11653549 11957794 13717087 14713500 13091947
41350A3091947k821085l62857L176978L467487M65761j599054r5210K934426L972168
$$ 13091947 10270862 9908005 13084983 16552470 17018231 15419177 15323967 18258393 22230561
41341B2230561K105510p75227k305184j481153Q59474K848040L217620K157952
$$ 22230561 24336071 23560844 21255660 19774507 20633981 23482021 26699641 28857593
41333B8857593N35606j009842j903852j603210l15887J188095K851947N067739
$$ 28857593 29393199 28383357 26479505 24876295 24560408 25748503 28600450 33668189
41325C3668189O795382O075488L528675K963468O372536J0260613R793177N498918
$$ 33668189 40463571 46539059 50067734 53031202 59403738 69664351 79457528 84956446
41317H4956446K789385N019098R808117J2672497J1948215R248778O816682N550963
$$ 84956446 87745831 92764929 102573046 115245543 127193758 136442536 143259218 148810181
41309A48810181M732381K967522o7464k665017k613356J93176L487206N213678
$$ 148810181 153542562 156510084 156442620 153777603 151164247 151357423 154844629 160058307
41301A60058307N692992O880143R945746J4016091J7330526J9509708K2245410
$$ 160058307 165751299 172631442 182577188 196593279 213923805 233433513 255678923
41294B55678923K7189230L3450807L8241844M0072397L9928543L8583888L4047126
$$ 255678923 282868153 316318960 354560804 394633201 434561744 473145632 507192758
41287E07192758K3178517N716444j4113898l0159225l8636861m0543841l9952961
$$ 507192758 530371275 536087719 521973821 491814596 453177735 412633894 372680933
41280C72680933l9479325l7894166l3208698k7113728k3759763k3915577k3350122
$$ 372680933 333201608 295307442 262098744 234985016 211225253 187309676 163959554
41273A63959554j8626842j2094718q720859r492203j0728427r520845p272395
$$ 163959554 145332712 133237994 124517135 115024932 104296505 94775660 87503265
41266H7503265p092073r247060j0560939q297952l764294r92487j786161l689637
$$ 87503265 80411192 71164132 60603193 52305241 48540947 47548460 45762299 42072662
41258D2072662l905508l168505l354185l245885o32458K471054J746064k072683
$$ 42072662 38167154 34998649 31644464 28398579 27766121 30237175 31983239 29910556
41250B9910556l337672n13358Q30183k828821o480591m094861J901743M483057
$$ 29910556 26572884 26059526 26889709 24060888 17580297 13485436 15387179 19870236
41242A9870236K183276p35505k111143l445743m631736l499694q79430l84978
$$ 19870236 22053512 21318007 19206864 15761121 11129385 7629691 6750261 6365283
41234F365283k260465k564465K78980K852227K296748K81947m66946L6959O70784
$$ 6365283 4104818 1540353 1819333 4671560 6968308 7250255 6783309 6820268 7491052
41225G491052J455497K240931J825446J43171r86002o84947l40828r36158j393559
$$ 7491052 8946549 11187480 13012926 13156097 12170095 11485148 11144320 10208162 8814603
41216H814603p75004P1704J96661r3934l78083p00156o29320J50305L75112j008135
$$ 8814603 8039599 8111303 8307964 8214030 7835947 7135791 6506471 6656776 7031888 6023753
41206F023753j911610M59383M260805M528536Q35011j499765L04921K087824k17914
$$ 6023753 4112143 4571526 8832331 13360867 14195878 12696113 13001034 15088858 14870944
41197A4870944l808132l686366n92395Q58308j89746l11249J828881L458172K616798
$$ 14870944 11062812 7376446 6784051 7642359 7452613 7141364 8970245 12428417 15045215
41188A5045215J193628J618318L108113K929301K38132k667023k918683m32722
$$ 15045215 16238843 17857161 20965274 23894575 24132707 21465684 18547001 18114279
41180A8114279J966874K219817J669226K370769L076795J219308j572043n52729
$$ 18114279 20081153 22300970 23970196 26340965 29417760 30637068 29065025 28512296
41172B8512296M378322O998332L686137o53287N1350L629660L330149j537417
$$ 28512296 32890618 39888950 43575087 42921800 42973150 46602810 49932959 48395542
41164D8395542n086967m331412k710920l180377l764096k429845j286898k355201
$$ 48395542 43308575 38977163 36266243 33085866 29321770 26891925 25605027 23249826
41156B3249826l136936q57620J597937p30967o271794p491447j448055N096461
$$ 23249826 20112890 19255270 20853207 20122240 13850446 6358999 4910944 10007405
41148A0007405M458315j478518m323530j220465J873548q3509l779588l315639
$$ 10007405 14465720 12987202 8663672 7443207 9316755 9233246 5453658 2138019
41140B138019P16652K903652J471684l69280p79733j462424k841168k241952J225844
$$ 2138019 2854671 5758323 7230007 6860727 6080994 4618570 1777402 -464550 761294
41131G61294M162744L573596P95272j340009k220530k318502j320966M03066J051709
$$ 761294 4924038 8497634 9292906 7952897 5732367 3413865 2092899 2495965 3547674
41122C547674K4711j142427j740351k591209k644360P57429O105526P171535J690904
$$ 3547674 3572385 2429958 689607 -1901602 -4545962 -3788533 2316993 9488528 11179432
41113A1179432m071682l846563j65568O22234j626598k107612J57235J425118
$$ 11179432 7107750 3261187 3095619 3717853 2091255 -16357 140878 1565996
41105A565996N6169j691211k212099j764643J44521L529866N043698J753306l046018
$$ 1565996 1622165 -69046 -2281145 -4045788 -3901267 -371401 4672297 6425603 3379585
41096C379585l604453o14837J11571k352726k716471P32159K593581m84987l912095
$$ 3379585 -224868 -839705 -728134 -3080860 -5797331 -5065172 -2471591 -2956578 -6868673
41087f868673k546469J485601L009759J627117N78511Q16683P22570j20904n80833
$$ -6868673 -9415142 -7929541 -4919782 -3292665 -2714154 -1897471 -1174901 -1295805 -1876638
41078a876638k46520M89143J360954J554966p6654k689789l577571j975468j77923
$$ -1876638 -2123158 -1634015 -273061 1281905 1205251 -1484538 -5062109 -7037577 -7215500
41069g215500L55740Q59206J809399J383526n62206r57586J276909K505256L27035
$$ -7215500 -6859760 -6000554 -4191155 -2807629 -3369835 -4327421 -3050512 -545256 -218221
41060b18221j712468J88299L161966J896817k554203m165089j205595J755992
$$ -218221 -1930689 -1742390 1419576 3316393 762190 -3402899 -4608494 -2852502
41052b852502J486885L37113J235779K795134J961245j138159l458206k885930
$$ -2852502 -1365617 -1028504 207275 3002409 4963654 3825495 367289 -2518641
41044b518641k32580J954800J770518l57114k086241j672972K30892J800111K266315
$$ -2518641 -2751221 -796421 974097 616983 -1469258 -3142230 -2911338 -1111227 1155088
41035A155088J981862J135190k11369j297223j216427j49385Q32111R72288L67762
$$ 1155088 3136950 4272140 4060771 2763548 1547121 1397736 2229847 3202135 3569897
41026C569897k25158L9613Q94216N44799j985478m386791l395385K37559K222172
$$ 3569897 3344739 3384352 4278568 4823367 2837889 -1548902 -4944287 -4706728 -2484556
41017b484556R78306j94819J163413K659330J474504p53644j015476J02723M47311
$$ -2484556 -1506250 -1701069 -537656 2121674 3596178 2842534 1827058 1929781 2377092
41008B377092O63955K242517L464702J970127m99867q80986o55294l316399o991765
$$ 2377092 3041047 5283564 8748266 10718393 10218526 9337540 8682246 5365847 -1625918
40999a625918n948592K03486N028660M374193J268145k48301p00524j766995k158266
$$ -1625918 -7574510 -7371024 -2342364 2031829 3299974 3051673 2351149 584154 -1574112
40990a574112m89763J441513J688439J370796J776227J351200j128628l313796
$$ -1574112 -2063875 -622362 1066077 2436873 4213100 5564300 4435672 1121876
40982A121876k773685j133654r97293j177151P88020L305047K647505p27421k416386
$$ 1121876 -1651809 -2785463 -3782756 -4959907 -4171887 -866840 1780665 1053244 -1363142
40973a363142n95081J789377J766419k67516k402879l241659j701960J908863
$$ -1363142 -1958223 -168846 1597573 1330057 -1072822 -4314481 -6016441 -4107578
40965d107578M239300J931299k942426m388283p41891K796685K054447j03547
$$ -4107578 131722 2063021 -879405 -5267688 -6009579 -3212894 -1158447 -1261994
40957a261994P13977K806950J488801k550300l946437j173674J483461J263918
$$ -1261994 -548017 2258933 3747734 1197434 -2749003 -3922677 -2439216 -1175298
40949a175298O72678J869737K471237K69610k109847j454786M08679p1983j760497
$$ -1175298 -502620 1367117 3838354 4107964 1998117 543331 952010 880027 -880470
40940h80470j053508J113921N25163k369018k242194J996500M252463N80587m071653
$$ -880470 -1933978 -820057 -294894 -2663912 -4906106 -2909606 1342857 1923444 -2148209
40931b148209l151295J620278L332864L69779k303620j645140l73130j159234
$$ -2148209 -5299504 -3679226 -346362 23417 -2280203 -3925343 -4298473 -5457707
40923e457707k016738j22818L073101L701157R26118k083452k350977m83284N55631
$$ -5457707 -7474445 -7597263 -4524162 -823005 103113 -1980339 -4331316 -4814600 -4258969
40914d258969p13736k424081j761770J165352L190083K269515J95632j43196J262680
$$ -4258969 -4972705 -7396786 -9158556 -7993204 -4803121 -2533606 -2337974 -2481170 -1218490
40905a218490K178340J643677O71934N7201l46112m94669k95283n08847j596381
$$ -1218490 959850 2603527 3275461 3332662 2986550 2491881 2196598 1687751 91370
40896I1370k243953j187278K25295j01244j252222n72471J638857K344219Q88261
$$ 91370 -2152583 -3339861 -3114566 -3215810 -4468032 -5040503 -3401646 -1057427 -169166
40887a69166q1861L67652j15660j996772j707095K206512M939416J926812l503063
$$ -169166 -251027 116625 965 -1995807 -3702902 -1496390 3443026 5369838 1866775
40878A866775m293437J09121L373582J978207n24781m54519K38893j426604l249232
$$ 1866775 -2426662 -2317541 1056041 3034248 2509467 2054948 2293841 867237 -2381995
40869b381995j103331L605931N000568J338575k162774q47010K826855L248316
$$ -2381995 -3485326 120605 5121173 6459748 4296974 3449964 6276819 9525135
40861I525135k93301l261229k664288m44332L70694l13813q17819m72501L53872
$$ 9525135 9231834 5970605 3306317 2861985 3232679 2918866 2101047 1628546 1982418
40852A982418J314011J780187R75106m75905q09472P163j79915j926957k571838
$$ 1982418 3296429 5076616 6051722 5575817 4766345 4773508 4593593 2666636 94798
40843I4798n43206J400512K42155k343993k724239j024216j6805J31101J378038
$$ 94798 -448408 952104 1194259 -1149734 -3873973 -4898189 -4914994 -4783893 -3405855
40834c405855L097584K835203J306885J398576K254873J76714l941409m468984
$$ -3405855 -308271 2526932 3833817 5232393 7487266 7663980 3722571 -746413
40826g46413j96573K805986N38580k876918k535956l19629n9833m73719R50823
$$ -746413 -942986 1863000 2401580 -475338 -3011294 -3330923 -3390756 -3864475 -2913652
40817b913652J633848j370621l973740n44629N445977N171898j661625n803078
$$ -2913652 -1279804 -2650425 -6624165 -7168794 -1722817 3449081 1787456 -4015622
40809d015622k622906J704085J363320k68228J717669M395440K437354j952112
$$ -4015622 -6638528 -4934443 -3571123 -3839351 -2121682 2273758 4711112 2759000
40801B759000k407008R06370J803587j446696l692700j936606J36393o97182j537663
$$ 2759000 351992 1258362 3061949 1615253 -2077447 -4014053 -3877660 -4574842 -6112505
40792f112505R74397L916904K362065k290734m002889j219630J317754M74657
$$ -6112505 -5138108 -1221204 1140861 -1149873 -5152762 -6372392 -5054638 -4579981
40784d579981r41556R7232J498406R1924k359436j741271J579053L115018J013915
$$ -4579981 -5521537 -5424305 -3925899 -3833975 -6193411 -7934682 -6355629 -3240611 -2226696
40775b226696j740936k212615q66493P00891J965385K363849J151943m30372Q9597
$$ -2226696 -3967632 -6180247 -7046740 -6345849 -4380464 -2016615 -864672 -1295044 -1205447
40766a205447K265892K614282J63006j504450K3711J940043J023027r54410o50670
$$ -1205447 1060445 3674727 3837733 2333283 2356994 4297037 5320064 4365654 3714984
40757C714984Q07455j1197k421603k459079M99159K785010K257199O40896n21703
$$ 3714984 4522439 4511242 2089639 -369440 129719 2914729 5171928 5812824 5291121
40748E291121k015523l893114m135695k054842J56595R73681J729775L417651
$$ 5291121 3275598 -617516 -4753211 -6808053 -6651458 -5677777 -3948002 -530351
40740e30351M062532J682286k120901l976842k955017r47670K30525L23512j82758
$$ -530351 3532181 5214467 3093566 -883276 -3838293 -4785963 -4555438 -4231926 -4414684
40731d414684p60797q50737j72151R60024J963319K372319J956955J091076P92924
$$ -4414684 -5175481 -6026218 -6198369 -5238345 -3275026 -902707 1054248 2145324 2938248
40722B938248J463915J889537P54405j149476j831512j076454o49169j403046
$$ 2938248 4402163 6291700 7046105 5896629 4065117 2988663 2339494 936448
40714I36448k157978j863739r37543R7639J335917K178148J393158n22332j109556
$$ 936448 -1221530 -3085269 -4022812 -3925173 -2589256 -411108 982050 459718 -649838
40705f49838N84044K170806J185356j380968k617973j578153K36440J419683J809493
$$ -649838 -65794 2105012 3290368 1909400 -708573 -2286726 -2050286 -630603 1178890
40696A178890J493993M22171q67112j350855o56848N22165J188526Q61383j14644
$$ 1178890 2672883 3095054 2227942 877087 220239 742404 1930930 2792313 2677669
40687B677669p39515j92014J175680K080105J816475R97657M25892j68398j565353
$$ 2677669 1938154 1746140 2921820 5001925 6818400 7816057 8241949 8073551 6508198
40678F508198l428455l981235j826982J975977M357573L407553O01213j201210
$$ 6508198 3079743 -901492 -2728474 -752497 3605076 7012629 7613842 6412632
40670F412632j397516j410067j198223Q81711L927126L917781l43425m175534
$$ 6412632 5015116 3605049 2406826 3288537 7215663 11133444 10790019 6614485
40662F614485l388227n88124n38731j912991K01648M816909N181540o15358n851890
$$ 6614485 3226258 2638134 2099403 186412 388060 5204969 10386509 9771151 3919261
40653C919261m634654L47192K894753J622611n33762j589807j479515l12495J047404
$$ 3919261 -715393 -368201 2526552 4149163 3615401 2025594 546079 233584 1280988
40644A280988P48214j149463j828521O0902K113584K283610J959466K349051J553456
$$ 1280988 2029202 879739 -948782 -887880 1225704 3509314 5468780 7817831 9371287
40635I371287j376120l191753j379581J045281K59705j970820j709423J65081
$$ 9371287 7995167 4803414 3423833 4469114 4728819 2757999 1048576 1213657
40627A213657J41604j000954J85860K620114J773343k305281m511708k789928
$$ 1213657 1355261 354307 540167 3160281 4933624 2628343 -1883365 -4673293
40619d673293o40310m84742l64222J139404K142287J619001J345642J657776J89981
$$ -4673293 -5313603 -5798345 -6162567 -5023163 -2880876 -1261875 83767 1741543 1931524
40610A931524k898552l478444j15574K595588Q16506k713710l374319j194371
$$ 1931524 -967028 -4445472 -4561046 -1965458 -1148952 -3862662 -7236981 -8431352
40602h431352J317161L939697O595001O014326L67872n181459l924124K352013
$$ -8431352 -7114191 -3174494 3420507 9434833 9802705 4621246 697122 3049135
40594C049135N071515Q81995m210193m306823j423169n70418j639025q78251J994219
$$ 3049135 8120650 9002645 4792452 485629 -937540 -1507958 -3146983 -4025234 -2031015
40585b031015L146796Q00142k100808k420736r50063k09562l56447K71959J647126
$$ -2031015 1115781 1915923 -184885 -2605621 -3555684 -3765246 -4121693 -3849734 -2202608
40576b202608J837568L83324o25668K41804J576315J600196J037297J521398K429905
$$ -2202608 -365040 18284 -607384 -365580 1210735 2810931 3848228 5369626 7799531
40567G799531J716901o41506k386762k173812j046120n52067j070301k126382
$$ 7799531 9516432 8874926 6488164 4314352 3268232 2716165 1645864 -480518
40559d80518k899699k500330j107361l44132j018918j509705m57477L62550j056059
$$ -480518 -3380217 -5880547 -6987908 -7332040 -8350958 -9860663 -10318140 -9955590 -11011649
40550a1011649k511088l16602M090674N350127K481525M31870J663359K120260
$$ -11011649 -13522737 -13839339 -9748665 -4398538 -1917013 -1485143 178216 2298476
40542B298476j110750l735634q94664M411859N471902J675144j808146k363159
$$ 2298476 1187726 -2547908 -3442572 969287 6441189 8116333 6308187 3945028
40534C945028j870641j250427O78808K671135J403686k385552l539241j52789
$$ 3945028 2074387 823960 1502768 4173903 5577589 3192037 -347204 -499993
40526d99993L342355L152771J475791J659067K183893k52787m489644o287923
$$ -499993 2842362 5995133 7470924 9129991 11313884 11061097 6571453 283530
40518B83530m493196j721110K86094K091694L550115L129418R30695p29339p58048
$$ 283530 -4209666 -5930776 -5644682 -3552988 -2873 3126545 4057240 3327901 2569853
40509B569853o11133j050367m04192J997152L209227N39925l459727l541019P79963
$$ 2569853 1958720 908353 504161 2501313 5710540 6250465 2790738 -750281 29682
40500B9682L959154J865423k720213m376565k296916L492O98051J331685K584278
$$ 29682 3988836 5854259 3134046 -1242519 -3539435 -3535943 -2837892 -1506207 1078071
40491A078071K490967K97310j407322p46557J2057j897354m585821l632781J237067
$$ 1078071 3569038 3866348 2459026 1712469 1724526 -172828 -4758649 -8391430 -7154363
40482g154363N131585M294767O57756j270339j67293J243600L62663j968214k841841
$$ -7154363 -2022778 2271989 2929745 1659406 1492113 2735713 3098376 1130162 -1711679
40473a711679j180577R31510J199126J68344j68557O8212r33339k685529k131718
$$ -1711679 -2892256 -1960746 -761620 -593276 -761833 -693621 -1626960 -4312489 -6444207
40464f444207J298201L657829J993986r91198j108022R06301J315189N7481N15725
$$ -6444207 -5146006 -1488177 505809 -485389 -1593411 -687110 628079 685560 1201285
40455A201285K950664L279392m74650m822559n657042l052542L97628K855851
$$ 1201285 4151949 7431341 6956691 2134132 -3522910 -6575452 -6177824 -3321973
40447c321973L235526J154547j190494k47158L587303M987677P14795n262808
$$ -3321973 -86447 1068100 -122394 -369552 3217751 8205428 8920223 3657415
40439C657415o833495l510669K98520J708641J213365l06596k227577k552243
$$ 3657415 -3176080 -6686749 -6388229 -4679588 -3466223 -3772819 -6000396 -8552639
40431h552639K27105L661693L613272L59902j356793P43899L270943K538435j94536
$$ -8552639 -8325534 -4663841 -1050569 -690667 -2047460 -1303561 1967382 4505817 4311281
40422D311281j306455j65507R00358N22717m71186j059613j030769k46165J248792
$$ 4311281 3004826 2839319 3739677 4262394 3791208 2731595 1700826 1454661 2703453
40413B703453K386907J880828K1835j520414j824473j545247j459422j352168
$$ 2703453 5090360 6971188 6993023 5472609 3648136 2102889 643467 -708701
40405g08701q42651l17402k36840j69092N24424J360785J173957k6904p26911
$$ -708701 -1551352 -1868754 -2105594 -2274686 -1750262 -389477 784480 757576 30665
40396C0665J9663J106972Q95118m35517j236264p84067o497J83991n2282k76847
$$ 30665 50328 1157300 2052418 1616901 380637 -403430 -409927 -225936 -278218 -555065
40386e55065k49956O55123K845632M705350L379298j239488n059010m372952p23862
$$ -555065 -805021 -149898 2695734 7401084 10780382 9540894 4481884 108932 -614930
40377f14930J151428l87461k214326j250208J433211K443080O08742j630076j227304
$$ -614930 536498 149037 -2065289 -3315497 -1882286 560794 1169536 -460540 -1687844
40368a687844J623446L202722O53300l661135m329141k19830L229764J404360
$$ -1687844 -64398 3138324 3791624 130489 -4198652 -4418482 -1188718 215642
40360B15642k697401l099701j04726P54247j567991j690106K680883N954048L377415
$$ 215642 -2481759 -5581460 -5686186 -4931939 -6499930 -8190036 -5509153 444895 3822310
40351C822310r92283o54839L011807L441745l41438k759515j202580L55078j260445
$$ 3822310 2830027 2175188 5186995 8628740 8287302 5527787 4325207 4680285 3419840
40342C419840l392637k646706k99462P21310P25206J573191K612180J836864l72031
$$ 3419840 27203 -2619503 -2918965 -2197655 -1472449 100742 2712922 4549786 4177755
40333D177755j763331j638690j289543j593363k125157k169304j236835O19484
$$ 4177755 2414424 775734 -513809 -2107172 -4232329 -6401633 -7638468 -7018984
40325g018984J971037R48242j716728k494581K33866L280403K950328L70093o74921
$$ -7018984 -5047947 -4099705 -5816433 -8311014 -8077148 -4796745 -1846417 -1476324 -2151245
40316b151245K05759M6748j791523k159527P00919L953796L890475N94449k683621
$$ -2151245 -1945486 -1898738 -3690261 -5849788 -5148869 -1195073 2695402 3289851 606230
40307F06230l266335j087168J677343K333734L20806j661550p75578J852640K502668
$$ 606230 -2660105 -3747273 -2069930 263804 584610 -1076940 -1852518 122 2502790
40298B502790L74148j360211p87586n0884j104960k055118o18897J433515Q71655
$$ 2502790 2876938 1516727 729141 678257 -426703 -2481821 -3100718 -1667203 -795548
40289g95548j674874k725479j365335P4720N20919J600325L904748N129778L417325
$$ -795548 -2470422 -5195901 -6561236 -6486516 -5965597 -4365272 -460524 4669254 8086579
40280H086579J54719k103468k685510k360153j493235k95707K77899l90744j254353
$$ 8086579 8241298 6137830 3452320 1092167 -401068 -696775 -418876 -809620 -2063973
40271b063973q65697M28656J013017N73456O01159J900105K945911J817081r62180
$$ -2063973 -2929670 -2501014 -1487997 -914541 -313382 1586723 4532634 6349715 5387535
40262E387535k887016k708752j751484j456039j110571N79741K728573L086361
$$ 5387535 2500519 -208233 -1959717 -3415756 -4526327 -3946586 -1218013 1868348
40254A868348J312248o18818j360496j440008j260472k83443R78119O99158j172569
$$ 1868348 3180596 2561778 1201282 -238726 -1499198 -1782641 -804522 -105364 -1277933
40245a277933k077453p99663M04039j27534k16886K011618L535072O44821m031285
$$ -1277933 -3355386 -4155049 -3751010 -3878544 -4095430 -2083812 1451260 2096081 -1935204
40236a935204m314165O1717K683722L34235k164929J78691M699312N282270J186872
$$ -1935204 -6249369 -6187652 -3503930 -3169695 -5334624 -5155933 -456621 4825649 6012521
40227F012521k796028l322815j607382j93057O2557k90756l20407O08442J860248
$$ 6012521 3216493 -106322 -1713704 -1906761 -1844204 -2134960 -2455367 -1846925 13323
40218A3323J898891P12390L74650J640867J947238p74190m086216m030860r37356
$$ 13323 1912214 2624604 2999254 4640121 6587359 5813169 1726953 -2303907 -3241263
40209c241263J282198J040836M63902P70196L40687j368258j734718Q62170L557929
$$ -3241263 -1959065 -918229 -454327 315869 656556 -711702 -2446420 -1584250 1973679
40200A973679K593821j202967l418712j929470P78096J339212m81800k325782
$$ 1973679 4567500 3364533 -54179 -1983649 -1205553 133659 -348141 -2673923
40192b673923k462352j266586J65198J657955L485951M771305L739304K40859
$$ -2673923 -5136275 -6402861 -6237663 -4579708 -1093757 3677548 7416852 7657711
40184G657711l068987l446546j462607j30090p32924j330480J1055K164943K385569
$$ 7657711 4588724 1142178 -320429 -450519 -1183443 -2513923 -2502868 -337925 2047644
40175B047644r8175l157119m064010j907674J885191M638755M348090J346155
$$ 2047644 1949469 -1207650 -5271660 -7179334 -5294143 -655388 3692702 5038857
40167E038857j924530l227878k478734j140536k86850k4k34145j062914j844941
$$ 5038857 3114327 -113551 -2592285 -3732821 -4019671 -4019695 -4253840 -5316754 -7161695
40158g161695j237186J120841L466308L481510J058550j385927j756409o46912
$$ -7161695 -8398881 -7278040 -3811732 -330222 728328 -657599 -2414008 -3060920
40150c060920p7004n00427m58839P46617J655224Q84749m23047k515K085969L156528
$$ -3060920 -3137924 -3638351 -4097190 -3350573 -1695349 -810600 -1233647 -1236162 849807 4006335
40140D006335J475097j320624k424811j552834r22244j683222k055152n0574K990286
$$ 4006335 5481432 4160808 1735997 183163 -739081 -2422303 -4477455 -4528029 -1537743
40131a537743L423806P7287l675706l755276k25439L195148L826723K358154N61366
$$ -1537743 1886063 1963350 -1712356 -5467632 -5693071 -2497923 1328800 3686954 4248320
40122D248320j119050k720241l233670j610488J354646L501239L512270J863393
$$ 4248320 3129270 409029 -2824641 -4435129 -3080483 420756 3933026 5796419
40114E796419j20548j411646j696968j279000n86373K65566J123741J301900L60791
$$ 5796419 5675871 4264225 2567257 1288257 701884 967450 2091191 3393091 3753882
40105C753882p68026p53720j5088k52703j499266j600667N13167K965851L457636
$$ 3753882 2985856 2232136 2217048 1964345 465079 -1135588 -622421 2343430 5801066
40096E801066J788703j190851m750104o857070m570262J345575M864918J641365
$$ 5801066 7589769 6398918 1648814 -5208256 -9778518 -8432943 -3568025 -1926660
40088a926660m333298n471360r53807K675188J368145j337506q30488J743476
$$ -1926660 -6259958 -11731318 -12685125 -10009937 -8641792 -9979298 -10809786 -9066310
40080i066310K329682L48664j387680j334966m86079K53070J217040K469832L020813
$$ -9066310 -6736628 -6387964 -7775644 -9110610 -9596689 -9343619 -8126579 -5656747 -2635934
40071b635934K047831J51354r34014q2641J469120R29631k331996m947636l562410
$$ -2635934 -588103 -436749 -1370763 -1453404 15716 945347 -1386649 -6334285 -9896695
40062i896695K51717K175465J704138K385754M987590N330176J187503l248667
$$ -9896695 -9644978 -7469513 -5765375 -3379621 1607969 6938145 8125648 4876981
40054D876981l423815j166860r05426k132877j047581K041492K882020O56464
$$ 4876981 1453166 286306 -619120 -2751997 -3799578 -1758086 1123934 1780398
40046A780398n70499J102423K234692J93907k125345j080664J705174K067621
$$ 1780398 1209899 2312322 4547014 4740921 2615576 1534912 3240086 5307707
40038E307707k33380j897337j656077j224574r94325Q34283L848356M296401O71540
$$ 5307707 5074327 3176990 1520913 296339 -697986 136297 3984653 8281054 8952594
40029H952594k967501k547047k48554r22502l775972l094036K299860O017771
$$ 8952594 5985093 3438046 3189492 2266990 -1508982 -4603018 -2303158 3714613
40021C714613L197326k204591l380292l26256J626052O33626j17018J033943J872011
$$ 3714613 6911939 4707348 1327056 1000800 2626852 3260478 3143460 4177403 6049414
40012F049414J121949N11236Q17349M13493q81786r33430K58878j34670k209472
$$ 6049414 7171363 7682599 8499948 8913441 8031655 7098225 7357103 7222433 5012961
40003E012961k056108J372663L223879J27610m114968m494538k168094j079218
$$ 5012961 2956853 4329516 7553395 7681005 3566037 -928501 -3096595 -4175813
39995d175813j112888l8478J041660N9055q99191J062795L441863J941207j503964
$$ -4175813 -5288701 -5327179 -4285519 -4226464 -5125655 -4062860 -620997 1320210 -183754
39986a83754j290746K250993L126280m68588l787619l775725k584782j566887
$$ -183754 -1474500 776493 3902773 3434185 -353434 -4129159 -6713941 -8280828
39978h280828J054884M390399L886266p44173l228656k08666L162475J596512
$$ -8280828 -7225944 -2835545 1050721 306548 -2922108 -3130774 31701 1628213
39970A628213k053188k244104L28938J215537R289l75117L01938J01891l25405
$$ 1628213 -424975 -2669079 -2340141 -1124604 -1115315 -1490432 -1188494 -1086603 -1412008
39961a412008J125840L225183K722724j61895k019411j633700j047767j475584
$$ -1412008 -286168 2939015 5661739 5499844 3480433 1846733 798966 -676618
39953f76618j846315j436200q11831j69139P39201J477101J891566K994524M555599
$$ -676618 -2522933 -3959133 -4770964 -4940103 -4200902 -2723801 -832235 2162289 6717888
39944F717888L779564m65864m198675l118846Q29766K196728J6725j918933j965697
$$ 6717888 10497452 10031588 5832913 2714067 3543833 5740561 5757286 3838353 1872656
39935A872656k260753l328159k711689j64440J051533j56925n99293J388171K615060
$$ 1872656 -388097 -3716256 -6427945 -6592385 -5540852 -5697777 -6297070 -4908899 -2293839
39926b293839M18101k646252k856001q31779M51799N07202P35227J115005Q52073
$$ -2293839 -1875738 -4521990 -7377991 -8209770 -7757971 -7250769 -6515542 -5400537 -4548464
39917d548464O75200J422842J876738R17067J62135J265737K232321K11805l191512
$$ -4548464 -3873264 -2450422 -573684 343383 505518 1771255 4003576 4215381 1023869
39908A023869l667898q82828J088651M97916L85675K549255L564742K53132m172917
$$ 1023869 -2644029 -3526857 -2438206 -1940290 -1554615 994640 4559382 4812514 639597
39899F39597l945038P69635L893653K084196j015072p59957J891938K657235M96079
$$ 639597 -3305441 -2535806 1357847 3442043 2426971 1667014 3558952 6216187 6712266
39890F712266j641548j820051j335249j456134j059525Q98157K733262K041099
$$ 6712266 5070718 3250667 1915418 459284 -600241 297916 3031178 5072277
39882E072277o52880k282235j156454J016168J396318n33531k380307j715302
$$ 5072277 4419397 2137162 980708 1996876 3393194 2859663 479356 -1235946
39874a235946Q27825K164988Q33075r22514n92315N41089l50106k189076r95937
$$ -1235946 -408121 1756867 2589942 1667428 1075113 1616202 1266096 -922980 -1918917
39865a918917K983887L943369j066846o651176o123044q65380K324454J153578
$$ -1918917 1064970 5008339 3941493 -2709683 -8832727 -9698107 -7373653 -6220075
39857f220075m70201J58471J238739J182198J296113K102335J565406q57098k395127
$$ -6220075 -6690276 -6531805 -5293066 -4110868 -2814755 -712420 852986 -4112 -2399239
39848b399239j584086r64682k345831k914178K22049M350300M438214P05817j590745
$$ -2399239 -3983325 -4948007 -7293838 -10208016 -9985967 -5635667 -1197453 -491636 -2082381
39839b082381M8456J890909k66850m808795o252182k416739K782447M347172K395579
$$ -2082381 -2033925 -143016 -409866 -5218661 -11470843 -13887582 -11105135 -6757963 -4362384
39830d362384J401676L448453M961952K002687l353840n292976k181439J556949
$$ -4362384 -2960708 487745 5449697 7452384 4098544 -1194432 -3375871 -1818922
39822a818922J965769K74773m01639J54528J39858q15424j456372r08372P40915
$$ -1818922 146847 421620 19981 174509 314367 -501057 -1957429 -2865801 -2124886
39813b124886K657083L092809P67259k679052l838681k186987q52598j367904
$$ -2124886 532197 3625006 4392265 1713213 -2125468 -4312455 -5165053 -6532957
39805f532957j023776K133477N049902L961265L50330j433145o96484l20549j249114
$$ -6532957 -7556733 -5423256 -373354 3587911 3938241 2505096 1808612 1488063 238949
39796B38949j368119K57561J781610J606361J94100j270490j745385m04421J820010
$$ 238949 -1129170 -871609 910001 2516362 2710462 1439972 -305413 -709834 1110176
39787A110176J935507j037210l271178j110185K764421K912291k31650j149935
$$ 1110176 3045683 2008473 -1262705 -2372890 391531 3303822 3072172 1922237
39779A922237J339217K093025j214563l583306q71421L163977K819429q33348
$$ 1922237 3261454 5354479 4139916 556610 -314811 2849166 5668595 4835247
39771D835247k526154j083870M06189Q30580J850949L092895J757775k394501
$$ 4835247 2309093 1225223 1631412 2461992 4312941 7405836 9163611 6769110
39763F769110n835167n919314l493395l55746K592320M015349K382528j151643
$$ 6769110 933943 -4985371 -8478766 -8834512 -6242192 -2226843 155685 -995958
39755i95958k965104j530071O54083R98621K31164K96228J207621J919569K335813
$$ -995958 -3961062 -5491133 -4837050 -3838429 -3607265 -3311037 -2103416 -183847 2151966
39746B151966K443865J318731q23860j441137Q00534K903288J180836l007283
$$ 2151966 4595831 5914562 5090702 3649565 4450099 7353387 8534223 5526940
39738E526940m796497k760676l94921j61431j93729J360906K536527R63644j743481
$$ 5526940 730443 -2030233 -2425154 -2586585 -2780314 -1419408 1117119 2080763 337282
39729C37282k378706j037133k51980o12203o92742l96442p40906q49201J012473
$$ 337282 -2041424 -3078557 -3330537 -3942740 -4635482 -5031924 -5772830 -6622031 -5609558
39720e609558L458713L107432J66490j380052k81304p5926k471001l448515K36774
$$ -5609558 -2150845 956587 1123077 -256975 -538279 -614205 -3085206 -6533721 -6296947
39711f296947M673303M016460m37769k130936P60160L069197J140641j783195
$$ -6296947 -1623644 2392816 1955047 -175889 584271 3653468 4794109 3010914
39703C010914j099332K218111L581699J476887j200654j846045j351721j940404
$$ 3010914 1911582 4129693 7711392 9188279 7987625 6141580 4789859 2849455
39695B849455l503404l616451j103174J842131K355343R72832P94231K419942
$$ 2849455 -653949 -4270400 -5373574 -3531443 -1176100 -203268 590963 3010905
39687C010905K626973m29618l640981l300986o23542O34015J83319N25987J393303
$$ 3010905 5637878 5208260 1567279 -1733707 -2357249 -1723234 -1539915 -1013928 379375
39678C79375p1035l399838m213530r73342K279250K073063K57006o9258M53253
$$ 379375 308340 -3091498 -7305028 -8278370 -5999120 -3926057 -3669051 -3738309 -3285056
39669c285056n5475m10283J335370L434835K629843l18314j473103J39338J194616
$$ -3285056 -3340531 -3750814 -2415444 1019391 3649234 3330920 1857817 1997155 3191771
39660C191771m71979k547232j925984P99731K518620J829580J39883r29958j479345
$$ 3191771 2719792 172560 -1753424 -953693 1564927 3394507 3534390 2604432 1125087
39651A125087k276730k956203k363578m97353J046269J062374K24129k13004j83969
$$ 1125087 -1151643 -4107846 -6471424 -6968777 -5922508 -4860134 -4636005 -4849009 -5032978
39642e032978p3365O79420K311010K990633J017085j605211j042574K436528L949665
$$ -5032978 -5106343 -4426923 -2115913 874720 1891805 286594 -755980 1680548 5630213
39633E630213R24260k889884k861123k7869J206833p5826q45269J62763M43736
$$ 5630213 6554473 3664589 803466 775597 1982430 1906604 1061335 1224098 1667834
39624A667834j640192l603121k353261R39758K050576n34120l285956k167870
$$ 1667834 27642 -3575479 -5928740 -4988982 -2938406 -3472526 -6758482 -8926352
39616h926352J853815L973020K183817L9310J125197L313367J933010k642359
$$ -8926352 -7072537 -3099517 -915700 -876390 248807 3562174 5495184 2852825
39608B852825m945310k250431J837953L061211J807832N15996n86002k042908
$$ 2852825 -2092485 -4342916 -2504963 556248 2364080 2880076 2294074 251166
39600B51166k353319j95163K388959K441424M23054r65787j061793j194681j348436
$$ 251166 -2102153 -2297316 91643 2533067 2956121 1990334 928541 -266140 -1614576
39591a614576j78897J955775K924958J858993k5089j504932k258550k046374r37414
$$ -1614576 -1793473 162302 3087260 4946253 4921164 3416232 1157682 -888692 -1826106
39582a826106O0451L14759P25300J781434J721262r03359l839004l264924R08565
$$ -1826106 -1765655 -1450896 -725596 1055838 2777100 1873741 -1965263 -5230187 -4321622
39573d321622M509190M086050M58438k805936k968558l91659J700207N17394k480867
$$ -4321622 187568 4273618 4732056 1926120 -1042438 -1434097 266110 783504 -1697363
39564a697363k892802M31530L377225K844594J567441L050217M949037K608651
$$ -1697363 -4590165 -4158635 -781410 2063184 3630625 6680842 11629879 14238530
39556A4238530k883724n876941m455899j912314k39434J915901M152820L110169
$$ 14238530 11354806 5477865 1021966 -890348 -1129782 786119 4938939 8049108
39548H049108j656358n499027m788981j345381J252732K121351J878468N40557
$$ 8049108 6392750 893723 -3895258 -5240639 -3987907 -1866556 11912 552469
39540E52469j198794j595362o72504o04903j747820j401235J683942M622436M289632
$$ 552469 -646325 -2241687 -2914191 -3519094 -5266914 -6668149 -4984207 -361771 3927861
39531C927861J367374j302645k116692j088027P86387J428160n73780l351199
$$ 3927861 5295235 3992590 1875898 787871 1574258 3002418 2428638 -922561
39523i22561l649153j717555q95168j940938j973153J07302J770628J763643J998983
$$ -922561 -4571714 -6289269 -7184437 -9125375 -11098528 -10991226 -9220598 -7456955 -5457972
39514e457972K861947J892010n99954k52810L847982O046141K538139k410782
$$ -5457972 -2596025 -704015 -1303969 -1556779 2291203 8337344 10875483 8464701
39506H464701l336887j550514r03556n04105J969214L794409J192787l095901
$$ 8464701 5127814 3577300 2673744 2169639 4138853 7933262 9126049 6030148
39498F030148l400503k73070R76599n93343j093350K61167K080k502815l583223
$$ 6030148 2629645 2356575 3333174 2739831 1646481 1907648 1909728 -593087 -4176310
39489d176310j870827k52963m3720R38276K971118K848004j66281k041620k88059
$$ -4176310 -6047137 -6300100 -6343820 -5405544 -2434426 413578 247297 -1794323 -2082382
39480b082382K030299J528949k09431J07961J938301K019566o51317l607084l878180
$$ -2082382 -52083 1476866 1267435 1375396 3313697 5333263 4681946 1074862 -2803318
39471b803318q38083L037908L890006L74919m181637n358780k960141l46976R03447
$$ -2803318 -3641401 -603493 3286513 3661432 -520205 -5878985 -8839126 -9186102 -8282655
39462h282655K218427L874413L625020P53449j927119j987795p38006q23055k366593
$$ -8282655 -6064228 -2189815 1435205 2188654 261535 -1726260 -2464266 -3287321 -5653914
39453e653914l186744j738623J171949L011999J945385o67071j352329O49972
$$ -5653914 -8840658 -10579281 -9407332 -6395333 -4449948 -5117019 -6469348 -5819376
39445e819376J838976J05593r62332K366857O674935N598097L4208k811285q14038
$$ -5819376 -3980400 -3874807 -4837139 -2470282 4204653 9802750 9836958 7025673 6211635
39436F211635J54117l252560n888069k808592K349213L230498M42756p27082O44678
$$ 6211635 6365752 3113192 -2774877 -5583469 -3234256 -3758 438998 -288084 356594
39427C56594O45465j961307l467539j148028K743306M361034L000968Q80068l72595
$$ 356594 1002059 -959248 -4426787 -5574815 -2831509 1529525 4530493 5410561 5037966
39418E037966j332904k817171l554764j574115J896264K546048j034395m132302
$$ 5037966 3705062 887891 -2666873 -4240988 -2344724 201324 -833071 -4965373
39410d965373k133341K318021L182936M28575n55091J464009J626367k012877
$$ -4965373 -7098714 -4780693 -1597757 -1169182 -1724273 -260264 1366103 -646774
39402f46774m637556k750675L66492J091909J386276L653984N098984K669634
$$ -646774 -5284330 -8035005 -7668513 -6576604 -5190328 -1536344 3562640 6232274
39394F232274q18156j237712r8743j066628k791040j515472J527322J779234r07151
$$ 6232274 5414118 4176406 4077663 3011035 219995 -1295477 231845 2011079 1103928
39385A103928k237271n69019J416566J873355J645187J009590q86243l167993
$$ 1103928 -1133343 -1702362 -285796 1587559 3232746 4242336 3356093 188100
39377A88100l726599k558024j235916K53176K519003L633427J254139k643033
$$ 188100 -3538499 -6096523 -7332439 -7079263 -4560260 -926833 327306 -2315727
39369b315727l465219m20163K641155K830788J112240l93447p26070J42865J073887
$$ -2315727 -5780946 -6201109 -3559954 -729166 383074 -10373 -736443 -593578 480309
39360D80309Q1123k485109k926101L16729K768362J72911l935294k974049K155787
$$ 480309 561432 -1923677 -4849778 -4533049 -1764687 -1591776 -5527070 -8501119 -6345332
39351f345332M357873J606789o68988O27875J681190n50759k848841j606628J194296
$$ -6345332 -1987459 -380670 -1049658 -421783 1259407 708648 -2140193 -3746821 -2552525
39342b552525J872242P88356M11301P97916M22842o98564j280954n29134J607810
$$ -2552525 -680283 108073 519374 1317290 1740132 1041568 -239386 -768520 839290
39333H39290M013271M072055O03479l130473l050047m08148L46338p50303K44036
$$ 839290 4852561 8924616 9528095 6397622 3347575 2939427 3285765 2535462 2779498
39324B779498K851401J944140k534477l733535Q44149M250558J222277l095640
$$ 2779498 5630899 7575039 5040562 1307027 2151176 6401734 7624011 4528371
39316D528371j982445J848958J726562j623119k489038l78521M71086n49329m84629
$$ 4528371 2545926 4394884 6121446 4498327 2009289 1630768 2101854 1552525 1067896
39307A067896K86549j149939l457666k472069R53250J743832o24586j289755J321104
$$ 1067896 1354445 204506 -3253160 -5725229 -4771979 -3028147 -3652733 -4942488 -3621384
39298c621384K961734J192228r78873j029191m67401k71754J362172M092048L845346
$$ -3621384 -659650 532578 -446295 -1475486 -1942887 -2214641 -852469 3239579 7084925
39289G084925o04092m427147l564182l68563R85107M87207L7255o90490k000449
$$ 7084925 6480833 2053686 -1510496 -1879059 -893952 -406745 -369490 -1059980 -3060429
39280c060429j504268J792922L981206J642590k080012k034577P37440J239523
$$ -3060429 -4564697 -2771775 1209431 2852021 772009 -1262568 -525128 714395
39272G14395o88479m89265K395915K891673r58162l963211j773145K302291K779477
$$ 714395 25916 -463349 1932566 4824239 3866077 -97134 -1870279 432012 3211489
39263C211489M08990k2645K039205K393907n92343l221088k211194O67594J656547
$$ 3211489 3620479 3597834 5637039 8030946 7438603 4217515 2006321 2673915 4330462
39254D330462J3550k098331k860110k012740k23399R94783n1930k861575m164354
$$ 4330462 4344012 2245681 -614429 -2627169 -2850568 -1855785 -1907715 -4769290 -8933644
39245h933644j786851J820333K364487l66473k086927L7703L609393M465838J997306
$$ -8933644 -10720495 -8900162 -6535675 -6902148 -8989075 -8951372 -5341979 -876141 1121165
39236A121165p95079j501231p00824k56850o32563o55047L94494J369857Q06408
$$ 1121165 326086 -1175145 -1875969 -2132819 -2765382 -3420429 -3025935 -1656078 -849670
39227h49670m67392l8933K073003K340459j252114n057727m020816Q67862L452713
$$ -849670 -1317062 -1355995 717008 3057467 1805353 -3252374 -7273190 -6405328 -2952615
39218b952615J032967k083836j107391K878705N315034L958118m5265m269088
$$ -2952615 -1919648 -4003484 -5110875 -2232170 3082864 7040982 6995717 2726629
39210B726629n883880k998395K327470M818538K326962j089215j217193J86677
$$ 2726629 -3157251 -6155646 -3828176 990362 3317324 2228109 1010916 1197593
39202A197593q59694l501371l729432j395655o8537m97754K39327K668922L369983
$$ 1197593 337899 -3163472 -6892904 -8288559 -8357096 -8854850 -8615523 -5946601 -2576618
39193b576618Q95752j521143j212304Q6541k558m97447M42443J890183J899681
$$ -2576618 -1680866 -3202009 -4414313 -4327772 -4330330 -4827777 -4385334 -2495151 -595470
39184e95470Q18862L16213O82441J171496J545622J556546M88166j224878j758374
$$ -595470 223392 539605 1222046 2393542 3939164 5495710 5983876 4758998 3000624
39175C000624q84948j069711l555997n501675l637531Q72136M010289M106615
$$ 3000624 2115676 1045965 -2510032 -8011707 -11649238 -10777102 -6766813 -2660198
39167b660198K672756J096333m30127j213038m49025N87050l30547k572090k787243
$$ -2660198 12558 1108891 678764 -534274 -983299 -396249 -726796 -3298886 -6086129
39158f086129J25057K765181J701715j679359k970996m80529K974127L987097
$$ -6086129 -5961072 -3195891 -1494176 -3173535 -6144531 -6625060 -3650933 336164
39150C36164K497966J040729J126438J613783O84040j557748l238663l179799
$$ 336164 2834130 3874859 5001297 6615080 7299120 5741372 2502709 -677090
39142f77090k210582j642526j280714K3893K075549K875553J176812j275698j329257
$$ -677090 -2887672 -4530198 -5810912 -5787019 -3711470 -835917 340895 -934803 -2264060
39133b264060J653633M671093M601299J790463j128333l000881m511350n122205
$$ -2264060 -610427 4060666 8661965 10452428 9324095 6323214 1811864 -3310341
39125c310341k856750J640439M011231J840728j099571K4304L483069L279301
$$ -3310341 -6167091 -4526652 -515421 1325307 225736 250040 3733109 7012410
39117G012410j324083m106531j303848K565957J729663k222596l531097j321297
$$ 7012410 5688327 1581796 277948 2843905 4573568 2350972 -1180125 -2501422
39109b501422J28787q61239j177748P76468J992463M22747r03007J043372L454250
$$ -2501422 -2372635 -3233874 -4411622 -3635154 -1642691 -1219944 -2122951 -1079579 2374671
39100B374671J608563l090216m210633K83146M532824K779143k819425n521579
$$ 2374671 3983234 893018 -3317615 -3034469 1498355 4277498 1458073 -4063506
39092d063506k912055J104103K365856J078864L899O79807K365793L066962J124683
$$ -4063506 -6975561 -5871458 -3505602 -2426738 -2422839 -1743032 622761 3689723 4814406
39083D814406k714675m850484k523934J960062L359512M10230k445582j528062
$$ 4814406 2099731 -2750753 -5274687 -3314625 44887 455117 -1990465 -3518527
39075c518527J161853J748264J81441r65925r75096o89610L27446K362783K702709
$$ -3518527 -2356674 -608410 -426969 -1392894 -2367990 -3057600 -2730154 -367371 2335338
39066B335338j263917o603169p181851j993770L128884L279512J28499j747880
$$ 2335338 1071421 -5531748 -12713599 -14707369 -11578485 -8298973 -8170474 -9918354
39058i918354p76111J363340K704414K245274K30886j392813o95208J184845J001470
$$ -9918354 -10694465 -9331125 -6626711 -4381437 -4150551 -5543364 -6238572 -5053727 -4052257
39049d052257j761806l741907k491753M37311K542354L479220L488117J888978
$$ -4052257 -5814063 -9555970 -12047723 -11610412 -9068058 -5588838 -2100721 -211743
39041b11743o57319j356211O99172K375862J024544j428960j799459n32896j0808
$$ -211743 -869062 -2225273 -1526101 849761 1874305 445345 -1354114 -1887010 -1897818
39032a897818k35384J44135L69596q88562j856330K86536M205242N301870K043777
$$ -1897818 -2133202 -1989067 -1619471 -2508033 -4364363 -4077827 127415 5429285 7473062
39023G473062k060296l428238k460513j746114k364591k916495j189232L244644
$$ 7473062 5412766 1984528 -475985 -2222099 -4586690 -7503185 -8692417 -5447773
39015e447773P424307P165724K141830k788776l230813n23529R81498M1389j184668
$$ -5447773 1976534 9142258 11284088 8495312 5264499 4740970 5722468 5763857 4579189
39006D579189j458716j466313j288249l42340O08955N44579O17920K248860L639873
$$ 4579189 3120473 1654160 365911 23571 632526 1177105 1795025 4043885 7683758
38997G683758J929333j798862l648628k658338j273063m71147Q87653J908469
$$ 7683758 9613091 7814229 4165601 1507263 234200 -236947 650706 2559175
38989B559175J94087k710746k021331K428456M576695J012866l739075m213369
$$ 2559175 2753262 42516 -1978815 449641 5026336 6039202 2300127 -1913242
38981a913242j533372J25167M04597J281756J945498L63555k041834k154153l10949
$$ -1913242 -3446614 -3321447 -2916850 -1635094 310404 673959 -1367875 -3522028 -3832977
38972c832977O69252M68551R47080J719672N94242j764341k032204L93370K193054
$$ -3832977 -3163725 -2695174 -1748094 -28422 565820 -1198521 -3230725 -2837355 -644301
38963f44301J277252l91376m53006M28001M44278m43252j133188j137267l75343
$$ -644301 632951 241575 -211431 216570 660848 217596 -915592 -2052859 -2428202
38954b428202J161151K387083J465084j454175l380713k060303P56519J541545
$$ -2428202 -1267051 1120032 2585116 1130941 -2249772 -4310075 -3553556 -2012011
38946b012011j38727j121107O90022L099614K473328j108643l505497j805391
$$ -2012011 -2150738 -3271845 -2581823 517791 2991119 1882476 -1623021 -3428412
38938c428412J678334K316125o72530l182675j826644J516676K329514o21784
$$ -3428412 -1750078 566047 -106483 -3289158 -5115802 -3599126 -1269612 -1891396
38930a891396m044984m593960k665157r79763o53583j95292J560777L047200K016860
$$ -1891396 -5936380 -10530340 -13195497 -14175260 -14828843 -15024135 -13463358 -10416158 -8399298
38921h399298m41889l21689L705283P348776N920068R83591j738206n86973J61365
$$ -8399298 -8841187 -9162876 -5457593 1891183 7811251 8794842 7056636 6469663 6631028
38912F631028k461835n373088m408526n36092K222391K622045K420285K426526
$$ 6631028 4169193 -1203895 -5612421 -6148513 -3926122 -1304077 1116208 3542734
38904C542734J827655N23451r16676k823013n173097n817383l012393J217874
$$ 3542734 5370389 5893840 4977164 2154151 -3018946 -8836329 -11848722 -10630848
38896a0630848L471938L721468M031338L640901J61987m404336m426123R57316
$$ -10630848 -7158910 -3437442 593896 4234797 4396784 -7552 -4433675 -3476359
38888c476359N341394L801565l08205j025593J461859K439007O02815r25335p49944
$$ -3476359 1865035 5666600 5358395 4332802 5794661 8233668 8836483 7911148 7161204
38879G161204j205395l407130m645502k684891M20733J202856m61561j804312
$$ 7161204 5955809 2548679 -2096823 -4781714 -4360981 -3158125 -3619686 -5423998
38871e423998j248519J89574J122391J358512J079076J96353p90010o65895P17084
$$ -5423998 -6672517 -6482943 -5360552 -4002040 -2922964 -2726611 -3516621 -4182516 -3465432
38862c465432J525669J99925j937098k053790J37607J591735P8631k484903k397091
$$ -3465432 -1939763 -1739838 -3676936 -5730726 -5593119 -4001384 -3922753 -6407656 -8804747
38853h804747J065886M884522N850347L450005m11343l049592k601545M02552
$$ -8804747 -7738861 -2854339 2996008 6446013 6034670 2985078 383533 786085
38845G86085L001998K714479M32103r58953n06038J66026k8014l17025l47400
$$ 786085 3788083 6502562 6934665 5975712 5469674 5635700 5607686 5290661 4943261
38836D943261j190777k896133l382533j491019P61439R27577l70960p02214O19557
$$ 4943261 3752484 856351 -2526182 -4017201 -3255762 -2328185 -2699145 -3401359 -2781802
38827b781802K233403K965620K403197K69920k609487l668755j394345J868851
$$ -2781802 -548399 2417221 4820418 5090338 2480851 -1187904 -2582249 -713398
38819g13398K492883N08882q51253l36081n2598j112261j430029M91455K565886
$$ -713398 1779485 2288367 1437114 1101033 1048435 -63826 -1493855 -1002400 1563486
38810A563486K180073K3872j450580j518816p51381J060762L632784M294804Q75842
$$ 1563486 3743559 3767431 2316851 798035 46654 1107416 4740200 9035004 9910846
38801I910846m105557n702421l097662l85923k11268m40945J159873K655070J397628
$$ 9910846 5805289 102868 -2994794 -3380717 -3591985 -4032930 -2873057 -217987 1179641
38792A179641r15599n36979K244027L290952R11415j670001j187056J220529K138677
$$ 1179641 264042 -272937 1971090 5262042 6173457 4503456 3316400 4536929 6675606
38783F675606M51124k095595l627927l619752k299770k36793J548466K146151
$$ 6675606 7126730 5031135 1403208 -2216544 -4516314 -4753107 -3204641 -1058490
38775a058490J545296M20241n73717r71998o41415k68311r06773k338324k781959
$$ -1058490 486806 907047 333330 -638668 -1280083 -1548394 -2455167 -4793491 -7575450
38766g575450j207469R74398J802937J474327J465386J618764L62707k111306
$$ -7575450 -8782919 -7808521 -6005584 -4531257 -3065871 -1447107 -1084400 -3195706
38758c195706l295231j840368M82194J565547J854849K701892L387062K160042
$$ -3195706 -6490937 -8331305 -7849111 -6283564 -4428715 -1726823 1660239 3820281
38750C820281m85098k036694j431831j00803O57504J084976J170320j04514k342069
$$ 3820281 3335183 1298489 -133342 -234145 423359 1508335 2678655 2574141 232072
38741B32072k737024L40349M216095M783998J703032j653337k888999k546594
$$ 232072 -2504952 -2164603 2051492 6835490 8538522 6885185 3996186 1449592
38733A449592j487734N26860K645368K276370j293630m708800m436583j559580
$$ 1449592 -38142 488718 3134086 5410456 4116826 -591974 -5028557 -6588137
38725f588137q3583j116243j542036J102446M853335N777209K892606q77109k362830
$$ -6588137 -6671720 -7787963 -9329999 -8227553 -3374218 2402991 5295597 4418488 2055658
38716B055658j533594p09505j064764j211836K10108J925972J807936N27351P49011
$$ 2055658 522064 -187441 -1252205 -2464041 -2253933 -327961 1479975 2007326 2756337
38707B756337K449559K215671j322543m439908l286065N44273K604677J884339
$$ 2756337 5205896 7421567 6099024 1659116 -1626949 -1082676 1522001 3406340
38699C406340Q53833N07221n63574k460488l190682j894777K80950K492556M218999
$$ 3406340 4260173 4767394 4203820 1743332 -1447350 -3342127 -3061177 -568621 3650378
38690C650378L527293o60996m836211m168206J47607K010154k14518j365802J417025
$$ 3650378 7177671 6516675 1680464 -2487742 -2340135 -329981 -544499 -1910301 -493276
$$ [...]
##END NTUPLES=NMR SPECTRUM
##END=
