##TITLE=31Pdec_LR-688A-C2
 CDCl3, 8 sc
 20.9.2019
##JCAMPDX= 6.0         $$ Bruker NMR JCAMP-DX V2.0
##DATA TYPE= NMR SPECTRUM
##DATA CLASS= NTUPLES
##ORIGIN= UXNMR, Bruker Analytische Messtechnik GmbH
##OWNER= root
$$ XWIN-NMR		Version 3.5
$$ Fri Sep 20 14:41:55 2019 Russian Standard Time (UT+4h)  she@DPX200
##.OBSERVE FREQUENCY= 81.013821
##.OBSERVE NUCLEUS= ^31P
##.ACQUISITION MODE= SIMULTANEOUS
##.ACQUISITION SCHEME= undefined
##.AVERAGES= 24
##.DIGITISER RES= 17
##SPECTROMETER/DATA SYSTEM= spect
##.PULSE SEQUENCE= zgpg30
##.SOLVENT NAME= DMSO
##.SHIFT REFERENCE= (INTERNAL, DMSO, 0, 182.463)
##AUDIT TRAIL= $$ (NUMBER, WHEN, WHO, WHERE, WHAT)
$$ ##TITLE= Audit trail, XWIN-NMR		Version 3.5
$$ ##JCAMPDX= 5.01
$$ ##ORIGIN= Bruker BioSpin GmbH
$$ ##OWNER= she
$$ F:/spectra/data/she/nmr/P31/1/pdata/1/auditp.txt
$$ ##AUDIT TRAIL=  $$ (NUMBER, WHEN, WHO, WHERE, WHAT)
(   1,<2019-09-20 14:41:04.57 +0400>,<she>,<DPX200>,
      <created by zg, POWCHK disabled, PULCHK disabled
       configuration hash MD5:
       00 E9 B6 7A A2 85 ED C7 34 08 36 98 17 FE 4E 26
       data hash MD5: 32K
       E1 48 35 DC 0B C3 86 C6 31 2A 33 06 D2 1E A0 03>)
(   2,<2019-09-20 14:41:08.21 +0400>,<she>,<DPX200>,
      <Start of raw data processing
       efp BC_mod = 2 LB = 1 FT_mod = 6 PKNL = 1 PHC0 = -153.2775 PHC1 = -497.1997 SI = 64K 
       data hash MD5: 64K
       8C 21 96 D5 4E 57 AC D7 88 9A 98 9F 90 7C E2 30>)
(   3,<2019-09-20 14:41:21.76 +0400>,<she>,<DPX200>,
      <pk PHC0 = -29.57249 PHC1 = 0 
       data hash MD5: 64K
       BD 6C B6 3F 5F 72 02 3F 92 DD 26 F4 B4 6E 53 FA>)
(   4,<2019-09-20 14:41:25.68 +0400>,<she>,<DPX200>,
      <abs ABSG = 5 
       data hash MD5: 64K
       83 80 BC 10 07 DC C3 C5 99 F4 69 B0 87 E6 30 4F>)
$$ ##END=
$$ 
$$ hash MD5
$$ 6C 8C D2 46 6F 45 AB AF 4E B7 4B 2E 03 27 27 04
##$RELAX= 
##$RELAX= 
##$RELAX= 
##$RELAX= 
##$RELAX= 
##$RELAX= 
##$RELAX= 
##$RELAX= 
$$ Bruker specific parameters
$$ --------------------------
##$DU= <F:/spectra>
##$EXPNO= 1
##$NAME= <P31>
##$PROCNO= 1
##$TYPE= <nmr>
##$USER= <she>
##$AMP= (0..31)
100 100 100 100 100 100 100 100 100 100 100 100 100 100 100 100 100 100 
100 100 100 100 100 100 100 100 100 100 100 100 100 100 
##$AQSEQ= 0
##$AQ_mod= 1
##$AUNM= <au_zg>
##$AUTOPOS= <>
##$BF1= 81.014009
##$BF2= 200.13
##$BF3= 200.13
##$BF4= 200.13
##$BF5= 200.13
##$BF6= 200.13
##$BF7= 200.13
##$BF8= 200.13
##$BYTORDA= 1
##$CFDGTYP= 0
##$CFRGTYP= 5
##$CHEMSTR= <none>
##$CNST= (0..31)
1 1 145 1 1 1 1 1 1 1 1 1 1 1 1 1 1 1 1 1 1 1 1 1 1 1 1 1 1 1 1 1 
##$CPDPRG= <waltz16>
##$CPDPRG1= <>
##$CPDPRG2= <waltz16>
##$CPDPRG3= <>
##$CPDPRG4= <mlev>
##$CPDPRG5= <mlev>
##$CPDPRG6= <mlev>
##$CPDPRG7= <mlev>
##$CPDPRG8= <mlev>
##$CPDPRGB= <>
##$CPDPRGT= <>
##$D= (0..31)
0 1 0 0 0 0 0 0 0 0 0 0.03 2e-05 3e-06 0 0 0 0 0 0 0 0 0 0 0 0 0 0 0 0 
0 0 
##$DATE= 1568976063
##$DBL= (0..7)
120 120 120 11 120 120 24 19 
##$DBP= (0..7)
150 150 150 150 150 150 150 150 
##$DBP07= 0
##$DBPNAM0= <>
##$DBPNAM1= <>
##$DBPNAM2= <>
$$ [...]
##$SUBNAM3= <"">
##$SUBNAM4= <"">
##$SUBNAM5= <"">
##$SUBNAM6= <"">
##$SUBNAM7= <"">
##$SUBNAM8= <"">
##$SUBNAM9= <"">
##$SW= 369.568048894756
##$SWIBOX= (0..15)
0 1 3 0 0 0 0 0 0 0 0 0 0 0 0 0 
##$SW_h= 29940.119760479
##$TD= 32768
##$TD0= 1
##$TE= 0
##$TE2= 300
##$TE3= 300
##$TEG= 300
##$TL= (0..7)
0 120 53 12 22 120 120 120 
##$TP= (0..7)
150 150 150 150 150 150 150 150 
##$TP07= 0
##$TPNAME0= <>
##$TPNAME1= <>
##$TPNAME2= <>
##$TPNAME3= <>
##$TPNAME4= <>
##$TPNAME5= <>
##$TPNAME6= <>
##$TPNAME7= <>
##$TPOAL= (0..7)
0.5 0.5 0.5 0.5 0.5 0.5 0.5 0.5 
##$TPOFFS= (0..7)
0 0 0 0 0 0 0 0 
##$TUNHIN= 0
##$TUNHOUT= 0
##$TUNXOUT= 0
##$USERA1= <user>
##$USERA2= <user>
##$USERA3= <user>
##$USERA4= <user>
##$USERA5= <user>
##$V9= 5
##$VALIST= <valist>
##$VCLIST= <CCCCCCCCCCCCCCC>
##$VD= 0
##$VDLIST= <DDDDDDDDDDDDDDD>
##$VPLIST= <PPPPPPPPPPPPPPP>
##$VTLIST= <TTTTTTTTTTTTTTT>
##$WBST= 1024
##$WBSW= 4
##$XGAIN= (0..3)
0 0 0 0 
##$XL= 0
##$YL= 0
##$YMAX_a= 23685
##$YMIN_a= -24348
##$ZGOPTNS= <>
##$ZL1= 120
##$ZL2= 120
##$ZL3= 120
##$ZL4= 120
##$ABSF1= 182.463
##$ABSF2= -187.1042
##$ABSG= 5
##$ABSL= 3
##$ALPHA= 0
##$AQORDER= 0
##$ASSFAC= 0
##$ASSFACI= 0
##$ASSFACX= 0
##$ASSWID= 0
##$AUNMP= <proc_1d>
##$AZFE= 0.1
##$AZFW= 0.5
##$BCFW= 0
##$BC_mod= 2
##$BYTORDP= 0
##$COROFFS= 0
##$CY= -3
##$DATMOD= 1
##$DC= 0
##$DFILT= <>
##$DTYPP= 0
##$F1P= 0
##$F2P= 0
##$FCOR= 1
##$FTSIZE= 65536
##$FT_mod= 6
##$GAMMA= 0
##$GB= 0
##$INTBC= 1
##$INTSCL= 5.30512e-09
##$ISEN= 30
##$LB= 1
##$LEV0= 0
##$LPBIN= 0
##$MAXI= 10000
##$MC2= 0
##$MEAN= 0
##$ME_mod= 0
##$MI= 50
##$NCOEF= 0
##$NC_proc= -5
##$NLEV= 6
##$NOISF1= 182.463
##$NOISF2= 159.3651
##$NSP= 0
##$NTH_PI= 0
##$NZP= 0
##$OFFSET= 182.463
##$PC= 4
##$PHC0= -182.85
##$PHC1= -497.1997
##$PH_mod= 1
##$PKNL= yes
##$PPARMOD= 0
##$PSCAL= 0
##$PSIGN= 0
##$REVERSE= no
##$SF= 81.0140089999434
##$SI= 65536
##$SIGF1= 159.3651
##$SIGF2= -187.1042
##$SINO= 113.3802
##$SIOLD= 16384
##$SREGLST= <1H.CDCl3>
##$SSB= 0
##$STSI= 65536
##$STSR= 0
##$SW_p= 29940.119760479
##$SYMM= 0
##$S_DEV= 0
##$TDeff= 32768
##$TDoff= 0
##$TI= <>
##$TILT= no
##$TM1= 0
##$TM2= 0
##$TOPLEV= 0
##$USERP1= <user>
##$USERP2= <user>
##$USERP3= <user>
##$USERP4= <user>
##$USERP5= <user>
##$WDW= 1
##$XDIM= 65536
##$YMAX_p= 303950898
##$YMIN_p= -17088067
$$ End of Bruker specific parameters
$$ ---------------------------------
##NTUPLES= NMR SPECTRUM
##VAR_NAME=  FREQUENCY,     SPECTRUM/REAL,   SPECTRUM/IMAG
##SYMBOL=    X,             R,               I
##VAR_TYPE=  INDEPENDENT,   DEPENDENT,       DEPENDENT
##VAR_FORM=  AFFN,          ASDF,            ASDF
##VAR_DIM=   65536,         65536,           65536
##UNITS=     HZ,            ARBITRARY UNITS, ARBITRARY UNITS
##FACTOR=    0.456856943014862, 1,           1
##FIRST=     14782.0589164792, 0,            0
##LAST=      -15158.0608439998, 0,           0
##MIN=       -15158.0608439998, -17088067,   0
##MAX=       14782.0589164792, 303950898,    0
$$ Real data points
##PAGE= N=1
##DATA TABLE= (X++(R..R)), XYDATA
$$ [...]
46207C30783J15863L73580q4877q83097j018342k01249P75655R79300L13909m49666
46197B51859n05383P9659L78227k30413j092887j034301m3099N63284m1226r32946
46187b607226o29771Q89549K089079J726561K23017r49200q85005k4278N64342
46178C97068M13752k8850k29384k51273l40046k91785J47172N40606K44687m35621
46168A66326m98455J85100N32965r2668q34984o34559K17593O83261N28735K93450
46158E46764J24887k68093o54834l82394M19020O95210j09435j221072j535664
46149b385611q90502M6911O70624P88020M64611r497k01375L6947L47301L34661
46139g97910Q0796q5837j28774k30908k91146M7462P62795J223815Q65121q6409
$$ plain form
46207 330783 446646 820226 735349 -147748 -1166090 -1367339 -591684 387616 701525 251859
46197 251859 -253524 -173865 204362 -26051 -1118938 -2153239 -2196338 -1633054 -1674280 -2607226
46187 -2607226 -3236997 -2347448 -258369 1468192 1691209 742009 -142996 -167274 397068
46178 397068 810820 781970 552586 301313 -38733 -330518 -183346 357260 601947 166326
46168 166326 -332129 -147029 385936 293268 -541716 -1176275 -958682 -275421 253314 546764
46158 546764 671651 403558 -251276 -633670 -214650 480560 371125 -849947 -2385611
46149 -2385611 -3276113 -3229202 -2558578 -1770558 -1305947 -1315444 -1516819 -1479872 -1132571 -797910
46139 -797910 -717114 -802951 -931725 -1162633 -1453779 -1406317 -643522 580293 1445414 1359005
46129A359005q27621q63604m36628p2010L2778L0854N6310Q1339O9139M8632M7032
46118d74774J02189K79358M91360M13181j22311p00424o87005p1195M58981M29813
46108A19173J56944J49101L22922K15558k53771o67407o82225l81267o9168L7449
46098a052691o8184j93452j20205J19189K56918J83103J19767K39809L51207K02532
46088C7993j01153k55194j64026M4600K31242K43924n9912n19692o51667k38668
46078a432553L06296M93522L87949L09306K35672M720j92042j05295L1800r5353
46068e5978j79985K34799P41876M49344n81533j226534q63306j42955J67424K14538
46058a242310L69819L42239k05307p33066m50055M05593P85763K90008l53657
$$ plain form
46129 1359005 531384 -332220 -768848 -840858 -808080 -777226 -720916 -639577 -570438 -521806 -474774
46118 -474774 -372585 -93227 398133 811314 689003 -11421 -698426 -769621 -310640 119173
46108 119173 276117 425218 748140 963698 709927 42520 -639705 -1020972 -1090140 -1052691
46098 -1052691 -1120875 -1314327 -1434532 -1315343 -1058425 -875322 -755555 -515746 -164539 37993
46088 37993 -63160 -318354 -482380 -437780 -206538 37386 -22526 -542218 -1193885 -1432553
46078 -1432553 -1126257 -632735 -244786 64520 300192 304912 112870 7575 39375 -55978
46068 -55978 -235963 -1164 740712 1190056 608523 -618011 -1481317 -1624272 -1456848 -1242310
46058 -1242310 -872491 -530252 -735559 -1468625 -1918680 -1513087 -727324 -437316 -790973
46049g90973l78885Q4854M20368L86968K09243N4629j73476n02537o51876l55674
46039a697359J74848M19359K41918O1079J15336p159o29226j150939p02693M96117
46029b678719J250825R43229J84322k49336l07189j97965J23556N33353N56912
46020A58988J47896n2649K16854K77397l11444q13193m47502K47578K53935k81264
46010f03404m22177p7003J8130k41525j90710K62659M14993P5074r1247J72337
46000f82873K32037k21801n28699j67383M10493O31580O42037O92927M92209j36228
45990A364299o51872n86779l23692l56976l72680J01143O22179L63840n32452
45981c72990j032295n89660K71933P72654O76352K49805q1970J448M26070P06296
$$ plain form
46049 -790973 -1169858 -1085004 -664636 -277668 -68425 -13796 -187272 -689809 -1341685 -1697359
46039 -1697359 -1522511 -1103152 -861234 -800155 -684819 -691978 -1321204 -2472143 -3174836 -2678719
46029 -2678719 -1427894 -484665 -300343 -549679 -856868 -1054833 -931277 -397924 158988
46020 158988 306884 254235 471089 748486 437042 -376151 -823653 -576075 -322140 -603404
46010 -603404 -1025581 -1102584 -1084454 -1325979 -1516689 -1254030 -839037 -763963 -855210 -682873
46000 -682873 -450836 -672637 -1201336 -1368719 -958226 -326646 315391 1008318 1500527 1364299
45990 1364299 712427 125648 -198044 -555020 -927700 -826557 -204378 159462 -372990
45981 -372990 -1405285 -1994945 -1723012 -950358 -274006 -24201 -106171 -104723 321347 1027643
45971A027643M89903n733l61989n20218o29850o07146k96770J01160J97050r1832
45961f97782n02655p01490l82443N25735J427567J333177R2768j088349j018709
45952a012181l1994N83177L27136j63555k85144p9535K65137O59098P95743L71101
45942A428983k89010n25062l11227k07933l47596k94716K2386J51969N3921K32639
45932h5646O52943N31397l24281r39493n72494J79356M13782K67648L47492M97834
45922I68538J82175l45157l34981J74228L76570j5827m16802l94859k33271k48724
45912b88110k69315j08168K0820o5419j03283K02371O21917O48200J96230k52267
45902F02976k41331R4258J81909k67556q28879q42984k80095J98508J41083j08808
$$ plain form
45971 1027643 1517546 1511813 1149824 629606 -244 -607390 -904160 -803000 -605950 -697782
45961 -697782 -1200437 -1901927 -2284370 -1758635 -331068 1002109 1094877 6528 -1012181
45952 -1012181 -1044175 -460998 -133862 -297417 -582561 -662096 -396959 262139 1057882 1428983
45942 1428983 1139973 614911 303684 95751 -251845 -546561 -524175 -372206 -318285 -85646
45932 -85646 567297 1098694 774413 -165080 -737574 -558218 -144436 123212 470704 968538
45922 968538 1150713 805556 470575 644803 1021373 1005546 588744 193885 -39386 -288110
45912 -288110 -557425 -665593 -644773 -710192 -813475 -611104 10813 659013 855243 602976
45902 602976 361645 455903 637812 370256 -458623 -1301607 -1581702 -1383194 -1242111 -1350919
45892a350919p052L42819L86881N408k99087j40633K29389L09011L980l05535
45882h25738k72983Q244J80288J40948J82421M77521O70149L37511k89074n66745
45872D2542l70458j90762k39913j55313J94378L72000K17910K30634N48832L99345
45862A049195o14367j447584r42901L30957Q29293K87015j47294P4184K40384
45853c41118l1414l6673N75482Q95489J78259q14877q94033j43926M39077M69704
45843B95970L27654J55623k69455p78493q29137l38879J96247M51615N21989M20488
45833A53622J622n12577n79556j30874K32620J01141j95369k13383p4655p0592
45823a288001j4035L85777P42542L61286n57725q86063j28356O86908L83940n93642
$$ plain form
45892 -1350919 -1357971 -1015152 -628271 -622863 -921950 -1062583 -833194 -524183 -520203 -825738
45882 -825738 -1098721 -1090477 -910189 -769241 -586820 -109299 560850 898361 609287 42542
45872 42542 -327916 -518678 -758591 -913904 -719526 -347526 -129616 101018 649850 1049195
45862 1049195 434828 -1012756 -1955657 -1624700 -795407 -508392 -655686 -581502 -341118
45853 -341118 -372532 -409205 166277 1061766 1240025 425148 -468885 -612811 -173734 295970
45843 295970 623624 779247 509792 -268701 -1097838 -1436717 -1240470 -788855 -266866 153622
45833 153622 155244 -357333 -936889 -1067763 -835143 -734002 -929371 -1142754 -1217409 -1288001
45823 -1288001 -1302036 -916259 -173717 187569 -370156 -1256219 -1384575 -697667 -313727 -907369
45813i07369p85927Q1852O88348J87221n11515k82561M08167L78292k67395l79077
45803a389964K65470O46133K42753k41151k32611j43363l43737l85368O8117M75649
45793a038072L27511n392p6080j92126o13278p50326j67455L76768O8845m30477
45783b500082K0682R77648R27873k25977q67949j58934P46038O34383J7301L765
45773d25252M62436M90686L6727j80796m9957j81178o58792p35919l7892P73001
45763e06936R42700N81733J99220j54065o27526q61401l88744L55421L65934l72238
45753d65902o14529K86245J174526P34675l76214m41096N80748R10024k18647
45744A569830j299425r25590J20654L65696k9782J8800M01450J71171m73288l79752
$$ plain form
45813 -907369 -1693296 -1611444 -923096 -735875 -1247390 -1529951 -1121784 -743492 -1010887 -1389964
45803 -1389964 -1124494 -478361 -235608 -476759 -709370 -852733 -1196470 -1581838 -1513721 -1038072
45793 -1038072 -710561 -715953 -792033 -984159 -1597437 -2347763 -2515218 -2138450 -2069605 -2500082
45783 -2500082 -2479400 -1501752 -573879 -799856 -1667805 -1826739 -1080701 -446318 -429017 -425252
45773 -425252 37184 527870 564597 383801 333844 152666 -506126 -1242045 -1279937 -506936
45763 -506936 435764 1017497 1216717 1062652 435126 -426275 -815019 -459598 -93664 -465902
45753 -465902 -1080431 -794186 380340 1115015 738801 297705 878453 1788477 1569830
45744 1569830 270405 -655185 -534531 -168835 -198617 -179817 221633 392804 -80484 -460236
45734d60236M78535Q33072K06878m04896k89525P061o5443j90515j45495l57999
45724c88563q35920p47509J70228R04093O76135Q7465j05405k44199p62417r90412
45714b236504k36992P79805R32594M55570L57631O31411M90646k3085j78856m8475
45704I23745l21817p47175l78458N28309N65747m77629r93084j8232J187141J077729
45694A346276P2385m12024k24220l09976q05205p96299M6170Q44763P88003J20098
45684F69971m45881n99569m04084J7841L93151L16204k57686p87914p27183j59423
45674a984573L70339N02399L06275J0574k37012l60432l36453k40268j65766o2611
45664b197528K05165N87549Q02492O81065M12834K68861J98088n0466m53239o58152
$$ plain form
45734 -460236 18299 851371 1058249 653353 363828 370889 305446 114931 -30564 -388563
45724 -388563 -1224483 -1971992 -1801764 -897671 -221536 -134071 -239476 -483675 -1246092 -2236504
45714 -2236504 -2473496 -1693691 -761097 -305527 52104 683515 1174161 1151076 972220 923745
45704 923745 601928 -145247 -523705 4604 570351 92722 -900362 -918594 268547 1346276
45694 1346276 1418661 1006637 782417 472441 -332764 -1129063 -1082893 -238130 549873 669971
45684 669971 224090 -375479 -779563 -761722 -368571 -52367 -310053 -1097967 -1825150 -1984573
45674 -1984573 -1614234 -1111835 -805560 -794986 -1031998 -1392430 -1728883 -1969151 -2134917 -2197528
45664 -2197528 -1992363 -1404814 -602322 78743 491577 760438 958526 908060 454821 -203331
45654b03331m60230o6344K09642K73669J75712k1499j56684l3736K44334K86144
45644B47677l4221l47652l71990l48857n10703n01716P3462P80263P74603O3237
45634a75897m08923j04750L76406K81721j77687k47975J90278M97026K44736k37229
45624B37706m28819l35817l45535n29924m53300J87171R62497J098286M68972
45615H61237j74299j77076J70926J56815k44517l59833R7812N42059L63210j90477
45605A045857l88408n0831K21598j22697q19141j041597l82158N99067R62789
45596B4479M74453j59705k12234K25150N42589M54175J81481n028l8002K8294
45586A515652L925l68812r64212j129405m91116L28175M43130j9448j65985K00433
$$ plain form
45654 -203331 -663561 -729905 -520263 -246594 -70882 -92381 -249065 -282801 -38467 247677
45644 247677 213456 -134196 -506186 -855043 -1365746 -1867462 -1794000 -1013737 -239134 -175897
45634 -175897 -584820 -689570 -313164 -31443 -209130 -457105 -266827 230199 474935 237706
45624 237706 -191113 -526930 -872465 -1402389 -1855689 -1668518 -706021 392265 861237
45615 861237 686938 509862 680788 837603 593086 233253 331065 873124 1236334 1045857
45605 1045857 657449 606618 828216 705519 -113622 -1155219 -1537377 -938310 24479
45596 24479 498932 339227 126993 352143 894732 1348907 1530388 1525360 1487358 1515652
45586 1515652 1519577 1150765 186553 -942852 -1433968 -1105793 -662663 -682111 -848096 -647663
45576f47663L02064k40043p14445m48626K01680N69366O56663P28827N81721L2258
45566A021802l60209J1677O71242N61993l83083j057453o90961K00744O21776
45557E97528K72887l66652p09349n19644K8042N17128O33702M12573N8497l41081
45547E83631p04253p66094m05582k5066j03613m16577k74354L77915P27226K54299
45537g52468m25159l74588L61648Q50975N39054j49370n51848n88986n53987m74964
45527b119693j82729J36061N6952k73709n8055R80797J848997J436329J44328
45518A969278n64397k33566M9470m72928r68593m59444M27027L79920m72490p61077
45508a106800n2908N80485L79933o0258q8206j01702n18511o47899K70574J509129
$$ plain form
45576 -647663 -345599 -585642 -1300087 -1748713 -1547033 -977667 -321004 407823 989544 1021802
45566 1021802 661593 673270 1344512 1906505 1523422 465969 -224992 -24248 597528
45557 597528 870415 503763 -205586 -725230 -697188 -180060 453642 866215 924712 583631
45547 583631 -120622 -886716 -1292298 -1317364 -1420977 -1837554 -2111908 -1733993 -1006767 -752468
45537 -752468 -1177627 -1552215 -1190567 -339592 199462 50092 -501756 -1090742 -1644729 -2119693
45527 -2119693 -2302422 -2166361 -2109409 -2383118 -2441173 -1460376 388621 1824950 1969278
45518 1969278 1404881 1171315 1220785 747857 -220736 -680180 -253153 126767 -345723 -1106800
45508 -1106800 -1159708 -579223 -199290 -259548 -347754 -449456 -967967 -1615866 -1345292 163837
45498A63837J567552K70168r50395r55551j63697L37321J65586k62073m45587
45489b72839j73196M36619Q74043N39434m87560j236230q62589K56827R17159
45480h332N38865k54170n96287m06879j59266n0866R6544L14440M12423M00649
45470B87121M68631M82307P0963n81970o57028J44251R00117N92324m37175r59483
45460C10058o06982k05713k74605k22991M56035J069327O58589m42913r50738
45451b09933m03757L01423L09033n5171J4284N07844O52691R9375n47043n50894
45441A17852n058L67986J96509j81829l93978n98795j017056j232472o07983O07231
45431b747593J286988Q49943P3740k1994L85644L31244l66916q26646m50231K77895
$$ plain form
45498 163837 1731389 2001557 1051162 95611 -68086 269235 434821 172748 -272839
45489 -272839 -446035 -9416 864627 1404061 916501 -319729 -1182318 -925491 -8332
45480 -8332 530533 276363 -319924 -726803 -886069 -936935 -840391 -525951 -113528 287121
45470 287121 755752 1238059 1309022 727052 70024 214275 1114392 1706716 1269541 310058
45460 310058 -296924 -502637 -777242 -1000233 -544198 525129 1183718 740805 -209933
45451 -209933 -613690 -312267 -3234 -58405 -44121 463723 1116414 1215789 668746 117852
45441 117852 112794 480780 677289 495460 101482 -497313 -1514369 -2746841 -3354824 -2747593
45431 -2747593 -1460605 -610662 -536922 -558916 -173272 157972 -208944 -1035590 -1485821 -1207926
45421a207926O39173O15210N21214L09625j40320m55578k03983K98383K96930
45412F72728l26960r07035r44004o10667k16582K12904N99668O29112K52373p4559
45402g13022r172K06605K25482J28384R9091Q919j99643j58765L04216O10400
45392E02495K21397l66429k95753K29766K31016l99704o88096k04136K79311J89782
45382c00351O2682L67726N19658k585n00442j83906L07834j14071r98423q96422
45372a738300K57575R17638L22845l98011j14170O36715P38123K12945j81128
45363F54232l21999n73301p31283k69534N09081O24397j43601q33724o15181J49604
45353a551309N47695L28300j6489j18940j48597l16696l84810K3818P43440J056918
$$ plain form
45421 -1207926 -568753 46457 567671 877296 736976 281398 77415 375798 672728
45412 672728 345768 -561267 -1505271 -2115938 -2332520 -2119616 -1519948 -890836 -638463 -713022
45402 -713022 -722194 -515589 -290107 -161723 -62632 -53713 -253356 -412121 -107905 502495
45392 502495 723892 357463 61710 291476 522492 122788 -565308 -769444 -490133 -300351
45382 -300351 -237669 130057 649715 647130 146688 -37218 270616 156545 -841878 -1738300
45372 -1738300 -1480725 -563087 -240242 -638253 -752423 -115708 622415 835360 654232
45363 654232 332233 -241068 -972351 -1241885 -732804 -108407 -252008 -1085732 -1700913 -1551309
45353 -1551309 -1003614 -675314 -691803 -810743 -959340 -1276036 -1660846 -1637028 -893588 163330
45343A63330N30513l70283p78926m37666J03616K67674P1909j13878j03672l034
45333f70417K4653m4491l3845K75297P56638Q61093K89456l99261m10425R6074
45323G44772J69313m34174p81746k40569M40852L04356k65960k15252L79793M12685
45313E14070l86651r31429m73505K68619L18223q4891q2392K97451K46003l92658
45303g07160p74078l22777M17984N84347J03144m31731n98624l67035K32611J038107
45293h25212J440265Q25699m64212j194321o36710N10096J043443P37304L29780
45284A766132K74724K37791j15072n12510n49218k79624n143J88363L51106L84569
45274A741118J72727j40460k83823k22828k15690m99017r45398j036616l55881
$$ plain form
45343 163330 693843 323560 -455366 -893032 -789416 -521742 -449833 -563711 -667383 -670417
45333 -670417 -645764 -690255 -724100 -448803 307835 1168928 1458384 1059123 648698 744772
45323 744772 914085 479911 -301835 -542404 -101552 202804 -63156 -278408 101385 514070
45313 514070 127419 -804010 -1277515 -1008896 -690673 -775564 -857956 -560505 -314502 -707160
45303 -707160 -1481238 -1804015 -1386031 -801684 -698540 -1130271 -1728895 -2095930 -1863319 -825212
45293 -825212 615053 1440752 976540 -217781 -854491 -344395 699048 1436352 1766132
45284 1766132 2040856 2278647 2163575 1651065 1101847 822223 817080 1005443 1356549 1741118
45274 1741118 1913845 1773385 1489562 1266734 1051044 552027 -393371 -1429987 -1785868
45265a785868P26013J145669L57475p77238r34678n8365O25957L80898j56395
45256d76532j69975J57351K40556J06948Q9400Q8215j07768k32425j2736K09951
45246a07015Q2646O666M37426Q49864M39798m22888n97068M1929M07961m2097
45236A097222n21599k92435J87242J11961m23376o93433l93506J26101L80093
45227d21730J59233l03361m27887O4324N72340K93114m63077m90255M80615J128478
45217E91794L69614r99360j399809o22985J74501L19343L25570O76230R34451
45208C69349N24648k64102o24928k93359K06875L11957O4277j03770m8257j05210
45198C7480n02902q43189n61804J48385M03986j63960p69340m78662M88002J044682
$$ plain form
45265 -1785868 -1059855 85814 443289 -333949 -1268627 -1326992 -701035 -320137 -476532
45256 -476532 -646507 -489156 -248600 -141652 -52252 35963 -71805 -304230 -316966 -107015
45246 -107015 -24369 -17703 419723 1269587 1709385 1286497 689429 731358 1139319 1097222
45236 1097222 575623 283188 470430 582391 159015 -534418 -927924 -801823 -421730
45227 -421730 -262497 -565858 -993745 -929421 -357081 -63967 -527044 -1017299 -536684 591794
45217 591794 961408 -37952 -1437761 -2060746 -1886245 -1566902 -1241332 -565102 369349
45208 369349 893997 629895 4967 -288392 -81517 230440 294717 190947 142690 37480
45198 37480 -465422 -1308611 -1870415 -1722030 -1318044 -1482004 -2251344 -2730006 -2242004 -1197322
45188a197322O90920N8217q4551J88110K92935Q1330l0987J84586L41603k134
45178E22707o05487p55592k33331L26508K74804j61239k21215L19337Q92620R42824
45168A301936N25977P738l97028n75749l89623R6511M81902M14897O484l15874
45158A157171k76380J9510K07947j6558n55616q92101o31559j8647L60159L23963
45148c22111J77471J02160k7048j60757K1184N10195P76293M60660j46061n58864
45138H33122o26324m10681k6710J84266j09633n48263l09757N76290R27207P1238
45128E60755r49071p81915K12445N28267j81591o77308j29603O76133O20171j98219
45118c19936q30060p65285k14609M52539R25306Q81761K96268k88789k90782J34851
$$ plain form
45188 -1197322 -506402 -448185 -532736 -344626 -51691 29639 -1348 183238 524841 522707
45178 522707 -82780 -838372 -1071703 -745195 -470391 -631630 -852845 -533508 359112 1301936
45168 1301936 1827913 1835651 1438623 862874 473251 569762 1051664 1466561 1473045 1157171
45158 1157171 880791 900301 1108248 1091690 536074 -356027 -987586 -1006233 -646074 -322111
45148 -322111 -144640 -42480 -69528 -230285 -209101 301094 1077387 1538047 1391986 833122
45138 833122 206798 -203883 -230593 -46327 -155960 -704223 -1013980 -437690 489517 560755
45128 560755 -388316 -1170231 -957786 -429519 -611110 -1288418 -1418021 -741888 -121717 -319936
45118 -319936 -1149996 -1915281 -2129890 -1677351 -752045 129716 425984 137195 -153587 -18736
45108a8736K68622j76643o40429m87057J13437M16139J13042k70950j29189L93309
45098d18455O45609L95924Q0726Q8734K28345J34090j29206k04970j2730J59108
45088I67175R6678n2866M096L06831N10798K29128m27383q07763m59430K29108
45078E96372M96135K21586k2122P9766J90532R410k72285m34946n33963m77346
45068a46861J049N88871M19939n84498j217234o22114L28226L27224l10965j94068
45058a410431Q44368J414037O91577m06122o39032l8450N09735N45525K69382
45049A780589l2128k29477k60134j73711j25043j59706j92275k18545k54733j07858
45039B6979L57871P33924M04099n03042j072697p84901k11467j25172l39674l1245
$$ plain form
45108 -18736 249886 73243 -567186 -1054243 -940806 -524667 -411625 -682575 -811764 -418455
45098 -418455 227154 623078 703804 792538 1020883 1154973 1025767 820797 808067 967175
45088 967175 1063853 1010987 1015083 1321914 1832712 2061840 1634457 826694 367264 596372
45078 596372 1092507 1314093 1291971 1371737 1562269 1571679 1299394 864448 330485 -146861
45068 -146861 -145812 443059 862998 278500 -938734 -1560848 -1232622 -905398 -1216363 -1410431
45058 -1410431 -566063 847974 1539551 1133429 494397 455947 965682 1511207 1780589
45049 1780589 1748461 1518984 1258850 1085139 960096 800390 608115 389570 134837 26979
45039 26979 384850 1118774 1522873 1019831 -52866 -837767 -1049234 -1174406 -1514080 -1545325
45029a545325R13399J495140Q23301o08432j358685p68069K70773N95793K97985
45020A15880K51348N07128K70504n15537q55265l81964n5164m45977o21141J86208
45010a543980J006174O50717k17503k11040L88189K57542m84523n02760K65728
45001c91456M93588q4380k50327L42207N44675r580j75069L72187K81455q77218
44991B46082j356007r3055J187632O47802o29017n09677O28090P08221m81195
44982C48876j102994m08421L33246K45647O7824M27946O68777J73357m78470n01271
44972b25483j01080N1595j09249j07767L19026Q91174J010834K95994q64628j488382
44962c27966j076629j98270L87513O64370Q54626O67396o2474n85798j91434M99493
$$ plain form
45029 -1545325 -631926 863214 1686515 1078083 -280602 -1048671 -777898 -182105 115880
45020 115880 367228 874356 1144860 629323 -225942 -607906 -663070 -1109047 -1730188 -1543980
45010 -1543980 -537806 112911 -104592 -315632 72557 330099 -154424 -657184 -391456
45001 -391456 102132 17752 -232575 109632 654307 644727 469658 841845 1123300 246082
44991 246082 -1109925 -1202980 -15348 632454 3437 -506240 121850 830071 348876
44982 348876 -754118 -1162539 -829293 -583646 -515822 -87876 580901 754258 275788 -225483
44972 -225483 -326563 -274968 -384217 -491984 -172958 718216 1729050 2025044 1160416 -327966
44962 -327966 -1404595 -1602865 -1215352 -550982 303644 971040 908566 322768 131334 630827
44952F30827L93843k64311k88250M16969O79829M5511n02111k16891K72768J25823
44942A294007m08451n54355j81309K27124L24221J43230j17128k72235l00746
44933A54358l16539k09984L35087J051939R07562m53670j627361j023504P60046
44924d22066J537529N21237p50398p77951K7436M54810K53311m6184j70445j42065
44914D85214R6402M36152M86652J74471p8816j18057l25076p63471q21217k13733
44904f41479L78673K84986j47879j53964L26704P42227P91511O23206L87768M6052
44894B637805m38011r14770j027034n06109K81898M35333l11127r22473l87407
44885a151895O69260Q00847p1741o30427l15839n414k31394k59735M11832J015566
$$ plain form
44952 630827 1024670 760359 472109 889078 1568907 1614418 1112307 895416 1168184 1294007
44942 1294007 885556 331201 149892 377016 701237 844467 727339 455104 154358
44933 154358 -162181 -372165 -37078 1014861 1922423 1468753 -158608 -1182112 -422066
44924 -422066 1115463 1636700 886302 108351 135787 590597 843908 797724 627279 485214
44914 485214 581616 1017768 1504420 1678891 1600075 1482018 1156942 393471 -427746 -641479
44904 -641479 -262806 22180 -125699 -279663 47041 789268 1580779 2203985 2591753 2637805
44894 2637805 2199794 1285024 257990 -248119 33779 469112 157985 -764488 -1151895
44885 -1151895 -482635 318212 246471 -383956 -699795 -705209 -936603 -1196338 -784506 231060
44875B31060Q03889K26036j6387n7798k25768l14510k56405m84422q85007n56742
44865a536054N24570Q82829k83047j523664j128600L38141J035504N70609P9245
44856a040467J04809N4351l93867p67487p13838l62346J69631P57731R70973N96923
44846f23587J28261j6924k08050p10049q17008N2191J098929J200398N91237K40075
44836I35473K00199n2821k83531k320K68786j79497p15198l66146K18592k51814
44826b28277j231916j032914K42444Q34558M24788N41105J464721J411707k49407
44817B176809j498572q05998M23322K66591o92845p02388K04061O28659K66357
44808B65996M911J01051l0139m56633n76261k12373K13634M44060M74044J84175
$$ plain form
44875 231060 1034949 1260985 1244598 1186800 961032 646522 390117 -94305 -979312 -1536054
44865 -1536054 -1011484 -128655 -411702 -1935366 -3063966 -2725825 -1690321 -1119712 -1040467
44856 -1040467 -935658 -881307 -1275174 -2042661 -2756499 -3118845 -2949214 -2191483 -1220510 -623587
44846 -623587 -495326 -512250 -720300 -1430349 -2247357 -2195166 -1096237 104161 695398 935473
44836 935473 1135672 1082851 799320 797000 1065786 886289 171091 -195055 23537 -228277
44826 -228277 -1460193 -2493107 -2250663 -1416105 -991317 -450212 1014509 2426216 2176809
44817 2176809 678237 -127761 295561 562152 -130693 -833081 -629020 -361 265996
44808 265996 270907 371958 341819 -114814 -691075 -903448 -689814 -245754 228290 412465
44798D12465l54401o13266l47108p2294j21234O0181Q16160J272378N39416o99294
44788H93003j025437k94063L83653L63973J8863k48075m24984m04121n4905K56319
44778e35774Q4246k49578o2488N54686Q36560M70417j55528o72623r14407o04446
44768a248935K50155Q43258M12275n07419o55536J54507Q09402N32436k37646
44759C52497p65199q84900p05983k80324J58446L23791M14345Q12959J171387
44750E97019O78078n48953j269990p35520L14791P38772L74628j57299l95711
44741d04185k38073K63450P53040O51495r3250o99924m85189K17220N37733K02988
44731G05305k74488l54199p249L95221M40716L2082m27368l95738R8328L88291
$$ plain form
44798 412465 58064 -555202 -902310 -974604 -1095838 -1035657 -219497 1052881 1592297 893003
44788 893003 -132434 -426497 -42844 321129 339992 91917 -333067 -737188 -792093 -535774
44778 -535774 -451528 -701106 -763594 -208908 627652 1098069 942541 269918 -644489 -1248935
44768 -1248935 -998780 -155522 256753 -250666 -906202 -751695 57707 590143 352497
44759 352497 -412702 -1297602 -2003585 -2283909 -2125463 -1801672 -1387327 -574368 597019
44750 597019 1275097 726144 -543846 -1279366 -964575 -225803 148825 -8474 -404185
44741 -404185 -642258 -378808 374232 1025727 932477 232553 -252636 -35416 502317 705305
44731 705305 430817 76618 69369 464590 905306 937388 510020 114282 212610 600901
44721F00901L2110n72606p53609m68163k28979k84416l34639r7483K37221L21729
44711a547934J89431J80477L57880L43203m6017l06785R3707P14791N60556l33362
44701B05947o56934K46138J119451N01070r90411j462037n23587L20985J48085
44692a091293j82511J56901N20462J35061m15226k73123J37003j7551l46752M5177
44682a331852P71872O85403q7670k70450L80259O49322m0974o61014l33965L12700
44672G3631M15848L08045O12742Q48440J75029j036043j572416j030441q0911
44663a286076O66678J079065R70339K03471o76311q51800l54762N8132J43957
44654d7307L33101O02196L28761m10620n59079K93859J041832O34632l55153p02923
$$ plain form
44721 600901 633011 60405 -693204 -1161367 -1390346 -1674762 -2009401 -2106884 -1869663 -1547934
44711 -1547934 -1358503 -1178026 -820146 -476943 -522960 -829745 -736038 -21247 539309 205947
44701 205947 -450987 -204849 914602 1415672 425261 -1036776 -1560363 -1239378 -1091293
44692 -1091293 -1273804 -1116903 -596441 -461380 -876606 -1149729 -1012726 -1030277 -1377029 -1331852
44682 -1331852 -559980 125423 37753 -232697 147562 796884 755910 94896 -239069 73631
44672 73631 489479 797524 1410266 2258706 2433735 1397692 -174724 -1205165 -1286076
44663 -1286076 -619398 459667 1430006 1633477 957166 105366 -249396 -191264 -47307
44654 -47307 285794 887990 1216751 806131 247052 540911 1582743 2217375 1862222 1159299
44644A159299l45852j05434j11586K34266R02860J063549L77961n32789j072180
44635A570094j221758r77946k10942O36114O87106o9527n22553n1484M77595J15595
44625D32294n48353k48501R23328J559437R79077P7464j94973j97416p37364j509287
44615E35706j378426j17944J050929R95034R7389m21523j90348Q0091p7492k32479
44605C40937K3032L33278K84390J70893L84328N92413K95307k65386n73834p46168
44595H39190j021951q58176K19881J230243P48632p29752j146897P7520J120831
44586D79521N93389m06090k46605O46527O80815l53443j179570j012555l16617
44577a114628J82082K17840q5032k69651J35625Q30212R03759K90172O3418N69473
$$ plain form
44644 1159299 813447 708013 596427 830693 1733553 2797102 3175063 2642274 1570094
44635 1570094 348336 -629610 -840552 -204438 482668 413141 -109412 -160896 316699 432294
44625 432294 -116059 -364560 558768 2118205 3097282 3174746 2979773 2782357 2044993 535706
44615 535706 -842720 -960664 90265 1085299 1182688 761165 570817 650908 573416 340937
44605 340937 363969 697247 981637 1152530 1536858 2129271 2424578 2159192 1585358 839190
44595 839190 -182761 -1040937 -821056 409187 1157819 428067 -718830 -641310 479521
44586 479521 1072910 666820 420215 1066742 1747557 1394114 214544 -798011 -1114628
44577 -1114628 -932546 -714706 -799738 -1069389 -933764 -103552 800207 1090379 1153797 1723270
44567A723270N69788o04178j453482n52552Q46517N78734r43794j417576l58251
44558a611524M42694J53033j0521O23043R56142L25626k54677o1814R4835l08900
44548C47937l30273N52260J125358M44753m29213k61670K20814k39731j076803
44539C53432q92363M2825K40352n05065q96167k97834M53281N04812K0262l91940
44529a368405l80211M4234M44487K20663m91182o84725Q9086Q82290Q06221M68021
44519C0479P66853J102859L60141q98027j029883N4434O86817O8827o13461k49360
44509B79679N05535M35982l96248r11023m83110N16619J262714J150560K55331
44500B616039o79745r95387p98038n18704j15737N82326J059938O37960k88256
$$ plain form
44567 1723270 2293058 1688880 235398 -317154 529363 1108097 164303 -1253273 -1611524
44558 -1611524 -1168830 -1015797 -1026318 -403275 552867 878493 623816 562002 656837 347937
44548 347937 17664 569924 1695282 2140035 1710822 1449152 1669966 1430235 353432
44539 353432 -538931 -496106 -255754 -760819 -1656986 -1954820 -1501539 -996727 -976465 -1368405
44529 -1368405 -1748616 -1704382 -1259895 -1039232 -1530414 -2215139 -2126053 -1243763 -437542 30479
44519 30479 797332 1900191 2260332 1362305 332422 386856 1073673 1142500 529039 279679
44509 279679 785214 1221196 824948 -86075 -569185 -52566 1210148 2360708 2616039
44500 2616039 1936294 940907 142869 -375835 -491572 90754 1150692 1788652 1500396
44491A500396n99075r2833K95628O2741k13787j01303m2482l41472m63033j7697
44481a2917M34123L04034l6931K9237K76701P7146m99396q15593o42092l28580
44471a214268j67928j41198j56548r0994K36476P17597P92768J20108p29762p74784
44461a408533J43623J062109J003129R8182o41754n57675k6552K09681Q4943J24762
44451I1915M24799M08498j38174n19870k10278J63628k07323q25543n03972O72117
44441f44203J243483M83955n22379m59818M47791R50805M72578m12409q82408
44432F77395o72126j13242K42514J04039k91112m95066m05988k32572L758M58887
44422g23513R41790R27738K54518n89387r84136o89702Q2358P23346N59264l21419
$$ plain form
44491 1500396 901321 808488 1104116 1166857 953070 851767 809285 467813 4780 -12917
44481 -12917 421206 725240 688309 717546 994247 1071393 571997 -243596 -885688 -1214268
44471 -1214268 -1382196 -1523394 -1679942 -1770936 -1534460 -816863 -24095 96013 -633749 -1408533
44461 -1408533 -1264910 -202801 800328 898510 256756 -300919 -327471 -117790 -32847 91915
44451 91915 516714 925212 787038 267168 56890 220518 13195 -812348 -1316320 -644203
44441 -644203 599280 1083235 560856 101038 548829 1499634 1972212 1559803 677395
44432 677395 5269 -107973 134541 238580 -52532 -547598 -953586 -1186158 -1182400 -723513
44422 -723513 218277 1146015 1400533 811146 -172990 -862692 -780334 -56988 502276 180857
44412A80857q15665j05317J022776J077549m3354r45530p72132j76487l189j56002
44402g36494k22915j72877O9993P30063J333124Q33128p30726j745354j048773
44393a690831M49333J092491O44090J34021J51531L35046K52023n8910k95408
44384A013386j76950K29693L12382l77676j152982q91992J16616L50570m91124
44375a068077p98576L31596J462911J112081J11604L58M23513J30967n35205l86067
44365G85105J69346j95246j064746p82197N17702Q90067j57480q35402j01069
44356g73920P82937O07303N0176N3511K02828m3766j12545M08130O47508p8247
44346A743915r05539q19607k74749j35986j19490L16677N64748r6997r06586o82324
$$ plain form
44412 180857 -634808 -740125 282651 1360200 1316846 371316 -400816 -577303 -580492 -736494
44402 -736494 -959409 -1132286 -1062293 -332230 1000894 1834022 1103296 -642058 -1690831
44393 -1690831 -1241498 -149007 495083 629104 780635 1115681 1367704 1308794 1013386
44384 1013386 836436 1066129 1378511 1000835 -152147 -1044139 -927523 -576953 -1068077
44375 -1068077 -1866653 -1535057 -72146 1039935 1151539 1151897 1575410 1706377 1171172 785105
44365 785105 954451 759205 -305541 -1087738 -570036 320031 162551 -672851 -773920
44356 -773920 9017 616320 666496 720007 922835 879069 766524 1174654 1822162 1743915
44346 1743915 838376 18769 -255980 -391966 -511456 -194779 369969 272972 -633614 -1315938
44336a315938J70588L78919J8784K36921R99970R76465j72464j092206p99637
44327e98598o436K51582P8544N1160J01859m6728p1772M00399R00751O62211j59997
44316A562975o02642k07821M30329N38721N8233n37418q89784r05904n43775J32791
44306i64295P43382Q19844L47414j99607m73962o07766p66978p04837j47062N89072
44296a364795Q33934M07969j54234k70695O5745L57049J23682n59360r46693l50532
44286a857930Q03697J159811J54680r93077q04346M03074J016473M29057l80569
44277f9130n71518m34203l54927n0914N79754R18288O18019K31290J96922J06593
44267A170174l27643n20460p0351L28552J2571m26919j50698M08865K86069k97251
$$ plain form
44336 -1315938 -1145350 -766431 -747647 -510726 489244 1465709 1293245 201039 -598598
44327 -598598 -605034 -353452 -274908 -223748 -121889 -168617 -240389 160010 1060761 1722972 1562975
44316 1562975 960333 752512 1182841 1721562 1779795 1242377 352593 -553311 -1097086 -964295
44306 -964295 -220913 598931 946345 746738 272776 -334990 -1101968 -1806805 -1953867 -1364795
44296 -1364795 -530861 -122892 -277126 -547821 -482076 -125027 -1345 -560705 -1507398 -1857930
44286 -1857930 -1054233 105578 260258 -732819 -1537165 -1134091 -117618 311439 -69130
44277 -69130 -640648 -1074851 -1429778 -1480692 -900938 17350 635369 866659 1063581 1170174
44267 1170174 842531 322071 251720 580272 592843 165924 15226 424091 710160 412909
44257D12909l03156L26867O04084J51488l45468m39536m81500o42936m78144J33202
44247a062190N24849K35024k26024j10462N26280R48336O38182j76904p32283
44238E64808m35719M33703Q85961L72640m88350p62733m25045j26458p7887L4310
44228b4770K32217K41472K09370M84675O90810P6620j029485j244345r0386J086154
44218F32332Q97809j73120n69693J06700O74694J52784q99380j175673k95535
44209f49082Q05739J093525N96463Q6616q3976k47706n63157o38107k97258N13
44199A03570q131J17714N43895M77426n61670j505978j065807K10755O86587J64053
44189h37586j6020N75468P54950l5815n76600J00687J017599Q01139j94387o26425
$$ plain form
44257 412909 109753 436620 1040704 1192192 846724 407188 -74312 -717248 -1195392 -1062190
44247 -1062190 -537341 -302317 -528341 -638803 -112523 835813 1473995 1297091 564808
44238 564808 129089 562792 1448753 1821393 1333043 570310 145265 18807 -59080 -24770
44228 -24770 207447 448919 658289 1142964 1833774 1910394 880909 -363436 -453822 632332
44218 632332 1530141 1357021 787328 894028 1568722 1721506 822126 -353547 -649082
44209 -649082 156657 1250182 1846645 1933261 1849285 1601579 1038422 400315 103057 103570
44199 103570 95439 213153 757048 1234474 672804 -833174 -1898981 -1688226 -1001639 -837586
44189 -837586 -853606 -278138 476812 440997 -135603 -34916 982683 1783822 1589435 963010
44179I63010k36062J12680k0924k46837k52003j73358j65684k29077k92489r2698
44169f33442N89817J245826R23376l05243j053572n13831L14906K43488k38007
44160E73318J4503P27497P24997M006l72110k30485m33358j014583q85345K09170
44150f82390J013907O96011R2447K16836O82828N71382m3021m45245m87894m61729
44140A153132k61496L28589Q28434N21210l54302p40279k10848M24832K45251
44131A934523n72372j053185o82228M5842L55654J60404L9217L35599O64196N05641
44121A733291l2489m09643l96485k03124k836K03739L20553K37140J39372K37956
44111A827474K42388k79612j009119j081660l59952K79528K80251K24864P21747
$$ plain form
44179 963010 726948 839628 818704 571867 319864 146506 -19178 -248255 -540744 -633442
44169 -633442 -43625 1202201 2125577 1820334 766762 252931 567837 811325 573318
44160 573318 587821 1315318 2040315 2044321 1672211 1441726 1008368 -6215 -891560 -682390
44150 -682390 331517 1027528 1119975 1336811 2019639 2591021 2548000 2102755 1614861 1153132
44140 1153132 891636 1220225 2048659 2569869 2215567 1475288 1264440 1689272 1934523
44131 1934523 1362151 308966 -373262 -327420 28234 188638 227855 563454 1227650 1733291
44121 1733291 1700802 1291159 894674 691550 688714 892453 1213006 1450146 1589518 1827474
44111 1827474 2069862 1790250 781131 -300529 -660481 -380953 -100702 124162 845909
44102H45909J182044O11504p34504j457380q03644M34382J016582O54502p085
44093A742310l76161m41087m50535m46782k53930J78686N74834N70211J34248
44084A231794l61146n35349l63642j01734L9882N7368O6132J47948K72498L38428
44074G92179K90357J55891m6739l17047n16339l92748N1528M02304L19653L1852
44064G70891O146K54309L82549K54898J09780M058l02161p58606q72234m27511
44054e77881R8487J90094k786K2223L98195Q41824J093702J071668P87931M16328
44044D339785K38504K36935j8775p42567j422181j356901n72700K11863M73399
44035A387362L44358J85982R3500k4834j26882j8330L54410O91044N46250j32161
$$ plain form
44102 845909 2027953 2639457 1904953 447573 -356071 78311 1094893 1749395 1742310
44093 1742310 1366149 925062 474527 27745 -226185 -47499 527335 1097546 1231794
44084 1231794 870648 335299 -28343 -130077 -90195 -32827 33305 181253 453751 792179
44074 792179 1082536 1238427 1191688 874641 358302 -34446 17082 419386 739039 770891
44064 770891 777037 1031346 1413895 1668793 1778573 1782631 1480470 721864 -150370 -577881
44054 -577881 -479394 -289300 -292086 -269863 128332 970156 2063858 3135526 3923457 4339785
44044 4339785 4578289 4815224 4796449 4053882 2631701 1274800 702100 913963 1387362
44035 1387362 1731720 1917702 2011202 1986368 1859486 1841156 2195566 2886610 3432860 3300699
44025C300699p76623p75219k60373J2735l51824r00482r74613m71524K46052Q19689
44015a31483J010512P24753K42584O6117K22788J34768m38069q22865l68899M83112
44005A123318P83824M03964k0269k38912n54826q78419o17567K44561Q49093O53304
43995A748071J89237J40589K94416J6836o77554j163333j057852n10502J70025
43986h50067P06926Q30413N15406J57611J34610K91459K20186r2312l31576m60112
43976A122544p09056r31031n70984M25124J178134Q72012o7507l91176L50791
43967A278851J175219R47347j40366q84823o68804j00874M2360j27437m3748K80129
43957A757854L10061n5362k75131m6603J89960m0012m65499m67400l0744K17588
$$ plain form
44025 3300699 2524076 1748857 1488484 1501219 1149395 248913 -725700 -1197224 -951172 -131483
44015 -131483 879029 1603782 1846366 1912483 2135271 2270039 1831970 1009105 640206 1123318
44005 1123318 1907142 2311106 2290837 2051925 1497099 618680 1113 245674 1094767 1748071
43995 1748071 1937308 2077897 2372313 2389149 1711595 548262 -509590 -1020092 -850067
43986 -850067 -143141 687272 1202678 1360289 1494899 1786358 2006544 1914232 1582656 1122544
43976 1122544 413488 -517543 -1088527 -663403 514731 1386743 1319236 928060 1278851
43967 1278851 2454070 3401417 3261051 2376228 1707424 1606550 1648910 1521473 1477725 1757854
43957 1757854 2067915 2012553 1737422 1690819 1880779 1840767 1375268 907868 877124 1094712
43947A094712p0084m60655l64997J43833M62090K82689o9724j81939p6602K8454
43937G87777J76540M75581O19941J72173o31714r56758m94825N5377M2319j60115
43927H6296J34080O66905N68538j90840o19250j66374M46853K88723m90928r63702
43917b39699o65267j5935L60325L22663J95540K82773M85174M42527R1473j25333
43907A134241J37677N39240N04856R5410j70117k44716n19146q15485l90499O93601
43897I65062J197231M05368o40186n52377L97037Q12896L25205p7963J69883M01263
43887C403419M8734l31245m8266N18906N36431N0087j36981K67974O69798N38728
43877E517585J41600R4800N59868J129900J317573R75936L64206p5951j21315
$$ plain form
43947 1094712 1024628 563973 198976 342809 804899 1087588 1017864 835925 759323 787777
43937 787777 964317 1439898 2059839 2232012 1600298 643540 148715 204092 246411 86296
43927 86296 220376 887281 1455819 1264979 645729 479355 926208 1214931 724003 -239699
43917 -239699 -904966 -920901 -560576 -237913 -42373 240400 725574 1168101 1259574 1134241
43907 1134241 1271918 1811158 2316014 2411424 2241307 1996591 1477445 661960 271461 965062
43897 965062 2162293 2567661 1927475 1375098 1772135 2585031 2910236 2832273 3002156 3403419
43887 3403419 3452153 3120908 3072642 3591548 4127979 4178066 4041085 4309059 4978857 5517585
43877 5517585 5659185 5753985 6313853 7443753 8761326 9737262 10101468 10025517 9904202
43868I904202l7437k99833r30543j325143r87752k55419R4073j31457l99907l74980
43858E255804l50507n12082m45826P9190M43629N9187n58906n42347j34964k56520
43848C036658p78087o17229K90016O13847k25763j008346p06659j61131m97122
43839e3816j030758l76394J104355J716255R67941K4722k97453l80827n15216
43830A158809l11535K18473L71009J8037o4642L68007M82494j42676o50929k95613
43820A151434L33121L23287j70706m16856k76749p7564P7667J53605o6499m39781
43810E90959l46459K73349N74199J96208L7903O83968J068916N9476j404157j390332
43800C44030J40455J199923N89753o50963r86161l23082L50791L75827r8716m85672
$$ plain form
43868 9904202 9866765 9566932 8636389 7311246 6323494 6068075 6162148 6030691 5630784 5255804
43858 5255804 4905297 4393215 3947389 4026579 4470208 4529395 3970489 3428142 3293178 3036658
43848 3036658 2258571 1641342 1931358 2545205 2319442 1311096 604437 443306 -53816
43839 -53816 -1084574 -1460968 -356613 1359642 2327583 2352305 2054852 1674025 1158809
43830 1158809 847274 1065747 1436756 1454793 1390151 1758158 2240652 2097976 1447047 1151434
43820 1151434 1484555 1807842 1637136 1220280 943531 865967 943634 1097239 1030740 590959
43810 590959 244500 517849 1092048 1288256 1326159 2010127 3079043 3138519 1734362 344030
43800 344030 484485 1684408 2274161 1623198 637037 313955 664746 1040573 941857 456185
43790D56185k61994M97693J014904O90101k0512k26016P7534J11609l60374p35941
43780A243189o43544m00415k83778k04947k06886m01637l54093M60513J472470
43771F80872J431289K54693p24635p13194l79523l32816j06931N19961O14416
43762A244132l13394j024915l22110Q65678Q08302k87340o60353J84820Q72028
43753A366848M82985j98588k37773Q3890J28849M017L6325q89l69060o78253m18914
43742A99437K26615O55554O05107K24840k77024o71035o79190k58613K87780O69697
43732I83168Q15973O49037R3688n32917o41733j44493L50207L75729J59949N3356
43722B161964m1549k57665l22086o7228Q1633k43236n91238k90552M45121P58472
$$ plain form
43790 456185 194191 691884 1706788 2396889 2376377 2150361 2227895 2339504 1979130 1243189
43780 1243189 599645 199230 -84548 -289495 -496381 -898018 -1252111 -791598 680872
43771 680872 2112161 2366854 1642219 929025 549502 216686 109755 629716 1244132
43762 1244132 930738 -94177 -416287 449391 1257693 970353 310000 494820 1366848
43753 1366848 1849833 1651245 1413472 1497362 1626211 1630228 1666553 1665664 1296604 618351 199437
43742 199437 426052 1081606 1686713 1911553 1634529 963494 284304 25691 313471 983168
43732 983168 1799141 2448178 2541866 2008949 1367216 1222723 1572930 1948659 2108608 2161964
43722 2161964 2120415 1862750 1540664 1473436 1555069 1311833 720595 430043 875164 1633636
43712A633636L96337j9369Q713K82870M74367O01334O77148M39995j84936p35339
43702C574756p18194k54736Q8535j6390l60212m81980j25520M83129P76007M36684
43692C402079j58117l78148k11752k47949o66119q22443k45978M62906L85343
43683A519822l37051o28018K7331R21281J144567O59390M1224l38383m48415k97253
43673B264495J6167J56999r9117m88347n81504l46263l8942K66642N80046N98810
43663B328986L2999o90105p36806n8102M15544J18481k81241O1071P84048Q00106
43653B774981j02949r91221j106949o64266j67228K94166O96446O95488J51879
43644A580347l97078l93530r2681j15213l70717j70175N63240R66488M43376m12587
$$ plain form
43712 1633636 2029973 2010604 2019317 2302187 2776554 3377888 4055036 4495031 4310095 3574756
43702 3574756 2856562 2601826 2690361 2673971 2313759 1831779 1706259 2189388 2965395 3402079
43692 3402079 3243962 2865814 2654062 2406113 1739994 917551 671573 1134479 1519822
43683 1519822 1182771 554753 582084 1503365 2647932 3307322 3348546 3010163 2561748 2264495
43673 2264495 2280662 2437661 2338544 1850197 1268693 922430 883488 1150130 1730176 2328986
43663 2328986 2361985 1671880 935074 876972 1292516 1410997 1129756 1190827 1974875 2774981
43653 2774981 2672032 1680811 573862 -90404 -257632 36534 732980 1428468 1580347
43644 1580347 1183269 789739 697058 581845 211128 40953 604193 1570681 2014057 1601470
43634A601470o19768j46241J55564k04464p71937q73612m29673J50166N13127
43625f25368N61818L68714J46016J24450K52120J91910j68978m22685j65752L37689
43615E99934M12555j28982p13935p06166r1116O14275Q87050N70304k7290l23610
43605A093019J2966O56048R41910O11896n174m94778o70126m36157J15117L97736
43595B222457k11365j321462j621325n29854Q58429J149030M46853n5056J07119
43586A044826K91567Q4641o7746K05119N33120M76037J82794k2209j59813l29704
43576B238632m04695l31193k99043l33650j79353J67531L40047K67551L40584
43567A806411O01366N05550n3278k91386K24348O83054K72181m11338l23111K29288
$$ plain form
43634 1601470 981702 835461 991025 786561 14624 -858988 -1288661 -1138495 -625368
43625 -625368 -63550 305164 451180 575630 827750 1019660 850682 427997 262245 599934
43615 599934 1012489 883507 169572 -536594 -627710 -13435 873615 1443919 1416629 1093019
43605 1093019 1105985 1762033 2703943 3315839 3310665 2815887 2145761 1709604 1824721 2222457
43595 2222457 2011092 689630 -931695 -1461549 -603120 545910 992763 937707 1044826
43586 1044826 1336393 1421034 1353288 1558407 2091527 2567564 2750358 2728149 2568336 2238632
43576 2238632 1833937 1502744 1203701 870051 690698 858229 1198276 1465827 1806411
43567 1806411 2407777 2913327 2860049 2568663 2793011 3476065 3748246 3336908 3013797 3243085
43557C243085J16771n88000o50334K04275P48107K38382m78350n05358k30658
43548B097920k37412p4804P00596J200095L48888j188223j694388q14086J17942
43539D56528J94123J458K37513N35071L37408l5026j8887J69717m386l65364l13622
43528A194533Q7304J46392l13103n67867l174R65316J333885P04558k42717n28305
43518B776822j8396M04041l9573r40333j173021m08107M73811O97226N95545P35256
43508C103271P24576j01722j155427j025394L75205J305799M96029j004761j247496
43499A470080o2022Q50803L76360o28269p65466j6505M66299L4834p36573r67988
43489B1553n31071J3295K01887J05257O8564K52765N12169O38104O08052N41737
$$ plain form
43557 3243085 3359856 2771856 2121522 2325797 3073904 3312286 2833936 2328578 2097920
43548 2097920 1860508 1785704 2486300 3686395 4035283 2847060 1152672 338586 456528
43539 456528 650651 652109 889622 1424693 1762101 1727075 1708188 1877905 1873519 1508155 1194533
43528 1194533 1281837 1428229 1115126 547259 544085 1509401 2843286 3547844 3305127 2776822
43518 2776822 2758426 3162467 3122894 2182561 1009540 601433 1075244 1772470 2368015 3103271
43508 3103271 3827847 3726125 2570698 1545304 1920509 3226308 3722337 2717576 1470080
43499 1470080 1408058 2258861 2635221 2006952 1241486 1224981 1691280 1726114 989541 21553
43489 21553 -509518 -496223 -294336 -189079 -120515 132250 644419 1282523 1890575 2432312
43479B432312M50237J52931m36840r83100r06013m7517R91607J444943J240014
43470D338574R16841P06432K42509n55595r32954k70035Q00470J086684M91739
43461F824665N1936K80718N07326J93707j44994J6904K07773q6088k54485M63795
43451H061257J383734J136478j57581r23221m88086L0534l05094p60166l23527
43442G654328M70376L53271o31783j193310p62885k20238m05943q67758o57816
43433C738242J87122O71947K48410m12006l33757M07078P60633J67391o22742
43424D812318n86670J48992N52081J37533n34302p65657m21883K79551R11929
43415D533892P42714n48826j852872j442927O66089K268026J682606o7368q39879
$$ plain form
43479 2432312 2882549 3035480 2598640 1615540 709527 662010 1653617 3098560 4338574
43470 4338574 5255415 5961847 6204356 5648761 4715807 4445772 5246242 6332926 6824665
43461 6824665 6876601 7157319 7664645 7858352 7713358 7730262 7938035 7851947 7597462 8061257
43451 8061257 9444991 10581469 10423888 9500667 9012581 9043115 8738021 7977855 7654328
43442 7654328 8124704 8477975 7846192 6652882 5889997 5669759 5263816 4396058 3738242
43433 3738242 3925364 4597311 4845721 4433715 4099958 4507036 5267669 5435060 4812318
43424 4812318 4225648 4374640 4926721 5064254 4529952 3764295 3342412 3621963 4533892
43415 4533892 5276606 4727780 2874908 1431981 2098070 4366096 6048702 5981334 5141455
43406E141455k71601K35427j36092p64552r33128o53192m9411Q63532J572361
43397E004799J325255L08705l82460k50132K2430k19063p02145q86789o64832
43388C555768m7735R62243J792646J543285L61530l43359K44867J130281R67378
43379A0166904j3817n28846j20545N46415R42149J165476J276379J080791O72034
43370A5186940M54885N19276N70164N34681O96286J164991J703094K147709K604261
43361B5582287L201898M007931N109375O395423P404136P882994Q406889R884643
43353G7875576J2463510J5472927J8483008K1817680K5799793K9859776L2458246
43346B34230516L1520951K5165953J3033478k479016j6839699k6105890k9343016
$$ plain form
43406 5141455 4869854 5105281 4969189 4204637 3271509 2618317 2568906 3432438 5004799
43397 5004799 6330054 6638759 6256299 6006167 6028597 5809534 5107389 4220600 3555768
43388 3555768 3508033 4470276 6262922 7806207 8167737 7824378 8069245 9199526 10166904
43379 10166904 10153087 9624241 9503696 10050111 10992260 12157736 13434115 14514906 15186940
43370 15186940 15641825 16161101 16731265 17265946 17962232 19127223 20830317 22978026 25582287
43361 25582287 28784185 32792116 37901491 44296914 51701050 59584044 67990933 77875576
43353 77875576 90339086 105812013 124295021 146112701 171912494 201772270 234230516
43346 234230516 265751467 290917420 303950898 301471882 284632183 258526293 229183277
43339B29183277k8431948k5883747k3115142k0389750j7594767j4731147j1962198
43332H7074578r560004p823125o867667o438764o037322n320675m323439l244215
43324C7459367k182993j269685q73113j286378k162598k635118k185140j175433
43316B3688909m23277m57918j193972j974743j913410o92032Q30126J340504O26559
43307A9830746j72503j28940L86052O32271P07748J064362J491605J518028J323431
43298B6652800J291007J145287O38325O12026J983099L931106M703552M290064
43290D5247266M595423O543095Q734312R780023J0279798J1185954J1561643R653734
43282A17581248N443739N45894l940364p894976j0785064j1567227j0326730q665914
$$ plain form
43339 229183277 200751329 174867582 151752440 131362690 113767923 99036776 87074578
43332 87074578 77514574 69691449 62823782 56385018 50347696 45027021 40703582 37459367
43324 37459367 35276374 34006689 33133576 31847198 29684600 27049482 24864342 23688909
43316 23688909 23265632 22807714 21613742 19638999 17725589 17033557 17863683 19204187 19830746
43307 19830746 19658243 19529303 19915355 20547626 21255374 22319736 23811341 25329369 26652800
43298 26652800 27943807 29089094 29727419 30339445 32322544 36253650 40957202 45247266
43290 45247266 49842689 56385784 65120096 74900119 85179917 96365871 107927514 117581248
43282 117581248 123024987 123570881 119630517 111735541 100950477 89383250 79056520 70390606
43274G0390606p888402p703031p156158n993205m595648l300371k367178k097434
43266B9289179k421652k718410k507540k046927j845454j854599j597533r67927
43258A3329137m51038m75977q34347r30965n43396j31871k37272o84455p47804
43249H292012k09451K02898j93628r86233j180168n62004J06970K30629L5277
43240E736302n2366m9446j33854k09576j29388k9446j18008l49540n21738m78306
43230C664634j03860N55697J042689P89899q3679p13280n65127j65644l15656
43221D105673r24525j181736p00748O8960N23488N07135K14551q0150j29596J01915
43211B504967L05411J80029r5263j06434R8853M6140l30056m42501L2434M85995
$$ plain form
43274 70390606 62502204 54799173 47643015 41649810 37054162 33753791 31386613 29289179
43266 29289179 26867527 24149117 21641577 19594650 17749196 15894597 14297064 13329137
43258 13329137 12878099 12402122 11567775 10636810 10093414 9961543 9724271 9039816 8292012
43249 8292012 8082561 8285459 8091831 7105598 5925430 5363426 5470396 5701025 5736302
43240 5736302 5683936 5634490 5500636 5291060 5161672 5132226 5014218 4664678 4142940 3664634
43230 3664634 3560774 4116471 5159160 5949059 5865380 5152100 4586973 4421329 4105673
43221 4105673 3181148 1999412 1298664 1367624 1891112 2398247 2612798 2532648 2403052 2504967
43211 2504967 2810378 2990407 2895144 2788710 2887563 2933703 2603647 2161146 2193580 2679575
43201B679575J66885o42014q87395j76333O69267P09953N7203m35547l41167m2369
43191A758058l6172l09973n15165m39766j45648J53447K20482j244j98415N6356
43181E41960O89802J040878O59503n9428m14939l58211l90394n90635m17314L12355
43171A013577Q65791N07179m07041q17162l04506M90729Q02075N71045J73101
43162B894788k38276p20293j088306r40926k19657N71213Q93009P28897M05395
43153B285844N3002l91654p27955n57150J7886K70713j72271o56644l66181M48190
43143B03780Q17720M72481Q7540R9836J73768N7920N2223K13718J6716n93162
43133A602540p11808J28482R16067N76482k87316l74407J45607K3641p47897p99887
$$ plain form
43201 2679575 2846460 2204446 1317051 1140718 1809985 2519938 2577141 2141594 1800427 1758058
43191 1758058 1721886 1411913 896748 456982 311334 464781 685263 684019 485604 541960
43181 541960 1231762 2272640 2932143 2872715 2457776 2099565 1709171 1118536 701222 1013577
43171 1013577 1879368 2386547 1979506 1162344 857838 1348567 2150642 2721687 2894788
43162 2894788 2656512 1936219 847913 -93013 -312670 258543 1151552 1880449 2285844
43153 2285844 2338846 1947192 1219237 662087 679973 950686 778415 121771 -244410 203780
43143 203780 1021500 1493981 1581521 1681357 1855125 1913045 1965268 2178986 2195702 1602540
43133 1602540 890732 1019214 1935281 2511763 2224447 1850040 1995647 2019288 1271391 471504
43123D71504K03417Q27412K21662m48948J1939Q39235O69186j91795m19317J24582
43113B308877M41194K46836J94827L81581J49752n13882p85119m61830l17827
43104A644409o38412o62004m542N39908L14641j15782L236L82512L56869M7906
43094A868741o0866j10052m68629q07811n40478J09881M01350K46114K20054N11074
43084A369378O99019N71623L81920K35955o6785m73588n89672k90960Q9493K67980
43074B194363K30141m0559n03398p40363l26002M09548O20309P9139n46587p06038
43064F70553n84850m77578k52614J38308K55966j34390m28303Q8650J108630J545598
43054A929970Q95670j70285o98344n48679l46261n16241p15951l87168L37665
$$ plain form
43123 471504 674921 1502333 1723995 1275047 1286986 2126221 2795407 2603612 2184295 2308877
43113 2308877 2750071 2996907 3191734 3573315 3723067 3209185 2424066 1962236 1644409
43104 1644409 1005997 343993 339451 879359 1194000 1078218 1081454 1463966 1820835 1868741
43094 1868741 1807875 1697823 1229194 421383 -119095 -9214 392136 638250 858304 1369378
43084 1369378 2068397 2640020 3021940 3257895 3191110 2717522 2127850 1836890 1926383 2194363
43074 2194363 2424504 2383945 1880547 1140184 814182 1223730 1844039 1923178 1376591 670553
43064 670553 85703 -391875 -644489 -506181 -250215 -384605 -812908 -724258 384372 1929970
43054 1929970 2825640 2655355 1957011 1408332 1062071 545830 -170121 -557289 -219624
43045b19624O95834L37398j58109j28940K31900K97849J8182j63342j72779l13420
43035D24949m97217k99167J77781L33704R5786M2825L03650K74316k10868l97456
43025B48303J54497P53323O66188K14350K7711k9992l27332n36257k07096K65931
43015A229626K49765M9J64346N28324L39338l49280p30985n33534k46975j26827
43005E23847O2727L38863M53756N05614O94959O33793m9840o12894l1761J082927
42995C601991R67668n60794j485805m74116J112377J240631O0562o73939k68909
42986C519666L32681L34197M5215m8413o9360k59360m45893l93705k66993m00562
42976B347473p70741r15815m51188L47200O80765J93854m47636m41753o7967j97192
$$ plain form
43045 -219624 476210 813608 655499 526559 758459 1056308 1074490 911148 738369 424949
43035 424949 -72268 -371435 -193654 140050 235836 278661 582311 856627 645759 248303
43025 248303 402800 1156123 1822311 2036661 2064372 2034380 1707048 1170791 963695 1229626
43015 1229626 1479391 1479440 1643786 2172110 2511448 2162168 1431183 897649 650674 523847
43005 523847 586574 925437 1379193 1884807 2579766 3213559 3163719 2550825 2519064 3601991
42995 3601991 4569659 4008865 2523060 2048944 3161321 4401952 4462514 3788575 3519666
42986 3519666 3852347 4186544 4231759 4183346 4113986 3854626 3408733 3015028 2748035 2347473
42976 2347473 1576732 660917 209729 556929 1237694 1431548 983912 542159 474192 277000
42966B77000o79792l80378Q65595J582200P12296p21783j072942l58975J27626
42957C50847p6736k43684M1808L06416J77979j07669l14443m44651l20733K09173
42947d21693O29898K53363n64808o85763J28799P79598M35214l52341o37986l72088
42937h07807p6371J17443M07967P19805P90305O26047M16351K06435K117o0817
42927B341475J6576p3161n06393r49365r44399n04143m9053J03638k0662j85448
42917g70935j61783N6689K08651J16826K7976K59913N55796L04363m84526r70812
42907h57842n29094M31802J005174Q00643J51612l70097l88520M7292M59572M12408
42897A162950O1348j03667m1197j44102m20160m07300p2047K9725j95964p6864
$$ plain form
42966 277000 -402792 -783170 82425 1664625 2376921 1655138 582196 223221 350847
42957 350847 274111 30427 72235 378651 556630 448961 134518 -310133 -630866 -421693
42947 -421693 208205 461568 -103240 -789003 -660204 119394 554608 202267 -435719 -807807
42937 -807807 -884178 -766735 -358768 361037 1151342 1777389 2193740 2400175 2402292 2341475
42927 2341475 2358051 2284890 1778497 829132 -115267 -619410 -668463 -564825 -585487 -770935
42917 -770935 -932718 -876029 -667378 -550552 -522576 -262663 293133 597496 112970 -857842
42907 -857842 -1386936 -955134 50040 850683 1002295 632198 243678 290970 750542 1162950
42897 1162950 1224298 1120631 1079434 935332 515172 107872 35825 65550 -130414 -207278
42887b07278N74177Q65033K38685m38140k04287L86160K14628m80097n72854n6792
42877C19235J6202m78483m72231L11103P25189J52632l98755j7838N87714L74218
42867A118986k99231m45676j38118j07293k63958r575L69320O0254o70927o86473
42857a072691J18153N38516K2927m57282q2630N23529N02610J85343K92176N58706
42847A129357L05957k19115k68346L3742n5637m93799n24483q7556Q4744j27987
42837b23123j2648N13896N29558k74775q63298m97776P2277K0201r2418M93373
42827c34733J073988N81717l59219k67124O56417P58467k47697p16639J52211
42818A297388R08095K26257r63984j078457l21843j309l10612l94205n5945J35439
$$ plain form
42887 -207278 366899 1231932 1470617 1032477 828190 1214350 1428978 948881 376027 319235
42877 319235 335437 -143046 -615277 -304174 421015 573647 174892 157054 744768 1118986
42867 1118986 819755 374079 235961 128668 -135290 -144865 224455 284709 -386218 -1072691
42857 -1072691 -954538 -416022 -393095 -850377 -933007 -409478 93132 278475 570651 1129357
42847 1129357 1435314 1216199 947853 981595 925958 432159 -92324 -179880 -95136 -223123
42837 -223123 -235771 278125 807683 532908 -330390 -828166 -755889 -735688 -828106 -334733
42827 -334733 739255 1320972 961753 694629 1351046 2109513 1861816 1145177 1297388
42818 1297388 2205483 2431740 1467756 389299 67456 66147 -244465 -638670 -694615 -559176
42808e59176J28439L48702N82401K83307j40135K12068R76908P64884n87916j511148
42798D98334r68513J48946N97565M57566L40289J03909m79041o93506J41911J231767
42788A379227J172109J3425p74289l74564M39272O04499Q0129m42684m61922j731
42778A633471N02241M88612j65948q40825q50407l56064o4228j08419M5698N15170
42768G99301O31125j0988q08468r36706l98975J85329M73403N91178O73885O80714
42758A879798N77708L79173P5579k63506m38303l67889k47449k68502l31697k22996
42748G71916O1954L25842L67533Q4054m14103p17269m69519N0392J07449m56414
42738b88165q03938j84968Q98725J234053M83590m07139m87284O3680L62408L7972
$$ plain form
42808 -559176 -430737 -82035 500366 783673 643538 855606 1832514 2597398 2009482 498334
42798 498334 -470179 -321233 276332 733898 1074187 1178096 699055 5549 147460 1379227
42788 1379227 2551336 2564761 1790472 1415908 1855180 2459679 2539808 2097124 1635202 1633471
42778 1633471 2135712 2624324 2458376 1617551 767144 411080 346852 238433 284131 799301
42768 799301 1430426 1419438 610970 -325736 -724711 -539382 -65979 525199 1199084 1879798
42758 1879798 2457506 2836679 2912258 2648752 2210449 1842560 1595111 1326609 994912 771916
42748 771916 833870 1159712 1527245 1611299 1197196 479927 10408 60800 168249 -288165
42738 -288165 -1092103 -1277071 -378346 855707 1339297 932158 444874 508554 870962 908934
42728I08934l55489j09055O91636J171304O96471k67245o80910l05849j806l92308
42718A355683q70238n67440J86164L12260k99085n93244l5486N48357L07020l31361
42708A2630m21241M1618K67537l7164l45458k14092J51656L09651R1339l48429
42698d91953o39883l92738L64680J010483R65017M16994K0780o824J2865o1394
42688A198027M077K22550K41582J4940N73L28918L65815l31455j071784p98224
42678A75019L50422J024284L88558p53119r74032j3328R58791Q27870j54583p90746
42668A039136m52282K20389K61333l05761n38388N1968P32021N28029l70090q12536
42658C53819k81944M08366L48163j33581n2648O22465Q58552J63647o04860n34633
$$ plain form
42728 908934 553445 444390 1136026 2307330 3003801 2736556 2055646 1749797 1747991 1355683
42718 1355683 485445 -81995 104169 416429 117344 -475900 -511386 36971 343991 12630
42708 12630 -408611 -366993 -99456 -136620 -482078 -696170 -544514 -234863 -143524 -491953
42698 -491953 -1131836 -1524574 -1159894 -149411 815606 1232600 1253380 1246556 1259421 1198027
42688 1198027 1202104 1424654 1666236 1681176 1681749 2010667 2376482 2045027 973243 175019
42678 175019 525441 1549725 1938283 1185164 211132 197804 1156595 1984465 1829882 1039136
42668 1039136 586854 807243 1068576 762815 224427 276395 1008416 1536445 1166355 353819
42658 353819 71875 480241 828404 694823 642175 1264640 2123192 2286839 1681979 1147346
42648A147346l873O1595k61616j35187M61198N75602j12428o80194m43766n83
42638F08094m0477p4363N66216J181694N51892r35731j469828l38463J017651
42629A066685J003067j14370q97093o79848Q138M98104O35856N23087K38771j18931
42619B163466m22830n57280l91765P6969M95338M33846L3148p4914L03082N88018
42609B647078L41695l4991J1382K96020K76340p4754m15802p31173j172536j430981
42599b87722j025851j47051M99231O70798P22230P56017M44379j10683j59701
42590A361647N85181J251588Q38569m09858j265454r84674J0956Q50117J075732
42581C313804P10619k7102p41956r08105l66862K74126J96045n41827r00766j71363
$$ plain form
42648 1147346 1143473 1205068 943452 808265 1269463 1845065 1732637 1052443 608677 608094
42638 608094 567617 493254 1059470 2241164 2793056 1857325 387497 49034 1066685
42629 1066685 2069752 1955382 1058289 378441 386579 884683 1520539 2043626 2282397 2163466
42619 2163466 1740636 1183356 791591 868560 1363898 1797744 1830892 1755978 2059060 2647078
42609 2647078 2988773 2953782 2965164 3261184 3537524 3462770 3046968 2315795 1143259 -287722
42599 -287722 -1313573 -1460624 -961393 -290595 431635 1187652 1632031 1521348 1361647
42590 1361647 1946828 3198416 4036985 3627127 2361673 1376999 1387955 2238072 3313804
42581 3313804 4024423 3997321 3255365 2347260 1980398 2254524 2450569 1908742 1007976 836613
42571H36613R87180J330870O28226j70406l07780l8487Q2698J4208k0690M8Q1041
42560C423521L36850N60407K43809n35845q98484l87085K63654K80406O5765L49251
42550C702249P82005N38220j47629l41879l7379m2668l54358j27574N90572O36030
42540E197589l21907j044687o08877K45569M29541K1566l62674o28009p18129
42531B209982j48225R36521J265663K18066q66296n46875M20549L26976o11599
42522C204762o20820N82191J232238L88401o11389m25649K27401K322q20887r52209
42512B206361k22751L28454K07032K5990K62118M90476J78180m57086p80866n60982
42502A676926j30820J01400Q5375P0348J89937K31639j9446l12691j81569K97894
$$ plain form
42571 836613 1823793 3154663 3782889 3612483 3304703 3266216 3348914 3363122 3342432 3342480 3423521
42560 3423521 3760371 4320778 4564587 4028742 3130258 2743173 3006827 3287233 3352998 3702249
42550 3702249 4484254 5022474 4874845 4532966 4495587 4452919 4098561 3970987 4561559 5197589
42540 5197589 4875682 3830995 3222118 3467687 3897228 3918794 3556120 2928111 2209982
42531 2209982 2061757 2998278 4263941 4482007 3615711 3068836 3489385 3816361 3204762
42522 3204762 2583942 3166133 4398371 4786772 4175383 3749734 3977135 3979457 3158570 2206361
42512 2206361 1983610 2312064 2519096 2545086 2807204 3297680 3475860 3018774 2237908 1676926
42502 1676926 1546106 1647506 1732881 1803229 1993166 2224805 2205359 1892668 1711099 2008993
42492B008993M85815J40232j27503K03105O43292L83727m06091p69776l75848
42483B185946J05274J63814J30704L24394L28053k33590q14814o72020p9533Q4757
42473A522985k22165j81342M19032P23736J92645m80005m40495O5421K47524J2054
42463A859390j76439k37853l74371l19366L19436J070173R75027N9829n55246
42454B620580k72228J85238p975o13589r34178q57727o56806l22232K13379O01839
42444d3699M93164J44723N1546K06332K25975q640k83049l96380k13993L25844
42434E01823R02911R00999K14091m59702n74269m70508n98474o00364J7481P66481
42424F00469P13566q6804o52192m82334k4589K45380L42724L21057J12504q0741
$$ plain form
42492 2008993 2494808 2635040 2507537 2710642 3353934 3737661 3331570 2561794 2185946
42483 2185946 2291220 2455034 2585738 2910132 3238185 3004595 2189781 1517761 1438228 1522985
42473 1522985 1300820 1119478 1538510 2262246 2454891 1974886 1534391 1599812 1847336 1859390
42463 1859390 1682951 1445098 1070727 751361 1070797 2140970 3115997 3175826 2620580
42454 2620580 2348352 2533590 2525615 1912026 977848 120121 -536685 -858917 -645538 -43699
42444 -43699 449465 594188 645734 852066 1078041 1069401 786352 389972 175979 501823
42434 501823 1404734 2305733 2519824 2060122 1485853 1015345 416871 -183493 -166012 600469
42424 600469 1314035 1227231 575039 92705 68116 313496 656220 977277 1089781 1009040
42414A009040L7884K42051O6767l06835k82592L5949o0741n49809n11158L38335
42404A8891R94839O33879j71953m03887l4970K34575J11093j66484m03490m78130
42394C34363j70584M06936N84493K513o29032l75593N28705R11183K77036n19250
42384A350770m36069M18940R54339M14607p37910j342929q64121N1196M91796
42375C00619M21555M07448M78699R9146o68366r33811l24076L16122J91281k40435
42365D8182j31748L17725K79732k35052l93579P4922N02485M00819R9569K7858
42355I90913P5747R18r2863n4499m8125k44533m24776k46268K14309M60092J37668
42344G68583n12200q31230m16385M01983Q81552O82225J69428j24831n8588J97882
$$ plain form
42414 1009040 1046924 1288975 1355742 1048907 766315 802264 741523 191714 -319444 18891
42404 18891 1013730 1647609 1475656 1071769 1036799 1271374 1382467 1215983 812493 334363
42394 334363 163779 570715 1155208 1157721 528689 153096 681801 1592984 1870020 1350770
42384 1350770 914701 1333641 2287980 2702587 1964677 621748 -242373 -191177 300619
42375 300619 722174 1129622 1608321 1707467 1039101 105290 -218786 97336 288617 48182
42365 48182 -83566 234159 513891 278839 -114740 -39818 462667 863486 963055 990913
42355 990913 1066660 1067578 974715 920216 872091 627558 202782 -43486 170823 630915 768583
42344 768583 256383 -574847 -991232 -589249 292303 974528 1143956 1019125 960537 1158419
42334A158419M46407M78057J56443k90007m34073l41828n97294j266795j443742
42325b134413m88945P64486R37481J1258o37492j38011Q24586J103116M91950
42316G34016l33988p28351n16095Q6571O13844O42087K15662j68411j36588J87204
42306E95951M61784N39255M84280L95448L20474K10420o3666m98565q12786p19702
42296I12893k94377J39658L88509M16973J70388k86640n97380m85766j96820j36697
42286C0741j92760O5546N70658P45590L72534j09891l10181l21149k78264n8894
42276E13930L04953M42193K02032o4944j13380k12439n53264p27730l32595K74072
42266b67172M22635J00210j39288p3046L8931J43085M91323Q97120O55398l46163
$$ plain form
42334 1158419 1604826 2082883 2239326 1949319 1515246 1173418 576124 -690671 -2134413
42325 -2134413 -2623358 -1858872 -921391 -910133 -1547625 -1685636 -861050 242066 734016
42316 734016 400028 -328323 -844418 -757847 -144003 498084 713746 545335 408747 595951
42306 595951 1057735 1596990 2081270 2476718 2797192 3007612 2943946 2445381 1632595 912893
42296 912893 618516 758174 1146683 1563656 1734044 1447404 850024 364258 167438 30741
42286 30741 -162019 -96473 474185 1219775 1592309 1482418 1172237 851088 572824 513930
42276 513930 818883 1261076 1463108 1398164 1284784 1072345 519081 -208649 -541244 -267172
42266 -267172 155463 255673 116385 43339 82270 225355 716678 1613798 2269196 1923033
42256A923033j067346n76895N06565P17376j86389q36177k40694P95335R47312
42247A982120K99472m8489J48733Q0283n00024p80119l53711O1294k9610J5294
42237H75243O87054J168238N77214m54398p19695l28265k71735n44982k51939
42228G36735N73087Q66178L99915J67110N03024L79951p07063j571217j090506
42219B57214j2350K25625l03976l28396M95881J066050N27834n11280q37925j55140
42209D23537O48950O12116j66864o67279k55325M73058N38354m6246m33348l09734
42199H17219j89538k69257k7991O57760R88373M37025l51779n54393l57385l98082
42189G51952n99638l90293K78177Q56462R28636N20511o3245l74473j75451J17941
$$ plain form
42256 1923033 855687 278792 785357 1502733 1316344 480167 239473 1034808 1982120
42247 1982120 2281592 2233103 2381836 2462119 1962095 1181976 828265 889559 859949 875243
42237 875243 1562297 2730535 3307749 2853351 2133656 1805391 1533656 988674 736735
42228 736735 1309822 2176000 2575915 2743025 3246049 3626000 2918937 1347720 257214
42219 257214 244864 470489 166513 -161883 333998 1400048 1927882 1416602 578677 423537
42209 423537 1072487 1684603 1517739 850460 595135 1068193 1606547 1560301 1126953 817219
42199 817219 627681 358424 330433 988193 1976566 2413591 2061812 1507419 1150034 751952
42189 751952 152314 -237979 40198 896660 1825296 2345807 2282562 1908089 1732638 1850579
42179A850579q7918n00225k42310N20967M97819n68110j064636L9006J255867
42170A701039P07157q58059j134490K39203J364745J139872N18046L95584K21338
42161D294435n31259j152120r53683m94218n20744o66790k32127M75182N95549
42152H14225O1843l96822l43900l8138J04524n4764l86540o15160n26358j89772
42142a570862J73552M92885P10270N14397k30388r02113o95092J98161P45840
42133e63350N13938J24606J11711K19597J62095J81160L84922L57284l0929j93586
42123A267448J87246M83657J14836m48770m50850o0415L1177j82366j02876L75883
42113A214970O52369K99992m06009q70549p27873r0983M84779M75139J9583k48414
$$ plain form
42179 1850579 1762661 1262436 1020126 1541093 2038912 1470802 406166 445172 1701039
42170 1701039 2408196 1550137 415647 654850 2019595 3159467 3677513 4073097 4294435
42161 4294435 3763176 2611056 1657373 1163155 642411 -24379 -256506 218676 814225
42152 814225 876068 479246 135346 97208 201732 146968 -239572 -854732 -1381090 -1570862
42142 -1570862 -1397310 -904425 -194155 320242 89854 -812259 -1507351 -1309190 -563350
42133 -563350 -49412 75194 186905 406502 568597 749757 1134679 1491963 1461034 1267448
42123 1267448 1454694 1938351 2053187 1604417 1153567 1093152 1124329 941963 839087 1214970
42113 1214970 1867339 2167331 1761322 890773 162900 71917 556696 1031835 1051418 803004
42103H03004j71549l05928q42994r83795n9403J249393J636270Q30977k37367
42094A918608p58443p54414n32613j78467K45571N25633N26249L22732O7326p7941
42084A304241Q191J94510J31331k50608n41863m51849k67938l27302l90253n7528
42074f49068M69061O18618K84558q6296j19551J90764O32696Q33689M39493l37000
42064B276964p01868l32906j7395n40172j340805j202872p8077P87774N86397
42055e62960j45758n42223m55639j59109K55625P19519R22821O30648j038o04682
42045E7204q39328m72587L61036J017794R47385M02437M0193m1558j91825k92979
42035I87772R2914O31560L68110p08190j331708p49672J44944K00556l59694n90394
$$ plain form
42103 803004 631455 325527 -517467 -1501262 -1560665 -311272 1324998 2155975 1918608
42094 1918608 1160165 405751 -126862 -305329 -59758 465875 992124 1314856 1382182 1304241
42084 1304241 1312432 1506942 1638273 1387665 845802 393953 126015 -201287 -591540 -649068
42074 -649068 -180007 438611 723169 636873 517322 708086 1340782 2174471 2613964 2276964
42064 2276964 1575096 1242190 1224795 684623 -656182 -1859054 -1937131 -1149357 -562960
42055 -562960 -708718 -1250941 -1706580 -1865689 -1610064 -890545 32276 662924 661886 57204
42045 57204 -782124 -1254711 -893675 124119 1071504 1473941 1514134 1472576 1280751 987772
42035 987772 1080686 1712246 2080356 1372166 40458 -709214 -564270 -363714 -723408 -1313802
42025a313802l67239k25515j79878J69995O37574O44504L07927L04358O51168
42016F29092O40979J16755k01587L5160J91319k31900p02644n43283m3474Q6950
42006b2633p7221J34315P88822J149276P24026j11336o81467p23424l99231j1997
41996G69130J45006M688j03404J49402M71257K13428n92054j037192n43418K78277
41986b44880N10943K13313R8705K53878R0286m53545o14055j250P11607P77426
41976A342428M14457K68158L26358P1272n44774r67346q48296m37792j14720M8043
41966d42212J55095K43279K78618K19503M5449j59360j98417L4492M00990O42409
41956A219846N61924R1852n76838r22057n31954K62581O24257K61165k32946l21492
$$ plain form
42025 -1313802 -1681041 -1906556 -2086434 -1916439 -1278865 -634361 -326434 -22076 629092
42016 629092 1270071 1386826 1185239 1220399 1411718 1179818 477174 -66109 -109583 -22633
42006 -22633 -99854 34461 823283 1972559 2696585 2585249 1903782 1180358 781127 769130
41996 769130 914136 918824 815420 964822 1436079 1649507 1057453 20261 -523157 -244880
41986 -244880 266063 479376 578081 831959 922245 468700 -145355 -146605 565002 1342428
41976 1342428 1756885 2025043 2351401 2422673 1877899 910553 62257 -375535 -490255 -442212
41966 -442212 -287117 -43838 234780 454283 499732 340372 141955 176447 577437 1219846
41956 1219846 1781770 1873622 1296784 374727 -157227 105354 729611 990776 757830 436338
41946D36338k25692l04751l68256j85726j12163m75340p92739m09018M19332Q90351
41936a127664Q21407O16345L56868j34626n38895l77180n552j93712p06430m58238
41926a747677P27274J646202J365552L35677n50446j032152j139274p29767N739
41917a118872L52008j918m67944m63735j47314J58983N07409Q27850P07569J85072
41907E39108o8228J13360J2082n88449p26679J31278Q78145L54985p22226q08443
41897h85067J30123P85834O22520L26172K98780J52326k14784l45188k30529m19454
41887B20733q58840p30920J93216J030756J053435O23906M07410L84544J47351
41878B471591l75003r17521j203516j012525l35531L74979N47914J99655j41965
$$ plain form
41946 436338 210646 -94105 -462361 -648087 -760250 -1235590 -2028329 -2437347 -2018015 -1127664
41936 -1127664 -306257 310088 666956 532330 -6565 -383745 -389297 -583009 -1289439 -1747677
41926 -1747677 -1020403 625799 1991351 2327028 1776582 744430 -394844 -1124611 -1118872
41917 -1118872 -766864 -768782 -1236726 -1700461 -1847775 -1688792 -1181383 -353533 354036 539108
41907 539108 470880 584240 596322 7873 -718806 -587528 290617 645602 -76624 -885067
41897 -885067 -754944 30890 653410 979582 1278362 1430688 1215904 870716 640187 220733
41887 220733 -638107 -1369027 -1175811 -145055 908380 1532286 1939696 2324240 2471591
41878 2471591 2096588 1179067 -24449 -1036974 -1372505 -997526 -449612 -249957 -391922
41869c91922k36900l18111m61216l95989n7790K52319L69677M02138L47059J50251
41859c40484R4563M31413O84501J74585p35360r00376q9107N99122L64551k53712
41849B9696m68049l85174l70497j58202N16614J048955O88706k39181p11624m05061
41839d53817M3750R0436p6983l5634K11173K79175l6260l85106k19134L63343
41829b19057M83990l39265j233355r79075K21071R90415P65312L49362K96491
41820C35889R1957n25442p71281j92275L56390J21819k37316R9678N56718J94055
41810C0192n28592n02294J31265L53266R2088J16691M07266K34564k55228j41019
41800f1801N36403P05060J15593k64335o216J47703j62252k38883J94262L03189
$$ plain form
41869 -391922 -628822 -946933 -1408149 -1804138 -1861928 -1609609 -1239932 -837794 -490735 -340484
41859 -340484 -245921 185492 869993 1044578 309218 -591158 -680265 -81143 283408 29696
41849 29696 -438353 -823527 -1194024 -1352226 -835612 213343 902049 662868 -48756 -453817
41839 -453817 -410067 -319631 -396614 -432248 -221075 58100 21840 -363266 -582400 -219057
41829 -219057 264933 -74332 -1307687 -2286762 -2065691 -1075276 -309964 39398 335889
41820 335889 427846 -97596 -868877 -1061152 -704762 -582943 -820259 -720581 -163863 30192
41810 30192 -498400 -1000694 -869429 -516163 -424075 -307384 99882 334446 79218 -61801
41800 -61801 474602 1179662 1295255 1030920 1024704 1172407 1010155 771272 965534 1268723
41790A268723k92271o34181m8441N89988L00270l77465m02818J4666j5299m11830
41780h658l68785J55737M32890K18244p6696k94852n97390p45757l12443M27371
41770a170339P30362N09295L50864L98533J36223n55404r96212o85075n952L84878
41760i02827L49494J42856o2478k32738l59816m81378n82031m52166M2605N87313
41750a951166P18409M82678L41160M05800K87654j90665o33204o18353k17381
41741a375068K12800M41976M66607M77879P15337J026361P47209m04734j475280
41732H33087j171171K81559J146675M49614p03550p65897J18066N85533J01036
41723H74952n89312q12973o60143k86452M01286J073980R45933p4829r35328p42220
$$ plain form
41790 1268723 976452 342271 293830 883818 1184088 806623 403805 418471 403172 -8658
41780 -8658 -377443 -221706 211184 429428 352732 57880 -539510 -1285267 -1597710 -1170339
41770 -1170339 -439977 69318 420182 818715 954938 399534 -596678 -1281753 -1287705 -902827
41760 -902827 -553333 -410477 -472955 -705693 -1065509 -1546887 -2128918 -2581084 -2538479 -1951166
41750 -1951166 -1232757 -750079 -408919 -3119 284535 93870 -539334 -1157687 -1375068
41741 -1375068 -1162268 -720292 -253685 224194 939531 1965892 2713101 2308367 833087
41732 833087 -338084 -56525 1090150 1539764 836214 70317 188383 773916 874952
41723 874952 285640 -527333 -1187476 -1473928 -1072642 1338 947271 872442 -62886 -805106
41713h05106M2034L58583N4666j46749P4685K52365P5237p6615J51582M38617
41703D19299L08958p8007j61637J76351M60896K82112k60094p84566r88718p40573
41693a365979j19343N21016P68869N70914K60340R3274j3010j56030j40506K20393
41683F39938O42924N56023j92171j016746j116474k90873P96844J207045O22787
41674A849297l71820r69516r49113o03184q6070O23579J118171O77673o01591
41665F87426j452990r07937L34403Q40459M40600K61674P97927J136968N27615
41656B666145l49075m71109p4295j62418q25127j100200m90913L00586M08876
41647i7530r2071m74341l16349J60240M71489L44197n6561k64532j3972L92571
$$ plain form
41713 -805106 -763072 -404489 -349823 -496572 -421887 -169522 -94285 -170900 -19318 419299
41703 419299 728257 650250 488613 664964 1125860 1407972 1147878 363312 -625406 -1365979
41693 -1365979 -1485322 -964306 -195437 375477 635817 729091 716081 560051 419545 639938
41683 639938 1282862 1838885 1646714 629968 -486506 -777379 19465 1226510 1849297
41674 1849297 1477477 507961 -441152 -1044336 -1130406 -506827 611344 1289017 687426
41665 687426 -765564 -1673501 -1339098 -498639 -58039 203635 1001562 2138530 2666145
41656 2666145 2317070 1845961 1771666 1609248 784121 -316079 -806992 -506406 -97530
41647 -97530 -189601 -663942 -980291 -820051 -348562 -4365 -60926 -325458 -339430 53141
41637E3141M34637O8463k41905k14093q0761r1321p6002J96787N17740M75304
41627A041990O8623k82665l24258k33748k25712j90997M7344K93492J30364m36767
41617a12334p98007m54237K70999O03718L36256L43m3624q5080l04149j81836
41607g67951O43842J401294J015945k43049r73842n87349K0338M5636j03857J02573
41597E53580K05671k73990o46722j05274O74030M72319k88370k3749J296498J780426
41587C644419N67037o65131l20774N38877k8154j557869j806230l38708P12419
41578G45886p7980j328272j068255L69035J070219L55614n60009m82004L81046
41569e94720J044015Q98247O5537p92916r08002j37661O97728O90303O47m37990
$$ plain form
41637 53141 487778 556241 314336 100243 19482 -71839 -147841 48946 566686 1041990
41627 1041990 1110613 827948 503690 269942 44230 -146767 -99423 194069 324433 -112334
41617 -112334 -910341 -1364578 -1093579 -489861 -153605 -153262 -196886 -281966 -586115 -767951
41607 -767951 -124109 1277185 2293130 2050081 1076239 488890 509228 554864 451007 553580
41597 553580 759251 485261 -161461 -266735 407295 879614 591244 567495 1863993 3644419
41587 3644419 4211456 3546325 3225551 3764428 3736274 2178405 372175 33467 745886
41578 745886 667906 -660366 -1728621 -1359586 -289367 66247 -493762 -975766 -594720
41569 -594720 449295 1347542 1413079 620163 -287839 -425500 272228 962531 963178 525188
41559E25188l10235k37885n62950o73489k5626Q53181J054548N37521m028k20019
41549I36206l21234l69794j25996L15552M21879M858m19406l68878q1304r1372
41539i9489m00605m70727M1121Q30452J234823Q53888o1172p73784p46242k21051
41529A87214N9114k20552n64224l73599K52093P21907P39211M97402K10821r3936
41519A415451k79328n2815N27828Q26972K91629p53199j331789r25737p9652K99083
41509f1557M5495k02704j0896K53419Q7899k76195k02887L12806N69407J97542
41499G12329l34133m81121l05386m8803L62614Q44562P69530j44873r82975o60709
41489b68965L77333O11738l10579r87180l62598P12026Q41381J21758k56364J03722
$$ plain form
41559 525188 214953 -22932 -585882 -1259371 -1284997 -431816 622732 1160253 1156225 936206
41549 936206 614972 245178 119182 434734 856613 861471 442065 73187 -8117 -99489
41539 -99489 -500094 -970821 -929700 -99248 1135575 1989463 1928291 1154507 408265 187214
41529 187214 246328 25776 -538448 -912047 -659954 61953 801164 1298566 1509387 1415451
41519 1415451 1136123 1083308 1611136 2438108 2729737 1976538 644749 -280988 -360640 -61557
41509 -61557 -16062 -218766 -229662 23757 111656 -164539 -367426 -54620 514787 712329
41499 712329 378196 -102925 -408311 -457114 -94500 750062 1519592 1374719 391744 -268965
41489 -268965 108368 720106 409527 -577653 -940251 -228225 613156 734914 478550 582272
41479E82272M72596L38724k3633l60540p83965j090278o83131L89389J100940
41470e7626P15867j89102n66527k97701q3108k41209l57498q9878L24388N12735
41460c29659M44353K60902j3223l38148m65331j60452M33684Q46579P24514J62111
41450A565330m11160o41392n47208m16350m15910l63993K5945O70377J013839
41441D79478N69694m09499j003779o02076K75466N00124k15704q35443l42880
41432a584619Q05907J236705N41061k05055k4692O41999P44386J46539m14558
41423A887673n63371o25555p79565o94150k31059J60745J13336r1290r882K89993
41413e43125M52894M15912L25222J19319l02968o34501m24977J87563N32984L53411
$$ plain form
41479 582272 1054868 1393592 1369959 1009419 225454 -864824 -1547955 -1158566 -57626
41470 -57626 658241 469139 -97388 -395089 -478197 -719406 -1076904 -1166782 -842394 -329659
41460 -329659 114694 375596 362373 24225 -441106 -601558 -167874 678705 1403219 1565330
41450 1565330 1154170 512778 -34430 -450780 -866690 -1230683 -1204738 -534361 479478
41441 479478 1049172 639673 -364106 -966182 -690716 -190592 -406296 -1241739 -1584619
41432 -1584619 -778712 457993 999054 793999 769307 1411306 2155692 2302231 1887673
41423 1887673 1324302 698747 -80818 -774968 -1006027 -845282 -731946 -823236 -833118 -543125
41413 -543125 -90231 325681 650903 770222 467254 -167247 -592224 -404661 128323 481734
41403D81734K11317O37217J238524J131960J36387r31889j227462p81931k76283
41394F19574j76194l39344l48711k821M84858O28007R6875q31656j387994j120204
41384b377610m58656j32352j55662P0205O41936Q58053L55707j63717L6825N47915
41374g77356N08997Q9674J90467P54015O18671n81295j529722j007111L17305
41365a416355Q48716K56848l65023k57075J78731L44187K70556K08519J35286
41356B04390Q756l1556R522o6850j83894q188L41280K24324n05129j009762n39209
41345a556316M58740R06699M72545k32140o10101n98169l27318R6635M12727L44487
41335f32211M6604k8207J75394J90305k27360o38140m85239J52827O56972N70062
$$ plain form
41403 481734 693051 1330268 2568792 3700752 3837139 2905250 1677788 895857 619574
41394 619574 443380 104036 -244675 -247496 237362 865369 962244 130588 -1257406 -2377610
41384 -2377610 -2836266 -2968618 -3124280 -3054075 -2412139 -1554086 -1198379 -1362096 -1325271 -777356
41374 -777356 -268359 -178685 11782 765797 1384468 803173 -726549 -1733660 -1416355
41365 -1416355 -567639 -310791 -675814 -932889 -754158 -409971 -139415 69104 204390
41356 204390 213146 181590 191112 124262 -59632 -67820 273460 497784 -7345 -1017107 -1556316
41345 -1556316 -1097576 -190877 281668 49528 -560573 -1158742 -1486060 -1389425 -976698 -632211
41335 -632211 -585607 -613814 -438420 -248115 -475475 -1113615 -1598854 -1446027 -789055 -218993
41325b18993J6016m67584m04965J66420O46835M65250k19853o74197n42582k89147
41315a522800m24085o61792l55194L99655P25294J75768n54495n20629K16921
41306b521357P37855N41125J10952P1334K98714K72030k7979j13913J96438N00450
41296F5649M47692J89906j8778k54820o26447q55855n74027J09095O70191P28994
41286a18400L12130k68596n55334k08602N24547Q57838L97261k47662l14683n1550
41276C26949k58723q35389p87205J43672Q93039O31070o10J9137M63076L12038
41266I07054n24722r91168m04169O56449J179318Q31043K1464o57285q29352n11673
41256c23041o7187K18035M76113Q84818J108401O46860k64401p37717m12603L7734
$$ plain form
41325 -218993 -202977 -670561 -1075526 -909106 -262271 202979 -16874 -691071 -1233653 -1522800
41315 -1522800 -1946885 -2608677 -2963871 -2564216 -1838922 -1663154 -2217649 -2738278 -2521357
41306 -2521357 -1783502 -1242377 -1131425 -1060091 -761377 -489347 -517326 -631239 -434801 65649
41296 65649 513341 703247 684469 429649 -196798 -1052653 -1626680 -1517585 -847394 -118400
41286 -118400 193730 -74866 -630200 -838802 -314255 543583 940844 693182 378499 326949
41276 326949 68226 -767163 -1554368 -1410696 -517657 113413 112803 131940 595016 907054
41266 907054 382332 -608836 -1013005 -356556 822762 1653805 1675269 1017984 188632 -323041
41256 -323041 -390228 -172193 303920 1188738 2297139 2943999 2679598 1941881 1529278 1567012
41246A567012q0220m84864m36557J15997N01779L01103j97548n29939n69883l92902
41236b06022m5622L04835L04316j57066o02067m36515K49386P31209O01457K57375
41226A001286J74323J27311l19070q31292o08867K97171Q05669K93390m82117
41217D57804n13046K3718K15067j31508l55422j08790J82137Q2092k80991n11816
41207i40755l38780K63288Q89269Q27968n5699q27225o17732M7582N5627m00714
41197a097171p9611J080456J530223M58131q72394j014375l11091J00767J50091
41188e4974L94750O12870K76851j77042j43M03449J21058n34835n08781K4639
41178E57842q7156p46953n36668P24608J284125K02315r52683m72619Q32617R80765
$$ plain form
41246 1567012 1486792 1001928 565371 681368 1183147 1484250 1286702 756763 186880 -206022
41236 -206022 -251644 53191 357507 200441 -401626 -838141 -588755 142454 743911 1001286
41226 1001286 1175609 1302920 983850 152558 -456309 -159138 646531 939921 457804
41217 457804 -55242 -31524 183543 52035 -303387 -412177 -230040 -147948 -428939 -940755
41207 -940755 -1279535 -1016247 -126978 700990 645291 -181934 -799666 -752084 -696457 -1097171
41197 -1097171 -1176782 -96326 1433897 1892028 1019634 5259 -305832 -205065 -54974
41188 -54974 339776 952646 1229497 1052455 1052312 1455761 1576819 1041984 533203 557842
41178 557842 470686 -276267 -812935 -88327 1195798 1398113 445430 -27189 805428 1786193
41168A786193j23022p92755l38945O7914m86495j201990q91906K30475R28993
41159h21538O40735N3723N0793N91142Q68871M09400l14373n34202k25507o8239
41149F50805l92467p06771n04727l8737J27152k1878l7685K23362L98264J83209
41139a19473k21255l08814J78946Q69952R92094K17096p86136j034305m59868
41130f71763O3655J604j93830K8962M62423N93923L38985j21500o67030r60881
41120a125452n07734M69856R19444L78177k54091j56360N9086m53776j027787
41111a698637m42385Q43442J123178N6617q11390m06616N32115R24006P59012
41102H79342M42182m641m03760k42993K56583L2637j078364j652374o93329P43737
$$ plain form
41168 1786193 1663171 870416 531471 599385 112890 -1089100 -1981006 -1750531 -821538
41159 -821538 -180803 -127080 -76287 514855 1383726 1793126 1478753 944551 719044 650805
41149 650805 258338 -448433 -953160 -991897 -864745 -886623 -924308 -700946 -302682 -119473
41139 -119473 -340728 -649542 -470596 399356 1391450 1608546 822410 -211895 -671763
41130 -671763 -608108 -606504 -800334 -771372 -308949 284974 623959 502459 -164571 -1125452
41120 -1125452 -1633186 -1163330 -243886 134291 -119800 -276160 -217074 -670850 -1698637
41111 -1698637 -2141022 -1297580 -174402 -117785 -929175 -1335791 -803676 120330 879342
41102 879342 1321524 1316883 913123 670130 926713 959350 -119014 -1771388 -2464717 -1720980
41092a720980J083677M42348L0729J33496J03261j57953j67153k9192k56080n51978
41082a089825j20566Q00133J014198J73527o75893o63091j52678J41917J57090
41073d15188J36000Q0177K512Q4018K13329r134m90026n23768J65639Q65719P79955
41062H89233R752p13613q36399k75811N84454R58208K94284q65943j265899m91691
41052a713425M72467O28356K30454J25913M28064N54131K32776j87717k92383
41043D78636j6737L55633L71442j43513o61468m46892L33640O37470J6018o82732
41033B41497o04421j14094k376j79730r9472P7602j81867o33887n41380N9548
41023a978580M21145L32242K89114M40842L95696J46691J56075L64327J55669
$$ plain form
41092 -1720980 -637303 -194955 -164226 -30730 72531 -85422 -252575 -281767 -537847 -1089825
41082 -1089825 -1210391 -410258 603940 777467 101574 -561517 -714195 -572278 -415188
41073 -415188 -279188 -199011 -196499 -112481 100848 91714 -398312 -922080 -756441 109278 889233
41062 889233 898985 185372 -651027 -926838 -342384 615824 910108 44165 -1221734 -1713425
41052 -1713425 -1240958 -612602 -382148 -256235 171829 725960 958736 771019 478636
41043 478636 461899 817532 1188974 1045461 383993 -62899 270741 908211 924229 241497
41033 241497 -362924 -477018 -479394 -659124 -758596 -680994 -862861 -1496748 -2038128 -1978580
41023 -1978580 -1557435 -1225193 -936079 -495237 -99541 47150 203225 567552 723221
41014G23221m42849n86552j3866M18805J26633k62261k6935M61696M74159J16829
41004I88880o9599j31371m19627p01111m52780J87411N65010M64740K39581J25166
40994G96300O0901O2538J72401J67164j26872m05248l42377k35118n20431q89610
40984a260352o86422m7635K36522j8766j89193K2501K12598K49370N90425J202397
40974C11445J186931J80226p50143m97213M66995Q57258M55697J02702Q3606k18745
40964B178759r49724j254576o12177K16886K41341l85950p40520m53545L8505
40955a721001L31834M52469M74885L51995J82569J45040R6094k62595p06814n54153
40945a209677K98058R39469N65853l33840n50193K29747J050223J009407L25512
$$ plain form
41014 723221 280372 -306180 -320046 98759 225392 -36869 -63804 397892 872051 988880
41004 988880 919281 787910 368283 -332828 -785608 -598197 -33187 431553 671134 796300
40994 796300 857201 919739 1092140 1259304 1132432 727184 384807 149689 -370742 -1260352
40984 -1260352 -1946774 -1994409 -1757887 -1776653 -1965846 -1943345 -1730747 -1481377 -890952 311445
40974 311445 1498376 1678602 928459 431246 898241 1755499 2211196 2313898 2397504 2178759
40964 2178759 1229035 -25541 -637718 -420832 -179491 -565441 -1305961 -1759506 -1721001
40955 -1721001 -1389167 -936698 -461813 -109818 72751 217791 313885 51290 -655524 -1209677
40945 -1209677 -911619 27850 593703 259863 -290330 -60583 989640 1999047 2324559
40936B324559k00730k75679k13348k53452k88701k04864r1104o2836j18247j84114
40926D31484j38443J23419M36449L44538l10256q95146n97498M08894R70193M04092
40916A177726n54669p21052Q73O48834N75918R1808k97500n56184p26051n23582
40906h83879J12179N18506P4250p23941p15891L31234J309560J207631L14931
40897A544580m24091o70474o79526m70685J46177Q23685Q10254L5831o10219m22217
40887H3315K21164M83076J70371k38242l64575k54326q1067N1093O2749k6857
40877A06701l2141J46347K97677J69325j62095m34195n54506n29507k30678L81431
40867h41641R27813R40660M82221L1617j99635l86199n37003l70051J14621M34665
$$ plain form
40936 2324559 2123829 1848150 1634802 1381350 1092649 887785 796681 733845 615598 431484
40926 431484 293041 416460 852909 1197447 887191 -7955 -605453 -196559 773634 1177726
40916 1177726 623057 -97995 -97122 551712 1127630 1219438 921938 365754 -360297 -883879
40906 -883879 -771700 -253194 -178944 -902885 -1618776 -1287542 22018 1229649 1544580
40897 1544580 1120489 450015 -229511 -700196 -554019 269666 1079920 1115751 505532 83315
40887 83315 304479 787555 957926 719684 355109 100783 19716 70809 133558 106701
40877 106701 74560 220907 518584 687909 525814 91619 -462887 -992394 -1223072 -841641
40867 -841641 86172 1026832 1509053 1540670 1341035 954836 417833 47782 162403 597068
40857E97068K46588k29502o36294r08542r78740n11215N64650J539889J535529
40848A219431N80876m03715p24090n47973l21962o6677L74086P09852M01211m68588
40838G52451j005807n30335M56755P83828Q1315p27141o24751K15558P71145N41895
40828G14913K9339j36821k599j6990l44690p28107q25770m97468Q4943N04601
40818a218649M70398J80955P0439J73846J31297j05006j15670J67998J08786o13743
40808g49349j139617m29226J086646J799522R87722k80321o69886k35353O2712
40799D32850q5637j18888K63257O01446M53957J4273l26785n25790o52668n49374
40789d93359j68714P2320j90592n93791m65330J54987N37738L61983J28276K50561
$$ plain form
40857 597068 843656 614154 -22140 -930682 -1909422 -2420637 -1855987 -316098 1219431
40848 1219431 1800307 1396592 672502 124529 -197433 -264110 109976 819828 1221039 752451
40838 752451 -253356 -783691 -326936 456892 538207 -188934 -813685 -598127 173018 714913
40828 714913 744252 607431 604832 587842 243152 -484955 -1310725 -1808193 -1723250 -1218649
40818 -1218649 -748251 -567296 -496857 -323011 -191714 -296720 -412390 -244392 -135606 -749349
40808 -749349 -1888966 -2318192 -1231546 567976 1555698 1275377 605491 370138 432850
40799 432850 347213 228325 491582 1093028 1546985 1561258 1234473 708683 56015 -493359
40789 -493359 -662073 -589753 -780345 -1374136 -1839466 -1684479 -1146741 -784758 -656482 -405921
40779d05921M02255J93186r1346k4878J48496m2159l51043j39963M65947O06863
40769G61437j0264o22654n13190M1591K99037L3096l95401n89091m04572K7570
40759a372441L45116K96835J61850M28918R38135Q88697j4727r56696r70634j02276
40749c57223P87521J034175O17652n2843m39270k72101P6338n707m03580l21257
40739F63705L93725P58392R0682q23988q46442j29554L42138L39907L66168L87050
40729A541783j11871q56164q65402l4372N22633J04525n89075n86140P4159P00248
40719i9676Q97344O52784N3284n97738q22789n04058k2158K89679L64844O5487
40709B77003o63390j221201q14139K73643Q09179L54523j33971P2481L80119J39701
$$ plain form
40779 -405921 -3666 189520 98174 73296 221792 179633 -171410 -311373 154574 761437
40769 761437 751173 128519 -384671 -343080 -44043 -10947 -406348 -995439 -1400011 -1372441
40759 -1372441 -1027325 -730490 -568640 -139722 798413 1687110 1672383 715687 -254947 -357223
40749 -357223 430298 1464473 2082125 2029282 1590012 1317911 1394249 1388542 984962 663705
40739 663705 1057430 1815822 1906504 1082516 236074 106520 448658 788565 1154733 1541783
40729 1541783 1429912 573748 -291654 -326026 196607 301132 -287943 -874083 -799924 -99676
40719 -99676 797668 1450452 1503736 905998 83209 -420849 -443007 -153328 211516 277003
40709 277003 -386387 -1607588 -2421727 -2148084 -1338905 -984382 -1118353 -1045872 -665753 -526052
40699e26052j18757K27614N41009m6646r59253r48868r3868M12575K13217N4297
40689a244732J73421m4142n83728m78316N13483J237328Q66461J40719L2446K06852
40679H19792j21806o12856l63489L77342L98015n64108j289541q06765K75106
40670a888310P40700M40083K53020O46346J025640O88291j23755n68977l85741
40661H27297j84899m52632p64177m17632M40541R19651N98965M1379j07438M442
40651I05497j42288n33507o80414m20056j18041l9770K5604L47409P83223R45226
40641A072883O55795P5462m72155o71181l94266R3204K69461n2478l92080j76342
40631H303M24173O55961K41448k13736j30872K13315K51705J10916K94478N76337
$$ plain form
40699 -526052 -644809 -417195 123814 77168 -882085 -1830953 -1924821 -1512246 -1299029 -1244732
40689 -1244732 -1071311 -1115453 -1699181 -2177497 -1664014 -426686 439775 580494 612940 819792
40679 819792 697986 85130 -278359 98983 496998 -67110 -1356651 -2163416 -1888310
40670 -1888310 -1147610 -707527 -454507 191839 1217479 1905770 1782015 1213038 827297
40661 827297 642398 189766 -574411 -992043 -551502 368149 967114 1008493 901055 905497
40651 905497 763209 229702 -450712 -870768 -988809 -1028579 -1002975 -655566 127657 1072883
40641 1072883 1728678 1804140 1331985 660804 266538 359742 629203 576725 184645 8303
40631 8303 432476 1088437 1329885 1116149 985277 1198592 1450297 1561213 1855691 2432028
40621B432028J54217r11241j376171n20732O02171N22873n21175r21194o4853
40612f04077Q14429N39310l02100l80574L08490N24637k01941p81777k30055P58715
40602D45057P45339l68287j188920q01240Q7783M00751K25118K81242M54811J0814
40592B92468q60153r49933J54423J233515J087163J86185k03626O7553P1647n24636
40582E54606r53512o28331J8040L21379K96108L22974M38581M00801J66206q0516
40572H56336k19035k76880l39484m81759o34922n32396p4559K85157j7379p25311
40562b160232q21829J53391J322087J480796N77102l60450n71606k50842Q7047
40553e44536L06980M85344N01734J88988l13937p02427r11387j075281j113997
$$ plain form
40621 2432028 2586245 1675004 298833 -221899 380272 903145 381970 -539224 -604077
40612 -604077 210352 749662 447562 66988 375478 900115 698174 -83603 -313658 445057
40602 445057 1190396 822109 -366811 -1168051 -1080268 -679517 -454399 -173157 281654 292468
40592 292468 -567685 -1517618 -1363195 -129680 957483 1143668 940042 1007595 1079242 554606
40582 554606 -398906 -1027237 -1009197 -687818 -391710 -68736 369845 770646 936852 856336
40572 856336 637301 360421 20937 -460822 -1095744 -1628140 -1702699 -1417542 -1434921 -2160232
40562 -2160232 -2982061 -2828670 -1506583 -25787 551315 190865 -380741 -631583 -544536
40553 -544536 -237556 247788 749522 938510 624573 -77854 -989241 -2064522 -3178519
40544c178519p03891K01374J081915J326301Q85296K51782j18266j46372J9700
40535c80680K02067K25006L3197j55678o7016J99536K38694n5421k62930j6432
40525c9657M43486N36610L3854o89306j003718n96029J61061M74202M0549m47278
40515a086226j82106N24406O48914Q8710j48564L05962M44837l54098r94058k96011
40505a048234R36052J017961J1662m57433J45418N70141J2919o48594n07429o5429
40495c2966j20896l85583k27554J08878O7035j28587M1268L44104K22557j35072
40485b46816j05867K70032M09466K11502R4836J19969p6967m60804m97938k7119
40475c09706M19095L64820m4456m12632n93076o12042m36855n4430M05820P77866
$$ plain form
40544 -3178519 -3882410 -3681036 -2599121 -1272820 -387524 -135742 -254008 -400380 -380680
40535 -380680 -178613 46393 79590 -76088 -143104 56432 295126 239705 -23225 -39657
40525 -39657 403829 940439 974293 284987 -718731 -1314760 -1153699 -679497 -638948 -1086226
40515 -1086226 -1268332 -743926 -95012 -6302 -154866 151096 595933 241835 -752223 -1048234
40505 -1048234 -112182 905779 917441 460008 605426 1175567 1188486 539892 32463 -32966
40495 -32966 -153862 -539445 -766999 -658121 -591086 -719673 -678405 -334301 -111744 -246816
40485 -246816 -352683 -82651 326815 538317 633153 753122 676155 215351 -282587 -309706
40475 -309706 109389 474209 429753 17121 -575955 -1187997 -1624852 -1679282 -1273462 -495596
$$ [...]
##END NTUPLES=NMR SPECTRUM
##END=
