##TITLE=31Pdec_LR-688A-C1
 CDcl3, 24 sc
 18.9.2019
##JCAMPDX= 6.0         $$ Bruker NMR JCAMP-DX V2.0
##DATA TYPE= NMR SPECTRUM
##DATA CLASS= NTUPLES
##ORIGIN= UXNMR, Bruker Analytische Messtechnik GmbH
##OWNER= root
$$ XWIN-NMR		Version 3.5
$$ Wed Sep 18 14:44:51 2019 Russian Standard Time (UT+4h)  she@DPX200
##.OBSERVE FREQUENCY= 81.013821
##.OBSERVE NUCLEUS= ^31P
##.ACQUISITION MODE= SIMULTANEOUS
##.ACQUISITION SCHEME= undefined
##.AVERAGES= 24
##.DIGITISER RES= 17
##SPECTROMETER/DATA SYSTEM= spect
##.PULSE SEQUENCE= zgpg30
##.SOLVENT NAME= CDCl3
##.SHIFT REFERENCE= (INTERNAL, CDCl3, 0, 182.463)
##AUDIT TRAIL= $$ (NUMBER, WHEN, WHO, WHERE, WHAT)
$$ ##TITLE= Audit trail, XWIN-NMR		Version 3.5
$$ ##JCAMPDX= 5.01
$$ ##ORIGIN= Bruker BioSpin GmbH
$$ ##OWNER= she
$$ F:/spectra/data/she/nmr/P31/1/pdata/1/auditp.txt
$$ ##AUDIT TRAIL=  $$ (NUMBER, WHEN, WHO, WHERE, WHAT)
(   1,<2019-09-18 14:43:51.92 +0400>,<she>,<DPX200>,
      <created by zg, POWCHK disabled, PULCHK disabled
       configuration hash MD5:
       00 E9 B6 7A A2 85 ED C7 34 08 36 98 17 FE 4E 26
       data hash MD5: 32K
       FF A8 BF DC DE 9C BD 2F 65 F4 82 12 A1 FD 0F B6>)
(   2,<2019-09-18 14:44:03.23 +0400>,<she>,<DPX200>,
      <Start of raw data processing
       efp BC_mod = 2 LB = 1 FT_mod = 6 PKNL = 1 PHC0 = -400.8147 PHC1 = 103.8003 SI = 64K 
       data hash MD5: 64K
       46 5D 36 04 2D C2 44 4B AC 6D 9D C4 F0 BD DF 2A>)
(   3,<2019-09-18 14:44:15.76 +0400>,<she>,<DPX200>,
      <pk PHC0 = 11.66346 PHC1 = 0 
       data hash MD5: 64K
       5F AD 84 D8 C2 97 EC FC 8C 02 B7 B7 09 77 A6 8C>)
(   4,<2019-09-18 14:44:24.34 +0400>,<she>,<DPX200>,
      <abs ABSG = 5 
       data hash MD5: 64K
       CD 54 55 4B E5 78 15 CE 75 DA B0 DB A7 EA 2F B3>)
$$ ##END=
$$ 
$$ hash MD5
$$ FB 0A AA A6 84 02 CA D6 E4 A0 85 FB 8E 3A 31 43
##$RELAX= 
##$RELAX= 
##$RELAX= 
##$RELAX= 
##$RELAX= 
##$RELAX= 
##$RELAX= 
##$RELAX= 
$$ Bruker specific parameters
$$ --------------------------
##$DU= <F:/spectra>
##$EXPNO= 1
##$NAME= <P31>
##$PROCNO= 1
##$TYPE= <nmr>
##$USER= <she>
##$AMP= (0..31)
100 100 100 100 100 100 100 100 100 100 100 100 100 100 100 100 100 100 
100 100 100 100 100 100 100 100 100 100 100 100 100 100 
##$AQSEQ= 0
##$AQ_mod= 1
##$AUNM= <au_zg>
##$AUTOPOS= <>
##$BF1= 81.014009
##$BF2= 200.13
##$BF3= 200.13
##$BF4= 200.13
##$BF5= 200.13
##$BF6= 200.13
##$BF7= 200.13
##$BF8= 200.13
##$BYTORDA= 1
##$CFDGTYP= 0
##$CFRGTYP= 5
##$CHEMSTR= <none>
##$CNST= (0..31)
1 1 145 1 1 1 1 1 1 1 1 1 1 1 1 1 1 1 1 1 1 1 1 1 1 1 1 1 1 1 1 1 
##$CPDPRG= <waltz16>
##$CPDPRG1= <>
##$CPDPRG2= <waltz16>
##$CPDPRG3= <>
##$CPDPRG4= <mlev>
##$CPDPRG5= <mlev>
##$CPDPRG6= <mlev>
##$CPDPRG7= <mlev>
##$CPDPRG8= <mlev>
##$CPDPRGB= <>
##$CPDPRGT= <>
##$D= (0..31)
0 1 0 0 0 0 0 0 0 0 0 0.03 2e-05 3e-06 0 0 0 0 0 0 0 0 0 0 0 0 0 0 0 0 
0 0 
##$DATE= 1568803431
##$DBL= (0..7)
120 120 120 11 120 120 24 19 
##$DBP= (0..7)
150 150 150 150 150 150 150 150 
##$DBP07= 0
##$DBPNAM0= <>
##$DBPNAM1= <>
##$DBPNAM2= <>
$$ [...]
##$SUBNAM3= <"">
##$SUBNAM4= <"">
##$SUBNAM5= <"">
##$SUBNAM6= <"">
##$SUBNAM7= <"">
##$SUBNAM8= <"">
##$SUBNAM9= <"">
##$SW= 369.568048894756
##$SWIBOX= (0..15)
0 1 3 0 0 0 0 0 0 0 0 0 0 0 0 0 
##$SW_h= 29940.119760479
##$TD= 32768
##$TD0= 1
##$TE= 0
##$TE2= 300
##$TE3= 300
##$TEG= 300
##$TL= (0..7)
0 120 53 12 22 120 120 120 
##$TP= (0..7)
150 150 150 150 150 150 150 150 
##$TP07= 0
##$TPNAME0= <>
##$TPNAME1= <>
##$TPNAME2= <>
##$TPNAME3= <>
##$TPNAME4= <>
##$TPNAME5= <>
##$TPNAME6= <>
##$TPNAME7= <>
##$TPOAL= (0..7)
0.5 0.5 0.5 0.5 0.5 0.5 0.5 0.5 
##$TPOFFS= (0..7)
0 0 0 0 0 0 0 0 
##$TUNHIN= 0
##$TUNHOUT= 0
##$TUNXOUT= 0
##$USERA1= <user>
##$USERA2= <user>
##$USERA3= <user>
##$USERA4= <user>
##$USERA5= <user>
##$V9= 5
##$VALIST= <valist>
##$VCLIST= <CCCCCCCCCCCCCCC>
##$VD= 0
##$VDLIST= <DDDDDDDDDDDDDDD>
##$VPLIST= <PPPPPPPPPPPPPPP>
##$VTLIST= <TTTTTTTTTTTTTTT>
##$WBST= 1024
##$WBSW= 4
##$XGAIN= (0..3)
0 0 0 0 
##$XL= 0
##$YL= 0
##$YMAX_a= 18957
##$YMIN_a= -19602
##$ZGOPTNS= <>
##$ZL1= 120
##$ZL2= 120
##$ZL3= 120
##$ZL4= 120
##$ABSF1= 182.463
##$ABSF2= -187.1042
##$ABSG= 5
##$ABSL= 3
##$ALPHA= 0
##$AQORDER= 0
##$ASSFAC= 0
##$ASSFACI= 0
##$ASSFACX= 0
##$ASSWID= 0
##$AUNMP= <proc_1d>
##$AZFE= 0.1
##$AZFW= 0.5
##$BCFW= 0
##$BC_mod= 2
##$BYTORDP= 0
##$COROFFS= 0
##$CY= -3
##$DATMOD= 1
##$DC= 0
##$DFILT= <>
##$DTYPP= 0
##$F1P= 0
##$F2P= 0
##$FCOR= 1
##$FTSIZE= 65536
##$FT_mod= 6
##$GAMMA= 0
##$GB= 0
##$INTBC= 1
##$INTSCL= 5.30512e-09
##$ISEN= 30
##$LB= 1
##$LEV0= 0
##$LPBIN= 0
##$MAXI= 10000
##$MC2= 0
##$MEAN= 0
##$ME_mod= 0
##$MI= 50
##$NCOEF= 0
##$NC_proc= -5
##$NLEV= 6
##$NOISF1= 182.463
##$NOISF2= 159.3651
##$NSP= 0
##$NTH_PI= 0
##$NZP= 0
##$OFFSET= 182.463
##$PC= 4
##$PHC0= -389.1512
##$PHC1= 103.8003
##$PH_mod= 1
##$PKNL= yes
##$PPARMOD= 0
##$PSCAL= 0
##$PSIGN= 0
##$REVERSE= no
##$SF= 81.0140089999434
##$SI= 65536
##$SIGF1= 159.3651
##$SIGF2= -187.1042
##$SINO= 113.3802
##$SIOLD= 16384
##$SREGLST= <1H.CDCl3>
##$SSB= 0
##$STSI= 65536
##$STSR= 0
##$SW_p= 29940.119760479
##$SYMM= 0
##$S_DEV= 0
##$TDeff= 32768
##$TDoff= 0
##$TI= <>
##$TILT= no
##$TM1= 0
##$TM2= 0
##$TOPLEV= 0
##$USERP1= <user>
##$USERP2= <user>
##$USERP3= <user>
##$USERP4= <user>
##$USERP5= <user>
##$WDW= 1
##$XDIM= 65536
##$YMAX_p= 422142024
##$YMIN_p= -4179534
$$ End of Bruker specific parameters
$$ ---------------------------------
##NTUPLES= NMR SPECTRUM
##VAR_NAME=  FREQUENCY,     SPECTRUM/REAL,   SPECTRUM/IMAG
##SYMBOL=    X,             R,               I
##VAR_TYPE=  INDEPENDENT,   DEPENDENT,       DEPENDENT
##VAR_FORM=  AFFN,          ASDF,            ASDF
##VAR_DIM=   65536,         65536,           65536
##UNITS=     HZ,            ARBITRARY UNITS, ARBITRARY UNITS
##FACTOR=    0.456856943014862, 1,           1
##FIRST=     14782.0589164792, 0,            0
##LAST=      -15158.0608439998, 0,           0
##MIN=       -15158.0608439998, -4179534,    0
##MAX=       14782.0589164792, 422142024,    0
$$ Real data points
##PAGE= N=1
##DATA TABLE= (X++(R..R)), XYDATA
$$ [...]
45769A430801o62161n26584N454J42175l55850p16564l83831O4576q9032m66540
45759a557556k53800L74217N13099J3718k96278Q8285O88686Q31170M11830k54138
45749E59233p46335o40908P7883O55142K89571o80209j033127k99660O00753O77456
45739e40201J19101k44322j41104P3133J62232K15660K61940J65523r1334l11920
45729c31292k93213l0994K32772J95903j05798j97625K14377O50210L90827m26012
45719B99155q76574n24071P1987L58820N46127R00011R93570L67485n35362q55287
45709G45861m90689j26217k33274o03453p65766m12024M22832J188611J111304
45700H37185J53850o46319m13602L30093M32478j73530m95312j46240J12574k41321
$$ plain form
45769 1430801 768640 242056 247510 389685 33835 -682729 -1066560 -1001984 -1091016 -1557556
45759 -1557556 -1811356 -1437139 -924040 -910322 -1206600 -1118315 -429629 401541 813371 559233
45749 559233 -187102 -828010 -750127 -94985 194586 -485623 -1518750 -1818410 -1217657 -540201
45739 -540201 -421100 -665422 -806526 -733393 -571161 -355501 -93561 71962 -19372 -331292
45729 -331292 -624505 -655499 -422727 -226824 -332622 -530247 -315870 334340 725167 299155
45719 299155 -577419 -1101490 -1029503 -670683 -124556 775455 1769025 2136510 1601148 745861
45709 745861 255172 128955 -104319 -707772 -1473538 -1885562 -1462730 -274119 837185
45700 837185 991035 344716 -68886 261207 693685 520155 24843 -121397 -8823 -250144
45690b50144n78222j55145O70626R51172M50362j72819k92520J0397J50163k73715
45680E10155r25930r63370r1744Q12350O97514j98894o75720l23377N7760j5003
45670a116259M7867N76475P49412j6086p77542l84705O41327Q87619K18283k65060
45660E61331j65466j79036n25722n15364M133J97737k04916k31868O63102J407836
45650A011767Q24997n00442r98375k68243N88956N56444k43668r65005q50610
45641h44179K15107J425825J580515M43662p49009p62898M7249M03192j0515l56619
45631A392330k07767j25190m36765n32781M0416O25050L70892l93469n34788K90213
45621D88141J116567Q74700l21880j314623j157854p1227Q64203Q69755J85541
$$ plain form
45690 -250144 -828366 -983511 -312885 638287 1088649 915830 623310 633707 783870 510155
45680 510155 -415775 -1379145 -1470889 -658539 38975 -159919 -835639 -1159016 -1101256 -1116259
45670 -1116259 -1068392 -491917 257495 241409 -536133 -920838 -279511 608108 826391 561331
45660 561331 395865 216829 -308893 -824257 -820124 -622387 -827303 -1059171 -396069 1011767
45650 1011767 1836764 1336322 337947 69704 658660 1215104 971436 6431 -844179
45641 -844179 -629072 796753 2377268 2820930 2071921 1309023 1356272 1759464 1748949 1392330
45631 1392330 1184563 1059373 622608 89827 130243 755293 1126185 732716 197928 488141
45621 488141 1604708 2479408 2157528 842905 -314949 -386176 478027 1347782 1533323
45612A533323m16930n78737n13581m02964j35076K73110M74613K88232N3369J44180
45602G19539L51168J40612n32834j043714q31849q2703N11627N69394L69615L30513
45592E01368L85802J86010j77805j54666L57484N97666m3605r47315r53082m8933
45582b97076M74646j79189j145587j093814l2080Q38140Q07416L83412K76313
45573C2181M01190K63592j41888l50153j94392o5892k92363n98918m63519J38144
45563a272018O70111P38656N29183L75160K11811j76660n61001m31501J95449
45554B79190O13276K85089m84079r82145q95901m09452J99644O81410P48952L53241
45544C89225n0725M3930M57502M66731j95664q84262q26845q4485N62446N23647
$$ plain form
45612 1533323 1116393 537656 24075 -378889 -513965 -240855 233758 521990 575359 719539
45602 719539 1070707 1211319 678485 -365229 -1197078 -1279781 -768154 -198760 170855 501368
45592 501368 887170 1073180 895375 740709 1098193 1695859 1652254 704939 -248143 -297076
45582 -297076 177570 -1619 -1147206 -2241020 -2273100 -1434960 -627544 -244132 32181
45573 32181 433371 696963 555075 204922 10530 -55362 -347725 -946643 -1410162 -1272018
45563 -1272018 -601907 136749 665932 1041092 1252903 1076243 515242 83741 279190
45554 279190 892466 1177555 693476 -288669 -1184570 -1594022 -1394378 -712968 35984 389225
45544 389225 338500 382430 839932 1306663 1110999 226737 -600108 -684593 -122147 401500
45534D01500p2985o58105p61529l15015L34472O72869M54601n9856m02632m00737
45524h07417k31429n2096J48812L22290L23121K27482L22972N51159L72161l72131
45514H04924q23873o4424J375394J801892M55647j378412j893430r05141J77136
45505d50287K44273l76814o93975l24965K59516M22857K7829m73712n04292M4089
45495a825481O96196R10699N92139M4726l42525k58476L24816Q72505O26371l87029
45485A253941j106606p32139J34089L48148j29503l81091j32862p0156m32311
45476a248490m91157J04299N65949K79156p6754L23407R45477P12356j49723m01084
45466E63436J77808L85251m54957j345384j111074j49665K75221j0274M7589R19595
$$ plain form
45534 401500 328515 -329590 -1091119 -1406134 -1071662 -398793 55808 -4048 -406680 -807417
45524 -807417 -1038846 -1090942 -942130 -619840 -296719 -69237 253735 804894 1177055 804924
45514 804924 -18949 -83373 1292021 3093913 3549560 2171148 277718 -627423 -450287
45505 -450287 -206014 -582828 -1276803 -1601768 -1342252 -919395 -891566 -1365278 -1869570 -1825481
45495 -1825481 -1129285 -218586 373553 418279 75754 -182722 142094 1014599 1640970 1253941
45485 1253941 147335 -584804 -450715 -102567 -232070 -613161 -746023 -816179 -1248490
45476 -1248490 -1739647 -1635348 -1069399 -790243 -866997 -543590 401887 1114243 964520 563436
45466 563436 741244 1126495 671538 -673846 -1784920 -1934585 -1659364 -1669638 -1622049 -702454
45456g02454J606582J069043j97368q40084n65223l89559q84812j205679m84761
45447b594315O15861P54422r9990o73093l25965J96186K30840K49580P92046J305374
45437D50946R75035J09021k79132M1897L30314L5865n89056r94971q56422j73614
45427i50117O10082P46076J0424p69887o44100J65048N88097K26695k41333k04909
45417d63924J32483L34473L41373K23921m6062k71426m3900N68672Q57178L96872
45407B029660k72967l30403K49701P10573M60746l10867r00385p74984l9822O86372
45397A507624Q80983N47099r490n67564r15557p45440j24340K03370l30930j106408
45387f60653r56192J50877R45659O02742k09932m45966p8553J98954R1854j07193
$$ plain form
45456 -702454 904128 1973171 1775803 935719 370496 -19063 -903875 -2109554 -2594315
45447 -2594315 -1978454 -1224032 -1324022 -1997115 -2323080 -2126894 -1896054 -1646474 -854428 450946
45437 450946 1425981 1535002 1255870 1297767 1628081 1663946 1074890 79919 -776503 -950117
45427 -950117 -340035 406041 416465 -353422 -997522 -832474 -244377 -17682 -259015 -463924
45417 -463924 -331441 3032 344405 568326 522264 250838 206938 775610 1632788 2029660
45407 2029660 1756693 1426290 1675991 2386564 2847310 2536443 1636058 861074 821252 1507624
45397 1507624 2388607 2935706 2926216 2358652 1443095 697655 573315 776685 445755 -660653
45387 -660653 -1616845 -1465968 -520309 82433 -127499 -573465 -652018 -453064 -361210 -468403
45377d68403q8447K16951O67514Q75085N13531q9193k03846J78029J94183m74665
45367A320739q93285l18503M53160K41319o04069p03435K09739R54031P51219
45358A410915J87359K2713J00783o3904m17428o17057n79293l57197M7114M27837
45348A61842M13962L5989k31090k12042k62032n23016n97053k87340J3505Q7544
45338a399731L13566P66280O69622l98733j377773r03981O51963J473084O77484
45329D71781o27539r78206l52430K05230J40018j09679N1525N82681R23469O74171
45319I81021N4046l43088k50085j3527m3348k31845k44858j51987k66457m77696
45309i87824l32697J92481N85427N66648L93752K52475l4692m44411n31013j42523
$$ plain form
45377 -468403 -556850 -339899 327615 1202700 1716231 1627038 1423192 1601221 1795404 1320739
45367 1320739 427454 108951 562111 803430 199361 -504074 -294335 659696 1410915
45358 1410915 1598274 1620987 1721770 1657866 1240438 623381 44088 -313109 -265995 161842
45348 161842 575804 611793 380703 168661 -93371 -616387 -1213440 -1500780 -1487275 -1399731
45338 -1399731 -1086165 -319885 349737 -48996 -1426769 -2330750 -1678787 -205703 471781
45329 471781 -155758 -1133964 -1486394 -1281164 -1141146 -1250825 -1199300 -616619 306850 981021
45319 981021 1035067 691979 441894 428367 385019 153174 -91684 -243671 -510128 -987824
45309 -987824 -1320521 -1128040 -542613 24035 417787 670262 635570 191159 -339854 -482377
45299d82377K15091J56168M227J15637J79733j84552o23954n57978j06756K19722
45289a065039M07520P13721Q67188M09665l43851o30921m37181l96238n46468
45280a021604k81087L64914N58826J03205j58157J52499K24269m47430r76353
45271a480918m65507M71057O87849K64075P0955J62161q2115n39954m31138K52767
45261a090768O57971M98658M08098O51852O14673l6291o57356o18360k16733p4643
45251A37101k28433l05132j31793K20508N85969O30805R9895o29066p67699j63762
45241e51607M09917L04914k07721n05172m10873n7164M82821R76951R53902L24514
45231A720482l42483n86784o22530p04428n16373J70217P48047N04357k07115
$$ plain form
45299 -482377 -267286 -111118 -106891 8746 188479 3927 -620027 -1178005 -1284761 -1065039
45289 -1065039 -657519 56202 923390 1333055 989204 358283 -78898 -475136 -1021604
45280 -1021604 -1302691 -937777 -378951 -275746 -433903 -281404 -57135 -504565 -1480918
45271 -1480918 -1946425 -1475368 -787519 -523444 -452489 -290328 -372443 -912397 -1343535 -1090768
45261 -1090768 -432797 65861 473959 1125811 1740484 1704193 1046837 428477 211744 137101
45251 137101 -91332 -396464 -528257 -307749 278220 909025 1008920 379854 -387845 -551607
45241 -551607 -141690 163224 -44497 -549669 -960542 -1017706 -534885 442066 1395968 1720482
45231 1720482 1377999 791215 168685 -535743 -1052116 -881899 -133852 370505 163390
45222A63390l73225K21159P54572O06820O6069l68907o88039j013435j070906
45213a702502n28738L36678P58204L27187m92674q41975m14935K23971L73582
45204a961202P7687k8000L05152N68342K95991j72919j23457N53571J204381J189517
45194A909063N19926k93140p91333q86000p31779m35680l5976K51506J03986l42713
45184g32140l58236M41118J276930J055631n1115p20897l07014L49637K99872
45175A253786j87967k84950J02357M05405L01962q8827n54138p97885m97041J57988
45165a89310M28356L1148l46124r3175L62858L36622P627q5118j07215m86009
45155a40340q44682m85335L21498O20829K02643k77559m55136m68996j68840O90827
$$ plain form
45222 163390 -209835 11324 765896 1372716 1438785 1069878 381839 -631596 -1702502
45213 -1702502 -2231240 -1894562 -1136358 -809171 -1301845 -2143820 -2558755 -2334784 -1961202
45204 -1961202 -1883515 -1911515 -1606363 -1038021 -742030 -914949 -1038406 -484835 719546 1909063
45194 1909063 2428989 2135849 1344516 458516 -273263 -708943 -744919 -493413 -389427 -732140
45184 -732140 -1090376 -649258 627672 1683303 1632188 911291 604277 953914 1253786
45175 1253786 1065819 780869 883226 1288631 1590593 1501766 947628 149743 -347298 -189310
45165 -189310 239046 270194 -75930 -169105 193753 530375 538002 452884 345669 -140340
45155 -140340 -985022 -1470357 -1148859 -528030 -325387 -602946 -1058082 -1527078 -1695918 -1005091
45145a005091J483096J209385J24906l99645P9334M59997l4543o61853n41631
45136G13955q0552j04595m59051m44908j8124L39034M61786M42304J67523l58848
45126F58524o37557l04079K26443L61439J77474O1099k4061k16295j85816K82037
45116C99208N51042l8637q72084o93100M72949J161229N28167m63486n10479K02833
45106G37642M91666P784m11792k09450M0304l11898p84961m35699N33915Q13159
45096D70670j42716j163285r17562K41722Q66952M46795j89291l71472l64162
45087a122349m40416k66739K86067O06847K67202k00656j13051L42784N63235
45078g7076M98816M52907L42796m7485l80595j66664K90622J77916n55934r75199
$$ plain form
45145 -1005091 478005 1687390 1812296 1412651 1491985 1951982 1917439 1255586 713955
45136 713955 633403 528808 69757 -375151 -393275 -54241 407545 849849 1017372 658524
45126 658524 20967 -283112 -56669 304770 482244 543343 519282 302987 117171 399208
45116 399208 950250 911613 39529 -653571 -180622 980607 1508774 1045288 534809 737642
45106 737642 1229308 1237092 825300 615850 656154 344256 -440705 -876404 -342489 470670
45096 470670 327954 -835331 -1752893 -1511171 -644219 -197424 -386715 -758187 -1122349
45087 -1122349 -1562765 -1829504 -1543437 -936590 -669388 -870044 -983095 -640311 -77076
45078 -77076 421740 874647 1217443 1169958 789363 622699 913321 1091237 535303 -439896
45068d39896m42629M63932O94707M3586o73644o61527m4593M04142K72359n3183
45058d36746l1162L10060N98400P28482P44319M05674m23976j130277r39772j32429
45048c07427K57793M274j05131K10059K29959l07897n51334l0371M42411K53198
45038I5534J18896O28117Q85527L1156r74469p60128J37242K31604l02368p1137
45028A9974Q37802Q62486k38043q46725k45690K13794m44605j124094n83725M96265
45018a052561P21602Q6596m34711n01514m02100j48490L30482O54691N50029L71782
45008A75806L44773L8516o23272p48031J26095R08374M45457o32068r07243l92260
44998a263853k34027o13169n71675J30795N70590K93251j0042J57379L21950R6015
$$ plain form
45068 -439896 -882525 -418593 276114 319700 -353944 -1015471 -1060064 -655922 -383563 -436746
45058 -436746 -467908 -157848 440552 1169034 1913353 2319027 1895051 764774 -174998 -307427
45048 -307427 -49634 -45360 -150491 59568 289527 -18370 -569704 -600075 -157664 95534
45038 95534 214430 842547 1728074 1759230 784761 24633 161875 393479 91111 19974
45028 19974 857776 1720262 1482219 635494 389804 603598 158993 -965101 -1548826 -1052561
45018 -1052561 -330959 -244363 -679074 -1180588 -1582688 -1731178 -1400696 -746005 -195976 175806
45008 175806 520579 559095 -64177 -812208 -686113 222261 667718 35650 -871593 -1263853
44998 -1263853 -1497880 -2111049 -2682724 -2551929 -1981339 -1688088 -1698130 -1540751 -1218801 -1122786
44988a122786q5765J28328K97424K1564k83203r3610L46300M70824K28362o1512
44978a54074k60359l50839k26879L3208Q4403j15078j08648K82387N22307K29546
44968f4026o5113K47484P03103L66484n97915r58660j73259P83192P60700q2561
44958I19429p12118o62896l67827k37767j28073J45235L21722R3770l12879l75884
44948a317288j9968K50400M2221l95183n10123j28639M20469P47946P39770M94870
44938C24475J68850o8660r7940L7862J65729J57465J729k54174m89461m78972
44928e33097j06665L55991M45701J03808j83127n6641J47320j18911o85053p27653
44918a358327P3011Q93855P11333l37135j059041p00528J88668O35908N18770
$$ plain form
44988 -1122786 -1208551 -1080223 -782799 -761235 -1044438 -1138048 -791748 -320924 -92562 -154074
44978 -154074 -414433 -765272 -992151 -958943 -874540 -989618 -1098266 -815879 -293572 -64026
44968 -64026 -129139 118345 821448 1187932 590017 -368643 -541902 241290 1001990 919429
44958 919429 207311 -455585 -823412 -1061179 -1189252 -1044017 -722295 -628525 -941404 -1317288
44948 -1317288 -1337256 -1086856 -1044635 -1439818 -1949941 -2078580 -1658111 -910165 -170395 324475
44938 324475 493325 424665 326725 364587 530316 687781 689510 435336 -54125 -533097
44928 -533097 -639762 -283771 161930 265738 82611 25970 173290 54379 -630674 -1358327
44918 -1358327 -1285316 -391461 319872 -17263 -1076304 -1776832 -1588164 -952256 -433486
44909d33486M38446N89530M76702j42359p07022o38948j94575j1843j31217q8413
44899h43185J70551J59402k82546o24963m03715J41559M82292M53994K09226q3055
44889f20440j70959K30177R16100J119855M38950n34296j023806j060478r80817
44880a685714m67949Q18763J954649J500885k76033j353467o73659M26658L63948
44871F08081m03434n01830q34J0452m02745j07041R27823J305411L72163q15989
44861I92057j202912j040308q59919m38363L68874Q70831N83615J36595J99447
44852c90083L46282r241l60097L4694O82644N39102k65845o77075m38181k67198
44842h04998l95855k36135L54691O78688L88882N4076J41311L12410J69109m7155
$$ plain form
44909 -433486 4960 594490 1071192 928833 221811 -417137 -611712 -623555 -754772 -843185
44899 -843185 -672634 -513232 -795778 -1420741 -1824456 -1682897 -1200605 -746611 -537385 -620440
44889 -620440 -791399 -561222 354878 1474733 1913683 1379387 355581 -704897 -1685714
44880 -1685714 -2153663 -1334900 619749 2120634 1844601 491134 -182525 244133 608081
44871 608081 204647 -297183 -298017 -287565 -690310 -797351 130472 1435883 1808046 992057
44861 992057 -210855 -1251163 -2111082 -2549445 -2180571 -1309740 -726125 -589530 -390083
44852 -390083 -43801 -53042 -413139 -378445 304199 843301 577456 -99619 -537800 -804998
44842 -804998 -1200853 -1436988 -1082297 -403609 -14727 39349 180660 493070 662179 615024
44832F15024L2422K66604L01192Q8323j84188l52016l24495j77150j49312k13813
44822i7409O7101P17997Q43966j37849j174524p70701O68340J230650L78033l08379
44812A417225J55813N22685m27160j584191j184990K83820Q18788L4952m31785
44803c94843K90207R96954M89660n34971o68333J03270N86144K15972l35666l69635
44793C78759j30769k41926o76965q08834l45396K75675N49656N41663N58768N38287
44783F38918K43953j44844k22430o2368j26237m43405n08291j16446L01837L58006
44773h1307J49277j30166m23562m99774p4905N41577O26707J28199j79260O9843
44763A26629K62736q7075m92599l31569J85372M84189M27951J18469m23479q71916
$$ plain form
44832 615024 647446 914050 1215242 1303565 1119377 767361 442866 265716 116404 -97409
44822 -97409 -30308 687689 1531655 1393806 219282 -551419 116921 1347571 1725604 1417225
44812 1417225 1573038 2095723 1668563 84372 -1100618 -816798 1990 36942 -394843
44803 -394843 -104636 892318 1381978 847007 178674 281944 868088 1084060 748394 378759
44793 378759 247990 6064 -670901 -1479735 -1825131 -1549456 -999800 -458137 100631 638918
44783 638918 882871 738027 515597 453229 326992 -116413 -624704 -741150 -439313 -81307
44773 -81307 67970 -62196 -485758 -985532 -1060437 -518860 107847 236046 56786 126629
44763 126629 389365 302290 -190309 -521878 -336506 147683 575634 694103 270624 -601292
44753f01292o54339N9212K72460l25918p14967j35547O86231Q04509N06169M41118
44743C37636L36423j85697n02253j00337J63469n11216j112930l33585R52571
44734i55919Q62002l52195o69920L12519Q10042k4543p65439k54905N97491N66327
44724A25460m5243l60933l23365j80397J81606N86016M39089r1146n0339N76113
44714H56861O04522k16402n18526L01862P81373k38513j574527j585525o61750
44705b250625j34888K8249N65850R98051M00822n84611n22911M40420Q56115L60265
44695A56737l6440O8537j5851m82543n91118p9202L83424L77740J53056j95801
44685b61461p05398p42842L14337J553748J306967k84826j168455l49845P24229
$$ plain form
44753 -601292 -1255631 -1196419 -923959 -1249877 -1964844 -2100391 -1414160 -609651 -103482 337636
44743 337636 674059 488362 -13891 -114228 49241 -461975 -1574905 -1908490 -955919
44734 -955919 -93917 -446112 -1116032 -803513 6529 -18014 -783453 -1038358 -440867 125460
44724 125460 80217 -280716 -604081 -784478 -602872 -16856 422233 331087 280748 856861
44714 856861 1461383 1244981 726455 1028317 1809690 1571177 -3350 -1588875 -2250625
44705 -2250625 -2385513 -2357264 -1791414 -793363 -392541 -977152 -1500063 -1059643 -203528 156737
44695 156737 120297 188834 172983 -309560 -900678 -979880 -596456 -218716 -65660 -261461
44685 -261461 -966859 -1709701 -1395364 158384 1465351 1180525 12070 -337775 386454
44676C86454N57167k40919l40624J15740J23076l38449n26666m11355n33374p36391
44666a945341l57010M38942P30254L21498L6426K92297M24248p9373n50084j15329
44656h03472Q36512J066270K29469o33079n55355J09454L80693P0256j94905j24727
44646C81116r8881k77408k29208J87252L27877k62648r73503r40670k98428J58675
44636b025826K25803L26098M97202L05691j92951l42332L9671K98756J504l66738
44626a233122k06154K88441N39334M70956M41236N45447M90023R1175m44665p50278
44616B32393o47365k88935j487P3506J19848K92224L85572J64204j30966p2632
44606A26362J92425L5655o59463j146876p85447O0040N02281K65226j02247o6866
$$ plain form
44676 386454 943621 702702 362078 477818 600894 262445 -264221 -675576 -1208950 -1945341
44666 -1945341 -2302351 -1863409 -1133155 -811657 -775231 -482934 -58686 -138059 -688143 -803472
44656 -803472 33040 1099310 1328779 695700 140345 249799 630492 700748 505843 381116
44646 381116 282235 4827 -224381 -37129 290748 28100 -945403 -1886073 -2184501 -2025826
44636 -2025826 -1800023 -1473925 -976723 -671032 -863983 -1206315 -1166644 -867888 -866384 -1233122
44626 -1233122 -1439276 -1150835 -611501 -140545 300691 846138 1336161 1427336 982671 232393
44616 232393 -414972 -703907 -705394 -631888 -512040 -219816 165756 329960 198994 126362
44606 126362 318787 354442 -305021 -1451897 -2237344 -2177304 -1675023 -1409797 -1512044 -1578910
44596a578910K46455L83922K65563K46355M63752M69110j56893j005767j196000
44587a862413n74972M4920R5745L4575M37546R59531R30033M88769K39800J15322
44577I08856m02729j069552r73171K9381R58393J067899O79296L23537r3614p55837
44567F72459j252153j047543k54089N16742P97541N18730l1999l25382m7827M51310
44557b211N97393M51432N01399O19983J43232p97291j052274j08539R46122Q54661
44547B153907j41676q81156r20144o97091n04961k48152m908J4228l8203R8192
44537a169964J90951j09008m45112j40405O12774Q35934K31459k90094J6737N70160
44527C03432L68930m13027o42549K4844N57031J17284n63954k55738P59710R39447
$$ plain form
44596 -1578910 -1332455 -948533 -682970 -436615 27137 496247 339354 -666413 -1862413
44587 -1862413 -2437385 -2392465 -2296720 -2262145 -1824599 -865068 64965 553734 793534 908856
44577 908856 506127 -563425 -1536596 -1507215 -548822 519077 1198373 1521910 1428296 672459
44567 672459 -579694 -1627237 -1881326 -1364584 -567043 -48313 -80312 -405694 -453521 -2211
44557 -2211 595182 1046614 1548013 2167996 2311228 1513937 461663 353124 1299246 2153907
44547 2153907 2012231 1131075 210931 -486160 -991121 -1239273 -1244181 -1229953 -1268156 -1169964
44537 -1169964 -979013 -1088021 -1533133 -1673538 -1060764 -224830 6629 -283465 -266728 303432
44527 303432 672362 259335 -383214 -358370 198661 315945 -248009 -503747 255963 1195410
44517A195410j49733j024209n16230M06358K54918n03470k69483Q62522J074814
44508A330897k33174j418537j152504k40833R2469J38041N96536Q95184K33432
44499B41511o47832m67601M36048O55173L9216k54848J06293K14608k03841k20931
44489a02204M78101P76275n0766r72971p17409K87379O32663L3781m54531j54655
44479b44337L62508L30355q5438j95230J05883K41959p1116l43339j18761J95292
44469A77776o4179o17932n22663K80451O84906J06581n25317k09821N47611O10865
44459D68278K8290k13099J18313K78104q7007m88534n56816m45789k09955K73524
44449h34691O89793N29279J9083j28144N5946j49935p69017r27581l01886L56549
$$ plain form
44517 1195410 1045677 21468 -494762 -88404 166514 -336956 -606439 256083 1330897
44508 1330897 1097723 -320814 -1473318 -1714151 -1621682 -1483641 -887105 8079 241511
44499 241511 -406321 -873922 -437874 217299 256515 1667 107960 322568 118727 -102204
44489 -102204 375897 1152172 1101406 128435 -588974 -301595 331068 364849 -89682 -244337
44479 -244337 118171 448526 363088 167858 273741 515700 444584 101245 -17516 177776
44469 177776 113597 -504335 -1026998 -746547 -61641 44940 -480377 -690198 -142587 468278
44459 468278 496568 283469 401782 679886 592879 104345 -452471 -898260 -1108215 -834691
44449 -834691 -144898 384381 403464 275320 331266 181331 -587686 -1515267 -1817153 -1460604
44439a460604M98844M80929N73544M09174m3885r1798M31881O27594K0378n05917
44429I40140j92963K40563j33349p89206o93804j51721j98290o54145m06693N44677
44419a494791R49309L69320j20469K70966Q72048Q00431K86130l1994k27995o03953
44409A069002p58625j66626O59508O13922m00645j196545q68486N2281M27923
44400e68291J6517m16908k83524J49241L65188L66899M69581O19716M08640k36658
44390H90401p78860o60354L5378O63425O68473R1538n05444o06453k60873N0353
44380d12416R0382J52828N07766Q88220Q73425N01396O6686m07737r38640j095337
44370B26573m91373L63956N40602K7425k74732n860J67719k01626o07359n82638
$$ plain form
44439 -1460604 -961760 -480831 92713 501887 458002 366204 798085 1425679 1446057 940140
44429 940140 747177 987740 854391 65185 -628619 -780340 -978630 -1632775 -2039468 -1494791
44419 -1494791 -545482 -176162 -296631 -25665 846383 1646814 1932944 1900950 1672955 1069002
44409 1069002 310377 143751 803259 1417181 1016536 -180009 -1048495 -996214 -568291
44400 -568291 -551774 -968682 -1252206 -1102965 -737777 -370878 98703 718419 1127059 890401
44390 890401 111541 -548813 -513435 149990 818463 910001 404557 -201896 -462769 -412416
44380 -412416 -322034 -169206 338560 1226780 2100205 2601601 2668287 2260550 1321910 226573
44370 226573 -264800 99156 639758 667183 392451 386591 554310 352684 -254675 -837313
44360h37313m88859o59109o07991R8423Q93657J017038O98720O24097O90848K91232
44350A720743m69214q21325m82034Q8863M86757O48225M62089j05244n55102l10981
44340F62777L65785O30006K19333l30921o13793p34968p30479l80862K26667O30380
44330e6075O69428O23210N53692J64197n03455q82652o65900k30193k5854l4479
44320c88081n5832m3765O5849L86814P22221O34122R3389l82296m39666k87306
44310C05449j93330q1330J28061K58296K43853K91587L74426O0957p29028j241243
44300e82302p37232L81325Q76575J57432r45717j111117q4289R73961Q59658j61287
44290c72993o93229j04801O37991M91759o1542J31670R35837J083697K27503m97686
$$ plain form
44360 -837313 -1326172 -1985281 -2593272 -2494849 -1601192 -584154 114566 738663 1429511 1720743
44350 1720743 1251529 430204 -51830 37033 523790 1172015 1634104 1528860 973758 662777
44340 662777 1028562 1658568 1877901 1546980 933187 198219 -532260 -913122 -686455 -56075
44330 -56075 613353 1236563 1790255 1954452 1450997 568345 -97555 -327748 -353602 -388081
44320 -388081 -443913 -487678 -421829 -35015 687206 1321328 1414717 1032421 592755 305449
44310 305449 112119 30789 158850 417146 660999 952586 1327012 1387969 658941 -582302
44300 -582302 -1319534 -938209 -61634 95798 -849919 -1961036 -2045325 -1071364 -211706 -372993
44290 -372993 -1066222 -1171023 -533032 -41273 -102815 28855 964692 2048389 2275892 1778206
44280A778206k91827J51117o8235o23779o47659j08314L47105M14555K21409j95209
44270I77369p60774j027516o42819P4137N64370P48083Q04267O21849J01932l26045
44260A134853j92284K26510K75318r8676l86764l89372l61409l56901j20840K98001
44250B8436M26910K9642n25006o85947k62865M27836P53021K90233n66948q36600
44240i21288j53512O31220N63486j05372l94580j7590M86324P66322Q60616N51829
44230B267455l90495j297581j100121j857N08517k10209r61037n76888L13985
44221a448231M44534l9159j8903N93379P59042J64114k48583O8390L45162j05815
44211E13930n96280j42298Q13958R02719j39730j011601o19231N46216J223474
$$ plain form
44280 1778206 1486379 1637496 1569261 945482 297823 189509 536614 951169 1172578 977369
44270 977369 216595 -810921 -1453740 -1379603 -815233 -67150 737117 1358966 1460898 1134853
44260 1134853 942569 1169079 1444397 1345721 958957 569585 208176 -148725 -269565 28436
44250 28436 455346 484988 -40018 -725965 -988830 -560994 192027 482260 -84688 -921288
44240 -921288 -1074800 -443580 119906 14534 -380046 -397636 88688 855010 1715626 2267455
44230 2267455 1876960 579379 -520742 -522599 -14082 -224291 -1185328 -1762216 -1448231
44221 -1448231 -1003697 -1042856 -1061759 -468380 290662 454776 206193 274583 619745 513930
44211 513930 -82350 -224648 589310 1492029 1352299 340698 -278533 267683 1491157
44202A491157R43576K39446k84380m69202l61163l7568K80431L47185J99911P3695
44192B423088K4816p0867j94982k04037j30130j04425n5007Q9835L1752m33855
44182A376188o69062J77582J588869J795522J31708j669518j566906M7102R53430
44173B164915J77728r26537q62008K8387M30172J3607l89789j81129K75536L40220
44163A071102m7070m15908m22879k19597j49719k35782j80181J16311L40347K52259
44153A08883R3130J96746M31104M06160P1530k80143m70778n21608m25307k13271
44143f03554q7918j17095l5002K47859L03847q5415l09408J63955O81691K85614
44133D44574n60873m55169O93166J347544O81896k06501j67909K38910o2845p76403
$$ plain form
44202 1491157 2434733 2674179 2389799 1920597 1559434 1521866 1802297 2149482 2349393 2423088
44192 2423088 2447904 2377037 2182055 1978018 1847888 1743463 1688456 1778291 1810043 1376188
44182 1376188 707126 884708 2473577 4269099 4400807 2731289 1164383 1211485 2164915
44173 2164915 2342643 1416106 554098 582485 1012657 1026264 636475 455346 730882 1071102
44163 1071102 1024032 608124 185245 -34352 -184071 -419853 -600034 -483723 -143376 108883
44153 108883 202013 398759 829863 1236023 1307553 1027410 556632 35024 -390283 -603554
44143 -603554 -691472 -808567 -843569 -595710 -291863 -377278 -686686 -522731 158960 444574
44133 444574 -116299 -571468 121698 1469242 2151138 1944637 1776728 2015638 1952793 1176390
44123A176390q39407k32045J58665R0750J11683L21904J83182l94176p84566o15332
44113h22952j90534J60640M23834N11132K56690r1642n2590L07442M18915J25310
44103A046245j16473p3492p6082l14438m67766l17186j20288n7209J31007N85707
44093B20025R17828P63693L49359J00761K8431j14539l44119m89346n14373m77242
44083D40478l45928j27920j4280j44276l58131l70775o7489M61930R65258J032574
44073A471441M01494n55141r89460n09220L19040O78744M48997J10927m0217j40203
44063A196402l01773l58521j54189J95849M53329N10234M07596J97899j22029
44054B024797n17129p65709n41440J59406P44909N41611k97048p69613k21958
$$ plain form
44123 1176390 336983 104938 263603 354353 466036 787940 971122 576946 -207620 -822952
44113 -822952 -1013486 -852846 -429012 82120 338810 247168 194578 502020 920935 1046245
44103 1046245 929772 856280 780198 465760 -2006 -319192 -439480 -496689 -365682 220025
44093 220025 1137853 1901546 2250905 2351666 2380097 2265558 1921439 1432093 917720 440478
44083 440478 94550 -33370 -47650 -191926 -550057 -920832 -988321 -526391 438867 1471441
44073 1471441 1872935 1317794 328334 -180886 138154 816898 1265895 1376822 1336605 1196402
44063 1196402 894629 536108 381919 577768 1031097 1541331 1948927 2146826 2024797
44054 2024797 1507668 741959 200519 359925 1104834 1646445 1349397 579784 357826
44045C57826P20392Q70562K1075p64518n40881L05483O17587k587p43523p27406
44035A14010j25930K27112O3088l4872L75346Q47329O38756k56004j084976j229380
44025d65521p47295q0669M20853O39132O33600N49438M56642K97768P6096p8442
44015A701602j85626m67206q35781p11785J27671Q64198N73452l32061n48612
44006A85852J60854N28339k71499j256197j018979K57659J147000R27344K16099
43997H76472j74744j08593J67989L97316K74285k87291p32255l74142N12153Q18358
43987A369548J15803o76221o11252m1670P8838k87836l72645j7195O4139l82142
43977g60633n54264J15271Q86466P64802Q0967k5974N31618O41208j38741p67658
$$ plain form
44045 357826 1078218 1948780 1969855 1205337 664456 969939 1587526 1584939 841416 114010
44035 114010 -11920 215192 278280 243408 618754 1466083 2104839 1848835 763859 -465521
44025 -465521 -1212816 -1293485 -872632 -233500 400100 949538 1406180 1703948 1780044 1701602
44015 1701602 1515976 1048770 212989 -498796 -371125 493073 1066525 734464 185852
44006 185852 346706 875045 603546 -652651 -1671630 -1413971 -266971 660373 876472
43997 876472 701728 593135 761124 1158440 1432725 1145434 413179 39037 551190 1369548
43987 1369548 1485351 809130 197878 156208 235046 -52790 -425435 -442630 -378491 -760633
43977 -760633 -1314897 -1199626 -313160 451642 532609 506635 1038253 1679461 1540720 773062
43967G73062l68578L55378K66205m14682n73871k630M68887M37700L26879K95644
43957A563994o0899o82543q27760k92709J55157M1503q0661K65295N93883M08811
43947A084071J65414L96682O22177J36596o80212r02548n17498k91998m31079
43938d18395m05684k5076K82536K92532K66528L55292M05718L58592K28134j69839
43928A170338p93043r31996p9110R47043Q12166l77178j049826l60798O72902
43919A0498P28096m6309n11216k00999K42485J05047m50375n73825J77086J023557
43909E04045P07468o77400j339986j10338J588598J441758m46116j630592q32236
43900g94799M49468M57773l84706o51943j61725K91471M79849O55468N91960j9
$$ plain form
43967 773062 404484 759862 1026067 611385 37514 34884 503771 941471 1268350 1563994
43957 1563994 1503095 820552 -7208 -299917 -144760 -103257 -183918 81377 675260 1084071
43947 1084071 1249485 1646167 2268344 2404940 1724728 822180 304682 12684 -418395
43938 -418395 -824079 -849155 -566619 -274087 -7559 347733 753451 1112043 1340177 1170338
43928 1170338 377295 -554701 -633811 313232 1125398 748220 -301606 -662404 10498
43919 10498 738594 692285 181069 -19930 222555 327602 -122773 -696598 -519512 504045
43909 504045 1211513 534113 -805873 -916211 672387 2114145 1668029 37437 -794799
43900 -794799 -345331 112442 -272264 -924207 -1085932 -794461 -314612 340856 932816 932797
43890I32797n75496m39462P3034J80645m638J47539M55672K06588m59451o90389
43880a73161l67048j84390k70346K4847P56936J027992M28844k26021j83196J22660
43870I57117p5250n68084n13450K55801R67162Q96949J63481n23207o52742l40324
43860E67453j2675J69706L46831M82204L23980p911J3624M07319L89319m04003
43850B275847j059913o26695L36263N20525j85463p09104n59830k96203k29643
43841e34216L259L68310K47489l06299l90945J99198N15080J28319m9236N67286
43831G48245J033590M21283n53949p06333k47202j04116j62515K69334P96590
43822A494927M17254n70076q13479j08410K67839k89873p82335l90245K14616
$$ plain form
43890 932797 357301 -82161 -9127 171518 166880 314419 770091 976679 517228 -173161
43880 -173161 -540209 -724599 -994945 -970098 -213162 814830 1243674 1017653 834457 957117
43870 957117 881867 313783 -199667 56134 1023296 1920245 2083726 1560519 907777 567453
43860 567453 554778 724484 1071315 1553519 1877499 1869588 1883212 2290531 2679850 2275847
43850 2275847 1215934 589239 925502 1446027 1260564 551460 -8370 -304573 -534216
43841 -534216 -530957 -162647 84842 -221457 -612402 -413204 101876 230195 180959 748245
43831 748245 1781835 2203118 1649169 942836 695634 591518 429003 698337 1494927
43822 1494927 1912181 1342105 528626 420216 688055 398182 -384153 -774398 -559782
43813e59782J46279k72827k98544l6788N6473J74071O05406Q04821J63002o95709
43803H6402o02075L28044P76366K34752k69324J35285Q37647Q35989L16958J76204
43793B856248M40238K57677n75345j093403n25806N38508R05811K94060m87892
43784B610096p10900m99435l54341l78688k95880k0962J65584O6710q9523J7116
43774E09777K60292K03365j78271l23756O7665L95472o3568r21154r93388K9700
43764a013866J039301J038189M53816K41385L23022q7540r40581j276564p50422
43755i73260j55377r4246q6130M35284J019093Q66001J00200m48855m84328m50907
43745b72525n40429k96984M86419J087375O52927n21423j124117m30965O86981
$$ plain form
43813 -559782 -413503 -686330 -984874 -1021662 -965189 -791118 -185712 619109 782111 86402
43803 86402 -515673 -187629 588737 823489 554165 689450 1527097 2363086 2680044 2856248
43793 2856248 3296486 3554163 2978818 1885415 1359609 1898117 2803928 3097988 2610096
43784 2610096 1899196 1399761 1045420 666732 370852 349890 515474 582184 492661 509777
43774 509777 770069 973434 795163 471407 539072 934544 870976 -50178 -1043566 -1013866
43764 -1013866 25435 1063624 1517440 1758825 2081847 1994307 1053726 -222838 -973260
43755 -973260 -1128637 -1222883 -1309013 -873729 145364 1011365 1111565 662710 178382 -272525
43745 -272525 -812954 -1109938 -623519 463856 1116783 595360 -528757 -959722 -272741
43736b72741Q41880k6212o09998j34463N64741L92637l63107o69829m74899n62434
43726a314425q94347n03776P18061J483574R54221k5217l06338m7547k8732k18272
43716a82798j00681J92196J83517M7497K44168N08254K61157k40595k55702J19142
43706G76155R0194m22220o29995k23236J99911K54092L08671N88897O42217J30131
43696A714817n45503p81035m05342L80306J110582J097688J33305q42852p02139
43687A159827J89385L50742n63610j181543n50407M66806O95391L23936J09463
43678I99990K4336j67430N908P53937J030863J1781j176021r13179K37686K83687
43668A091558r08383j229139K99843J808056J294603n14773j391063o26624N60661
$$ plain form
43736 -272741 569139 542927 -67071 -201534 363207 755844 392737 -277092 -751991 -1314425
43726 -1314425 -2208772 -2712548 -1994487 -510913 443308 418091 111753 64206 35474 -182798
43716 -182798 -283479 -91283 92234 139731 383899 892153 1153310 912715 657013 776155
43706 776155 866349 444129 -185866 -409102 -209191 44901 353572 942469 1584686 1714817
43696 1714817 1169314 388279 -17063 363243 1473825 2571513 2704818 1861966 1159827
43687 1159827 1349212 1699954 1136344 -45199 -595606 -128800 566591 890527 999990
43678 999990 1024326 856896 862804 1616741 2647604 2659385 1483364 570185 807871 1091558
43668 1091558 183175 -1045964 -746121 1061935 2356538 1841765 450702 -175922 384739
43659C84739J021251P60344K79007j00947k51825k54926l40097m31362j27391
43650I38793M54870M56863m24615j107581n71239M39900L96608o59516j154243
43641a230160l84250N60355O31779K43737K14925M39118M45663L81562N20018
43632A822747M93477n3455o05385n00346n5024k2110k98077j69207L93580O90337
43622A696537M37928K3536l15307o31422o52162m1657O92054O38664j6544r0086
43612A741541O94977J127770M12232n29080n26833M2207J4685o96388j137433
43603A143678q18578j47085M01795O23590K90994n66698j183864p29016N11416
43594d73768J348982J129725L20060l19151m89895k87040q226o4195n08113o94380
$$ plain form
43659 384739 1405990 2166334 2445341 2344394 2092569 1837643 1497546 1066184 938793
43650 938793 1393663 1850526 1425911 318330 -252909 186991 583599 -75917 -1230160
43641 -1230160 -1614410 -1054055 -422276 -178539 36386 475504 921167 1302729 1822747
43632 1822747 2316224 2262769 1657384 1157038 1102014 1079904 781827 612620 1006200 1696537
43622 1696537 2134465 2158001 1842694 1211272 559110 517453 1209507 1848171 1831627 1741541
43612 1741541 2436518 3564288 3976520 3447440 2920607 2962814 2977499 2281111 1143678
43603 1143678 325100 178015 579810 1203400 1494394 927696 -256168 -985184 -473768
43594 -473768 875214 2004939 2324999 2005848 1515953 1228913 1220687 1156492 648379 -46001
43584d6001k7037J008737J285378N45435k69351l57417n205R4046j42246k53129
43574A833210N0068N68556Q57459O70276K55357O7519M7863l79682j227307j484460
43564A258859m98375P56376Q74873J08043n8711P31724J252540P86988J60415
43555E372732J49581K49874j97585q28062j062843j079092j108930p43751J30574
43546H82498O29959J37580n48631m08861K30704M73517M51879Q19926J227561
43537C896132P71387l25841r14326o93144m47243n10208l24438K70012N43930
43528B266261O9068n76031o83407k35877M04760R08376R05767K40894n52720p18431
43518B028660k83737J03612K63190M99099O01669j5179j017256j207452k94374
$$ plain form
43584 -46001 -73038 935699 2221077 2766512 2497161 2139744 2134539 2228585 2086339 1833210
43574 1833210 1883278 2451834 3309293 3979569 4234926 4302445 4350308 3970626 2743319 1258859
43564 1258859 760484 1516860 2391733 2499776 2441065 3172789 4425329 5212317 5372732
43555 5372732 5522313 5772187 5574602 4746540 3683697 2604605 1495675 751924 882498
43546 882498 1512457 1650037 1101406 692545 923249 1396766 1848645 2668571 3896132
43537 3896132 4667519 4341678 3427352 2734208 2286965 1776757 1452319 1722331 2266261
43528 2266261 2335329 1759298 1075891 840014 1244774 2153150 3058917 3299811 2747091 2028660
43518 2028660 1744923 1848535 2111725 2610824 3212493 3197314 2180058 972606 678232
43509F78232N17598K61237m84451o55013j58789M07916O89625N42929j39638q99267
43499G60379p91457K81067J108647Q32179K43309N25241J512863K274142K631262
43490I377632K791437K129432l0157k656989l699254k686885j219365o00305m20587
43481B984959K7191L56638q016o17563p00770l54366j17822L1965L56885N50021
43471B509122K15583k14854l3032N03758M86421j57312n13090j62796J65890j89454
43461B610236q07688r41419o58788n50357o79567n33445P2199O10619M85682k32951
43451f25479q20813n88141L73244J153973R99289L15149K28852R90857J457801
43442C484732O43551q08483j451130r22146j11546L20306N37942O12139J33480
$$ plain form
43509 678232 1195830 1457067 972616 317603 158814 566730 1256355 1799284 1659646 760379
43499 760379 -31078 249989 1358636 2190815 2434124 2959365 4472228 6746370 9377632
43490 9377632 12169069 14298501 14268344 11611355 7912101 5225216 4005851 3405546 2984959
43481 2984959 3012150 3368788 3360772 2743209 2042439 1688073 1570251 1602216 1959101 2509122
43471 2509122 2724705 2509851 2476819 2980577 3466998 3309686 2796596 2633800 2799690 2610236
43461 2610236 1802548 861129 202341 -348016 -1027583 -1561028 -1488829 -878210 -392528 -625479
43451 -625479 -1446292 -2034433 -1661189 -507216 492073 807222 1036074 2026931 3484732
43442 3484732 4128283 3319800 1868670 946524 834978 1155284 1693226 2305365 2438845
43433B438845q45909j416623r49038O3540Q36530J276444J517107J202422J18627
43424D241945r54450j010539k04486M32228N25806O84067J266870J754814J604703
43415H340958J003671M32050K8519k89371n25891p34493j078953j491809j567354
43406D117327j046049k09088L61748K72400m18592j163559j209206l03761Q40221
43397A241441J164386M23192n94952j016639o80197J8664O09264P51565L82262
43388B298986j49581l76809k37888l7344R0547K81240M96579M50253Q2260l01326
43378B596917m63980m47359l14571r5256J2101j54580l24987j14498L02174M25234
43368A421195K75224K84027L77858N1861n64079p17980l29775j71776l91146r9339
$$ plain form
43433 2438845 1592936 176313 -772725 -709185 127345 1403789 2920896 4123318 4241945
43424 4241945 3287495 2276956 2072470 2504698 3030504 3714571 4981441 6736255 8340958
43415 8340958 9344629 9776679 9805198 9515827 8989936 8255443 7176490 5684681 4117327
43406 4117327 3071278 2862190 3223938 3496338 3077746 1914187 704981 401220 1241441
43397 1241441 2405827 2829019 2234067 1217428 537231 555895 1165159 1916724 2298986
43388 2298986 2149405 1772596 1534708 1497364 1587911 1869151 2365730 2815983 2898243 2596917
43378 2596917 2132937 1685578 1371007 1275751 1287852 1133272 808285 693787 995961 1421195
43368 1421195 1696419 1980446 2358304 2410165 1846086 1128106 798331 626555 235409 136070
43358A36070R07386J325494L05047r11685p06257M21339O93743j27903n49050
43349A494184J05943P05763K75034n63908q14520n92742n53808p04976o55790
43340a304820m40254k75664L9368O88478J134096P02727k28035m63709L99378
43331B51565J284760R79177k79587j147128r49943m22233m40256o96641l25162
43322a745448N38410Q29856K62789j24457L53259Q09403J91906q44992p72582
43313e01856M15709J057194K45287q99911r40511n0079N58566L90976m0174k47073
43303a1872k02802Q0531O17183J061460Q94957J45699n45126p15989n48001l88458
43293C87582k18901J16111M46392M38936J36241l4914J39867L46514J88436k57434
$$ plain form
43358 136070 1043456 2368950 2673997 1762312 1056055 1477394 2171137 2043234 1494184
43349 1494184 1600127 2305890 2580924 2017016 1202496 609754 55946 -649030 -1304820
43340 -1304820 -1745074 -2020738 -1981370 -1292892 -158796 543931 315896 -147813 251565
43331 251565 1536325 2515502 2235915 1088787 138844 -283389 -723645 -1420286 -1745448
43322 -1745448 -1207038 -377182 -114393 -238850 114409 923812 1115718 270726 -501856
43313 -501856 -86147 971047 1216334 316423 -624088 -674167 -115601 275375 235201 -11872
43303 -11872 -214674 -134143 483040 1544500 2439457 2585156 2040030 1324041 776040 387582
43293 387582 168681 284792 731184 1170120 1306361 1271447 1411314 1757828 1946264 1688830
43283A688830n68739n56036m37017m24503m04773j55789K68957N28633L45702
43274B85265j74362n75056m79003m7190J50010j29568m19555j99809L07449M75385
43264h06434K53489J89752M75853O54287M26206P3700j59713m19130o59828m60878
43254d32696J47361M29843Q9764j07887M13680R44766O14235n0415R1719Q51470
43244B991840R02922j39410j129646j088407l77092J53161K14174j03160o87254
43235G37128j120633p91208K10140R12674O49600j09160n27274m91274m54109
43226i84116n85800n77891j33916O38313J244172J185003N14985j05514k27300
43217I67936k24863n76996q80538m21542M75197P22439J24947l49509j42327K06938
$$ plain form
43283 1688830 1120091 564055 127038 -297465 -702238 -858027 -589070 -60437 285265
43274 285265 110903 -464153 -943156 -990346 -840336 -969904 -1389459 -1589268 -1281819 -806434
43264 -806434 -552945 -363193 112660 766947 1193153 1266853 1107140 688010 28182 -432696
43254 -432696 -285335 144508 234272 126385 540065 1484831 2099066 2048651 2140370 2991840
43244 2991840 3894762 3755352 2625706 1537299 1160207 1313368 1527542 1424382 737128
43235 737128 -383505 -1174713 -964573 -51899 597701 488541 -38733 -530007 -984116
43226 -984116 -1569916 -2147807 -2281723 -1643410 -399238 785765 1300750 1195236 967936
43217 967936 743073 166077 -714461 -1136003 -660806 61633 186580 -162929 -305256 -98318
43207i8318K81644M69766Q52781O35110m69484j349391j009639r6330J74371j48600
43197g58090j64066K43284M47070L75489N06027P52492N34983q4608m00203k14051
43187A238327k8448o0822k015J83863J35357j17178j10933J60057J65727j73827
43177A390108k64020J56551N67357N08627J68804j19022k78180j85038K73720
43168B218907O20919J32034r14483j275507n33243J39596k37910q42077l08341
43159a000105J050712J615089Q25390j27800j57348L20733L29824j90058n34934
43150B131503l64822Q829K52386L43419L05904Q7437j97314k58691n7864J3567
43140B264354l48254q03057o92682L5629O24704M81258J8344N3465N50525O30209
$$ plain form
43207 -98318 183326 653092 1505873 2140983 1671499 322108 -687531 -783861 -609490 -758090
43197 -758090 -922156 -678872 -231802 143687 649714 1402206 1937189 1852581 1452378 1238327
43187 1238327 1209879 1149057 1147042 1330905 1466262 1349084 1238151 1398208 1563935 1390108
43177 1390108 1126088 1282639 1849996 2358623 2527427 2408405 2130225 1945187 2218907
43168 2218907 2839826 2971860 2057377 781870 248627 388223 150313 -691764 -1000105
43159 -1000105 50607 1665696 2491086 2363286 2205938 2526671 2856495 2666437 2131503
43150 2131503 1766681 1775510 2027896 2371315 2677219 2764656 2567342 2308651 2250787 2264354
43140 2264354 1916100 1113043 420361 455990 1080694 1561952 1580296 1633761 2184286 2814495
43130B814495n5257o78689m33691J92739Q8239p95406j265825n18598P75344J360622
43120A483973Q73768m55n22698n80881m96525n35152o57668o07725k61949J07462
43110a197850J32303o4935L0705M77124O17089O8224m92868j72759P92029J270715
43100A459777P47406j27943n48877m15235m6044K84443K84288k37064q74532q44400
43090c18181l6343P29193Q60910P88241J098678J478802J187510K26249n60814
43081E454245l40321J090438L100009M287407L408150Q49287j409429j993515
43073A4446271j675477j922080k632643k531720j363123k81023q3077l38426m64556
43064C154146n32168o62918n87692k10001J24599K15559K19191J31535k23034
$$ plain form
43130 2814495 2759238 2080549 1646858 1839597 1927836 1132430 -133395 -651993 123351 1483973
43120 1483973 2357741 2357286 1834588 1253707 757182 222030 -435638 -1043363 -1305312 -1197850
43110 -1197850 -1065547 -1130482 -1099777 -622653 -5564 62660 -430208 -602967 189062 1459777
43100 1459777 2207183 2079240 1530363 1115128 1069084 1353527 1637815 1400751 526219 -318181
43090 -318181 -354524 374669 1235579 2023820 3122498 4601300 5788810 6015059 5454245
43081 5454245 5113924 6204362 9304371 13591778 16999928 17849215 16439786 14446271
43073 14446271 12770794 10848714 8216071 5684351 4321228 4040205 3957128 3618702 3154146
43064 3154146 2621978 1959060 1371368 1161367 1285966 1501525 1720716 1852251 1629217
43055A629217n70158l43952L54834P38492M74456R0972L5059Q4238n4824k58305
43045B180029l32627k50104O3557N67905P88483L91270o5890J52125O78188N72466
43035D745402k5112q8597M67928O34644J46807o7250L82718P55675P94767J286412
43025I033394K325215K659304J645497L21435m09297j100085k193070k716330
43017I566063j899553p10563l54508m71841k43181m9473m78867q29249k96895
43008D231933L02791k50933j404973j574922n13420O00595R49441O06207j46176
42999B800543p68895m42529O80339J062442p8967j256426q40620L95286O27908
42990B179081j34370n00030j93836l2479l7854L56718P09446J84046o69507o70013
$$ plain form
43055 1629217 1059059 715107 1069941 1808433 2282889 2373861 2408920 2493158 2438334 2180029
43045 2180029 1847402 1597298 1660855 2228760 3017243 3408513 3342623 3494748 4172936 4745402
43035 4745402 4720290 4631693 5099621 5734265 5881072 5813822 6196540 6952215 7746982 9033394
43025 9033394 11358609 14017913 15663410 15984845 15575548 14475463 12282393 9566063
43017 9566063 7666510 6955947 6601439 6129598 5886417 5836944 5358077 4528828 4231933
43008 4231933 4534724 4283791 2878818 1303896 790476 1391071 2340512 2946719 2800543
42999 2800543 2031648 1589119 2269458 3331900 3252933 1996507 1155887 1551173 2179081
42990 2179081 2044711 1544681 1350845 1318366 1280512 1637230 2346676 2530722 1861215 1191202
42980A191202p4855R388k62388M9686O37450M75692j30753j41189J43406k11690
42970A685949o34065q09R01866M89822n96629m00929Q28489J035165O4066j85084
42960C187841O32308P63069k35123o90820K4877N28612K11979J08720M04765l0378
42950D905850j058799j112955j36180K43525j31372K50442J271405J115673n3422
42941E294167o907J363821J626484L09385k17845P54615J123143L31216M49652
42932A1027731J760098J913527P09789P59191K158912J989119M16046J098093
42924B1832506L990062M853435L818993O052770J1194203J2042244P981707Q401993
42916H0167913J6683313K4166521K9387682M6879399P8992409R2889000N2975787
$$ plain form
42980 1191202 1116347 1125735 863347 913033 1550483 2026175 1895422 1754233 1897639 1685949
42970 1685949 1051884 1051075 1952941 2442763 1846134 1445205 2273694 3308859 3372925 3187841
42960 3187841 3820149 4583218 4348095 3657275 3682152 4210764 4422743 4531463 4936228 4905850
42950 4905850 3847051 2734096 2597916 2841441 2710069 2960511 4231916 5347589 5294167
42941 5294167 5287260 6651081 8277565 8586950 8369105 9123720 10246863 10578079 11027731
42932 11027731 12787829 14701356 15411145 16170336 18329248 20318367 20734413 21832506
42924 21832506 25822568 30676003 34494996 40547766 51741969 63784213 71765920 80167913
42916 80167913 96851226 121017747 150405429 197284828 276277237 369166237 422142024
42909D22142024k6213257q6465727r0950939o0271480l5424747k8071410k3566569
42902G1177895j4612054q540650q384458p652875l904501k293113m190111m258929
42894A7341204p46342J277407q26450l134472k597816j435670j696540j631306
42886F550015k5984J042130K28795n85164N5549P26560J26166p31187q68160r76283
42876E542437j416177j254924l50437O9091k91945k73855L94642N97697J15868
42867C132397K7568M53258K71903n83646r02722n18098m78564p41737j93847Q47906
42857A314418P94952k41777l53361Q12534J325358K87831p78515p32789m61170
42848A967481p04966o42899J73549O28549L0593n91811l33779J72526K19850K29132
$$ plain form
42909 422142024 395928767 309463040 218512101 158240621 122815874 94744464 71177895
42902 71177895 56565841 48025191 39640733 31987858 28083357 25790244 21600133 17341204
42894 17341204 16594862 17872269 17045819 13911347 11313531 9877861 8181321 6550015
42886 6550015 6524031 7566161 7794956 7209792 7265341 7991901 8118067 7386880 6518720 5542437
42876 5542437 4126260 2871336 2520899 2589990 2298045 2024190 2418832 3016529 3132397
42867 3132397 3159965 3613223 3885126 3301480 2398758 1880660 1402096 660359 466512 1314418
42857 1314418 2109370 1867593 1514232 2326766 3652124 3939955 3161440 2428651 1967481
42848 1967481 1262515 619616 793165 1421714 1452307 860496 526717 699243 919093 1148225
42838A148225N09412M26631k39586o24005k96914L5647M0740L38022Q87170N87822
42828B813164o56586j282775m94266L89691J39825m96879l82185Q5993L4039k17427
42818f7406J9574L79901K14370j13732N6104M41118M04289R2181m318J3139j74652
42807A260568l72554k28573K14592P78310J289410J228631K15788r13468p66680
42798B706024M83169J051471J75763p63371n65957k1580k22755n95663j44028
42789B103073N45352K61164o67347q80322k28489R9667m19041r17346n96626J69909
42779e30006N58679M42309M01192Q24209J291177J038922P3435o09991l18144
42770C171782L36008M34789K06645M14270Q02668N85125J75746P63549K180739
$$ plain form
42838 1148225 1657637 2084268 1844682 1220677 923763 959410 1000150 1338172 2225342 2813164
42828 2813164 2156578 873803 379537 769228 909053 412174 29989 115982 150021 -67406
42818 -67406 -47832 332069 546439 432707 488811 929929 1334218 1426399 1422081 1435220 1260568
42807 1260568 888014 659441 874033 1652343 2941753 4170384 4386172 3472704 2706024
42798 2706024 3189193 4240664 4416427 3653056 3087099 3065519 2842764 2247101 2103073
42789 2103073 2648425 2909589 2242242 1361920 1133431 1233098 814057 -103289 -699915 -530006
42779 -530006 28673 470982 872174 1696383 2987560 4026482 4099917 3489926 3171782
42770 3171782 3507790 3942579 4149224 4563494 5366162 5951287 6127033 6890582 9071321
42761I071321K939637K569268K180085K480119L051247L861238N542408P885567
42753C9580890J0164235J2996386J6927738J8675209J2731024j062627j4787695
42746I5225160k0322672j7697932j2833204r451659o989155m757372l592251l349886
42738A6231029k491928q59530j13622q66484j762835j878790j816871j939499
42730D501470j595056o63085l6521m8085k8930K30743J59381k37648k74601K8936
42720B036604L9498m3954M25513Q37016K9964j320006j309879J0091N42773l16648
42710I30972p11594K51879Q66762R03p15251J97148J247379M36135j232783j325927
42700e4377R8300Q17552J23678l97412K27174R40341O46896j39657m03190j83876
$$ plain form
42761 9071321 12010958 14580226 16760311 19240430 22291677 26152915 31695323 39580890
42753 39580890 49745125 62741511 79669249 98344458 111075482 110012855 95225160
42746 95225160 74902488 57204556 44371352 34919693 27930538 23173166 19580915 16231029
42738 16231029 13739101 12879571 12765949 11899465 10136630 8257840 6440969 4501470
42730 4501470 2906414 2243329 2206808 2158723 2129793 2360536 2519917 2282269 2007668 2036604
42720 2036604 2076102 2032148 2457661 3294677 3324641 2004635 694756 704847 1247620 930972
42710 930972 219378 471257 1338019 1338922 623671 820819 2068198 2504333 1271550 -54377
42700 -54377 43923 861475 985153 587741 814915 1755256 2402152 2262495 1859305 1675429
42690A675429k39237p92242j217793p86750M41616J423823J109594j94424r58078
42681D61938l16987P91583R72848K10621m59758n76112n30015n01217j70870M52815
42671C34846P79874M29506k75083p63174q02502n71162l92325l59923j30798O33126
42661a117615J513037J557048N64514m43442n11045O4986M00954K90639R4845
42652B413921q6753k83388j39367N24459R80028M55102m93648n90636K28180O86435
42642C694333J47901m85797l44547M6742k13194q29244p78347M0597O44424M47026
42632B369894L5789J76138O74847P56185K72778n4491L35922J067247J375661
42623G009970J126898Q50699R21261J234723J723278K618194L967804N342397
$$ plain form
42690 1675429 1436192 643950 -573843 -1360593 -918977 504846 1614440 1420016 461938
42681 461938 144951 936534 1909382 2120003 1660245 1084133 554118 52901 -117969 334846
42671 334846 1114720 1544226 1269143 505969 -296533 -867695 -1260020 -1619943 -1750741 -1117615
42661 -1117615 395422 1952470 2516984 2073542 1562497 1627483 2028437 2319076 2413921
42652 2413921 2327168 2043780 1904413 2428872 3408900 3864002 3370354 2779718 3007898 3694333
42642 3694333 3842234 3356437 3011890 3058632 2845438 2016194 1237847 1278444 1922868 2369894
42632 2369894 2405683 2581821 3256668 4012853 4285631 4231140 4567062 5634309 7009970
42623 7009970 8136868 8987567 9908828 11143551 12866829 15485023 19452827 24795224
42615B4795224O261189O459678N505061K828721j245199n007495o722324o325203
42607B6549652n139875m151669l343115k565976k036071j723664j149826k52880
42599F186576K36574j70969q65845r27848l79401m124j56313m18931l98504k57229
42589B843986l27114o17866q63005p87867k81714M18728P15677J95046p19788
42580E76083j045807l76198N91030R15577M99834k8727k53771l02851l30375j97493
42570D7302J74763N08467M73527J04034k58269l10201l907M09293N05809J00474
42560A751292m05715m03129P8100L03613j02453m71636k110R37374J150556K73665
42550C109557o58841o23504M8537K99681j11082m66400l86474l90439q38833j085370
$$ plain form
42615 24795224 31056413 37516091 43021152 45849873 44604674 39597179 32874855 26549652
42607 26549652 21409777 17258108 13914993 11349017 9312946 7589282 6439456 6186576
42599 6186576 6423150 6252181 5386336 4458488 4079087 4074963 3918650 3499719 3101215 2843986
42589 2843986 2516872 1899006 1036001 248134 -33580 385148 1100825 1295871 576083
42580 576083 -469724 -845922 -254892 660685 1160519 1131792 878021 575170 244795 47302
42570 47302 222065 730532 1204059 1308093 1049824 739623 735716 1145009 1650818 1751292
42560 1751292 1345577 942448 1020548 1324161 1221708 750072 747962 1685336 2835892 3109557
42550 3109557 2450716 1827212 1875749 2175430 2064348 1597948 1211474 821035 -17798 -1103168
42540a103168m14663O34507Q62367K37434K3685P54269J229028L68973q96152
42531A696280q83440K75262Q70267K80451k73429L5499L32983k09194q02561m32412
42521H89706L22663K79379l50506m47893N5174K35550p5997j22148K60663M04058
42511A450649K05817L52741Q57982P47223k75902j063175o08380N55341J236219
42502C458515J103574P19955P05204J355319K443329L003412K069273O3601j365005
42493A3557177j388342r87595j270693j792096j528972p30366n27522j064598
42485D266993j267348n15997M66373O83627J31047l87243l41601l0291q6441o03548
42475B315571r74030p36799k69027j69691k39965J39065P37113O33166j84415
$$ plain form
42540 -1103168 -1517831 -883324 -20957 216477 240162 994431 2223459 2592432 1696280
42531 1696280 812840 1088102 1958369 2238820 1965391 2000890 2333873 2124679 1322118 889706
42521 889706 1212369 1491748 1141242 693349 748523 984073 908076 785928 1046591 1450649
42511 1450649 1656466 2009207 2867189 3614412 3338510 2275335 1666955 2222296 3458515
42502 3458515 4562089 5282044 5987248 7342567 9785896 12789308 14858581 14922182 13557177
42493 13557177 12168835 11181240 9910547 8118451 6589479 5859113 5331591 4266993
42485 4266993 2999645 2483648 2950021 3633648 3764695 3377452 3035851 3005560 2919119 2315571
42475 2315571 1341541 604742 335715 166024 -73941 65124 802237 1435403 1250988
42466A250988n39517J13204P29093L05944n63418p77356m75116m87178p03262
42457a146618l56431M17320O80851K97121J56395O38018R65755M55298m71710
42448A635999r40525o61931L1888O94089R94249P96031K54408l26526p49579q88084
42438H40019o00345K99M05833K41036k38945n24847m80575k35084K02890P49003
42428C59284J007267P67063M32062M57148P48885J131811J810442K602740K369260
42419A1685962L63938k204326l234544k302986r87549n87098p54047o56322k78537
42410A044491Q612K32615N03722N69991K78800L272J25071M60263N56948K48910
42400D032695l12621q48211j029662p22248k31008L2066Q2364J62491J82599n8326
$$ plain form
42466 1250988 711471 824675 1553768 1859712 1296294 518938 43822 -443356 -1146618
42457 -1146618 -1503049 -1085729 -404878 -107757 48638 686656 1652411 2107709 1635999
42448 1635999 695474 33543 65431 759520 1753769 2549800 2804208 2477682 1728103 840019
42438 840019 239674 239973 645806 886842 647897 123050 -357525 -592609 -389719 359284
42428 359284 1366551 2133614 2565676 3022824 3771709 4903520 6713962 9316702 11685962
42419 11685962 12049900 9845574 6611030 4308044 3320495 2733397 1979350 1323028 1044491
42410 1044491 1053103 1285718 1789440 2359431 2638231 2641503 2766574 3226837 3783785 4032695
42400 4032695 3720074 2871863 1842201 1119953 888945 921011 1003375 1165866 1348465 1290139
42390A290139k71536m0818L27781J73134l35187l35610L03936P16986M34168K9777
42380B292770k259j1916l06750m44590q2008K73338Q5871l13632l95805l74853
42370G20166o67271r07053m07899O29459J198750P71222r8159n19009k50405J36805
42360F06606m5148p20736r85652k30492Q56919J049762K91682k13884J94493P16500
42350A520050M40053l18908p39792p75890q30732p45485r3068Q29044J214941
42341E00213Q50535K65832j26989l88077n80468n46933k30527J77892M43724M17880
42331G83082R5252k65967l38872k21606l40277o43096m76207L20487Q45927L50643
42321A09366n18179n59330K16294O25404O7092o77718o16138J94565R06605R59123
$$ plain form
42390 1290139 1018603 977785 1305566 1478700 1143513 807903 1111839 1828825 2262993 2292770
42380 2292770 2290511 2278595 1971845 1527255 1445247 1718585 1804456 1490824 1095019 720166
42370 720166 52895 -854158 -1262057 -632598 566152 1337374 1239215 720206 469801 606606
42360 606606 561458 -159278 -1144930 -1375422 -518503 531259 822941 609057 803550 1520050
42350 1520050 1960103 1641195 901403 125513 -705219 -1450704 -1543772 -714728 500213
42341 500213 1350748 1616580 1489591 1101514 521046 -25887 -256414 -78522 365202 783082
42331 783082 878334 612367 273495 51889 -288388 -931484 -1407691 -1087204 -241277 109366
42321 109366 -408813 -968143 -751849 -126445 -59353 -737071 -1353209 -1158644 -252039 707084
42311G07084N40517J72247R4484R1413j15477m27733n49921n32126o86468q91973
42301a597953n71860L47638J056035R09709L38015J17948K16194P4619k91308
42292E99037l10267J28737M45823K45042j73048l17249r3112K35106L62680J76633
42282A299382r7202l0654M82380R31901O87040k70970j296258j671508j160650
42273a126539j71425N34617N37676K10205J55182K73697j2557o03805o40502J31045
42263g12406P88209N36607k09928o44444o75542n34006o8033P23259J165266Q46023
42253A215005M43963O72694J071075R24603P12685J302634K179030J947989M26728
42244A0896406j139644j869213j943671j591141p77479k4597j49929q95352j057582
$$ plain form
42311 707084 1247601 1419848 1514332 1605745 1490268 1062535 512614 -19512 -705980 -1597953
42301 -1597953 -2169813 -1822175 -766140 143569 481584 599532 815726 890345 599037
42292 599037 288770 417507 863330 1108372 935324 618075 524963 760069 1122749 1299382
42282 1299382 1202180 1171526 1653906 2585807 3272847 3001877 1705619 34111 -1126539
42273 -1126539 -1297964 -763347 -225671 -15466 139716 413413 400856 -202949 -843451 -712406
42263 -712406 75803 612410 402482 -241962 -917504 -1451510 -1519543 -796284 368982 1215005
42253 1215005 1658968 2331662 3402737 4327340 5040025 6342659 8521689 10469678 10896406
42244 10896406 9756762 7887549 5943878 4352737 3575258 3550661 3400732 2505380 1447798
42235A447798k99739L60646J99776k87988n16304o37394p24714l19337N33111
42226b44145Q80969K83359l27378m2315O06569N55665j24150m55641o3084M31255
42216A501104L74698j83184o71615n71268O2407N30336K65841l11431k86818L54261
42206A064331O17184L0028n92450m03470K52016N16234K84433P6465R7955J21650
42196B064376K4138j22467k90680m17318l08185M9897L24642K46477n8604l01811
42186A210465l29349j50750p21k55398q03006p70271L21468J387048R26831o85576
42176H50741j458778o03866M19805L16817j30683L39929J259049J249949K38873
42167B481836n96182o15807k00290K34002N63266N16833p6712p19777p38781k04092
$$ plain form
42235 1447798 1148059 1508705 1708481 1420493 904189 266795 -457919 -777256 -244145
42226 -244145 636824 920183 592805 550490 1157059 1712724 1588574 1132933 1069849 1501104
42216 1501104 1875802 1692618 1021003 449735 512142 1042478 1308319 996888 710070 1064331
42206 1064331 1681515 1711543 1119093 715623 967639 1483873 1768306 1844771 1942726 2064376
42196 2064376 2088514 1966047 1675367 1258049 949864 999761 1324403 1570880 1512276 1210465
42186 1210465 881116 730366 729645 474247 -328759 -1099030 -777562 609486 1536317 850741
42176 850741 -608037 -1211903 -792098 -475281 -605964 -266035 993014 2242963 2481836
42167 2481836 1885654 1269847 1069557 1303559 1866825 2383658 2306946 1587169 848388 644296
42157F44296K92884M96233M94007K63668j26602k82505q8288m2326l66948m66523
42147H17896j7825K29745k76367o91355r8099P55334N59891l18158m28630K86502
42137H18934M79350j68737m25355K23534O16589m7774q04464n32574K64902L77778
42127H02183k91279q48074p47446j46090O11299J103522Q31326j74405r97689
42118A43347p22805M20369J242496R04402k10284r27263n26167M41587P75816
42109A541498J82242k87794J96836Q61302M29275q14923j326633o00402J87362
42100C68763J11847k60531j58614P8621j48556m82529k59142K67986L62277M7190
42090g2688k5524L00756N53692N01966L99998L87127L00023J26806Q4090J51525
$$ plain form
42157 644296 937180 1433413 1927420 2191088 2064486 1781981 1693693 1651367 1284419 817896
42147 817896 800071 1029816 753449 62094 -36005 719329 1279220 961062 532432 818934
42137 818934 1298284 1129547 704192 927726 1544315 1496541 692077 159503 424405 802183
42127 802183 510904 -337170 -1084616 -1230706 -619407 484115 1315441 1141036 143347
42118 143347 -579458 -159089 1083407 1987809 1777525 850262 324095 765682 1541498
42109 1541498 1723740 1435946 1632782 2494084 2923359 2108436 781803 181401 368763
42100 368763 480610 220079 61465 140086 -8470 -490999 -750141 -482155 -119878 -72688
42090 -72688 -98212 202544 756236 1258202 1658200 2045327 2345350 2472156 2556246 2707771
42080B707771J5692l81490o45631m78895j17356K7439m0966J7137K63376L10485
42070A677562o0268m26404k65257K12191L28654J9702o5025K66735L02085l54442
42060A635533r08565n09866L91505P74765O26230O90666R89212Q06198O2932m89169
42050D069441n34894n58952p89020q11684m49518o3905J91346M83860N90055J19259
42040B245988m78688l33773K88696K39315m41448l10630R94967J726878N57765
42031D489070j257290j610289m04181P13926P62298K15007j71681j32268K67683
42022B872275O67458N33654j21056n74549m67820l53368n95971o31509r6921L01969
42012A534162N2212n1822O99142J363754O85505p11036j094691j75395P20420
$$ plain form
42080 2707771 2723463 2341973 1696342 1217447 1100091 1127530 1086564 1103701 1367077 1677562
42070 1677562 1617294 1190890 925633 1137824 1466478 1486180 1421155 1687890 1989975 1635533
42060 1635533 726968 217102 608607 1383372 2009602 2700268 3689480 4495678 4558610 4069441
42050 4069441 3534547 2975595 2186575 1374891 925373 861468 1052814 1536674 2126729 2245988
42040 2245988 1767300 1433527 1722223 1961538 1520090 1209460 2204427 3931305 4489070
42031 4489070 3231780 1621491 1217310 1931236 2693534 2908541 2736860 2604592 2872275
42022 2872275 3539733 4073387 3952331 3377782 2909962 2556594 1960623 1329114 1232193 1534162
42012 1534162 1586374 1534552 2233694 3597448 4282953 3571917 2477226 2301831 3022251
42003C022251P73490M17169O1229m28909r03634q94708n08696k40896M000N32949
41993A834245P51797j31912j403502j417123N541J299373J503465J306741J360552
41984E109177J150697K45160o97669r65170p59965m92961j41347J38455j47525
41975C438852p94571q05743N8435P47535N62275J49278J38166L2022o05962j025345
41965A894942m76531M16696O06685J55476k32489m24617n46688k56538N21801
41956A658737Q95168K53044m96244k55622L91387J56456o63754o14023M27498
41947A752647R90240M01301k58429n2034M47292L75751n4815k13332j32937j35872
41937C119812j01437J26806J69766l17555r08377r00587k95912K53856K92929
$$ plain form
42003 3022251 3795741 4212910 4274139 3845230 2941596 2046888 1538192 1297296 1301296 1834245
41993 1834245 2586042 2454130 1050628 -366495 -360954 938419 2441884 3748625 5109177
41984 5109177 6259874 6505034 5807365 4842195 4082230 3589269 3447922 3586377 3438852
41975 3438852 2644281 1838538 1896973 2644508 3206783 3356061 3494227 3526249 2920287 1894942
41965 1894942 1418411 1835107 2441792 2597268 2364779 1940162 1393474 1136936 1658737
41956 1658737 2553905 2806949 2310705 2055083 2446470 2602926 1939172 1325149 1752647
41947 1752647 2742887 3144188 2885759 2833725 3281017 3656768 3601953 3388621 3255684 3119812
41937 3119812 3018375 3145181 3314947 2997392 2089015 1188428 892516 1146372 1439301
41928A439301o8946m58712n46629j91756M10288Q14164P60410M26208J38809J0794
41918B733931m8389j54774l62150n63269m84071m4121L29991J61891l03629l19665
41908I45745K46096O23132K80400k50002k29024J00339p2129p50409j007287l41390
41898d54529N51851P17593J68556k74143j06919L52270N32575K89977q5274k82410
41888A409547k23513k5321J43446J98863K13099L14294M72602M67626J61587k59494
41878B872736m49411l03130q0590r1529l25262m52325k07644K43541M18817J14701
41868A739904k18530l012N57952N65994l09060j132685q31569L04098R92440P27644
41858B393176K93517L27021L05494m34473j383276j454550n92032J18118j9131
$$ plain form
41928 1439301 1370355 911643 365014 173258 583546 1397710 2158120 2584328 2723137 2733931
41918 2733931 2685542 2530768 2168618 1605349 1121278 1077157 1407148 1569039 1265410 945745
41908 945745 1191841 1814973 2095373 1845371 1616347 1716686 1644557 894148 -113139 -454529
41898 -454529 97322 814915 983471 709328 602409 954679 1487254 1777231 1691957 1409547
41888 1409547 1186034 1160713 1304159 1503022 1716121 2030415 2503017 2970643 3132230 2872736
41878 2872736 2423325 2120195 2039605 1948076 1622814 1170489 962845 1206386 1625203 1739904
41868 1739904 1521374 1518362 2076314 2642308 2333248 1200563 368994 673092 1665532 2393176
41858 2393176 2686693 3013714 3319208 2884735 1501459 46909 -545123 -427005 -446136
41849d46136m24800j83241O84029J324399J176313N37488J2496k41803m83867
41840A954878p72177p74186l21992J87304K96130J67304K88297O09070N65382
41831B200010K0032m46953m13437j88987j79786k37973q1963J33160J65755J48170
41821A118028J51486k22959j107362j637609q64438P61121J706774J207031K1739
41812A133811p26127p00203j79021M87240R09071P63794K45094m9161O6771J50638
41802B101907n1005j70320O1134K66997O5666k88229m33190n50428q41638q43655
41792f82761r9027Q02048Q09726k9897n86903l36488j6236k14673l29890K99035
41782c85066J048531Q87090J27965N0418Q34131J167759K80679q11385q13827
$$ plain form
41849 -446136 -870936 -1054177 -370148 954251 2130564 2668052 2680548 2438745 1954878
41840 1954878 1182701 408515 86523 273827 569957 737261 1025558 1634628 2200010
41831 2200010 2220042 1773089 1359652 1170665 990879 752906 670943 804103 969858 1118028
41821 1118028 1269514 1046555 -60807 -1698416 -2562854 -1801733 -94959 1112072 1133811
41812 1133811 407684 -292519 -471540 15700 924771 1688565 1933659 1884498 1951269 2101907
41802 2101907 2050902 1880582 1941716 2208713 2274379 1986150 1552960 1002532 160894 -682761
41792 -682761 -781788 20260 829986 800089 213186 -123302 -139538 -354211 -684101 -385066
41782 -385066 663465 1550555 1678520 1728938 2563069 3730828 4011507 3200122 2386295
41773B386295K1235N07795K74048j67094n96630j116508j253245l87066Q58389
41764E27219J024596k8335p12896q2068P06102K81859p14519o67759M80249J242904
41754B057352Q59081J23333j08953R353K2453q2351k12142m43534o04896k73075
41744A346621M78279R30781O34745m2500n10964n90401l74579k3853J13719k52020
41734A709828p73965p15286n264N54389M06956m9481j90964O293K55229M84097
41724A681832O18724L74219k31848o22666m38597j56229l82274q78220q80720
41715i15779j80839O57616J043461Q75022L83495j56391n31734o14332l33698
41706B26821K90505R22402R31901J17853p34483o96974m9699P9738m92723o82276
$$ plain form
41773 2386295 2407530 2915325 3189373 3022279 2425649 1309141 55896 -331170 527219
41764 527219 1551815 1523480 810584 728516 1434618 1716477 1001958 334199 814448 2057352
41754 2057352 2916433 3039766 2930813 2940166 2962619 2880268 2668126 2224592 1619696 1346621
41744 1346621 1824900 2755681 3390426 3347926 2836962 2246561 1871982 1848129 1961848 1709828
41734 1709828 935863 220577 215313 769702 1176658 1127177 936213 942506 1197735 1681832
41724 1681832 2300556 2674775 2442927 1820261 1381664 1225435 843161 -35059 -915779
41715 -915779 -1096618 -439002 604459 1479481 1862976 1706585 1174851 560519 226821
41706 226821 517326 1439728 2371629 2489482 1754999 1058025 1008326 1088064 595341 -86935
41696h6935J7970N91143J93498l34043J73320J173337J141307j33566j353595
41687A382436j616154j221473o37954O2984O00318M88137o1435k30586J41810
41678a091917L35630L5769j75029J8710M4221m45675p73913k88627N34901Q30274
41668i75656N95065M12994L88740K06107l8589R0293N16374N83771m9542r22673
41658H06884j282351q08819J44377Q12436O45562r2930n32719k28356K98758L59893
41648A22735O6302j3977J54296J34743o8701K0069L68556K68584m71697r34170
41638c53260l44378O40970P52936p4001o72021m25806n4938k53356n33939j78911
41628a496704M23629M32681Q2459L33549J113810J230342L06433m87327k61329
$$ plain form
41696 -86935 -68965 522178 715676 381633 554953 1728290 2869597 2736031 1382436
41687 1382436 -233718 -1455191 -2093145 -2030161 -1429843 -941706 -1003141 -1233727 -1091917
41678 -1091917 -756287 -720518 -895547 -876837 -832616 -1278291 -2052204 -2340831 -1805930 -975656
41668 -975656 -380591 32403 421143 627250 588661 678954 1195328 1779099 1729557 806884
41658 806884 -475467 -1284286 -1139909 -327473 318089 225159 -307560 -535916 -237158 122735
41648 122735 189037 175060 329356 464099 395398 415467 784023 1052607 580910 -353260
41638 -353260 -697638 -56668 696268 622267 -49754 -475560 -530498 -783854 -1317793 -1496704
41628 -1496704 -1073075 -640394 -557935 -224386 889424 2119766 2426199 1938872 1677543
41619A677543K11895j07810p38470n37796K94160N05439j56307n98765j98522
41610C51367L24499K18226j87338k05692J74412N03815N04988Q9206o70064j244174
41600a40755r61945J3991O53755M01696r0305k4742M05739N29402K72992N9740
41590A119568M8234J11697K43140L89625J94111m94985j104305r21717n9200O61511
41580A87679O60922N6127o41824r18456n65612O0785L34820J60730Q9298L81325
41570a94206N44203K29972q0669O6698K21579j56155n82085k68300M63132O15616
41560H59785J19815j75482j9372m3749m38222n55595j38620J79904L1131n8321
41550b38726K89506N63008K80146j68143k56934j94128l56320m96734k58479N3236
$$ plain form
41619 1677543 1889438 1781628 1043158 505362 799522 1304961 1148654 549889 351367
41610 351367 675866 894092 706754 501062 675474 1179289 1684277 1773483 1103419 -140755
41600 -140755 -1102700 -1088709 -434954 -33258 -123563 -148305 257434 786836 1059828 1119568
41590 1119568 1167802 1279499 1522639 1912264 2106375 1611390 507085 -414632 -473832 187679
41580 187679 848601 904728 262904 -655552 -1221164 -1160379 -825559 -664829 -575531 -194206
41570 -194206 349997 579969 499300 565998 787577 631422 49337 -218963 244169 859785
41560 859785 979600 804118 784746 740997 302775 -252820 -391440 -211536 -180405 -238726
41550 -238726 50780 613788 893934 725791 468857 274729 -81591 -578325 -836804 -783568
41540g83568k3870k56078j24872K41380L00210K5259j23543k0609J3128j35795
41530h88358k08471o4895J57545L65843N52211N55602K18977k40914m27335l00571
41520b80366j42609m4774J44738L73777L33161m7288m00431l66905j6327K83562
41510a63462K76010L0349j84765k30516k51909l70905l50951N5097M80949K86634
41500d23469l34278l58877N18776J153244N29756o09176p88510j5882L09550l55665
41490c74531q64296j67094J141357J681224R70366l18012j245188j281957n50417
41481a008548K08790L07979M677J99539R94767J271505K21261j332488j847448
41472i79966r13569M63916J165387R35162K37842l04023l65925j57418j19865
$$ plain form
41540 -783568 -807438 -1063516 -1188388 -947008 -646798 -621539 -745082 -765691 -752563 -888358
41530 -888358 -1096829 -1161724 -1004179 -638336 -86125 469477 688454 447540 20205 -280366
41520 -280366 -422975 -467749 -323011 50766 383927 336639 -63792 -430697 -447024 -163462
41510 -163462 112548 142897 -41868 -272384 -524293 -895198 -1246149 -1191052 -710103 -423469
41500 -423469 -757747 -1116624 -597848 555396 1085152 475976 -312534 -328416 -18866 -374531
41490 -374531 -1238827 -1405921 -264564 1416660 2387026 2069014 823826 -458131 -1008548
41481 -1008548 -799758 -491779 -487102 -287563 707204 1978709 2199970 867482 -979966
41472 -979966 -1893535 -1429619 -264232 670930 908772 604749 238824 81406 -38459
41463c8459k61406j50315K59239L80250n2750m30168k33650R3163j4889j58999
41453f07984K99920R26735P70581m4854n07079l71011l33317m96184p6867R60191
41443E20131J363767M20234q35981j128914o86962m66211m63568m5860N60522
41434g62842M69445k71796n33244K05316J005425P76918k49011r01342n60866
41425h21997K34941N90957K81148j66421k48310n2203Q4653J63009L37740L59978
41415G63495j21729p16771n78425K52767P06610L20026J4444M88818Q44340j3434
41405A960141j358352j495021k58320Q49142R25166N43365K31038l14539r92967
41396H9653q30318L81642J256277P03450l66997m30390L59346N96470j36056q24201
$$ plain form
41463 -38459 -299865 -450180 -190941 189309 136559 -293609 -527259 -434096 -448985 -607984
41453 -607984 -308064 618671 1389252 1344398 837319 466308 132991 -363193 -440060 520131
41443 520131 1883898 2304132 1468151 339237 -347725 -813936 -1277504 -1323364 -762842
41434 -762842 -293397 -565193 -1098437 -893121 112304 889222 640211 -261131 -821997
41425 -821997 -587056 3901 285049 118628 -129682 -181885 -97232 65777 403517 763495
41415 763495 641766 -75005 -653430 -400663 305947 625973 640417 1129235 1973575 1960141
41405 1960141 601789 -893232 -1151552 -302410 622756 1166121 1397159 1082620 89653
41396 89653 -740665 -359023 897254 1600704 1233707 803317 1162663 1759133 1623077 798876
41386G98876p08185j93853N5178m3720k85523n24986n00591L3255P81074J069777
41376D81302P06861J65190j85442m43045o24715m16493J94147N98710L33274k24970
41366E84819l73004j3306L62593M23891K94689J75415O9109o5501j70201j94643
41356A093861j88142k13214k60930k86258k59093j68484l5474P6183J18457J26526
41346C432J63832J91178P3754k23732n17486n86121m39046k62505j04478J70685
41336a530487N28281O27191K75873j74870k21457J23849M02587L69674J91076
41327E91717K8600j13602j13114J73431M36863J38753n47143o55149K45735J193465
41317A379556R62355k74807j135109p92012J01371L71376k83324j091050j150222
$$ plain form
41386 798876 90691 -103162 -47984 -91704 -377227 -902213 -1402804 -1369549 -588475 481302
41376 481302 1188163 1353353 1167911 724866 100151 -316342 -122195 476515 809789 584819
41366 584819 211815 198509 561102 984993 1279682 1455097 1524206 1458705 1288504 1093861
41356 1093861 905719 692505 431575 145317 -113776 -282260 -317734 -241551 -123094 3432
41346 3432 167264 358442 432196 208464 -309022 -895143 -1334189 -1596694 -1701172 -1530487
41336 -1530487 -1002206 -375015 -99142 -274012 -495469 -371620 30967 400641 591717
41327 591717 620317 506715 393601 567032 1003895 1142648 595505 -59644 186091 1379556
41317 1379556 2341911 2067104 931995 139983 241354 612730 329406 -761644 -1911866
41308a911866l68160N11008P57623M26855J12123O5310k725k24999k65789M8538
41298h52082L43097L06900J77886J99284J24994k24174m41056j74333K00924K07852
41288a30708O7397J55124J97325j21212k72862L19158J003419O42154n54086j183280
41278A22429o41021K32404N69014L93680K3534l20641k06123N40046J007303J90525
41268A911150j125036j079516L77117J158525K44619p46603k95394O20998M74224
41259A540084j20749K91030J181178Q11243p56237j651285j087368k65136k29087
41250b86327n74593o20065l71112M1206N85144P42237j882q78909m92130R17089
41240i39342J421445K50634q82741l17563J040957J120745k83581j392657j039709
$$ plain form
41308 -1911866 -2280026 -1769018 -1011395 -584540 -472417 -407107 -409832 -634831 -900620 -852082
41298 -852082 -508985 -202085 -24199 175085 300079 75905 -365151 -539484 -338560 -130708
41288 -130708 -63311 91813 289138 167926 -104936 214222 1217641 1859795 1305709 122429
41278 122429 -518592 -286188 282826 676506 700040 379399 173276 713322 1720625 1911150
41268 1911150 786114 -293402 83715 1242240 1486859 740256 444862 1065860 1540084
41259 1540084 1419335 1710365 2891543 3702786 2946549 1295264 207896 -57240 -286327
41250 -286327 -860920 -1480985 -1852097 -1810891 -1225747 -483510 -485392 -1364301 -1856431 -939342
41240 -939342 482103 732737 -150004 -467567 573390 1694135 1410554 17897 -1021812
41231a021812k9695K47755m07185j020946p55074J88606R10779Q88048M95462
41222e04062L27984L25662O1257l29708k56455K82818N82495L49855J24770K41889
41212A206505J98382l99290r65567p12236J78106Q27093P95062L63095o2842k95884
41202A132424k81714r7602O7289J69746L33482M54814J71721n31931j097574j039120
41192g18465m34759L99339J178900J396666N64640q39964j449060o84515L27651
41183b59567L01146m16512n72119R591L70355J17124p2490K42239N57589L79073
41173F56429K2413K1556L53129O39908O55770L35368k75306q08728p38098m9477
41163H12964N73416N01767j43617p26479p80237l19850K81461N77147L93490j4107
$$ plain form
41231 -1021812 -1051507 -803752 -1210937 -2231883 -2986957 -2798351 -1887572 -999524 -504062
41222 -504062 -176078 149584 210841 -118867 -375322 -92504 489991 839846 964616 1206505
41212 1206505 1404887 1005597 40030 -672206 -494100 332993 1128055 1491150 1428308 1132424
41202 1132424 850710 753108 820397 990143 1323625 1778439 1950160 1418229 320655 -718465
41192 -718465 -1153224 -753885 425015 1821681 2386321 1546357 97297 -587218 -259567
41183 -259567 41579 -374933 -947052 -937461 -567106 -449982 -522472 -280233 277356 656429
41173 656429 678842 700398 1053527 1693435 2349205 2684573 2409267 1600539 862441 812964
41163 812964 1386380 1888147 1744530 1018051 237814 -82036 199425 776572 1170062 1155955
41153A155955k77013l37178l51379k94285j0162L74032M67689J12745m16228p26839
41143c02663o01889q3312M42078M08640k67205q45359n73606K83633P92652O26911
41133a20120L24744K89259L02852J77871J00603M4088l88177j109549j264209
41124a642638l63337Q71651J400431J101060N15529j17649q01827j138814o62382
41115h37976K69764P20634L79354j25020j90664Q1735L08056L57159K70729R6586
41105A330357j1424R4138K09869n8689o63653j053628r06408n12020k42319p1548
41095a885325J32895K75069K98881L94297N93812N74380K70973K31796P70248
41086A657026J164753N25941p19684j167339l81448M34893J44157p63761j002461
$$ plain form
41153 1155955 878942 541764 190385 -103900 -114062 259970 727659 840404 424176 -302663
41143 -302663 -904552 -987864 -545786 -137146 -404351 -1249710 -1823316 -1539683 -747031 -120120
41133 -120120 204624 493883 796735 974606 1075209 1119297 731120 -378429 -1642638
41124 -1642638 -2005975 -1134324 266107 1367167 1882696 1765047 963220 -175594 -837976
41115 -837976 -568212 152422 531776 406756 216092 297827 605883 963042 1233771 1330357
41105 1330357 1318933 1413071 1622940 1564251 900598 -153030 -1059438 -1571458 -1813777 -1885325
41095 -1885325 -1752430 -1477361 -1178480 -784183 -190371 384009 654982 886778 1657026
41086 1657026 2821779 3347720 2628036 1460697 1079249 1514142 1658299 894538 -107923
41077a07923l20793L34725K54663k39864m70986k36834J81506L99268J80587l53941
41067c79592p12738n21361J5543M70092Q34943J273052J393774O17303o32099
41058B358917j050291k18682O30289L18711n68128o58163N7341K86745m49453
41049G07286j028761m23845P93220J274672O12321m04448q81329n98494J05176
41040A55798P17293Q32814L84191l29022r07419j077986o97172J49314R34290
41031A62101R61699J60433o60411o98740j06175L22480K33505K276l4597o9303
41021B73268l00765l89627O9901P37206P88512J06168l67748J09749Q87905O93782
41011B608351n01468j244630n58546O28653P18642l75221j201305q17926P2663
$$ plain form
41077 -107923 -428716 -93991 160672 -79192 -550178 -787012 -605506 -206238 -25651 -379592
41067 -379592 -1092330 -1613691 -1598148 -1128056 -293113 979939 2373713 2991016 2358917
41058 2358917 1308626 1089944 1720233 2038944 1470816 812653 869994 1156739 707286
41049 707286 -321475 -745320 47900 1322572 1934893 1530445 649116 50622 155798
41040 155798 873091 1705905 2090096 1761074 853655 -224331 -921503 -772189 162101
41031 162101 1123800 1284233 623822 -74918 -181093 141387 374892 377168 342571 273268
41021 273268 -27497 -417124 -347223 389983 1178495 1284663 916915 1026664 1914569 2608351
41011 2608351 2106883 862253 303707 932360 1651002 1275781 74476 -743450 -670787
41002f70787L05404j93882n64494k85583K77598M91273K08820j59791j71582J46382
40992f16642L89692L78254L91563N74243M79172k47833r97744q18177J30704O56734
40982C19966K59660k14636p5749R7976l64556q62097m57694M43851O48529Q8142
40972a16608j74594J86040K98873k01812l90188L59820J151798Q73645j24001
40963A862973o92689o08828n14374n43293k29850L11515L31387k29670m70904
40954g83733n919L08061k19807q36206m03926Q10768J448434R31625L4063m21923
40944H61437m77927m42124k76398j4626o3036n25276p86851l61687L09542N23941
40934a253005L56177L29135M14482K15498p9697Q3537M60555J30996r12647j335298
$$ plain form
41002 -670787 -365383 -559265 -1123759 -1409342 -1131744 -640471 -431651 -591442 -763024 -616642
40992 -616642 -226950 151304 542867 1117110 1596282 1348449 350705 -467472 -336768 319966
40982 319966 579626 364990 289241 387217 22661 -839436 -1297130 -853279 -204750 -116608
40972 -116608 -291202 -105162 193711 -8101 -398289 -38469 1113329 1986974 1862973
40963 1862973 1170284 561456 47082 -496211 -726061 -414546 -83159 -312829 -783733
40954 -783733 -789652 -481591 -701398 -1537604 -1941530 -1130762 317672 1249297 1283360 861437
40944 861437 383510 -58614 -335012 -349638 -412674 -937950 -1724801 -2086488 -1776946 -1253005
40934 -1253005 -896828 -567693 -153211 62287 -17410 66127 526682 657678 -254969 -1590267
40924a590267k63498J276005J577987M49832p09850q28972k87354j9630k22979
40915f18726l62849j09737J89812L6200m51950n66866O6217Q61685R67616M44413
40905D55815J40839L47827L63949k31436o93342k45718N29210M58963l68900o63371
40895I3836J12204R41578P94277K4304l96812l40412m01803o97676o52662j0873
40885e34039O27560N74023k1395l69874p5111L52729J72251n58317r66845m99102
40875a298120K93675M86173O4315j22122K97577O27460K14025m64731m71960J56394
40865b17314M46939l6237n28200k13774N60387Q08660L23108j21848K6950L54869
40855A403540K11236l26631o88611o98324o57603o49713l69218K11548N39887
$$ plain form
40924 -1590267 -1853765 -577760 1000227 1450059 740209 -88763 -376117 -395747 -618726
40915 -618726 -981575 -1091312 -901500 -865300 -1317250 -1884116 -1817899 -956214 11402 455815
40905 455815 596654 944481 1308430 1076994 383652 137934 667144 1126107 757207 93836
40895 93836 206040 1147618 1941895 1966199 1569387 1228975 827172 129496 -523166 -534039
40885 -534039 93521 667544 646149 276275 201164 553893 726144 167827 -799018 -1298120
40875 -1298120 -1004445 -518272 -453957 -576079 -278502 348958 562983 98252 -373708 -217314
40865 -217314 229625 193388 -334812 -548586 11801 820461 1143569 1021721 1048671 1403540
40855 1403540 1614776 1288145 599534 -98790 -756393 -1406106 -1775324 -1563776 -1023889
40846a023889J93536m41420o08706j43006L83160M43622J56597l574J32991K71331
40836f39358J30288j19731q9811K15385L37418N1242k37523r8738K51026L63643
40826A63841L46361N58756P28457K55223n96334q19514k36825J01010m15338r34075
40816h48438n57627J84520K92014p1240r3184J34140q3527n45395l63621M30401
40806a521957Q46393N72379L38466M53996L05546l08040o16970k24542J38827
40797a5902j12019m18168j18303M18542N32840L60743L18596J95063l27376q07144
40787B6872o31624o5007J41070j49418m93083o39145n30634M4217R79583J422002
40777A04833P22786m67020r60697o29872k72125j37451K62876R08373J047505
$$ plain form
40846 -1023889 -830353 -1271773 -1880479 -2023485 -1640325 -1196703 -1040106 -1043680 -910689 -639358
40836 -639358 -509070 -628801 -718612 -503227 -165809 -114567 -352090 -450828 -199802 163841
40826 163841 510202 1068958 1797415 2052638 1456304 636790 399965 500975 85637 -848438
40816 -848438 -1406065 -1221545 -929531 -1000771 -1093955 -959815 -1043342 -1588737 -1952358 -1521957
40806 -1521957 -675564 -103185 235281 689277 994823 686783 69813 -154729 -15902
40797 -15902 -127921 -546089 -664392 -245850 286990 647733 966329 1161392 834016 26872
40787 26872 -604752 -669759 -528689 -678107 -1171190 -1810335 -2340969 -2296752 -1317169 104833
40777 104833 827619 360599 -600098 -1229970 -1502095 -1639546 -1376670 -468297 579208
40768E79208M82995j2175K2319K8026m35133p47079k06968O91341Q55937J42075
40758A400546n35567n40815k11609r7784j39608L2687L59823M07838J06626m0935
40748G41202K67721N07772j3929r85301j261863m40340M32533K75507m73616n51298
40738a501612K19853P49163M23081n4605L3113K44209j41115p61726o84344K8579
40728a445404K91777l70859j077936q59888L8682P03507Q61757Q80711P66296
40719b11357J32102p58777r17802o2196P26451M96665j36469k7207N89051N19324
40709C49785k72762m96465K65627P13040q9397j120428r73575K5322N51281L65988
40699f81584K55025L58018P3752m86180m10965M33889J005735O44494k0466j76360
$$ plain form
40768 579208 1062203 1050028 1072347 1100373 665240 -81839 -288807 402534 1258471 1400546
40758 1400546 864979 324164 112555 14771 -124837 -92150 267673 675511 782137 741202
40748 741202 1008923 1516695 1502766 517465 -744398 -1184738 -752205 -476698 -950314 -1501612
40738 -1501612 -1281759 -532596 -109515 -164120 -131007 113202 -27913 -789639 -1473983 -1445404
40728 -1445404 -1153627 -1524486 -2602422 -3462310 -3423628 -2720121 -1858364 -977653 -211357
40719 -211357 -79255 -838032 -1755834 -1818030 -1091579 -594914 -731383 -758590 -169539 349785
40709 349785 77023 -419442 -153815 559225 469828 -650600 -1624175 -1598853 -1047572 -681584
40699 -681584 -426559 -68541 5211 -480969 -891934 -458045 547690 1192184 1171718 995358
40689I95358O7009J94543J58259J75689K09008J33806K0374r4734l25180n80113
40679I54019n23894j10505K66095L26759J77146p3539m38320o92923m84276M9826
40669e49612L70566L84711N26987Q28808O85367j21190q96599r40514l66652K97467
40659B19339O79803M93776k80701q46129k10373J164831J457688j7880j540265
40650A120089j271807J88938Q98328M05675j16334j13243k33899o68216o21892
40641d12361J15503N40424M2568n53100l40321K58028L35650r671n0184J93259
40631A19795J5297o49513r21256k08656R05900J353771P90162j76495p45043o33137
40621a49175j36827K30363J17600l97911p76156m45332M86512J116676P19719
$$ plain form
40689 995358 1062367 1256910 1415169 1590858 1799866 1933672 1954046 1859312 1534132 954019
40679 954019 430125 319620 585715 912474 1089620 1016081 577761 -115162 -599438 -549612
40669 -549612 -179046 205665 732652 1561460 2246827 2125637 1229038 288524 -78128 219339
40659 219339 899142 1392918 1112217 266088 55715 1220546 2678234 2660354 1120089
40650 1120089 -151718 37220 935548 1341223 1224889 1111646 877747 209531 -412361
40641 -412361 -296858 243566 286134 -266966 -607287 -349259 -13609 -23280 -73464 119795
40631 119795 135092 -514421 -1435677 -1644333 -738433 615338 1405500 1229005 483962 -149175
40621 -149175 -286002 -55639 61961 -335950 -1112106 -1557438 -1070926 45750 765469
40612G65469k51886o47552j52332K89077j22254q48258q13200N6194Q25085Q79746
40602a9911N25586K60452J12989j22738m59289p18962p07135l45580J51500L61252
40592i61836K03917J75464N95922R20936M73201l37924m18592L24537O73051j25407
40582A523269j127790r51691K94921J166354P57707l18618q98710o29186j05801
40573b89545K4992k29527l87343j70435J74241K57909P0617p1064L847J59239
40563d57069K50407L16052L98146L81468J37680k53313m80515k20017M83678J019180
40553A575697P01470l20835j006840o60308J19411K79669j96798m20668p9165
40544h367J55362j33463l96645r8611L89516M83279L27876L38945L19711j25844
$$ plain form
40612 765469 513583 -133969 -286301 2776 -119478 -967736 -1780936 -1724742 -899657 -19911
40602 -19911 505675 766127 879116 756378 297089 -421873 -1129008 -1474588 -1323088 -961836
40592 -961836 -757919 -582455 13467 934403 1407604 1069680 651088 975625 1648676 1523269
40582 1523269 395479 -556212 -261291 905063 1662770 1344152 445442 -183744 -289545
40573 -289545 -264553 -494080 -881423 -1051858 -877617 -619708 -549091 -620155 -616308 -457069
40563 -457069 -206662 109390 507536 889004 1026684 773371 292856 72839 556517 1575697
40553 1575697 2277167 1956332 949492 289184 408595 688264 491466 70798 -8367
40544 -8367 146995 13532 -383113 -481724 -92208 391071 718947 1057892 1377603 1251759
40534A251759o24698m12530L71401O73158K7634p01573n29394K67973N82911J7440
40524I24081o50464n88910K8790L78564Q5515m40147o81557n99148m11562j61984
40514b116822J94789M76422L90077o7690n50553o65298k14881O69334J423685
40505d60937J338041L22428p76623j021508m08940L29277P12662P62899N03077
40496A300376m9308m56827k45342K19574R1023n70002p24248o165O00221L41634
40486E00936q6901J75157N67287O0120r08924r30193J09972P39461J27980p33034
40476c78139o46881J09609N34302M71061M33662L95221j17642q38816p67605L13747
40466d91481J166346N71356r73049j758223r73828L72731Q34995K45409l89619
$$ plain form
40534 1251759 627061 214531 585932 1259090 1286724 585151 55757 323730 906641 924081
40524 924081 273617 -315293 -286503 92061 177576 -262571 -944128 -1543276 -1954838 -2116822
40514 -2116822 -1922033 -1445611 -1055534 -1123224 -1673777 -2339075 -2553956 -1884622 -460937
40505 -460937 877104 1199532 422909 -598599 -1007539 -678262 34400 797299 1300376
40496 1300376 1251068 794241 548899 768473 859496 289494 -434754 -440919 159302 500936
40486 500936 414035 589192 1156479 1216599 307675 -622518 -512546 226915 354895 -378139
40476 -378139 -1025020 -915411 -381109 89952 523614 918835 801193 -37623 -805228 -491481
40466 -491481 674865 1246221 273172 -1485051 -2458879 -2086148 -1251153 -1005744 -1395363
40457a395363l29880J81807N44090N19201K01338k27461m74101k64029K49493
40448i94905N30098L37403L5472J3945J77832K57656K07610R637m26535q02986
40438f54773m79832M52272Q05683j20233j150436o52305R20650J392584M457j346633
40428h28566q11693P65533J200433J36526p18096l07970M14716K65199l68776
40419b52694l95710J44204K41619l73314p76221k73237N83939Q54924M80200J04012
40409C37722M804r5152k64024j43276L15491N24114Q1498n06917m54892J93997
40399f635O37359M33163j3521j99125k19411l76910m89212j37511M99538O43452
40389G71187n5282r37333j156461p56564m03124k38616K42401J058694J326830
$$ plain form
40457 -1395363 -1725243 -1543436 -999346 -480145 -278807 -506268 -980369 -1244398 -994905
40448 -994905 -464807 -127404 -91932 -77987 99845 357501 565111 574748 148213 -654773
40438 -654773 -1134605 -682333 123350 3117 -1147319 -1799624 -878974 513610 518067 -828566
40428 -828566 -1640259 -874726 325707 462233 -255863 -563833 -149117 116082 -252694
40419 -252694 -648404 -504200 -262581 -635895 -1412116 -1685353 -1101414 -246490 233710 337722
40409 337722 342526 247374 -16650 -159926 155565 679679 761177 254260 -200632 -6635
40399 -6635 630724 1063887 1050366 851241 631830 254920 -234292 -371803 127735 771187
40389 771187 715905 -221428 -1377889 -2134453 -2537577 -2776193 -2533792 -1475098 -148268
40380a48268N29236m52742l96256N29994J000932L87956n52150r31393p66132
40371g98823m76144j77452Q6111R0185j04837j2299M85562P54659L24596l36500
40361a64942n11904k37003m5817j21760k52551k86267j59607J66766M31617K34800
40351i46668j76812M79P90098J100799M25229j71453K12466O70371L0675q81451
40341A053733m05152J066895J470221K65879q83748r31099p82119j122788j018172
40332a286350J09168R12831J36330j139013j008911L62019J109903M82391l56238
40323f77870k82240L78409O32824J01641p28774j025351l67765O87366J064244
40314b17516M90987j46363j58572j3254l02874n93972k71596J95316K8716l64825
$$ plain form
40380 -148268 380968 -71774 -468030 61964 1062896 1450852 898702 -32691 -798823
40371 -798823 -1274967 -1452419 -1366308 -1276123 -1380960 -1393259 -907697 -153038 171558 -164942
40361 -164942 -676846 -913849 -959666 -1081426 -1333977 -1620244 -1779851 -1613085 -1181468 -946668
40351 -946668 -1123480 -1123001 -332903 767896 1193125 1021672 1234138 1904509 1935184 1053733
40341 1053733 648581 1715476 3185697 3451576 2567828 1636729 854610 -268178 -1286350
40332 -1286350 -1177182 -264351 -128021 -1267034 -2275945 -1913926 -804023 -321632 -677870
40323 -677870 -960110 -581701 51123 152764 -576010 -1601361 -1969126 -1281760 -217516
40314 -217516 273471 127108 -31464 -44718 -347592 -941564 -1213160 -1017844 -989128 -1353953
40304a353953l3729P11563O25007l49213p88536J4458R35081P59312n4163k50015
40294B15812L02033N49140j18339j006642j055923k11264M81688J75951o54066
40285a321610p93266N4094Q51196P68897L60096M98098Q31944L78670p00380j140625
40275b12886m23225N19902O96104K18996k43613l99303l26446j52723o3816j62098
40265e49108j70385K17528O70541N47640q1134m77232l63067k02710k40684j49667
40255g98278J39441J68287j52526k49326J22518M27857K96490Q1369O1356l0565
40245F6623k35088q0563L96154L72518l40919o79767J1978P66947N20281j48261
40235F49903j03990L63696J75945n24300o48286j38590J0112l35370j88592O43719
$$ plain form
40304 -1353953 -1387682 -676119 -51112 -400325 -1188861 -1174403 -239322 519990 465827 215812
40294 215812 517845 1066985 948646 -57996 -1113919 -1325183 -843495 -667544 -1321610
40285 -1321610 -2114876 -2060782 -1209586 -440689 -80593 417505 1249449 1628119 927739 -212886
40275 -212886 -636111 -116209 579895 798891 555278 155975 -170471 -323194 -387010 -549108
40265 -549108 -719493 -501965 168576 716216 635082 157850 -205217 -407927 -648611 -798278
40255 -798278 -658837 -490550 -643076 -892402 -769884 -342027 -45537 35832 97188 66623
40245 66623 -168465 -249028 147126 519644 178725 -501042 -489064 277883 798164 649903
40235 649903 545913 909609 1085554 561254 -87032 -225622 -215510 -550880 -739472 -95753
40225i5753R73717J24290r25337j026637m42118j41419l11861l69740M3454P12038
40215a459366J181453J083117M53290j16714q8726K36657J44205l27519m72408
40206F33989j86079j01434k84854k1541O78794O89566l77009j209939p32119J74541
40196g36085J60853l98145k58338M31210N09992J1952P8273P26848O52647m05993
40186G73214r66192j85905P11008M11697m80770o39318q8677K64722L25782N78627
40176G04188P27215Q4680r07543j010402j07167N20277J12273n35652m24581K31732
40166f04980N48904K33587k97060n83422m20642J39779O95266P28877K41637j87180
40156D94766j91025m3422o0066q1443J03194L00648K94604K41523K54731M1188
$$ plain form
40225 -95753 877964 1002254 76917 -949720 -1391838 -1533257 -1845118 -2214858 -2171404 -1459366
40215 -1459366 -277913 805204 1258494 1141780 1053054 1289711 1433916 1106397 633989
40206 633989 447910 346476 61622 40081 718875 1408441 1031432 -178507 -910626 -736085
40196 -736085 -575232 -973377 -1231715 -800505 -290513 -278561 -200288 526560 1179207 773214
40186 773214 -192978 -378883 332125 743822 263052 -376266 -464943 -200221 125561 704188
40176 704188 1431403 1516083 608540 -401862 -509029 11248 123521 -412131 -836712 -604980
40166 -604980 -56076 177511 -119549 -702971 -1123613 -983834 -288568 440309 681946 494766
40156 494766 303741 260319 200253 118810 222004 522652 817256 1058779 1313510 1354698
40146A354698n38123r58674o76330K8172M30219L15819j7748m17148q56631r97230
40136b332976n15308K12197M61395J82193M333K38811N43721N92891L96335n5457
40126b71865p29078j091334n45641N17969R59536M32717j60052q4781K57513K66963
40116d48053J46063K81793M04868J62643r7958O0834L15879J62972j59439j85429
40106F44173j49888m29827n40870J40544R75704P14396m99814j131214m79421
40097g56217L92463M06098o3514j54368Q0549J24179Q8212L86951P80776O57157
40087A942286M2343m29738m52685l31141l82397n56716o37655m68635n4888L13086
40077a016140K49421j53289k64574K17514P20308N99539J17029j9251J86157Q5444
$$ plain form
40146 1354698 816575 -142099 -818429 -790257 -360038 -44219 -61967 -479115 -1335746 -2332976
40136 -2332976 -2848284 -2636087 -2174692 -1992499 -1988166 -1749355 -1205634 -612743 -216408 -271865
40126 -271865 -1000943 -2092277 -2637918 -2119949 -1160413 -727696 -887748 -972529 -715016 -448053
40116 -448053 -301990 -20197 384671 547314 449356 510190 826069 989041 829602 644173
40106 644173 494285 64458 -476412 -335868 639836 1354232 854418 -276796 -756217
40097 -756217 -363754 42344 -21170 -175538 -94989 29190 117402 504353 1285129 1942286
40087 1942286 1984629 1554891 1102206 771065 388668 -168048 -805703 -1274338 -1329226 -1016140
40077 -1016140 -766719 -920008 -1184582 -967068 -246760 352779 469808 450557 636714 722158
40067G22158m71957q60800o55932j80949J44671L79411O58726P60820N00426J77545
40057A174119J87549M06187L55131j32202p09961r24438o28439p4523K74608J52251
$$ plain form
40067 722158 250201 -610599 -1266531 -1447480 -1302809 -923398 -264672 496148 996574 1174119
40057 1174119 1361668 1767855 2122986 1990784 1280823 356385 -272054 -346577 -71969 80282
$$ [...]
##END NTUPLES=NMR SPECTRUM
##END=
