##TITLE=31Pdec_LR-688A-2(R)
 DMSO, 24 sc
 30.7.2019
##JCAMPDX= 6.0         $$ Bruker NMR JCAMP-DX V2.0
##DATA TYPE= NMR SPECTRUM
##DATA CLASS= NTUPLES
##ORIGIN= UXNMR, Bruker Analytische Messtechnik GmbH
##OWNER= root
$$ XWIN-NMR		Version 3.5
$$ Tue Jul 30 14:38:05 2019 Russian Standard Time (UT+4h)  she@DPX200
##.OBSERVE FREQUENCY= 81.013821
##.OBSERVE NUCLEUS= ^31P
##.ACQUISITION MODE= SIMULTANEOUS
##.ACQUISITION SCHEME= undefined
##.AVERAGES= 24
##.DIGITISER RES= 17
##SPECTROMETER/DATA SYSTEM= spect
##.PULSE SEQUENCE= zgpg30
##.SOLVENT NAME= CDCl3
##.SHIFT REFERENCE= (INTERNAL, CDCl3, 0, 182.463)
##AUDIT TRAIL= $$ (NUMBER, WHEN, WHO, WHERE, WHAT)
$$ ##TITLE= Audit trail, XWIN-NMR		Version 3.5
$$ ##JCAMPDX= 5.01
$$ ##ORIGIN= Bruker BioSpin GmbH
$$ ##OWNER= she
$$ F:/spectra/data/she/nmr/P31/1/pdata/1/auditp.txt
$$ ##AUDIT TRAIL=  $$ (NUMBER, WHEN, WHO, WHERE, WHAT)
(   1,<2019-07-30 14:36:28.54 +0400>,<she>,<DPX200>,
      <created by zg, POWCHK disabled, PULCHK disabled
       configuration hash MD5:
       00 E9 B6 7A A2 85 ED C7 34 08 36 98 17 FE 4E 26
       data hash MD5: 32K
       F6 1B E4 1D 31 DC 69 AF 01 E7 42 32 29 7B 1D 95>)
(   2,<2019-07-30 14:37:16.35 +0400>,<she>,<DPX200>,
      <Start of raw data processing
       efp BC_mod = 2 LB = 1 FT_mod = 6 PKNL = 1 PHC0 = -388.1186 PHC1 = 101.2 SI = 64K 
       data hash MD5: 64K
       12 1E F4 6A 43 0D EC 11 CD 07 8E ED F1 50 58 F9>)
(   3,<2019-07-30 14:37:31.17 +0400>,<she>,<DPX200>,
      <pk PHC0 = -20.44315 PHC1 = 0 
       data hash MD5: 64K
       5B 00 CE D5 D8 6A 47 AE 2B 23 BD 01 E7 C8 53 A7>)
$$ ##END=
$$ 
$$ hash MD5
$$ D2 CC 79 9E E4 74 54 CB CB A5 C6 3B 5E 52 00 51
##$RELAX= 
##$RELAX= 
##$RELAX= 
##$RELAX= 
##$RELAX= 
##$RELAX= 
##$RELAX= 
##$RELAX= 
$$ Bruker specific parameters
$$ --------------------------
##$DU= <F:/spectra>
##$EXPNO= 1
##$NAME= <P31>
##$PROCNO= 1
##$TYPE= <nmr>
##$USER= <she>
##$AMP= (0..31)
100 100 100 100 100 100 100 100 100 100 100 100 100 100 100 100 100 100 
100 100 100 100 100 100 100 100 100 100 100 100 100 100 
##$AQSEQ= 0
##$AQ_mod= 1
##$AUNM= <au_zg>
##$AUTOPOS= <>
##$BF1= 81.014009
##$BF2= 200.13
##$BF3= 200.13
##$BF4= 200.13
##$BF5= 200.13
##$BF6= 200.13
##$BF7= 200.13
##$BF8= 200.13
##$BYTORDA= 1
##$CFDGTYP= 0
##$CFRGTYP= 5
##$CHEMSTR= <none>
##$CNST= (0..31)
1 1 145 1 1 1 1 1 1 1 1 1 1 1 1 1 1 1 1 1 1 1 1 1 1 1 1 1 1 1 1 1 
##$CPDPRG= <waltz16>
##$CPDPRG1= <>
##$CPDPRG2= <waltz16>
##$CPDPRG3= <>
##$CPDPRG4= <mlev>
##$CPDPRG5= <mlev>
##$CPDPRG6= <mlev>
##$CPDPRG7= <mlev>
##$CPDPRG8= <mlev>
##$CPDPRGB= <>
##$CPDPRGT= <>
##$D= (0..31)
0 1 0 0 0 0 0 0 0 0 0 0.03 2e-05 3e-06 0 0 0 0 0 0 0 0 0 0 0 0 0 0 0 0 
0 0 
##$DATE= 1564482988
##$DBL= (0..7)
120 120 120 11 120 120 24 19 
##$DBP= (0..7)
150 150 150 150 150 150 150 150 
##$DBP07= 0
##$DBPNAM0= <>
##$DBPNAM1= <>
##$DBPNAM2= <>
##$DBPNAM3= <>
##$DBPNAM4= <>
##$DBPNAM5= <>
##$DBPNAM6= <>
##$DBPNAM7= <>
##$DBPOAL= (0..7)
0.5 0.5 0.5 0.5 0.5 0.5 0.5 0.5 
##$DBPOFFS= (0..7)
0 0 0 0 0 0 0 0 
$$ [...]
##$SUBNAM2= <"">
##$SUBNAM3= <"">
##$SUBNAM4= <"">
##$SUBNAM5= <"">
##$SUBNAM6= <"">
##$SUBNAM7= <"">
##$SUBNAM8= <"">
##$SUBNAM9= <"">
##$SW= 369.568048894756
##$SWIBOX= (0..15)
0 1 3 0 0 0 0 0 0 0 0 0 0 0 0 0 
##$SW_h= 29940.119760479
##$TD= 32768
##$TD0= 1
##$TE= 0
##$TE2= 300
##$TE3= 300
##$TEG= 300
##$TL= (0..7)
0 120 53 12 22 120 120 120 
##$TP= (0..7)
150 150 150 150 150 150 150 150 
##$TP07= 0
##$TPNAME0= <>
##$TPNAME1= <>
##$TPNAME2= <>
##$TPNAME3= <>
##$TPNAME4= <>
##$TPNAME5= <>
##$TPNAME6= <>
##$TPNAME7= <>
##$TPOAL= (0..7)
0.5 0.5 0.5 0.5 0.5 0.5 0.5 0.5 
##$TPOFFS= (0..7)
0 0 0 0 0 0 0 0 
##$TUNHIN= 0
##$TUNHOUT= 0
##$TUNXOUT= 0
##$USERA1= <user>
##$USERA2= <user>
##$USERA3= <user>
##$USERA4= <user>
##$USERA5= <user>
##$V9= 5
##$VALIST= <valist>
##$VCLIST= <CCCCCCCCCCCCCCC>
##$VD= 0
##$VDLIST= <DDDDDDDDDDDDDDD>
##$VPLIST= <PPPPPPPPPPPPPPP>
##$VTLIST= <TTTTTTTTTTTTTTT>
##$WBST= 1024
##$WBSW= 4
##$XGAIN= (0..3)
0 0 0 0 
##$XL= 0
##$YL= 0
##$YMAX_a= 36651
##$YMIN_a= -47981
##$ZGOPTNS= <>
##$ZL1= 120
##$ZL2= 120
##$ZL3= 120
##$ZL4= 120
##$ABSF1= 0
##$ABSF2= 0
##$ABSG= 0
##$ABSL= 0
##$ALPHA= 0
##$AQORDER= 0
##$ASSFAC= 0
##$ASSFACI= 0
##$ASSFACX= 0
##$ASSWID= 0
##$AUNMP= <proc_1d>
##$AZFE= 0.1
##$AZFW= 0.5
##$BCFW= 0
##$BC_mod= 2
##$BYTORDP= 0
##$COROFFS= 0
##$CY= -3
##$DATMOD= 1
##$DC= 0
##$DFILT= <>
##$DTYPP= 0
##$F1P= 0
##$F2P= 0
##$FCOR= 1
##$FTSIZE= 65536
##$FT_mod= 6
##$GAMMA= 0
##$GB= 0
##$INTBC= 1
##$INTSCL= 5.30512e-09
##$ISEN= 30
##$LB= 1
##$LEV0= 0
##$LPBIN= 0
##$MAXI= 10000
##$MC2= 0
##$MEAN= 0
##$ME_mod= 0
##$MI= 50
##$NCOEF= 0
##$NC_proc= -4
##$NLEV= 6
##$NOISF1= 182.463
##$NOISF2= 159.3651
##$NSP= 0
##$NTH_PI= 0
##$NZP= 0
##$OFFSET= 182.463
##$PC= 4
##$PHC0= -408.5617
##$PHC1= 101.2
##$PH_mod= 1
##$PKNL= yes
##$PPARMOD= 0
##$PSCAL= 0
##$PSIGN= 0
##$REVERSE= no
##$SF= 81.0140089999434
##$SI= 65536
##$SIGF1= 159.3651
##$SIGF2= -187.1042
##$SINO= 113.3802
##$SIOLD= 16384
##$SREGLST= <1H.CDCl3>
##$SSB= 0
##$STSI= 65536
##$STSR= 0
##$SW_p= 29940.119760479
##$SYMM= 0
##$S_DEV= 0
##$TDeff= 32768
##$TDoff= 0
##$TI= <>
##$TILT= no
##$TM1= 0
##$TM2= 0
##$TOPLEV= 0
##$USERP1= <user>
##$USERP2= <user>
##$USERP3= <user>
##$USERP4= <user>
##$USERP5= <user>
##$WDW= 1
##$XDIM= 65536
##$YMAX_p= 401487626
##$YMIN_p= -4845959
$$ End of Bruker specific parameters
$$ ---------------------------------
##NTUPLES= NMR SPECTRUM
##VAR_NAME=  FREQUENCY,     SPECTRUM/REAL,   SPECTRUM/IMAG
##SYMBOL=    X,             R,               I
##VAR_TYPE=  INDEPENDENT,   DEPENDENT,       DEPENDENT
##VAR_FORM=  AFFN,          ASDF,            ASDF
##VAR_DIM=   65536,         65536,           65536
##UNITS=     HZ,            ARBITRARY UNITS, ARBITRARY UNITS
##FACTOR=    0.456856943014862, 1,           1
##FIRST=     14782.0589164792, 0,            0
##LAST=      -15158.0608439998, 0,           0
##MIN=       -15158.0608439998, -4845959,    0
##MAX=       14782.0589164792, 401487626,    0
$$ Real data points
##PAGE= N=1
##DATA TABLE= (X++(R..R)), XYDATA
$$ [...]
45119a35597j30459O7731L18004L11520K7621k07209j80253q3265j58944k91216
$$ -135597 -266056 -198325 119679 431199 458820 251611 71358 -11907 -170851 -462067
45109d62067k31980n5086k2348r1391L6431L65729N11537K68112q4840k15857
$$ -462067 -694047 -749133 -771481 -862872 -826441 -460712 50825 318937 234097 18240
45099A8240j66787j34928j16792l2975K2084m9526r8999M5253K26587J47830j55728
$$ 18240 -148547 -283475 -400267 -433242 -411158 -460684 -559683 -514430 -287843 -140013 -295741
45088b95741l37701k21599J8808J73635K24221K04317P7500j45757l37254l81765
$$ -295741 -633442 -855041 -836233 -662598 -438377 -234060 -156560 -302317 -639571 -1021336
45078a021336k63167l677L30920N52544M64608J17979j93262k44855p0273J64827
$$ -1021336 -1284503 -1288180 -957260 -404716 59892 177871 -15391 -260246 -330519 -165692
45068a65692L05378K21504r0563l59927k34934K42881N68071L52193j81265m75209
$$ -165692 139686 361190 270627 -89300 -324234 -81353 486718 838911 657646 182437
45058A82437k99823O7247K61109K21713J35434J28782J19219l2323k73784l66555
$$ 182437 -117386 -50139 210970 432683 568117 696899 816118 783795 510011 143456
45048A43456k01560J62l5334k36365k92671j21340N9203J29704K02587K73130
$$ 143456 -58104 -57942 -93276 -329641 -622312 -743652 -684449 -554745 -352158 -79028
45038g9028J29010j98549k85674P0885M32776L09542j07939k66975r5142J2473
$$ -79028 49982 -148567 -434241 -363356 69420 378962 271023 4048 -91094 -78621
45028g8621o4737l7338J56385J67737j24882l10048o0757L45228M46921K33510
$$ -78621 -143358 -180696 -24311 143426 18544 -291504 -352261 -7033 439888 673398
45018F73398K4414m6039q3596j27952j07853k5941N1016J20748J91846K14810
$$ 673398 697812 651773 568177 440225 332372 306431 357447 478195 670041 884851
45008H84851K28769M06287P38233Q64292N11437n1596l46246l59562m70200p31277
$$ 884851 1113620 1519907 2258140 3122432 3633869 3582273 3236027 2876465 2406265 1674988
44998A674988p28002k97456R4123K6007j98313j8106M50774N16197m4459o02043
$$ 1674988 946986 649530 743653 769660 571347 553241 1004015 1520212 1475753 873710
44988H73710n67696j91790p5569k40251k26762N3705J98470P0002L7235K50250
$$ 873710 306014 114224 38655 -201596 -428358 -374653 -176183 -106181 -68946 181304
44978A81304K80999j26436m81441k61330K17543K84077l2992j56097J6983L5024
$$ 181304 462303 335867 -145574 -406904 -189361 94716 61724 -94373 -77390 -42366
44968d2366j92449k30899N725L2317l01677m65969j68512J30638P6395M8480L59518
$$ -42366 -234815 -465714 -459989 -427672 -729349 -1195318 -1363830 -1233192 -1156797 -1108317 -748799
44957g48799N36363J34076l48721k23977K05363J58937k84959l76711j5470J60880
$$ -748799 -212436 -78360 -427081 -651058 -445695 -286758 -571717 -948428 -963898 -803018
44947h03018l3689q1824J90484K98590O0489m3092K07719L32149K2129l14503
$$ -803018 -836707 -918531 -728047 -429457 -368968 -412060 -204341 127808 149937 -164566
44937a64566l07130j93997j90310n072M75555O97339K58174l48893m57413j91336
$$ -164566 -471696 -665693 -856003 -861075 -385520 311819 569993 221100 -236313 -427649
44927d27649n5293l9951J43572L34988J98167o2625j0118K17284J37473j99456
$$ -427649 -482942 -522893 -379321 -44333 153834 91209 81091 298375 435848 236392
44917B36392l00712r5166R863j09913j71546j13291j67189k78288j27107K04157
$$ 236392 -64320 -159486 -149623 -259536 -431082 -544373 -711562 -989850 -1116957 -912800
44907i12800K62474K4078k1898K49046L39520J4652k38817k5437K84552J78467
$$ -912800 -650326 -626248 -648146 -399100 -59580 -44928 -283745 -309182 -24630 153837
44897A53837j68543k22122O2782K45173R5225j53315k09237p0366N1659j1517
$$ 153837 -14706 -236828 -174046 71127 166352 13037 -196200 -266566 -214907 -226424
44887b26424k04209k90679j50103L3103M7852J2449J50597L22239K09358p8772
$$ -226424 -430633 -721312 -871415 -838312 -790460 -778011 -627414 -305175 -95817 -174589
44877a74589j11156J17014J31144j88451l43660m6042L08845L42826K67900L20538
$$ -174589 -285745 -168731 -37587 -226038 -569698 -615740 -306895 35931 303831 624369
44867F24369K16643k66614o87611n71383k10616j35855j71627J72812O48240N15554
$$ 624369 841012 574398 -113213 -684596 -895212 -1031067 -1202694 -1029882 -381642 133912
44857A33912k11317o62923l74140J40655K84245J42706O3358P9348J04972K07252
$$ 133912 -77405 -740328 -1114468 -973813 -689568 -546862 -483504 -404156 -299184 -91932
44847i1932L36997K15832j76828l95772j49064K26603K57910j2360k21024k46826
$$ -91932 245065 460897 284069 -111703 -260767 -34164 223746 211386 -9638 -256464
44837b56464j95895o8620J48682K38310K0618k38699j13456L22095N27422K47497
$$ -256464 -452359 -520979 -372297 -133987 -113369 -352068 -465524 -143429 383993 631490
44827F31490j40823j80407O5227J84440O699k36409k87947j73523p2405m7727
$$ 631490 490667 310260 375487 559927 566626 330217 42270 -131253 -203658 -251385
44817b51385m4149o4499j55924k23426q0450K24303L57120J56574o9253K7632
$$ -251385 -295534 -360033 -515957 -739383 -819833 -595530 -238410 -81836 -151089 -123457
44807a23457K80975K49576q1090k68853j11427P2566j031j56764j17602N7725
$$ -123457 157518 407094 326004 57151 -54276 18290 17259 -139505 -257107 -199382
44797a99382J65890K01000K24055J47991m7041j21806O6613K29885M2319l02015
$$ -199382 -33492 167508 391563 539554 492513 370707 437320 667205 709524 407509
44787D07509l46727q7178K6043j98470m13405k83035M2793J84406K5347k13921
$$ 407509 60782 -26396 -353 -198823 -612228 -895263 -852470 -668064 -642717 -856638
44777h56638k52308l344L40412M61095K63412J1028l3319L2432J774k797K38722
$$ -856638 -1108946 -1112290 -771878 -310783 -47371 -36343 -69662 -37230 -35456 -38253 200469
44766B00469M81743K51497l06984m49582M8185M25842M1332o17278o61579j37613
$$ 200469 682212 933709 626725 177143 225328 651170 692502 75224 -586355 -723968
44756g23968J48663o1190k00149N5968K81414J30517n9968P1690K59326J48531
$$ -723968 -575305 -636495 -836644 -780676 -499262 -368745 -428713 -357023 -97697 50834
44746E0834o847J75823M07085J48996l66590l69597J84896M28840q2446o22614
$$ 50834 43987 219810 626895 775891 409301 39704 224600 653440 570994 -51620
44736e1620l85181K89583M63628K867l40457j30537K22545K50617P9553J410p3647
$$ -51620 -436801 -147218 316410 319277 -21180 -151717 70828 321445 400998 402408 328761
44725C28761l19262n11626l16625J42611M45327M76266M30437K96064j40735o96692
$$ 328761 9499 -502127 -818752 -676141 -230814 245452 675889 971953 831218 134526
44715A34526p50301j03408N53018M81650q2327k93769N9155L04556k4213m72432
$$ 134526 -615775 -719183 -166165 315485 233158 -60611 -1456 303100 278887 -193545
44705a93545l94459O8175K60208O258k43644j97972q6813j28353j33501R3503
$$ -193545 -588004 -519829 -259621 -253363 -497007 -694979 -781792 -910145 -1043646 -950143
44695i50143L31787K62038j5557j17369P8984L11528L11669Q1306j90929l22612
$$ -950143 -618356 -356318 -371875 -489244 -410260 -98732 212937 294243 103314 -219298
44685b19298k56493r4297J7752P5471J75284K66850J78390k6181l0919J96495
$$ -219298 -475791 -570088 -552336 -476865 -301581 -34731 143659 117478 86559 283054
44675B83054K10648k32179o41530m30207J63975L89775R0112j60235k7032J70418
$$ 283054 493702 261523 -380007 -810214 -646239 -256464 -166352 -326587 -353619 -183201
44665a83201J67422J75846K95257J62196l53871o71273l00103L01801L40201j26053
$$ -183201 -15779 160067 455324 617520 263649 -407624 -707727 -405926 -65725 -191778
44655a91778l14253O9461M48036K92851j67806l81138j87981J37045K84828J46686
$$ -191778 -506031 -436570 11466 304317 136511 -244627 -432608 -295563 -10735 135951
44645A35951j63356l77176k91542J6587L02814M50968M86553L72099O3270k49359
$$ 135951 -27405 -404581 -696123 -679536 -376722 74246 560799 932898 996168 746809
44635G46809k69145k7881R6630r3301l27136k55403O8866K69425J04671k73476
$$ 746809 477664 449783 546413 453112 125976 -129427 -60561 208864 313535 40059
44625D0059m75361k65728J48745K93354M185k93885j17876L77214N74430K45058
$$ 40059 -435302 -701030 -552285 -258931 -254746 -548631 -666507 -289293 285137 530195
44615E30195j71758k38603q8415j05668l30338m64691l22714k5163J95362K21109
$$ 530195 358437 119834 31419 -74249 -404587 -869278 -1191992 -1217155 -1021793 -800684
44605h00684J08100J562k8085n0647j04418m8716K22472M89377M00149m0401m38099
$$ -800684 -692584 -691022 -719107 -769754 -874172 -922888 -700416 -211039 189110 148709 -289390
44594b89390m84694k18870J60210M33653L58479q1418m23864j93895L37530M06007
$$ -289390 -774084 -992954 -832744 -399091 -40612 -122030 -545894 -739789 -402259 3748
44584C748j18001m86902k16734K07985K04797J8495J55436M25422L00332j26063
$$ 3748 -114253 -601155 -817889 -609904 -405107 -386612 -231176 194246 494578 368515
44574C68515l11507j75093q0416o5357J40567M03832K84258j20216k00496J60322
$$ 368515 57008 -118085 -198501 -263858 -123291 280541 564799 444583 244087 404409
44564D04409L49998Q822m44175n51580m42617l67760j91175K24506N86989N58147
$$ 404409 754407 763229 319054 -232526 -675143 -1042903 -1234078 -1009572 -422583 135564
44554A35564K31245j06453l50218m42424k53636R8384K09336j5607j40106R4073
$$ 135564 366809 260356 -89862 -532286 -785922 -687538 -478202 -493809 -633915 -539842
44544e39842K95366Q2307k34875j55353J98680L29029J29409j42888l90919o03823
$$ -539842 -244476 -162169 -397044 -552397 -353717 -24688 104721 -38167 -429086 -1032909
44534a032909n17385K0511N38837M56894k2079k00770K9060J30851n9137o4088
$$ -1032909 -1550294 -1529783 -990946 -534052 -556131 -756901 -727841 -596990 -656127 -720215
44524g20215L09498N42408K42976k01125k31670Q4645K89836K16541M3402q6918
$$ -720215 -410717 131691 374667 173542 -58128 26517 316353 532894 576296 489378
44514D89378j71764k28510k87452l58522l13797l2910K91756L23335J05681J6340
$$ 489378 317614 89104 -198348 -556870 -870667 -903577 -611821 -288486 -182805 -166465
44504a66465J24504R8824j02633m7208L82635O28004L12367j15724j47737q4652
$$ -166465 -41961 56863 -45770 -92978 289657 917661 1230028 1114304 966567 881915
44494H81915m42158r19279q00851j55974K36670J06624j1354K09607L87764K01758
$$ 881915 439757 -479522 -1280373 -1436347 -1199677 -1093053 -1104407 -894800 -507036 -305278
44484c05278l9970K5396K07549J31657j79910m46812n29591l97008j5070M43880
$$ -305278 -345248 -319852 -112303 19354 -160556 -607368 -1136959 -1533967 -1549037 -1105157
44474a105157N93576L36612Q5399J78085L67724K42950j07688k57774q6212J47547
$$ -1105157 -511581 -174969 -89570 88515 456239 699189 591501 333727 247515 395062
44464C95062K55010K58754J52271j04378l56879l51193q2603K00209L26316K99807
$$ 395062 650072 908826 1061097 956719 599840 248647 166044 366253 692569 992376
44454I92376J25603j67889l64601k43755N6424J76015O6295L6797J90132K01546
$$ 992376 1117979 950090 585489 341734 398158 574173 640468 677265 867397 1068943
44444A068943j32923m77490m04248k7670J70027L7376q4679Q4966L62663L72840
$$ 1068943 936020 458530 54282 26612 196639 234015 149336 234302 596965 969805
44434I69805L9315l44411m61711k82212m0609L2406o1050j22997r823J97530K96282
$$ 969805 1009120 664709 202998 -79214 -119823 -87417 -148467 -271464 -281287 -83757 212525
44423B12525J92888j1406j41406j15022j990O2232L1241L757Q0041J89997J70293
$$ 212525 405413 394007 252601 137579 135589 197821 229062 232819 312860 502857 673150
44412F73150J7298q5570n2447l3672j34259j67256O7374L57455K58211k63807
$$ 673150 690448 604878 552431 518759 384500 217244 284618 642073 900284 636477
44402F36477o85498n88716k08320o5643k29729k78137L7346M26945M86784K31096
$$ 636477 -49021 -637737 -846057 -911700 -1141429 -1419566 -1382220 -955275 -468491 -237395
44392b37395j0962p9181r9343j45537o4983K31686N03796M38657J08232r5034
$$ -237395 -248357 -327538 -426881 -572418 -637401 -405715 98081 536738 644970 549936
44382E49936j9964K5242k12725m63515l14225R2360J98565j01953k37963J74037
$$ 549936 529972 555214 342489 -121026 -435251 -342891 -144326 -246279 -484242 -310205
44372c10205O93467O84806K43482j4583J25750L40388M44463N64685N89211J38766
$$ -310205 383262 1068068 1311550 1296967 1422717 1763105 2207568 2772253 3361464 3500230
44362C500230o60023j012933n01388K19304K80253k40288n89856m65493k09334
$$ 3500230 2840207 1827274 1325886 1545190 1825443 1585155 995299 529806 320472
44353C20472n0540J46668L58937K76034j29117m14070k74759M5780J59458L0888
$$ 320472 269932 416600 775537 1051571 922454 508384 233625 279405 438863 469751
44343D69751r7231k0144K90632O20055N66672j3503o32533o50709j45173J84809
$$ 469751 372520 352376 643008 1263063 1829735 1816232 1183699 532990 387817 572626
44333E72626L1909j74618p9813Q5284Q4061J19948K92784K24239k54155o01745
$$ 572626 604535 429917 350104 435388 519449 639397 932181 1156420 902265 300520
44323C00520l67758J8793m8488l21505j75841K44071K74725p7905j59012J67203
$$ 300520 -67238 -48445 -96933 -418438 -594279 -350208 -75483 -153388 -312400 -145197
44313a45197L13996L5216j99885r8545J1924r8356j60440k6089K7617o9287M5780
$$ -145197 168799 204015 4130 -94415 -82491 -180847 -341287 -367376 -339759 -409046 -363266
44302c63266M12168M90702P5783k61266j14818R9659j6443j04063J70207L19763
$$ -363266 48902 539604 615387 354121 239303 338962 322519 218456 388663 708426
44292G08426j18872n73795k57376M71109O22790J43722j34533O2440J80081o009
$$ 708426 589554 15759 -241617 229492 852282 996004 861471 923911 1103992 1097983
44282A097983o7752R5269P566l84675m55916n143K99952K2341l53082l25199j61926
$$ 1097983 1030231 1125500 1133066 748391 292475 287332 587284 609625 256543 -68656 -230582
44271b30582k04909j57280K53443N75148L47994m3863k1013J85267J2964l58284
$$ -230582 -435491 -592771 -339328 235820 583814 539951 518938 704205 717169 358885
44261C58885l23342M2522J29813j06151j29321J30188J50952j60052k34933J28828
$$ 358885 35543 78065 207878 101727 -27594 102594 253546 93494 -141439 -12611
44251a2611L56618P4050k56495j35026J83985K22934O9059N6151Q3247j27225
$$ -12611 344007 418057 161562 26536 210521 433455 502514 558665 641912 514687
44241E14687l76541k27557K32937M47153J97626j19148j04339J43353K61490Q7136
$$ 514687 138146 -89411 143526 590679 788305 669157 564818 708171 969661 1056797
44231A056797k31036m13859k85229M4593K23148K0340l60608m80737j72577K84890
$$ 1056797 825761 411902 126673 171266 394414 414754 54146 -426591 -599168 -314278
44221c14278N06611L96747J76166R8937J86822K41186J13588r4933j81627j11013
$$ -314278 192333 589080 765246 864183 1051005 1292191 1405779 1310846 1129219 1018206
44211A018206K2560K20383N04030O50521L69519j76871m27258j70224J54857J51935
$$ 1018206 1040766 1261149 1765179 2415700 2785219 2608348 2181090 2010866 2165723 2317658
44201B317658M1338J77386M03233L84701K54237L23534L92393K9788n62035o97892
$$ 2317658 2358996 2536382 2939615 3324316 3578553 3902087 4294480 4324268 3762233 3064341
44191C064341k75469K1452k32642o17684o09681l16935j06733k516J24452J73725
$$ 3064341 2788872 2810324 2577682 1959998 1350317 1033382 926649 924133 1048585 1222310
44181A222310O7609N9192L57853P03774P10521M03508N7169k52894n44301o18540
$$ 1222310 1289919 1349111 1706964 2410738 3121259 3524767 3581936 3329042 2784741 2166201
44171B166201l09080J14688K17453k7214k92263l98239l94160k79322m5366J05705
$$ 2166201 1857121 1971809 2189262 2162048 1869785 1471546 1077386 798064 752698 858403
44161H58403k2507k64942l09670j54457J1935K13177N23973O71061L42263j89824
$$ 858403 835896 570954 261284 106827 118762 331939 855912 1526973 1869236 1679412
44151A679412l41445j08824p1607m26339o50258l40986J77025L82360K30752m704
$$ 1679412 1337967 1229143 1157536 731197 80939 -260047 -83022 299338 530090 525386
44141E25386j74849k39181j43079K3590L7055r6202j12094K0191r12k13516j86895
$$ 525386 350537 111356 -31723 -8133 28922 -67280 -179374 -159183 -160095 -373611 -560506
44130e60506K62102O22388M01518j07465k81186q9052o114j77912k35346O1750
$$ -560506 -298404 323984 725502 618037 336851 247799 241685 63773 -171573 -109823
44120a09823M48205N19888K10848j71137k72575p7088L7446j98815m37189j12117
$$ -109823 338382 858270 1069118 897981 625406 548318 585764 386949 -50240 -162357
44110a62357N88225P45925N041p75419o78262q60L09358P0307j02000O6138K14877
$$ -162357 425868 1171793 1176834 401415 -276847 -277707 31651 101958 -42 66096 280973
44099B80973J70600K22103M50942N25218L70188L76123O56589P01609J42781o09411
$$ 280973 451573 673676 1124618 1649836 2020024 2396147 3052736 3754345 3897126 3287715
44089C287715q92524o15164j95481M5493P7241n7647l06528n09111m79811k14800
$$ 3287715 2395191 1780027 1584546 1630039 1707280 1649633 1343105 833994 354183 139383
44079A39383P4988J56849J9203p5667J04162L78925L28076m4919j89355J72036
$$ 139383 214371 371220 390423 314756 418918 797843 1125919 1081000 891645 1063681
44069A063681N16461K83418k17130k87113P0805L07227L71270P12203J252824
$$ 1063681 1580142 1863560 1646430 1359317 1430122 1737349 2108619 2820822 4073646
44060D073646J297611O53169k0110k52144l44114n72264o32816l43807j51235
$$ 4073646 5371257 6024426 6004316 5752172 5408058 4835794 4202978 3859171 3707936
44051C707936l83977o43151m89813j55675j8181M9857K21638J90149k41921n81752
$$ 3707936 3323959 2680808 2190995 2035320 2017139 2066996 2288634 2478783 2236862 1655110
44041A655110l64309L2984L2736j51769Q634K99544J06020m38378n92460k02909
$$ 1655110 1290801 1323785 1356521 1204752 1213386 1512930 1618950 1180572 588112 385203
44031C85203J22871L7535j59876k05109j89330j22009J31105L79433K30590k15711
$$ 385203 508074 545609 385733 180624 -8706 -130715 390 379823 610413 394702
44021C94702m10827j85408O2719Q2133N1212N4923r0530l48543l93140j77184
$$ 394702 -16125 -201533 -138814 -56681 -5469 49454 -41076 -389619 -782759 -959943
44011i59943o642N8658K73037N67843N17923J16493j05824L7395R5312j43801
$$ -959943 -966585 -907927 -634890 -67047 450876 567369 461545 498940 594252 450451
44001D50451k22355J33034M34786K31325j41142j86436q0992k34711m71745l42532
$$ 450451 228096 361130 795916 1027241 886099 699663 618671 383960 -87785 -430317
43991d30317O7318L12875L40335M13720M64202J71426l59235o03455l47791O9824
$$ -430317 -362999 -50124 290211 703931 1168133 1339559 980324 376869 29078 98902
43981I8902K91176K79965J00477k10341m51270l25396J33933M88027M08665O8849
$$ 98902 390078 670043 770520 560179 108909 -216487 -82554 405473 814138 882987
43971H82987j19586K702K58593M35563M95249M60482K35111k77721q48177r49892
$$ 882987 763401 766103 1024696 1460259 1955508 2415990 2651101 2373380 1525203 575311
43961E75311l58259M16957O23694J56016l86602n14960l20303p7688J45241K92309
$$ 575311 217052 634009 1257703 1413719 1027117 512157 191854 114166 259407 551716
43951E51716J77580j64464l41973j28434J77504K07698M3822k3362L6885R1961
$$ 551716 729296 564832 222859 94425 271929 479627 523449 500087 536972 628933
43941F28933J35903J50560l8313m00878m92006m0862M92030M48447q8132m04897
$$ 628933 764836 915396 877083 476205 -15801 -56663 435367 883814 795682 390785
43931C90785j65186J95995J59429j97482l84151j46066K32640K62275j33521m41331
$$ 390785 225599 421594 581023 383541 -610 -146676 85964 348239 214718 -226613
43921b26613k06942K56218K53113k04580l45530J10457M07418l2166n69823l14290
$$ -226613 -433555 -177337 75776 -128804 -474334 -363877 43541 11375 -558448 -872738
43911h72738M27190O23291J23460k39954m8765K27134K38004K57837M19219L20927
$$ -872738 -445548 177743 301203 61249 12484 239618 477622 735459 1154678 1475605
43901A475605k00125o17726m77903m6437K01729K27749J82543Q412k94232m24509
$$ 1475605 1275480 657754 179851 133414 335143 562892 745435 753847 459615 35106
43891C5106k22974N478o045k5663K21149M73462K93296k24156n65636m96917k38108
$$ 35106 -187868 -182390 -188435 -214098 7051 480513 773809 549653 -15983 -512900 -751008
43880g51008k4496J32403K56007K88567K21772J52245J51947J77763J35564J1854
$$ -751008 -775504 -643101 -387094 -98527 123245 275490 427437 605200 740764 752618
43870G52618o1990M9480K20617J07906l53887o95572m77224N7635L16984K21843
$$ 752618 690628 740108 960725 1068631 714744 19172 -458052 -400417 -83433 138410
43860A38410J98588L63164L54342P2713q4561M3261O1465k30877l92638r0767
$$ 138410 336998 700162 1054504 1127217 1042656 1085917 1147382 916505 523867 433100
43850D33100K54327J23375k39848k18060K37446O31975O75570M71561J31252k80947
$$ 433100 687427 810802 570954 352894 590340 1222315 1897885 2369446 2500698 2219751
43840B219751n25306l86792n5750O7085j10683l55357m92061m99854l53114p4211
$$ 2219751 1694445 1307653 1251903 1318988 1208305 852948 360887 -138967 -492081 -566292
43830e66292J70267K72649L25623L69349K67564N3975L2609K41086K58412n7690
$$ -566292 -396025 -123376 202247 571596 839160 893135 925744 1166830 1425242 1367552
43820A367552j48318L76457R39780P93632K02810j7765J51215K4082m84429o91911
$$ 1367552 1219234 1595691 2535471 3329103 3531913 3514148 3665363 3689445 3205016 2513105
43810B513105l79553j78218m42105o54970l82455j9123o1999k89361k33987K4788
$$ 2513105 2133552 1955334 1513229 858259 475804 456681 394682 105321 -128666 -103878
43800a03878J02914k5495j13327j06092r0274j5859J64995L06000L11526L24180
$$ -103878 -964 -26459 -139786 -245878 -336152 -352011 -187016 118984 430510 754690
43790G54690M05501L28206k5053l59540l74810j91728p9458m6859M186K9974M5234
$$ 754690 1160191 1488397 1463344 1103804 728994 537266 457808 410949 415135 445109 490343
43779D90343K26770N02173M41740m2810l35913J5277M86838L07991l06002m50300
$$ 490343 717113 1219286 1661026 1618216 1282303 1297580 1784418 2092409 1786407 1336107
43769A336107P8508N43067M80399L14069M70366O18375K64272m11924q29597p92687
$$ 1336107 1414615 1957682 2438081 2752150 3222516 3840891 4105163 3693239 2863642 2070955
43759B070955n38049k39900P0914K33137O0517k82468l84508j30412J52231J70499
$$ 2070955 1532906 1293006 1363920 1597057 1657574 1375106 990598 860186 1012417 1182916
43749A182916K8468j6292O1352R8907L6462m3522r5794j31057q6300J09872L26290
$$ 1182916 1211384 1195092 1256444 1355351 1391813 1348291 1252497 1121440 1035140 1145012 1471302
43738A471302L10592N3203j54412j29665j1933R1988L53149P99279R56598M11489
$$ 1471302 1781894 1835097 1680685 1551020 1539087 1631075 1984224 2783503 3740101 4151590
43728D151590m34164p51611m08113q8442k03844l50080j27697J51285N2833k00285
$$ 4151590 3717426 2965815 2557702 2469260 2265416 1915336 1787639 1938924 1991757 1791472
43718A791472j19789K35096M21806L34283J90517J5631k76739m55261k39012J09257
$$ 1791472 1671683 1906779 2328585 2662868 2853385 2869016 2592277 2137016 1898004 2007261
43708B007261Q0555k52579l51921j26833j8691j23714k1707L20049K91702l12652
$$ 2007261 2087816 1835237 1483316 1356483 1337792 1214078 1192371 1512420 1804122 1491470
43698A491470p44936l71052L19586M43676O904k67495r3408J31609R8716o7637
$$ 1491470 746534 375482 695068 1138744 1145648 878153 784745 916354 1015070 947433
43688I47433k09742l02984k26547J05473L95936K79503k1171O3534N04483O13608
$$ 947433 737691 434707 208160 313633 709569 989072 967901 1031435 1535918 2149526
43678B149526J07076m20419m14302j63752k15762m58588l74871P6406M26077M21602
$$ 2149526 2256602 1836183 1421881 1258129 1042367 583779 208908 285314 711391 1132993
43668A132993K58523J19714l5367j81639j59054K168M3321j06476j81360L678
$$ 1132993 1391516 1511230 1475863 1294224 1135170 1137338 1180659 1074183 892823 896501
43658H96501K50529K78485J35693J19111L81954P50204Q78726N59765l0438m08503
$$ 896501 1147030 1425515 1561208 1680319 2062273 2812477 3691203 4250968 4220530 3812027
43648C812027k63692J56176L41116J77597K2231Q9596J41422m6403k70787k50961
$$ 3812027 3548335 3704511 4045627 4223224 4245455 4335051 4476473 4430070 4159283 3908322
43638C908322j12970j65678l78934m71809m19164m65017o25240n59996p6095N03793
$$ 3908322 3795352 3629674 3250740 2778931 2359767 1894750 1269510 709514 633419 1137212
43628A137212O55418K41110l14995m31862K3737N40637N15655L3587j81525K51070
$$ 1137212 1792630 2033740 1718745 1286883 1310620 1851257 2366912 2400499 2218974 2470044
43618B470044P93669P45631K46126r646J43071J84198j70720n49131n70041l36847
$$ 2470044 3263713 4009344 4255470 4245824 4388895 4573093 4402373 3853242 3283201 2946354
43608B946354o7691K32805M72595L63206n6976k67260j2537K33787j9632n17949
$$ 2946354 2878663 3111468 3584063 3947269 3890293 3623033 3610496 3844283 3824651 3306702
43598C306702o92358n02549l13671k16992l9745J68074K17140K11312L67319N23971
$$ 3306702 2614344 2111795 1798124 1581132 1541387 1709461 1926601 2137913 2505232 3029203
43588C029203L66396M1554p286K29056L16348Q5424j99388l86263n78434o83065
$$ 3029203 3395599 3437153 3429867 3658923 3975271 4060695 3861307 3475044 2896610 2213545
43578B213545m18662R0209K94318q291l90647m78648m05920l71479k61816k376
$$ 2213545 1794883 1885092 2179410 2171119 1780472 1301824 895904 524425 262609 260233
43568B60233J73584J10410j7408q7731k26727l77226j89541L20022N38126J29054
$$ 260233 433817 544227 526819 439088 212361 -164865 -354406 -34384 503742 632796
43558F32796l53750k57665K10581M14829K90762K29001K43056K1871l04220k19587
$$ 632796 279046 21381 231962 646791 937553 1166554 1409610 1431481 1127261 907674
43548I07674K93388N99138L06678k22224m61901l64710j91951o9899M1524J65340
$$ 907674 1201062 1800200 2106878 1884654 1422753 1058043 866092 796193 837717 1003057
43538A003057K66288K66842Q5604j89519k62347p901K41293J21293j91291k60418
$$ 1003057 1269345 1536187 1621791 1432272 1169925 1162024 1403317 1524610 1333319 1072901
43528A072901j20009j75780m15442l63052N4919K61635n6203l83228j55291L74640
$$ 1072901 952892 777112 361670 -1382 53537 315172 258969 -124259 -279550 95090
43518I5090N61448L13629P2714O0394Q2471P344l3592M8948J54835K01607K18044
$$ 95090 656538 970167 1042881 1103275 1185746 1193090 1159498 1208446 1363281 1564888 1782932
43507A782932K16164J90883K27595L89108N20921L90980J0078l82123o10591o42039
$$ 1782932 1999096 2189979 2417574 2806682 3327603 3718583 3728661 3346538 2735947 2093908
43497B093908m42817l4434L28102L30723P757k79499l29687l02739l50120l42152
$$ 2093908 1651091 1616657 1944759 2275482 2283239 2003740 1674053 1371314 1021194 679042
43487F79042j49187N8052M8907r3664j17298q643M1745K9683J54387L98579M31514
$$ 679042 529855 587907 636814 543150 425852 417209 458954 488637 643024 1041603 1473117
43476A473117R6314k82693l12393m1210K05044L14835L87122L59697N2931m03658
$$ 1473117 1569431 1286738 974345 933135 1138179 1453014 1840136 2199833 2252764 1849106
43466A849106n85460l25642P1331K83175L13903K64268J23448k8492K0730K37118
$$ 1849106 1263646 938004 1009335 1292510 1606413 1870681 1994129 1965637 1986367 2223485
43456B223485L12509K54578N09336J118610J314715N59391n00379q89604p25733
$$ 2223485 2535994 2790572 3299908 4418518 5733233 6292624 5792245 4902641 4176908
43447D176908q36645j217716j029058j77998L17795o8243n18638k32109L33754
$$ 4176908 3340263 2122547 1093489 915491 1233286 1165043 646405 414296 748050
43438G48050L67728M6794M3875K88622K09761j62802k96627j30870o0968j01890
$$ 748050 1115778 1162572 1206447 1495069 1704830 1542028 1245401 1114531 1053563 951673
43428I51673P1238L37737K48009q3458m5919M38879P74784P03890O39558P69454
$$ 951673 1022911 1360648 1608657 1525199 1479280 1918159 2692943 3396833 4036391 4805845
43418D805845O38385j3436p00449r08372p80637o73396n52929k75354j6130J2453
$$ 4805845 5444230 5430794 4730345 3821973 3041336 2367940 1815011 1539657 1523527 1535980
43408A535980r1800j98716l73729n15672k43398M57811R40957P09790J08435k68439
$$ 1535980 1444180 1245464 871735 356063 112665 570476 1511433 2221223 2329658 2061219
43398B061219m08669n73138n95612j99981K77445K43066k05313l93753r1570K54148
$$ 2061219 1652550 1079412 483800 283819 561264 804330 599017 205264 113694 367842
43388C67842L18169K78277K96025K16710l4237k50026l06783l01535k16480R5421
$$ 367842 686011 964288 1260313 1477023 1442786 1192760 885977 584442 367962 463383
43378D63383M72496M89199J13666j70318j08606l4389k02772k97504j7330L04199
$$ 463383 935879 1425078 1538744 1368426 1259820 1225431 1022659 725155 707825 1012024
43368A012024J92004j84773k88189o8890L2499j40521k53035r0682J29708J97290
$$ 1012024 1204028 1019255 731066 662176 694675 554154 301119 210437 340145 537435
43358E37435K15401K73784J97794r7614l06901j32676K06303K45331k7013j43982
$$ 537435 752836 1026620 1224414 1126800 819899 687223 893526 1138857 1111844 967862
43348I67862J02775K96114M000n27900o66292k64104J60710J72127m2226o7424
$$ 967862 1070637 1366751 1370751 842851 176559 -87545 73165 245292 203066 135642
43338A35642J25525K72591L00141L34006L29813J01760k64588m11339k21976j56
$$ 135642 261167 533758 833899 1167905 1497718 1599478 1334890 923551 701575 701419
43328G01419J0256l4904P2615K00887J30754r947P3522L14198L06965p4427l84854
$$ 701419 711675 676771 749386 950273 1081027 1071080 1144602 1458800 1765765 1691338 1306484
43317A306484j29177N56364R68380O36736p6313l62030L9310M79380K45427m52576
$$ 1306484 1177307 1733671 2702051 3338787 3262474 2900444 2939754 3419134 3664561 3211985
43307C211985p44793k95539K78031L32652K7856j21781p9646j46322k71756j30326
$$ 3211985 2467192 2171653 2449684 2782336 2810192 2688411 2608765 2462443 2190687 2060361
43297B060361K07966K93768L7167j36650j2409P7611j15478k97454j68262O053
$$ 2060361 2268327 2562095 2599262 2462612 2450203 2527814 2412336 2114882 1946620 1952673
43287A952673j69160n02379m72703o4758J87128L680k71695k46645k3425O6068
$$ 1952673 1783513 1281134 808431 743673 930801 934481 662786 416141 392716 458784
43277D58784j2689l1120P8725J40035R0498J77015O16091J146986J163860M19855
$$ 458784 446095 414975 493700 633735 724233 901248 1517339 2664325 3828185 4248040
43267D248040n51558r60138o68134k84941k97720m72766l58637m1415L6348j70760
$$ 4248040 3696482 2736344 2068210 1783269 1485549 1012783 654146 612731 649079 478319
43257D78319k49840j6310K32764K71545K92203M64926N45306K58313j97808l97911
$$ 478319 228479 212169 444933 716478 1008681 1473607 2018913 2277226 2079418 1681507
43247A681507k78697j36006j28814j21458o944J03505P2403p2112j88090j57120
$$ 1681507 1402810 1266804 1137990 1016532 1009588 1113093 1185496 1113384 925294 768174
43237G68174K2759K04820K21415J13454R7265K14326K34081P2038K3922K83170
$$ 768174 790933 995753 1217168 1330622 1427887 1642213 1876294 1948332 1972254 2255424
43227B255424M96483K42089k38448l32520j1811J15942k07192m78937k68922J01219
$$ 2255424 2751907 2993996 2755548 2423028 2411217 2527159 2319967 1841030 1572108 1673327
43217A673327J12079j50461k23876k0772J30251N8354m8622K6418K86289N46954
$$ 1673327 1785406 1634945 1411069 1390297 1520548 1578902 1530280 1556698 1842987 2389941
43207B389941N20331L5449o18017q16822l65715J38087Q3002k81671k53450K33644
$$ 2389941 2910272 2945721 2327704 1510882 1145167 1283254 1366256 1084585 831135 1064779
43197A064779N44489L35822j8409j16217o1802p6214p8982J9129J2664k31648
$$ 1064779 1609268 1945090 1926681 1810464 1748662 1672448 1593466 1612595 1625259 1393611
43187A393611m01735j37393L71395N64047K32640k40175l85764j73639M0093j7431
$$ 1393611 991876 854483 1225878 1789925 2022565 1782390 1396626 1222987 1263080 1245649
43177A245649k09998j87866J05805L01459J25129j49231q9726J95990K14008r2503
$$ 1245649 1035651 847785 953590 1255049 1380178 1230947 1141221 1337211 1551219 1458716
43167A458716k27173K2762K17018K5126j95907l6536K30630J32936j47830q9869
$$ 1458716 1231543 1254305 1471323 1496449 1300542 1264006 1494636 1627572 1479742 1389873
43157A389873K08995J41933l47248n61335j02258N07507N82341J64137k21994
$$ 1389873 1598868 1740801 1393553 832218 729960 1237467 1819808 1983945 1761951
43148A761951l30866l00880k36282r9560P6619J88135K21449J97027M8954k12895
$$ 1761951 1431085 1130205 893923 794363 870982 1059117 1280566 1477593 1526547 1313652
43138A313652l40609j33225J88545K12292o2273j82263J08889N00448N76412L75694
$$ 1313652 973043 839818 1028363 1240655 1178382 996119 1105008 1605456 2181868 2557562
43128B557562K13264J34816q1486m29141n75346l72970j35147j73687l18727k04305
$$ 2557562 2770826 2905642 2824156 2395015 1819669 1446699 1311552 1137865 819138 614833
43118F14833J30129K91496J46079K510J00986K62263K26274O4621O757M5909J434
$$ 614833 744962 1036458 1182537 1185047 1286033 1548296 1774570 1839191 1845948 1891857 1893291
43107A893291j26277j48502k4235M9418n4454j85036j24148J06110K65523J98418
$$ 1893291 1767014 1618512 1594277 1643695 1589241 1404205 1280057 1386167 1651690 1850108
43097A850108K3607j7121J34313K77205K26972Q6193J18782L72521N67845M02833
$$ 1850108 1873715 1856594 1990907 2268112 2495084 2581277 2700059 3072580 3640425 4043258
43087D043258j26663p29447j044591q76567l51745J36187K71554J25081l109J626
$$ 4043258 3916595 3187148 2142557 1265990 914245 1050432 1321986 1447067 1443958 1445584
43077A445584J5139j2869Q843M8517m4215j89212r3558K39045L98411J84517m8463
$$ 1445584 1460723 1447854 1456697 1505214 1460999 1271787 1178229 1417274 1815685 2000202 1951739
43066A951739M0617K38683J94774O6510K75655Q04658J204714J211826R43050
$$ 1951739 1992356 2231039 2425813 2492323 2767978 3572636 4777350 5989176 6932226
43057F932226N47163N2948m51309q14947j001172j045564r31409p05314n29813
$$ 6932226 7479389 7532337 7081028 6266081 5264909 4219345 3287936 2582622 2052809
43048B052809m02012j03350L00227L17755j78039m73249N9673R64524J390467
$$ 2052809 1650797 1547447 1847674 2165429 1987390 1514141 1573814 2538338 3928805
43039C928805J400472J620114J832394J140226l81334j436696j315739q39392
$$ 3928805 5329277 6949391 8781785 9922011 9540677 8103981 6788242 5948850
43031E948850r24080j220776r71042l77337j67253l49786l54073p8518N3607r5938
$$ 5948850 5024770 3803994 2832952 2455615 2288362 1938576 1584503 1505985 1559592 1463654
43021A463654k39057k14143r1906J29491M12858M52298P0121l57453l75073j19056
$$ 1463654 1224597 1010454 918548 1048039 1460897 1913195 1983316 1625863 1250790 1131734
43011A131734q15N064J69639L63387K51209n7896k00665k13986l34250l49270
$$ 1131734 1130919 1135983 1305622 1669009 1920218 1862322 1661657 1447671 1113421 764151
43001G64151P9782N92543M83383j38240m17801p3024K39746P1039j83748j16990
$$ 764151 843933 1436476 1919859 1781619 1363818 1290794 1530540 1601579 1417831 1300841
42991A300841L2914j4586l6848J51134K44021M3341o8440K07407M71291K61539
$$ 1300841 1333755 1319169 1282321 1433455 1677476 1720817 1652377 1859784 2331075 2592614
42981B592614j50343k21864j7580K0005j23239j19616J4395k6360k12285k27867
$$ 2592614 2442271 2220407 2202827 2222832 2099593 1979977 1994372 1968012 1755727 1527860
42971A527860p7657n1393j14828N8715M06267M40531O1118j62403K04133Q27294
$$ 1527860 1450203 1398810 1283982 1342697 1748964 2189495 2250613 2088210 2292343 3119637
42961C119637J124683J081027J163429J609847K157464K419004K254174J757745
$$ 3119637 4244320 5325347 6488776 8098623 10256087 12675091 14929265 16687010
42953A6687010J080691L46099l18218p28135p12905l48573p9884l89671j238325
$$ 16687010 17767701 18113800 17795582 17067447 16354542 16005969 15926085 15536414 14298089
42944A4298089j993006k079449j611379j196281j171372j253681r96747l90823
$$ 14298089 12305083 10225634 8614255 7417974 6246602 4992921 3996174 3605351
42936C605351J49713K89601P0611k70217n72339p62208p57409n20311j54306J67403
$$ 3605351 3755064 4044665 4115276 3845059 3272720 2510512 1753103 1232792 1078486 1245889
42926A245889L36146L09382Q4905k01154k67377J0260L39773K96676j21004m57068
$$ 1245889 1582035 1891417 1976322 1775168 1507791 1518051 1857824 2154500 2033496 1576428
42916A576428l72938k4526K38392L12504L00931K26411M1132j57800j77825j8853
$$ 1576428 1203490 1178964 1417356 1729860 2030791 2257202 2298334 2140534 1962709 1943856
42906A943856Q0138m8989k83085l92026l50174l23714l58028k45347J64718O10059
$$ 1943856 2023994 1975005 1691920 1299894 949720 626006 267978 22631 187349 797408
42896G97408N98332J6138o30070p41880k88280K30126L89157K12439k5721j47541
$$ 797408 1395740 1411878 781808 39928 -248352 -18226 370931 583370 557649 410108
42886D10108j68983j86776k26042j67045J10678M49880M49599l3079n64989n94262
$$ 410108 241125 54349 -171693 -338738 -228060 221820 671419 638340 73351 -520911
42876e20911j32264L24071M75108M53449L91945J97954j10086k37782k4985K59464
$$ -520911 -653175 -329104 146004 599453 991398 1189352 1079266 841484 816499 1075963
42866A075963K72651M0494j60212j75065k6135K38126N25457O31191L82298j57914
$$ 1075963 1348614 1389108 1228896 1053831 1027696 1265822 1791279 2422470 2804768 2646854
42856B646854o91455q66417n24056Q3654M09889J91842j67936j23002K12158K56746
$$ 2646854 1955399 1088982 564926 648580 1058469 1250311 1082375 959373 1171531 1428277
42846A428277n7921j40123K47553M99142J10829m61105m73530j4448K13354j6285
$$ 1428277 1370356 1230233 1477786 1976928 2087757 1626652 1153122 1138674 1352028 1335743
42836A335743k47096j44447J05253K35493K28861J15048j39465m25095n02684
$$ 1335743 1088647 944200 1049453 1284946 1513807 1628855 1489390 1064295 561611
42827E61611l26125j01779J6681N8264N3862k9803j56677k24161j95640q2110
$$ 561611 235486 133707 150388 208652 262514 232711 76034 -148127 -343767 -425877
42817d25877J14865K75236J52489k53524n03037k26013L20802N62710L56027O3770
$$ -425877 -311012 -35776 116713 -136811 -639848 -865861 -545059 17651 373678 437448
42807D37448j5666P6688J73791J23198j70368n02619l78252L00859Q09370M50712
$$ 437448 421782 498470 672261 795459 625091 122472 -255780 45079 854449 1305161
42797A305161l73592o68193k83646J1425r6265k6670M77018P01608J17646o40927
$$ 1305161 931569 263376 -20270 -8845 -105110 -131780 345238 1046846 1164492 523565
42787E23565o89517j76164J20589R958r4770m3951k8579M893K41946M30623J86676
$$ 523565 -165952 -342116 -221527 -211569 -306339 -350290 -378869 -373976 -132030 298593 485269
42776D85269k07382j08638L66361L92876k06375n48055o0788N37187L19035l85267
$$ 485269 277887 169249 535610 928486 722111 174056 113268 650455 969490 584223
42766E84223m73031K64744Q81618P29880L37529M80449J004014J120038N51930
$$ 584223 111192 375936 1257554 1987434 2324963 2805412 3809426 4929464 5481394
42757E481394j89726n88087o64677o61359o08079m45495l09163l91033o02265
$$ 5481394 5291668 4703581 4038904 3377545 2769466 2323971 2014808 1623775 1021510
42748A021510o12997k54712K39627M41610J60471l16340m59422o8865M45514N25610
$$ 1021510 408513 153801 393428 835038 995509 679169 219747 150882 596396 1122006
42738A122006J53936j85456k18655j70185k38343k37435l4409R1878o2216j54035
$$ 1122006 1275942 1090486 871831 701646 463303 225868 191459 283337 221121 67086
42728F7086J67506N48657L78403k22913n29684k72460R4337K11881K18359K11850
$$ 67086 234592 783249 1161652 938739 409055 136595 230932 442813 661172 873022
42718H73022R399l14460k99620J53915M87369L01637n5148j17461q290n8740j89625
$$ 873022 882421 567961 268341 422256 909625 1211262 1156114 1038653 1030363 971623 781998
42707G81998j79603j47587k47438k46932N3028L21648J83379j21632j59006o9138
$$ 781998 602395 454808 207370 -39562 13466 335114 518493 396861 237855 168717
42697A68717k40549m80300k80551K31896M14557J49471l0412Q8077J10318j11032
$$ 168717 -71832 -552132 -832683 -600787 -186230 -36759 -67171 20906 131224 20192
42687B0192j36114K28508M85837K65141n0017q659J40946n1293m06387m21412
$$ 20192 -115922 112586 598423 863564 813547 804888 945834 894541 488154 66742
42677F6742j26027N393j36830j73090Q9625L71928L94859K40401J29947J35208
$$ 66742 -59285 -53892 -190722 -363812 -274187 97741 492600 733001 862948 998156
42667I98156J95934K06236N9219j89707k49120N1728L85414K59918k52448n25044
$$ 998156 1194090 1400326 1459545 1269838 1020718 1072446 1457860 1717778 1465330 940286
42657I40286k44661J37431P7202k91482m30575k03828L3014N3111K2869J07253
$$ 940286 695625 833056 910258 618776 188201 -15627 17387 70498 93367 200620
42647B00620K07091K16936K18577K54710J90976j5442j70252j60984j52978k33686
$$ 200620 407711 624647 843224 1097934 1288910 1273468 1103216 942232 789254 555568
42637E55568j59364K09365M96163K83194j92820l38566j03680j0352k65848m46796
$$ 555568 396204 605569 1101732 1384926 1192106 853540 749860 739508 473660 26864
42627B6864k28358J28613K66906K13128R4302j31632l40032j54258L79651N52854
$$ 26864 -201494 -72881 194025 407153 501455 369823 29791 -124467 255184 808038
42617H08038j0613n93229l38813L95969N21667j11821m94856l3926N88989N40409
$$ 808038 797425 204196 -134617 261352 783019 671198 176342 142416 731405 1271814
42607A271814N2936r0748K17803L94547J37596k21493l34048k88472l07043l39901
$$ 1271814 1324750 1234002 1451805 1846352 1983948 1762455 1428407 1139935 832892 492991
42597D92991j84470J51096M05072L62222Q0120k04588l10696j98189Q7811M07796
$$ 492991 308521 459617 864689 1226911 1307031 1102443 791747 593558 681369 1089165
42587A089165M97843J74364l59306o26072m17755k4065J99688K28128J55103o7790
$$ 1089165 1587008 1761372 1402066 775994 358239 334174 533862 761990 917093 849303
42577H49303l64499l49000J25519N02587J92308m59820n48880P0675N69270L85525
$$ 849303 484804 135804 261323 763910 956218 496398 -52482 18193 587463 972988
42567I72988m1485j06305N1885l3180l14391l82192j63736O4797J91976L14900
$$ 972988 931503 825198 877083 843903 529512 147320 -16416 48381 240357 555257
42557E55257L68396J61829k12935l77308j37805K73035M69489K76446j58778m88718
$$ 555257 923653 1085482 872547 495239 357434 630469 1099958 1376404 1217626 728908
42547G28908m50254j33422J11812J02943J137k0840m2336j48099j67533O1384
$$ 728908 278654 145232 257044 359987 361124 340284 297948 149849 -17684 43700
42537D3700L41269L32167K1269k94014m10500l44975j28150K37258O05027P10366
$$ 43700 384969 717136 738405 444391 33891 -311084 -439234 -201976 403051 1113417
42527A113417M32490p0635m72184m69041j4162N11463N45218k2129o15258o24066
$$ 1113417 1545907 1475272 1003088 534047 519885 1031348 1576566 1554437 939179 315113
42517C15113j32595K84567L33960J96025M6252j54333l39783k52581J36441M50272
$$ 315113 182518 467085 801045 997070 1043322 888989 549206 296625 433066 883338
42507H83338L68240K8265k31076l08552k95470j89493N4105K76833K21480q9620
$$ 883338 1251578 1279843 1048767 740215 444745 255252 309357 586190 807670 718050
42497G18050l07873j76531J53572L28391K16525J4529m0254N3089J09820K3883
$$ 718050 410177 233646 387218 715609 932134 946663 906409 959498 1069318 1093201
42487A093201r5398o4864J35684L15365K79744O4138r3664m0037R2781N1891j99711
$$ 1093201 997803 932939 1068623 1383988 1663732 1727870 1634206 1594169 1686950 1738841 1539130
42476A539130m29458m29445k35947j9090J01207O9646j01388k48258j72725K6945
$$ 1539130 1109672 680227 444280 425190 526397 596043 494655 246397 73672 100617
42466A00617j5960l76737n96448l24871Q1908Q4321j44949J9596N81424Q44093
$$ 100617 84657 -292080 -888528 -1213399 -1131491 -1047170 -1192119 -1172523 -591099 252994
42456B52994N27389K01990K93107L80675J5235l96298k27525K75487L29611j75548
$$ 252994 780383 982373 1275480 1656155 1671390 1275092 1047567 1323054 1652665 1477117
42446A477117n77560m87443j99808l063K09560M46195L78751o7625l95067k01139
$$ 1477117 899557 412114 212306 209243 418803 864998 1243749 1176124 781057 579918
42436E79918K05615K68760j3593j86792p8758J5226j10092k25481m2089L11129
$$ 579918 785533 1054293 1040700 853908 775150 790376 680284 454803 412714 723843
42426G23843M14784J05057k97548l73693j13300R9161q470k73504l64417k12957
$$ 723843 1138627 1243684 946136 572443 459143 558304 549834 276330 -88087 -301044
42416c01044j3185J08611K01025K86218K80095J70269Q3469Q0346M3146j02553
$$ -301044 -314229 -205618 -4593 281625 561720 731989 815458 895804 938950 836397
42406H36397j88898j9322K78355L41302O7136j95553j18079J12861N4746k92197
$$ 836397 647499 628177 906532 1247834 1314970 1119417 1001338 1114199 1168945 876748
42396H76748m23153q4856K89929K00972j78169l06741j16687j8528j42998j59329
$$ 876748 453595 368739 658668 859640 681471 374730 258043 239515 96517 -62812
42386f2812P2553K41847J77927J62706L52389L85028k0890m74487m01103J37117
$$ -62812 9741 251588 429515 592221 944610 1329638 1308748 834261 433158 570275
42376E70275N62370N40032K09801j80327m65506m91654k18662J43792L47282L52062
$$ 570275 1132645 1672677 1882478 1702151 1236645 744991 526329 670121 1017403 1369465
42366A369465J95263j47531n38378o24005l28444q5437k03340l36481n7193L78054
$$ 1369465 1564728 1417197 878819 254814 -73630 -159067 -362407 -698888 -756081 -378027
42356c78027M17383J10683l6740N7010J8470j85705j32934K85617O09520M91574
$$ -378027 39356 150039 113299 170309 188779 3074 -129860 155757 765277 1256851
42346A256851J25206j60726k83684k59041q6882R9864J27077N4694K7231o1291
$$ 1256851 1382057 1221331 937647 678606 591724 691588 818665 873359 900590 839299
42336H39299l27061m71436j59230K99533L09600m0087j17063J58173K09566j00682
$$ 839299 512238 40802 -118428 181105 490705 450618 333555 491728 701294 600612
42326F00612k05313Q3613J73869j98413l81066P9592N67958L70751j78646l28467
$$ 600612 395299 478912 652781 454368 73302 152894 720852 1091603 912957 584490
42316E84490j08616n5309j84792j16472R2552R0505l344K02904N49205N00696
$$ 584490 475874 420565 235773 119301 211853 302358 299014 501918 1051123 1551819
42306A551819Q4437j34227j6978j9482k97118m02796j06265J61973K2088k48663
$$ 1551819 1636256 1502029 1485051 1465569 1168451 765655 659390 821363 843451 594788
42296E94788k12188M5695J42094K6428k4694R8716K01987J23546l5484p3264M8797
$$ 594788 382600 428295 570389 596817 572123 670839 872826 996372 960888 887624 936421
42285I36421J79874J96199J72304K54325L94481L83260J93561P0921J35866J28906
$$ 936421 1116295 1312494 1484798 1739123 2133604 2516864 2710425 2781346 2917212 3046118
42275C046118j88537n53924m73095P5556N46220M97824R3275j82136r8942J58476
$$ 3046118 2857581 2303657 1830562 1906118 2452338 2950162 3043437 2861301 2762359 2920835
42265B920835K84656J57135j13060l26599l67724k71640j55136r4712p6935o9761
$$ 2920835 3205491 3362626 3249566 2922967 2555243 2283603 2128467 2033755 1956820 1887059
42255A887059j19887k97031m83787l57483J91658O94746N26696k23779p27954
$$ 1887059 1767172 1470141 986354 628871 820529 1515275 2041971 1818192 1090238
42246A090238m78238O9297K57341J53652J82933K66212N1457k81139k53933K4448
$$ 1090238 612000 681297 938638 1092290 1275223 1541435 1592892 1311753 1057820 1082268
42236A082268N4859n8638K59228R01652J070932O22630L86941P66385J007952
$$ 1082268 1137127 1078489 1337717 2239369 3310301 3932931 4319872 5086257 6094209
42227F094209M36910m58082q44288p26246o14909o19144n50961m48398l87747
$$ 6094209 6531119 6073037 5228749 4502503 3887594 3268450 2717489 2269091 1881344
42218A881344k14919M3882J5449l12832l25373K53416P59512N61751K3191j51154
$$ 1881344 1666425 1710307 1725756 1412924 1087551 1340967 2100479 2662230 2685421 2534267
42208B534267N2443K28178K98199L38383J92135j29739k09288O8915J91764q3434
$$ 2534267 2586710 2814888 3113087 3451470 3643605 3513866 3304578 3373493 3565257 3481823
42198C481823k49377m387J81414M6537R7409N25657O79929L70158M38688J156763
$$ 3481823 3232446 3228059 3409473 3456010 3553419 4079076 4759005 5129163 5567851 6724614
42188F724614J484060R77618Q16680J614191K006359J096034M09081J350997K640783
$$ 6724614 8208674 9186292 10002972 11617163 13623522 14719556 15128637 16479634 19120417
42179A9120417K736921K858320M696805P143416Q731522J1280938J7097129K4935939
$$ 19120417 21857338 24715658 29412463 36555879 45287401 56568339 73665468 98601407
42171I8601407L3837787M7698250O7268458P8554792O1235566J4291366l5655004
$$ 98601407 132439194 180137444 247405902 325960694 387196260 401487626 365832622
42164C65832622n9793665n5661997m2906222l6248185l3367953k7539779j9916661
$$ 365832622 306038957 250376960 207470738 171222553 137854600 110314821 90398160
42157I0398160j5142873j3039812j0513939p389345n528438m784529l694780k480086
$$ 90398160 75255287 62215475 51701536 44312191 38783753 33999224 30304444 27824358
42149B7824358k291603k726027k541183j825599j475852j456323j247760j104591
$$ 27824358 25532755 22806728 20265545 18439946 16964094 15507771 14260011 13155420
42141A3155420j380661j491634q95286k48250l48079p61501o76030l01623k85208
$$ 13155420 11774759 10283125 9387839 9139589 8791510 8030009 7353979 7052356 6767148
42132F767148m84093m16896k56977l62286m47810j55580J58881M8298k30481k80783
$$ 6767148 6283055 5866159 5609182 5246896 4799086 4643506 4802387 4850685 4620204 4339421
42122D339421k50807k77742l7927M44680M29208l08121q04042l75102J97586q586
$$ 4339421 4088614 3810872 3772945 4217625 4646833 4338712 3534670 3159568 3357154 3348568
42112C348568m81640k46579L87231M11291j35059l78163j64710o9581j30449J22750
$$ 3348568 2866928 2620349 3007580 3418871 3283812 2905649 2740939 2671358 2540909 2663659
42102B663659N21288L83200k34288n30753k41566J01246K06385L09881L62543
$$ 2663659 3184947 3568147 3333859 2803106 2561540 2662786 2869171 3179052 3541595
42093C541595m6067p55220r57324l57763L58182N23667K99892J83976K61251K75177
$$ 3541595 3495528 2740308 1782984 1425221 1783403 2307070 2606962 2790938 3052189 3327366
42083C327366P6786k29423l85423k05187J20387J29865k41205m39452j29517J96196
$$ 3327366 3404152 3174729 2789306 2584119 2704506 2834371 2593166 2153714 2024197 2220393
42073B220393K2211k49353M1397O03657O20365J46816Q099L51169M26046l6445
$$ 2220393 2242604 1993251 2034648 2638305 3258670 3405486 3413585 3764754 4190800 4154355
42063D154355l39311o5256K10594k8025l50936j78360K36117L05372P4494J3549
$$ 4154355 3815044 3749788 3960382 3932357 3581421 3403061 3639178 3944550 4019044 4032593
42053D032593J93308K68644O5617k87423o27749p82279n36425O1511N47211N09387
$$ 4032593 4225901 4494545 4560162 4272739 3644990 2862711 2326286 2387797 2935008 3444395
42043C444395O2592l72325n48653m51038j55457J05271J8235l60004m92801m9278
$$ 3444395 3506987 3134662 2586009 2134971 1979514 2084785 2103020 1743016 1250215 1200937
42033A200937N32659N73149Q2719k71457q7607L10944M25991K40272J12348K13894
$$ 1200937 1733596 2306745 2389464 2118007 2030400 2341344 2767335 3007607 3119955 3333849
42023C333849L31721K30028J6876J984K41047M23361L05778Q2152J29571N04890
$$ 3333849 3665570 3895598 3912474 3914458 4155505 4578866 4884644 4966796 5096367 5601257
42013E601257R34927J245817J538845J949366K489988L143395L826738M192290
$$ 5601257 6536184 7782001 9320846 11270212 13760200 16903595 20730333 24922623
42005B4922623L739507K295191K59947j687480l013562l495986l230304k576013
$$ 24922623 28662130 30957321 31217268 29529788 26516226 23020240 19789936 17213923
41997A7213923j937190j512381j322006j380906j625415j753574j464996q90970
$$ 17213923 15276733 13764352 12442346 11061440 9436025 7682451 6217455 5326485
41989E326485m92639m76981n94698n75569m58801l80048l10117j58375O1274K66072
$$ 5326485 4833846 4356865 3762167 3186598 2727797 2347749 2037632 1879257 1940531 2206603
41979B206603L34395R6358m48926r06072q09779k40165K35297L15364K67898L45286
$$ 2206603 2540998 2637356 2188430 1282358 472579 232414 467711 783075 1050973 1396259
41969A396259L41104N225m64277o82852n78835l31913m3234K38533L68960K83913
$$ 1396259 1737363 1742588 1278311 595459 16624 -315289 -358523 -119990 248970 532883
41959E32883J60583J48501J20917n3620j99249r5035J21682J38114o0171j95984
$$ 532883 693466 841967 962884 909264 710015 614980 736662 874776 814605 618621
41949F18621j03140J25211L05031K75403j6914l42348l00305J33328M09818J13942
$$ 618621 515481 640692 945723 1221126 1204212 861864 561559 694887 1104705 1218647
41939A218647l62775l28005J77861M24279Q5776k84857q9087M77322P45952M48691
$$ 1218647 855872 527867 705728 1130007 1215783 930926 841839 1319161 2065113 2513804
41929B513804o3587l32332k47293l4208L2243j06062k51829k01046q396J00341
$$ 2513804 2450217 2117885 1870592 1836384 1868627 1762565 1510736 1309690 1301294 1401635
41919A401635N0755j7190j1235l029k9829M299J26378J88988J01359l400J4079
$$ 1401635 1452390 1435200 1423965 1420936 1391107 1395406 1521784 1710772 1812131 1808731 1822810
41908A822810O4460p221j41152j48710j1344J04952J01936K6607r1483k78143
$$ 1822810 1887270 1880049 1738897 1590187 1578843 1683795 1785731 1812338 1720855 1442712
41898A442712m54177m35979j95449L2617K9714j25548j84203n0148J60502L13131
$$ 1442712 988535 552556 357107 389724 419438 293890 109687 59539 220041 533172
41888E33172L49230K36254Q562j53096q3303J02532J14744q5400k05241p1097
$$ 533172 882402 1118656 1127218 974122 890819 993351 1108095 1022695 817454 746357
41878G46357J02787Q3971O033R9220K37804J19814k01355l44423j48784J49668
$$ 746357 849144 933115 939148 1038368 1276172 1395986 1194631 850208 701424 851092
41868H51092L13316L42272K77513J02530p6864p2773P1867J15225K8989K4449
$$ 851092 1164408 1506680 1784193 1886723 1809859 1737086 1808953 1924178 1953167 1977616
41858A977616Q7322p7610m71029o39758l65864n3446o3476j16866J49295M29726
$$ 1977616 2064938 1987328 1516299 876541 510677 457231 393755 276889 426184 855910
41848H55910J90904l73830n16989j8916N24709N63916K15281q9465j25088Q2825
$$ 855910 1046814 672984 155995 137079 661788 1225704 1440985 1351520 1226432 1309257
41838A309257L56315M07476J17340j90606j15228J92796K10235j33400l35273
$$ 1309257 1665572 2073048 2190388 1999782 1884554 2077350 2287585 2154185 1818912
41829A818912j29918J29220R7362q5470k07954l57299n48695m84801q0804K26978
$$ 1818912 1688994 1818214 1915576 1830106 1622152 1264853 716158 231357 150553 377531
41819C77531J27200n7652J6560O7335k43364n21834j95628M29217N19577J1979
$$ 377531 504731 447079 463639 530974 287610 -234224 -429852 -635 518942 530921
41809E30921l24177j60660l8990k88821m03179K8920M99994L44040j86027l04963
$$ 530921 206744 46084 7094 -281727 -684906 -655986 -155992 188048 2021 -302942
41799c02942J30434N15638M53641J90844N6298l613j46233k56065j07207K44800
$$ -302942 -172508 343130 796771 987615 1043913 1040300 894067 638002 530795 775595
41789G75595M35801J83606l39535o04887l03108K35143M08386J16308j57138q9865
$$ 775595 1211396 1395002 1055467 450580 147472 382615 791001 907309 750171 660306
41779F60306P2706N8201M1164J92580J91691k49161o86783m59257K49319N79518
$$ 660306 733012 791213 832377 1024957 1216648 967487 280704 -178553 70766 650284
41769F50284K36839j64287j33638M1909k2864j43738l1242J06618l6691k44229
$$ 650284 887123 722836 589198 631107 608243 464505 433263 539881 503190 258961
41759B58961j09658K56410L92832K14465P2424J51416K51090J70117n1220k80493
$$ 258961 149303 405713 798545 1013010 1085434 1236850 1487940 1658057 1606837 1326344
41749A326344l92521k47358J44083M63577L75908l9087l81638m09047j91287J06565
$$ 1326344 933823 686465 830548 1294125 1670033 1630946 1249308 840261 648974 755539
41739G55539L21957K79447q175k05780m5249K39701K24240n1288j59689J4819
$$ 755539 1077496 1356943 1348768 1142988 1097739 1337440 1561680 1510392 1350703 1365522
41729A365522J29537n777j35180k8585J44452J08608j45265m36038n85746m50041
$$ 1365522 1495059 1489282 1354102 1325517 1469969 1578577 1433312 997274 411528 -38513
41719c8513l7121L42656L61182J50101J25619K97110K19945k32490n62960l72065
$$ -38513 -75634 267022 628204 778305 903924 1201034 1420979 1188489 625529 253464
41709B53464P6439L28327L60687L71344L18230P7278k18280l70404m09184l85183
$$ 253464 329903 658230 1018917 1390261 1708491 1785769 1567489 1197085 787901 402718
41699D02718j66308K22394L90277J23129j74535l6907L41198M38775K18105M7608
$$ 402718 236410 458804 849081 972210 797675 760768 1101966 1540741 1758846 1806454
41689A806454N205j38631l34283k58703P4879K59156J15861r6294j65986j81103
$$ 1806454 1811659 1673028 1338745 1080042 1154921 1414077 1529938 1433644 1267658 1086555
41679A086555k24200k28497k04435k24047j50807K00130O10313O28221K50540
$$ 1086555 862355 633858 429423 205376 54569 254699 865012 1493233 1743773
41670A743773m4917l6052j5557j63011j90216J19956M75797M95008K10801j09917
$$ 1743773 1698856 1662804 1647247 1484236 1294020 1413976 1889773 2384781 2595582 2485665
41660B485665l21920l36446o6393K90471K82473j63677m95407k83427J16520R0028
$$ 2485665 2163745 1827299 1760906 2051377 2333850 2170173 1674766 1391339 1507859 1597887
41650A597887l15537n04889k33765J13064J52668j0354m0939J66029M12239M41073
$$ 1597887 1282350 777461 543696 656760 809428 799074 758135 924164 1336403 1777476
41640A777476J90989j32176k52484j23021O8934K11267L75275N36078M61971Q2983
$$ 1777476 1968465 1836289 1583805 1460784 1529718 1740985 2116260 2652338 3114309 3197292
41630C197292k73716k82155o1127O5206Q2865K30149N20508O71518N11649J77383
$$ 3197292 2923576 2641421 2580294 2645500 2728365 2958514 3479022 4150540 4662189 4839572
41620D839572j21131l02249l60354l20731k84053l48385m55739m48417k86889
$$ 4839572 4718441 4416192 4055838 3735107 3451054 3102669 2646930 2198513 1911624
41611A911624r5599l65k4851j22586k09669j97817q5838K1896N5608O7835J20990
$$ 1911624 1816025 1815660 1790809 1668223 1458554 1260737 1174899 1196795 1252403 1320238 1441228
41600A441228J93255K63577L51736L89009K18997j49634m61274n20631m00794
$$ 1441228 1634483 1898060 2249796 2638805 2857802 2708168 2246894 1726263 1325469
41591A325469k02125J60674P02212J112209J059432O24849J61149j65353m25528
$$ 1325469 1123344 1284018 1986230 3098439 4157871 4782720 4943869 4778516 4352988
41582D352988o35099p07714o41701n03579k91475l2815J01000K7343l8727J05675
$$ 4352988 3717889 3010175 2368474 1864895 1573420 1540605 1641605 1668948 1630221 1735896
41572A735896K79752J89299p4261j91322j51594j91219k67003r7903K50060L43050
$$ 1735896 2015648 2204947 2130686 1939364 1787770 1596551 1329548 1231645 1481705 1824755
41562A824755O8530j41171J9822K64209J86008j38488l23547k20881l4062k1509
$$ 1824755 1893285 1752114 1771936 2036145 2222153 2083665 1760118 1539237 1505175 1483666
41552A483666k38422m56772l17089K32445O84661N08929o2623k52639J58416M99888
$$ 1483666 1245244 788472 471383 703828 1388489 1897418 1834795 1582156 1740572 2240460
41542B240460K40317k16324k10323J67932L31298J38960m0141l4346k0229l0389
$$ 2240460 2480777 2264453 2054130 2222062 2553360 2692320 2652179 2617833 2597604 2567215
41532B567215Q9802K11806K364m08907m19207J44663O31795M42957j09454k74790
$$ 2567215 2657017 2868823 2871187 2462280 2043073 2187736 2819531 3262488 3153034 2878244
41522B878244P5888L76761K47675n9496j49207K7435L48118Q20024J408204J787961
$$ 2878244 2954132 3330893 3578568 3519072 3369865 3397300 3745418 4565442 5973646 7761607
41512G761607J622432J040656N59749N13426P69044J013739J095504J071434J188594
$$ 7761607 9384039 10424695 10984444 11497870 12266914 13280653 14376157 15447591 16636185
41503A6636185J854634L252221M768264N145145L594073O61787k254179m096068
$$ 16636185 18490819 21743040 26511304 31656449 35250522 35912309 33658130 29562062
41495B9562062m630692m089555k892304j666172r68792q15683q08626p67421q44433
$$ 29562062 24931370 20841815 17949511 16283339 15314547 14498864 13690238 12922817 12078384
41486A2078384r96892q70085l83115N0802J39189J11531K35612L79959M03025
$$ 12078384 11081492 10211407 9828292 9879094 10018283 10129814 10365426 10745385 11148410
41477A1148410N40308R49765J224019Q65873J5311p57335j156645j216205r35196
$$ 11148410 11688718 12638483 13862502 14728375 14743686 13986351 12829706 11613501 10678305
41468A0678305m21540j55633m43779p48005k99038O41999R40414J73416p36393
$$ 10678305 10256765 10101132 9657353 8909348 8610310 9252309 10192723 10366139 9629746
41459I629746q36375l78833j96686m10916m62726j24135K42895L68373M00642
$$ 9629746 8793371 8414538 8217852 7806936 7344210 7220075 7462970 7831343 8231985
41450H231985M78755M75685L19651J78426J27799n0562n02799r69087j092976
$$ 8231985 8710740 9186425 9506076 9684502 9812301 9761739 9258940 8289853 7196877
41441G196877r20080p85003p56386n40930l4481L61509K42492j86861l58913j17609
$$ 7196877 6276797 5491794 4735408 4194478 4159997 4521506 4763998 4577137 4218224 4100615
41431D100615J62690K63762M52752R00035J210765R50039L33688q8439k37685
$$ 4100615 4263305 4527067 4979819 5879854 7090619 8040658 8374346 8285907 8048222
41422H048222m49036p12166o05884q3189K87619J25460k28008l13770k53301m04797
$$ 8048222 7599186 6887020 6281136 6197947 6485566 6611026 6383018 6069248 5815947 5411150
41412E411150o64711o39414l35057j44251j83079j44205J02460K17614p4785m95104
$$ 5411150 4746439 4107025 3771968 3627717 3444638 3300433 3402893 3620507 3545722 3050618
41402C050618n51320j90769J99199L64818M42031N87272O46638L99208m1899l42342
$$ 3050618 2499298 2308529 2507728 2872546 3314577 3901849 4548487 4947695 4905796 4563454
41392D563454m06548m43333n46374n16042k34877O2414J15144J194p9672j62273
$$ 4563454 4156906 3713573 3167199 2651157 2416280 2478694 2593838 2595032 2515360 2353087
41382B353087l31350l79110o4209L90611N03202K19348k5218M5846K46516L23406
$$ 2353087 2021737 1642627 1578418 1969029 2472231 2691579 2666361 2712207 2958723 3282129
41372C282129K53497Q6515j16630j46974J22592L48714P3311m81207n86429j10551
$$ 3282129 3535626 3622141 3505511 3358537 3481129 3829843 3903154 3421947 2835518 2724967
41362B724967K50161R2732j03181P6573K26725o1233l39683o0063L83147K67581
$$ 2724967 2975128 3067860 2964679 3041252 3267977 3206744 2867061 2806998 3190145 3457726
41352C457726k22673l40275n5742J6564j86341j02063L29574M81255J20853k64466
$$ 3457726 3235053 2894778 2839036 2855600 2669259 2567196 2896770 3378025 3498878 3234412
41342C234412m20158o63808j002669q67422j49759L82275K37150l7345J50074
$$ 3234412 2814254 2150446 1147777 280355 130596 512871 750021 712676 862750
41333H62750M29785J99384k64916k58227K06901N10425M17139K25892R9843q1762
$$ 862750 1292535 1491919 1227003 968776 1175677 1686102 2103241 2329133 2428976 2347214
41323B347214k87390l16937j80120n8791J0272N6120k5904k28613k57084l77J52454
$$ 2347214 2059824 1742887 1562767 1503976 1514248 1570368 1544464 1315851 1058767 1058390 1210844
41312A210844o3432k34372P5097M97297M13391M664p7191J46701Q9947k71633
$$ 1210844 1147412 913040 988137 1485434 1898825 1903489 1826298 1972999 2062946 1791313
41302A791313l70327j52758j77367m54645k77526M33469O87674p8114r88411r61055
$$ 1791313 1420986 1268228 1090861 636216 358690 792159 1479833 1401719 413308 -547747
41292e47747j95575L76722M89802M93723M04724o287m38221l29723J67531L32977
$$ -547747 -743322 -366600 123202 616925 1021649 1015362 577141 247418 414949 747926
41282G47926L256k35588o0754J50541R0091J5113J59884K47645n310l43357l55479
$$ 747926 751182 515594 454840 605381 695472 710585 870469 1118114 1112804 769447 413968
41271D13968j00526N0781L20j4282J53298L56666L70615J47368j21332j47772
$$ 413968 313442 364223 364543 350261 503559 860225 1230840 1378208 1256876 1109104
41261A109104J44453M34416L10454j80683n25013l97037p1161J7057j12809r7605
$$ 1109104 1253557 1687973 1998427 1817744 1292731 895694 824533 841590 728781 631176
41251F31176J79407M36768M23653K25130O9185K3849j2502j29690k98436l94435
$$ 631176 810583 1247351 1671004 1896134 1965319 1989168 1976666 1846976 1548540 1154105
41241A154105l01099l9542K01214K33523P9555o0707o1004m230k9234j24140j54584
$$ 1154105 853006 813464 1014678 1248201 1327756 1267049 1206045 1201815 1172581 1048441 893857
41230H93857o6045L0895K17j51243k90424l15802k39670j10324P1727K93025M24053
$$ 893857 827812 858707 858924 707681 417257 101455 -138215 -248539 -176812 116213 540266
41219E40266K94780p3415l91672l67849m3013K32835J99528k0949j05382O0077
$$ 540266 835046 761631 369959 2110 -40903 191932 391460 370511 265129 325206
41209C25206K71170L01009J69969O0934O7900J21254J04781l2558k29719l14398
$$ 325206 596376 897385 1067354 1128288 1196188 1317442 1422223 1389665 1159946 845548
41199H45548j38739J88582L17017O6649k63937k33130J34082L49007J24576k44482
$$ 845548 706809 895391 1212408 1279057 1015120 781990 916072 1265079 1389655 1145173
41189A145173l13409o2593J69523J63521l892j66159k32952j92752j23379j59008
$$ 1145173 831764 769171 938694 1102215 1098323 932164 699212 506460 383081 224073
41179B24073k96699l04982q732L91167N04260K55985j3997j4538J34350J19506
$$ 224073 -72626 -377608 -386340 4827 509087 765072 751075 736537 870887 990393
41169I90393j15871k93458j51373K24261M66108L17821q2022l62426l41314j75801
$$ 990393 874522 581064 429691 653952 1120060 1437881 1355859 993433 652119 476318
41159D76318q2550o7518j9922P1830J30780J11502m737k10258l51074j81961K81931
$$ 476318 393768 326250 306328 378158 508938 620440 615703 405445 54371 -127590 154341
41148A54341O50787O30433M25686L75400L63115J2864n95465q85812n58682p298
$$ 154341 805128 1435561 1861247 2236647 2599762 2612626 2017161 1131349 572667 565369
41138E65369K01888l8328m07291n47784k97018K10944N60112M36451P9565K8729
$$ 565369 767257 728929 321638 -226146 -523164 -312220 247892 684343 763908 792637
41128G92637L34282M46415P1134l43652l11864n5426q0224l54858m66227l62525
$$ 792637 1126919 1573334 1644468 1300816 988952 933526 853302 498444 32217 -330308
41118c30308l37251l74666j30051L91830P01171N18062J39144p0188j31805j79946
$$ -330308 -667559 -1042225 -1172276 -780446 -79275 438787 577931 507743 375938 195992
41108A95992j08733J96818N22616N21142J35842l54935o20699n11342j61326O2531
$$ 195992 87259 284077 806693 1327835 1463677 1108742 488043 -23299 -184625 -122094
41098a22094q6120l61860k64607K49257O10888L91255j10777l26071j77361k34
$$ -122094 -208214 -570074 -834681 -585424 25464 416719 305942 -20129 -197490 -197724
41088a97724Q3774K41409M48542M23602J17688j34628r9134N3757Q7446L3246
$$ -197724 -113950 127459 576001 999603 1117291 982663 883529 937286 1024732 1057978
41078A057978j3480j39668l81870m75522j73752L08747N12690L47559J53039J35499
$$ 1057978 1044498 904830 522960 47438 -126314 182433 695123 1042682 1195721 1331220
41068A331220R4485j71257m96389n91581m26272j53102J46639L88344L52158k1361
$$ 1331220 1425705 1254448 758059 166478 -259794 -412896 -266257 122087 474245 452884
41058D52884l24152j02749M14793M96191m8813n00942k38392L37596M09780k5528
$$ 452884 128732 25983 440776 936967 888154 387212 148820 486416 896196 870668
41048H70668k19272J11310L74921J22808k21043j02185K28727J57566k40676l27176
$$ 870668 651396 762706 1137627 1260435 1039392 937207 1165934 1323500 1082824 755648
41038G55648R798J54112j84435m29000o0887M73975L88924k33347n41277j61307
$$ 755648 765446 919558 735123 306123 245236 719211 1108135 874788 333511 172204
41028A72204L17092K62994j48710l40932j81254K072K4725K0402P2864P3490L875
$$ 172204 489296 752290 603580 262648 81394 83466 108191 128593 201457 274947 278822
41017B78822M5143K78976M94912M33916J01140k50834l60616j57794J55599K28376
$$ 278822 323965 602941 1097853 1531769 1632909 1382075 1021459 863665 1019264 1247640
41007A247640o7739l93804k94471J82297M97457L41342J6118r0045o9627k10146
$$ 1247640 1179901 786097 491626 673923 1171380 1512722 1528840 1438795 1369168 1159022
40997A159022m20906l88587j56398o7361j63285j21626J49023L26338K37191J47134
$$ 1159022 738116 349529 193131 125770 -37515 -159141 -10118 316220 553411 700545
40987G00545K48731K89056M6325j94670q1858J68900R6761j95897j26904M48766
$$ 700545 949276 1238332 1284657 1089987 1008129 1177029 1273790 1077893 950989 1399755
40977A399755R37610Q09083K90516L349J82499N18677O02017K95803k22814o23059
$$ 1399755 2337365 3146448 3436964 3440313 3622812 4141489 4743506 5039309 4816495 4193436
40967D193436o97335n74999n57102o95089p24719m94267k05780p5624j5810J19575
$$ 4193436 3496101 2921102 2364000 1668911 944192 449925 244145 168521 152711 272286
40957B72286K19447J45566N7406J38625J77529j24410n21051m35890J39854N13446
$$ 272286 491733 637299 694705 833330 1010859 886449 365398 -70492 69362 582808
40947E82808K63215j56645j28992K19526K89694o7579m10938m09566k15045q4186
$$ 582808 846023 689378 560386 779912 1069606 1002027 591089 181523 -33522 -117708
40937a17708j7878Q5247J86702J86469R2814m475m1049J722J08671K31950L23558
$$ -117708 -135586 -50339 136363 322832 415646 411171 370122 371844 480515 712465 1036023
40926A036023L45271K24547q2221m11614m65942k29522j04971l66513o69208m84466
$$ 1036023 1381294 1605841 1523620 1112006 646064 416542 311571 -54942 -724150 -1208616
40916a208616R3403M44611L26325J68053L23781N21790L54199o8002l17397k55878
$$ -1208616 -1115213 -670602 -344277 -176224 147557 669347 1023546 955544 638147 382269
40906C82269q1072O0659J68536K02591J13452K565J654M2768l1173j86100k48336
$$ 382269 301197 361856 530392 732983 846435 849000 850654 893422 862249 676149 427813
40895D27813j93766j72641k57631l43479l00611j10053J31278K63550J97179N2553
$$ 427813 234047 61406 -196225 -539704 -840315 -950368 -819090 -555540 -358361 -305808
40885c05808L2803J00434K939k65819l23765M7597M91170N40846K67475P3153
$$ -305808 -273005 -172571 -169632 -435451 -759216 -711619 -220449 320397 587872 661025
40875F61025L3022r2884k89839k39342J21303M40375M60133L05593J51314l8549
$$ 661025 694047 601163 311324 71982 193285 633660 1093793 1399386 1550700 1512151
40865A512151k80680m00130k79946n3642J02487J68728J64734M9075j44639k62795
$$ 1512151 1231471 831341 551395 497753 600240 768968 933702 982777 838138 575343
40855E75343k31368j42717q8817q1230j50264l03570l76255j81677J63258L39297
$$ 575343 343975 201258 112441 31211 -119053 -422623 -798878 -980555 -817297 -478000
40845d78000K75744J97186K00398J48886M7749J08900L09726L08333l352k69673
$$ -478000 -202256 -5070 195328 344214 391963 500863 810589 1118922 1115570 845897
40835H45897k37319j47939k58978l54000j20807K76481M19081K33355L026o2867
$$ 845897 608578 460639 201661 -152339 -273146 3335 422416 655771 658797 595930
40825E95930L7723K34822L66608K09944j88316m22279k58430p245l6611j99786
$$ 595930 633653 868475 1235083 1445027 1256711 834432 576002 568757 532146 332360
40815C32360j62193k3101r5461k65318j50025J96128L18608J02762q2548l8736
$$ 332360 170167 147066 51605 -213713 -363738 -167610 150998 253760 171212 132476
40805A32476J1065n6033k2711J82329K43540j5577k69679j78805P8545J06733
$$ 132476 143541 87508 64797 247126 490666 475089 205410 26605 105150 211883
40795B11883r7693j92589l2226J55397J26415p0936j98984j22704O4365J84588
$$ 211883 114190 -78399 -110625 44772 171187 100251 -98733 -221437 -157072 27516
40785B7516J97561K03375K23031J26630j25259l35030l25670j86800o8782Q1269
$$ 27516 225077 428452 651483 778113 652854 317824 -7846 -194646 -263428 -182159
40775a82159L11427L89844J06261k88747l67190j66490r4953k29641k17319O4298
$$ -182159 129268 519112 625373 336626 -30564 -197054 -292007 -521648 -738967 -674669
40765f74669K64591J42617p1433j08164m0086k358Q2860K48199K91971J12986
$$ -674669 -410078 -267461 -338894 -447058 -487144 -489502 -406642 -158443 133528 246514
40755B46514o1812k2565J29296K22712K34552R5683l14235p48502o41802P0125
$$ 246514 184702 162137 291433 514145 748697 844380 530145 -218357 -860159 -790034
40745g90034O37404M61442m4066j18858J72411J31392l91538p51615m95737M1172
$$ -790034 -152630 308812 264746 145888 318299 449691 58153 -693462 -1189199 -1148027
40735a148027L02314J88301l0025j09582L5852L18769M56528K18228k16503l97555
$$ -1148027 -845713 -657412 -687437 -797019 -761167 -442398 14130 232358 15855 -381700
40725c81700j76452J21581J73635L9652l7252L2243J69619K59300J97929j7891
$$ -381700 -558152 -436571 -262936 -223284 -260536 -228293 -58674 200626 398555 380664
40715C80664j98305j37173Q4959J83391Q1641o894L5810M1846j30338l43520l98104
$$ 380664 182359 45186 130145 313536 395177 388283 424093 465939 335601 -7919 -406023
40704d06023k99945j59939m843J58504K46424K15546J48844J10052N5944p058
$$ -406023 -705968 -865907 -870750 -712246 -465822 -250276 -101432 8620 64564 57506
40694E7506L0660J39306O8780k68591n13423k54052L71294P66756N85422Q5631
$$ 57506 88166 227472 296252 27661 -485762 -739814 -368520 398236 983658 1069289
40684A069289k68858l10618j47590J25472M48613O30052M42538m8544m54935m93762
$$ 1069289 800431 489813 342223 467695 916308 1546360 1988898 1940354 1485419 991657
40674I91657l15808k56942l72057m26996l01020j31925j8576J49233M28089O20824
$$ 991657 675849 418907 46850 -380146 -681166 -813091 -831667 -682434 -254345 366479
40664C66479N35118K70550M7430r7626k36377l26170l04075k59737k54289j25163
$$ 366479 901597 1172147 1219577 1121951 885574 559404 255329 -4408 -258697 -383860
40654c83860K17017M65930K97741n9691j25910L8530o4194m28995m12335J98239
$$ -383860 -166843 299087 596828 537137 411227 449757 385563 -43432 -455767 -257528
40644b57528O63470L33279l38774m52561M4997M18980K83330l6389k12125k88390
$$ -257528 405942 739221 400447 -52114 -7117 411863 695193 658804 446679 158289
40634A58289k81889n6946K31253J64475k29197l54918M6004M11689K03449k50670
$$ 158289 -123600 -180546 50707 215182 -14015 -368933 -322929 88760 292209 41539
40624D1539l07923k6599M0521j49451q5188L28449M94887O7814m36046l64876
$$ 41539 -266384 -292983 -252462 -401913 -487101 -158652 336235 404049 -31997 -396873
40614c96873J50516M57293K92634j7961j39232p6216L7210J42500J88100J10310
$$ -396873 -246357 210936 503570 485609 346377 270161 307371 449871 637971 748281
40604G48281n5688k19197l81361n46916n32769j42021M42918P35873N27421J40563
$$ 748281 692593 473396 92035 -454881 -987650 -1129671 -686753 49120 576541 717104
40594G17104l0818J283o758r2707r0390M1552J53976J44853N8999m0254j19925
$$ 717104 686286 687569 680811 588104 497714 539266 693242 838095 897094 856840 736915
40583G36915j01242P9906K99996L08481M8091k17338k19977n5580o9974l57708
$$ 736915 635673 715579 1015575 1324056 1372147 1154809 934832 879252 809278 451570
40573D51570n41101k13303M56309P98018M21789k86120o44953m87672j96686n2981
$$ 451570 -89531 -302834 153475 951493 1373282 1087162 442209 -45463 -242149 -295130
40563b95130L8814J54724J36425l9485p2419J92883M19321K28874k44736n86702
$$ -295130 -256316 -101592 34833 -4652 -77071 115812 535133 764007 519271 -67431
40553f7431o53433n37793k25274K65455N82023L98859o868o8452K13543K93392
$$ -67431 -720864 -1258657 -1483931 -1218476 -636453 -237594 -244462 -312914 -99371 194021
40543A94021n847k26153r2911L0961j63241l49273j40168J99738J63536j69273
$$ 194021 188174 -37979 -130890 -99929 -263170 -612443 -752611 -552873 -389337 -558610
40533e58610k73115J1039L27911M07992L34195K04776l0505l21488m63973l91293
$$ -558610 -831725 -820686 -492775 -84783 249412 454188 423683 102195 -361778 -753071
40523g53071k40140p5339J66392M14594M57342K78641J06943K9432j30164m10327
$$ -753071 -993211 -1068550 -902158 -487564 -30222 248419 355362 384794 254630 -155697
40513a55697n20955k86427Q152J9226j23919m7106K45190L76914K14017O9423
$$ -155697 -676652 -963079 -954927 -935701 -1059620 -1106726 -861536 -484622 -270605 -201182
40503b01182J86018L60315K85964J4618j77701k05308j79207j17750M1458J80649
$$ -201182 -15164 345151 631115 645733 468032 262724 83517 -34233 7225 187874
40493A87874P8952j92730k58662M1975L84291M03327J91351R4437J71800J69808
$$ 187874 266826 74096 -184566 -142591 241700 645027 836378 930815 1102615 1272423
40483A272423k2604k09143k21272j51266j42249j49615o1045P1940Q3931n6400
$$ 1272423 1249819 1040676 819404 668138 525889 376274 315229 387169 471100 414700
40473D14700j71362r0516J00277J09084j95567n32417m91277p8367K49063J84160
$$ 414700 243338 152822 253099 362183 166616 -365801 -857078 -935445 -686382 -502222
40463e02222n3806j20028l4101J7183Q9535K81596L42402P24m23237l28518K23308
$$ -502222 -556028 -676056 -710157 -692974 -603439 -321843 20559 21283 -401954 -730472 -507164
40452e07164M88725J13648l69567l70433j2754K59641L45174L40080J74852j36032
$$ -507164 -18439 95209 -274358 -644791 -657545 -397904 -52730 287350 462202 326170
40442C26170k52119n807J87082o2103m03011k50828K31727L47068l3305k92123
$$ 326170 74051 68244 255326 193223 -209788 -460616 -228889 118179 84874 -207249
40432b07249p3456J97117M3396l31609l83325K8794N30296O86631L78415j44929
$$ -207249 -280705 -83588 -40192 -371801 -755126 -726332 -196036 490595 869010 724081
40422G24081m72202l91997q1198J48793K06942J75373O6011j16522k07307q8279
$$ 724081 251879 -140118 -221316 -72523 134419 309792 375803 259281 51974 -36305
40412c6305N0731j9191j70795j52349m3126m0623J4243L39213O01518L08068k54939
$$ -36305 14426 -4765 -175560 -327909 -371035 -411658 -397415 -58202 543316 851384 596445
40401E96445k80957K73337N37896J12887l10855j69433L4735k88830o71377l32308
$$ 596445 315488 588825 1126721 1239608 928753 759320 794055 505225 -166152 -498460
40391d98460M44709O74768J48478l95737m75438l52459k84804j22148J72477K99666
$$ -498460 -53751 621017 769495 373758 -101680 -454139 -738943 -861091 -688614 -388948
40381c88948J67605Q6057J84727J64087j18001k96773n0972L79788N39467L30846
$$ -388948 -221343 -135286 49441 213528 95527 -201246 -252218 127570 667037 997883
40371I97883j0652k68624l48844k47827r9620o8276r9708j6208R9872l4536l63925
$$ 997883 987231 718607 369763 121936 22316 -45960 -145668 -161876 -62004 -96540 -460465
40360d60465m28960m2202L71097L81573J35783J133k2314j29821k28576q9765
$$ -460465 -889425 -931627 -560530 -178957 -43174 -42041 -64355 -194176 -422752 -512517
40350e12517J79401K65316J65223J57744K89865K88905K0682k95446l94853k46267
$$ -512517 -333116 -67800 97423 255167 545032 833937 854619 559173 164320 -81947
40340h1947P231J83182J58784K7867P0906L43376M53236Q4100m19954m55709o3795
$$ -81947 -74716 108466 267250 295117 366023 709399 1162635 1246735 826781 371072 307277
40329C07277J26630j11204k87875o7655J75511M6071j78413n8370K23109J92423
$$ 307277 433907 322703 34828 -32827 142684 188755 10342 -48028 175081 367504
40319C67504p7643j13712J10660J31788j87139m08785k23866J21407K80839K37375
$$ 367504 289861 176149 286809 418597 231458 -177327 -401193 -279786 1053 238428
40309B38428Q5437j77639m13928l23608N8439K47425J7370j77604Q8767M60312
$$ 238428 323865 146226 -267702 -591310 -532871 -285446 -268076 -445680 -356913 103399
40299A03399L11360k36307m61601j39044J76003O1333j86871j46013O6866J05721
$$ 103399 414759 178452 -283149 -422193 -246190 -184857 -371728 -517741 -450875 -345154
40289c45154P974N2029K08437J77387q5410k68527j74430J8665O9522J7652O3479
$$ -345154 -337180 -285151 -76714 100673 15263 -253264 -427694 -409029 -339507 -321855 -258376
40278b58376K38578L50034K20515j06607l97694m29305j80836J42821K96794K19471
$$ -258376 -19798 330236 550751 444144 46450 -382855 -563691 -420870 -124076 95395
40268I5395N3416m3997m2008L3189K01435M41072N57442L33907j35297m54133
$$ 95395 148811 104814 62806 95995 297430 738502 1295944 1629851 1494554 1040421
40258A040421m00451k26453k83826m97181n05873k46019j3360P1389K29774N16734
$$ 1040421 639970 413517 129691 -367490 -873363 -1119382 -1132742 -1061353 -831579 -314845
40248c14845N88963K63052r6882j32979p2510k60646m31787j01210M81785N33082
$$ -314845 274118 537170 440288 307309 234799 -25847 -457634 -558844 -77059 456023
40238D56023o3860n13757l04488P2017J2817k15847p635N06931O31458J77012
$$ 456023 392163 -121594 -426082 -354065 -341248 -557095 -564730 -57799 573659 750671
40228G50671l07027l82229k25044j57865j55417m6015J29151K17282K24268K63478
$$ 750671 443644 61415 -163629 -321494 -476911 -522926 -393775 -176493 47775 311253
40218C11253L33228L15596J62419k8519j24854r5598k4709k877l2795o9485j10873
$$ 311253 644481 960077 1122496 1093977 969123 873525 848816 845939 813144 743659 632786
40207F32786j62031j47853o524J40985J05246o3274j07346K9885R5279m8228j68783
$$ 632786 470755 322902 316378 457363 562609 499335 391989 421874 517153 468925 300142
40196C00142m7061J51618J56008J4530o4839j00757k11635k66131o7218K09186
$$ 300142 253081 404699 560707 575237 510398 409641 198006 -68125 -135343 73843
40186G3843J93896p5546j74566L2517J77183L021k06233q1221K46772L43623J05849
$$ 73843 267739 192193 17627 50144 227327 230348 24115 -57106 189666 533289 639138
40175F39138j25821p7360R2311N5221j82847k43664R1680M86929M42921L7024
$$ 639138 513317 435957 528268 583489 400642 156978 248658 735587 1178508 1215532
40165A215532j14540K21601M39251o0077q90340j110797n05819J66899K62517
$$ 1215532 1100992 1322593 1761844 1701767 811427 -299370 -805189 -638290 -375773
40156c75773R692l0391K15868L98213L19975J00162r4134k08928k56080k55068
$$ -375773 -366081 -396472 -180604 217609 537584 637746 543612 334684 78604 -176464
40146a76464j81852L9799L69074N10561J96386l74989o65258m26037O9372M63256
$$ -176464 -358316 -318517 50557 561118 757504 382515 -282743 -708780 -639408 -176152
40136a76152O41563N50526J10498m72606o91827l39506J57869K93832J15155O085
$$ -176152 465411 1015937 1126435 653829 -37998 -377504 -219635 74197 189352 195437
40126A95437Q6331J67544J34823L4361j06349k56288k78238j02220R9170J31826
$$ 195437 281768 449312 584135 618496 512147 255859 -22379 -124599 -25429 106397
40116A06397N3214J3374j8319j29771k28625j79007k6668J38579L45175N18098
$$ 106397 159611 172985 154666 24895 -203730 -382737 -409405 -270826 74349 592447
40106E92447L70972j22216m26140j02537M34576M06590j76813n02859j58061L19904
$$ 592447 963419 841203 415063 312526 747102 1153692 976879 474020 315959 635863
40096F35863L41449J13952J59352M22616M11332K4713k86376j91703R7778J93954
$$ 635863 977312 1091264 1250616 1673232 2084564 2109277 1822901 1631198 1728976 1922930
40086A922930K6188j93944l17006l61428l47891k38750q6739p1628k55782m12660
$$ 1922930 1949118 1755174 1438168 1076740 728849 490099 403360 331732 75950 -336710
40076c36710k81546N7071K64512J86959j0079j48750j98977r6625K41060N88458
$$ -336710 -618256 -561185 -296673 -109714 -119793 -268543 -467520 -564145 -323085 265373
40066B65373M91906p9132n31974m21324o1045L1515n9896O2793L08636K44400
$$ 265373 757279 678147 146173 -275151 -336196 -304681 -364577 -301784 6852 251252
40056B51252q5264j81940M5076J23014j38881k94115j5671L46165L16548j2127
$$ 251252 165988 -15952 29124 152138 13257 -280858 -296529 49636 366184 354057
40046C54057j99758o4492K36321M78646M73774J34263l45995n93833m89884k54976
$$ 354057 154299 89807 326128 804774 1278548 1412811 1066816 472983 -16901 -271877
40036b71877k1162L15177O70205O47917J18092m59880o02744l64257m8187K57297
$$ -271877 -293039 22138 692343 1340260 1458352 998472 395728 31471 -16716 240581
40026B40581N03196M24775o6858n20022m54462l9065J91238J04746q349k1209
$$ 240581 743777 1168552 1101694 581672 127210 88145 279383 384129 375780 354571
40016C54571o5470j24644k9901J43579J16312j34145l31963l36459k59874j53482
$$ 354571 289101 164457 134556 278135 394447 260302 -71661 -408120 -667994 -821476
40006h21476N4790K81471K97761P9852j36142j77330n9529J72098M35538M94877
$$ -821476 -766686 -485215 -187454 -107602 -243744 -421074 -480603 -308505 127033 621910
39996F21910J81020k90048n28337m57429k86624j02057J27647K38220L1633k85574
$$ 621910 802930 512882 -15455 -472884 -759508 -861565 -733918 -495698 -464065 -749639
39986g49639l13611j01847o1759k22278j60171K21812M62130K96249O2704P7692
$$ -749639 -1063250 -1165097 -1226856 -1449134 -1609305 -1387493 -925363 -629114 -566410 -488718
39976d88718J56443R0117P4477K66541L82139J65665j46739k51919k65724l54639
$$ -488718 -332275 -242158 -167681 98860 480999 646664 499925 248006 -17718 -372357
39966c72357l03527M8536L35058J88334j00970m6546K17568K29918M7044Q1130
$$ -372357 -675884 -627348 -292290 -103956 -204926 -251472 -33904 196014 243058 324188
39956C24188K70920J71866k00259l72159k55700k25303k99064n6079M51293N34847
$$ 324188 595108 766974 566715 194556 -61144 -286447 -585511 -641590 -190297 344550
39946C44550l5103n36944l68416O6928J12515r4084j9920K55622K11984j51249
$$ 344550 309447 -227497 -595913 -528985 -416470 -510554 -530474 -274852 -62868 -214117
39936b14117k79709L2417L52539L13385P3514p8540j47056k52534l46254l14119
$$ -214117 -493826 -461409 -108870 204515 278029 199489 52433 -200101 -546355 -860474
39926h60474j77382l5576O9646J46028K01424K38794K21763P5683j68550k99613
$$ -860474 -1037856 -1073432 -1003786 -857758 -656334 -417540 -195777 -120094 -288644 -588257
39916e88257j59042R9269J69812n487j85718j74621k8213J04542J73506J99938
$$ -588257 -747299 -648030 -478218 -483705 -669423 -844044 -872257 -767715 -594209 -394271
39906c94271J82455J01794k5438j13639l5918K21866M12491K20263k75125n34248
$$ -394271 -211816 -110022 -135460 -249099 -285017 -63151 349340 569603 294478 -239770
39896b39770j83617M49326O98758L58295j59620l86906k35865P6958K52518Q3180
$$ -239770 -423387 25939 724697 1082992 923372 536466 300601 377559 630077 713257
39886G13257l21335n24500k55350J73659K67134M6391q2161n2639j61243l61655
$$ 713257 391922 -132578 -387928 -214269 52865 99256 17095 -35544 -196787 -558442
39876e58442k17828K61710M40901N8744k47769O5173N23144L72596j97164l53292
$$ -558442 -776270 -514560 -73659 -14915 -262684 -197511 325633 698229 501065 147773
39866A47773J01422N39062N24402K80639Q7490j06547l18311l59318k28236j90263
$$ 147773 249195 788257 1312659 1593298 1680788 1574241 1255930 896612 668376 478113
39856D78113k95893k81008r5182l3589j51509p0774L44314O12677L21352k13831
$$ 478113 182220 -98788 -193970 -227559 -379068 -449842 -105528 507149 828501 614670
39846F14670l93025j39712J42687J92046Q5204j6948l659J55622K80309R9495
$$ 614670 221645 81933 224620 416666 501870 484922 481263 636885 917194 1016689
39836A016689k78619l46141N6481L62536R1672l34995j99051L55088M91118m5196
$$ 1016689 738070 391929 448410 810946 902618 567623 368572 723660 1214778 1169582
39826A169582n52932m16462J06932L93262K52051p1395l15679l35717r3737K32617
$$ 1169582 616650 200188 307120 700382 952433 881038 565359 229642 135905 368522
39816C68522L37201J51980o1054q0486L8712J62707K33842J62226j18039l98306
$$ 368522 705723 857703 796649 716163 754875 917582 1151424 1313650 1195611 797305
39806G97305l47274j7306J71638O1197o5990p6802k27316n45805n45061R057N43737
$$ 797305 450031 432725 604363 665560 599570 522768 295452 -250353 -795414 -786357 -242620
39795b42620M51261N637j25204M7978j7448l71854m90029k02235N1114K7707N1473
$$ -242620 208641 214278 89074 137052 119604 -252250 -742279 -944514 -893400 -865693 -814220
39784h14220L31448N29197L44254L0076n3906p511j10993k81819k09911J40980
$$ -814220 -482772 46425 390679 420755 366849 359338 248345 -33474 -243385 -102405
39774a02405M87759N64271K89288k34676o90598p07718k74351J75314K72706J17657
$$ -102405 385354 949625 1238913 1004237 313639 -394079 -668430 -493116 -220410 -102753
39764a02753r158p2958j54987j43516Q6734L41960L29029J28109Q3436K40917
$$ -102753 -111911 -184869 -339856 -483372 -396638 -54678 274351 402460 485896 726813
39754G26813K49317j04872n49164o42273k71019K66200N62193M32957M0534k64139
$$ 726813 976130 871258 322094 -320179 -591198 -324998 237195 670152 710686 446547
39744D46547k56462k509K76630M09662L26218O3725j84835j85125M8513K15163
$$ 446547 190085 187576 464206 873868 1200086 1263811 1078976 893851 942364 1157527
39734A157527J10370j02817j58852p1710o2049k16773l98775m14563j64879K40529
$$ 1157527 1267897 1165080 1006228 934518 872469 655696 256921 -157642 -322521 -81992
39724h1992M56622K29157j68574j70910K50656M42869N0743l74816k44235R6661
$$ -81992 374630 603787 435213 264303 514959 957828 1008571 633755 389520 486181
39714D86181k8253m32883l76110J27897L00671o3554k61314P4096L61039J39280
$$ 486181 457928 25045 -351065 -223168 77503 13949 -247365 -173269 187770 327050
39704C27050j34274M5072L26827J83833j26544o4876K01902J33318k03992l08367
$$ 327050 192776 237848 564675 748508 621964 557088 758990 892308 688316 379949
39694C79949j63639j71718l01905j28341L02071M31211J10376j63852q7186M9046
$$ 379949 216310 44592 -257313 -385654 -83583 347628 458004 294152 206966 256012
39684B56012j0741r0479p0047j60302l74630l02898J82127N05899J77742m01062
$$ 256012 245271 154792 84745 -75557 -450187 -753085 -570958 -65059 112683 -288379
39674b88379m65031L9957M66621M22870J78620J02957J67125J59670O8713L5651
$$ -288379 -753410 -713453 -246832 176038 354658 457615 624740 784410 853123 888774
39664H88774Q6749R4773k4506j85357k38724j77264j56430k55685l10021j27078
$$ 888774 975523 1070296 1045790 860433 621709 444445 288015 32330 -277691 -404769
39654d04769J88888L46842K91640K48382K91789J90744j45224l67813j36838L33128
$$ -404769 -215881 130961 422601 670983 962772 1153516 1008292 640479 503641 836769
39644H36769N19034K87311o097r7687j27505k62635l54888k26659o6872j90981
$$ 836769 1355803 1643114 1637017 1539330 1411825 1149190 794302 567643 500771 309790
39634C09790m74140m04266J85677P65917P50052K61221r3796q2945k5649j03795
$$ 309790 -164350 -568616 -382939 382978 1133030 1394251 1300455 1217510 1191861 1088066
39624A088066l7804L12394N22963K17180k66626l56951j51992k16904n86659o64015
$$ 1088066 1050262 1362656 1885619 2102799 1836173 1479222 1327230 1110326 523667 -140348
39614a40348k02823K69858K69818J9675o4879o0609k32446l99922j66240L67317
$$ -140348 -343171 -73313 196505 216180 151301 90692 -141754 -541676 -707916 -340599
39604c40599O31035L48891j18422k79026p7046J66970K00296P1245l5433p3476
$$ -340599 290436 639327 520905 241879 164833 331803 532099 603344 567911 494435
39594D94435j47969k59881k14146O7588L06488K08073p1413j51806m8553j15897
$$ 494435 346466 86585 -127561 -59973 246515 454588 383175 231369 182816 66919
39584F6919l61660l57258J3952K71758R7681j32625J8670L29479L21476M2538
$$ 66919 -294741 -651999 -638047 -366289 -268608 -401233 -382563 -53084 268392 310930
39574C10930r3663j3951P783r4784j26043m9458j5906l6855l0843j01448l50462
$$ 310930 217267 203316 211099 116315 -9728 -59186 -75092 -111947 -142790 -244238 -594700
39563e94700n09384k18499L59081O45573L84497j14192m54279n02480k82164Q8352
$$ -594700 -1104084 -1322583 -963502 -317929 66568 -47624 -501903 -1004383 -1286547 -1198195
39553a198195L46104L25119K22097K87473L62909J47684j97648k38563O462J04366
$$ -1198195 -852091 -526972 -304875 -17402 345507 493191 295543 56980 63442 167808
39543A67808l2461n4161Q5260k6306m64927o79787l29043J65412K92858J83582
$$ 167808 135347 81186 166446 140140 -324787 -1004574 -1333617 -1168205 -875347 -691765
39533f91765K19881L42709K48253j9971j64234j35329j23705j73111j57418n6291
$$ -691765 -471884 -129175 119078 99107 -65127 -200456 -324161 -497272 -654690 -710981
39523g10981L0609P3417J03637R6769J5743j18182k62656l16413p4056M85617
$$ -710981 -680372 -606955 -503318 -406549 -390806 -508988 -771644 -1088057 -1162113 -676496
39513f76496Q92257O14247j31926n27490k67032O6155L687j14772Q3158K25282
$$ -676496 215761 830008 698082 170592 -96440 -30285 -26598 -141370 -58212 167070
39503A67070r5302l93548K2286P79629Q45831J01858m73501l01931M9561o5640
$$ 167070 71768 -321780 -299494 480135 1325966 1427824 954323 652392 701953 636313
39493F36313l97300l89607j03951N2714Q0808K40683M16011K47697j83828l76527
$$ 636313 239013 -150594 -254545 -201831 -121023 119660 535671 783368 599540 223013
39483B23013j59698N8423m4105k07367m4076L11229L95045J21876j21473j04034
$$ 223013 63315 121738 77633 -129734 -173810 137419 532464 654340 532867 428833
39473D28833n1894j65868k43398q6948N5501j10132l44565k24373J06180J60928
$$ 428833 376939 211071 -32327 -119275 -63774 -173906 -518471 -742844 -636664 -475736
39463d75736Q302J90573O60476O41677j11081p24278m43327K30044L55406m1511
$$ -475736 -467434 -276861 383615 1025292 914211 189933 -253394 -23350 332056 290545
39453B90545k20609o570R9559p5179j52180P93M7958j17497j58416N0191J78488
$$ 290545 69936 63366 162925 87746 -64434 -63641 -15683 -133180 -291596 -241405 -62917
39442f2917O4987J3739K19551L92837K37177r7151k93481k82297j74684o3757
$$ -62917 2070 15809 235360 628197 865374 768223 474742 192445 17761 -45996
39432d5996l5560j20167j63550k3213J13207m7872l82586m59517j69415J91531
$$ -45996 -81556 -201723 -365273 -388486 -275279 -323151 -705737 -1165254 -1334669 -1143138
39422a143138M48214O54770O89442L33946j82870l45745j64309j63159m21713
$$ -1143138 -694924 -40154 649288 983234 800364 454619 290310 127151 -294562
39413b94562l75937J61149N69740M19737J43633K05672L18356R9674j59811r8893
$$ -294562 -670499 -509350 60390 480127 623760 829432 1147788 1247462 1087651 988758
39403I88758m6907l77755o39321k44374L90993M11861m6605q1696M12038N32868
$$ 988758 941851 564096 -75225 -319599 71394 483255 436650 354954 766992 1299860
39393A299860j06895p16351n84653j02867K5611j22154n0537J96642J60690j73964
$$ 1299860 1192965 476614 -108039 -210906 -185295 -307449 -357986 -161344 -654 -174618
39383a74618k96026M7777M55004L95026j21180n53176m39321R9008M99788L89644
$$ -174618 -470644 -422867 32137 427163 305983 -247193 -686514 -587506 -87718 301926
39373C01926m3101l66207m13916k91924n3923K95618N47342M16822q924k75813
$$ 301926 258825 -107382 -521298 -813222 -867145 -571527 -24185 392637 383713 107900
39363A07900j30390J71630K49867P8779o0912K9265K45849K98144K6979l45771
$$ 107900 -22490 149140 399007 477786 416874 446139 691988 990132 1017111 671340
39353F71340l86762R975M12137L89873R1663l4568N8837K5398k29155l87570k71400
$$ 671340 284578 294553 706690 1096563 1188226 1153658 1212495 1237893 1008738 621168 349768
39342C49768r6083l9910K0717J58877J71826n0594k64015k32963p4934R58K4705
$$ 349768 253685 213775 234492 393369 565195 514601 250586 17623 -57311 -56353 -31648
39331c1648Q4316R2968K6915J29423N23911Q33242N91947o2957n04292m04130
$$ -31648 52668 145636 172551 301974 825885 1659127 2251074 2188117 1683825 1279695
39321A279695p0048M5320j27955l34323l52684j77241K8940P2949r0697k76736
$$ 1279695 1209647 1254967 1127012 792689 440005 262764 291704 364653 273956 -2780
39311b780k42279K5986K73548K61829K7498j86692k19529j42305j07070j15946
$$ -2780 -245059 -219073 54475 316304 343802 157110 -62419 -204724 -311794 -427740
39301d27740m8275R1369J21207k6532j30772J5829K61660L02926J46028O2055
$$ -427740 -476015 -384646 -263439 -289971 -420743 -404914 -143254 159672 305700 367755
39291C67755J16998R4341p9006j95529j63269j75828l12945l20810l3879K89461
$$ 367755 484753 579094 500088 304559 141290 -34538 -347483 -668293 -702172 -412711
39281d12711L31509J51626k4885j81814l43885l04610N5474L83173K62197j17128
$$ -412711 -81202 70424 45539 -136275 -480160 -784770 -729296 -346123 -83926 -201054
39271b01054k00342Q3193K61836J32940L4631J42620J00277l01718n99189l12419
$$ -201054 -401396 -318203 -56367 76573 111204 253824 354101 52383 -546806 -859225
39261h59225K40035L76957R2596J4243L58909O00090L50340l3657r1408n929j85964
$$ -859225 -619190 -242233 -149637 -135394 223515 823605 1173945 1140288 1048880 1042951 856987
39250H56987m39328k27282L51079N28217j3574o07846n44778n9809J19352j14467
$$ 856987 417659 190377 541456 1069673 1056099 448253 -96525 -156334 -36982 -151449
39240a51449k02111J17882M20626K96191o4505k44507k06246k05772l06074k89804
$$ -151449 -353560 -235678 184948 481139 416634 172127 -34119 -239891 -545965 -835769
39230h35769q505L95449O41777N99342M00997K63428J84119o1796n06264p50445
$$ -835769 -844274 -448825 192952 792294 1193291 1456719 1640838 1579042 1072778 322333
39220C22333m27704K08457N40244L97174J69964P8384j27095n23237o43457j84360
$$ 322333 -105371 103086 643330 1040504 1210468 1288852 1161757 638520 -4937 -189297
39210a89297L48881K59679l25911o26491k80130K74370M88394L09569K3028j30576
$$ -189297 159584 419263 93352 -533139 -813269 -538899 -50505 259064 282092 151516
$$ [...]
##END NTUPLES=NMR SPECTRUM
##END=
