##TITLE=31Pdec_LR-688A-1(R)
 , 24 sc
 29.7.2019
##JCAMPDX= 6.0         $$ Bruker NMR JCAMP-DX V2.0
##DATA TYPE= NMR SPECTRUM
##DATA CLASS= NTUPLES
##ORIGIN= UXNMR, Bruker Analytische Messtechnik GmbH
##OWNER= root
$$ XWIN-NMR		Version 3.5
$$ Mon Jul 29 16:18:28 2019 Russian Standard Time (UT+4h)  she@DPX200
##.OBSERVE FREQUENCY= 81.014009
##.OBSERVE NUCLEUS= ^31P
##.ACQUISITION MODE= SIMULTANEOUS
##.ACQUISITION SCHEME= undefined
##.AVERAGES= 24
##.DIGITISER RES= 16
##SPECTROMETER/DATA SYSTEM= spect
##.PULSE SEQUENCE= zgpg30
##.SOLVENT NAME= CDCl3
##.SHIFT REFERENCE= (INTERNAL, CDCl3, 0, 250.885)
##AUDIT TRAIL= $$ (NUMBER, WHEN, WHO, WHERE, WHAT)
$$ ##TITLE= Audit trail, XWIN-NMR		Version 3.5
$$ ##JCAMPDX= 5.01
$$ ##ORIGIN= Bruker BioSpin GmbH
$$ ##OWNER= she
$$ F:/spectra/data/she/nmr/P31/1/pdata/1/auditp.txt
$$ ##AUDIT TRAIL=  $$ (NUMBER, WHEN, WHO, WHERE, WHAT)
(   1,<2019-07-29 16:17:23.89 +0400>,<she>,<DPX200>,
      <created by zg, POWCHK disabled, PULCHK disabled
       configuration hash MD5:
       00 E9 B6 7A A2 85 ED C7 34 08 36 98 17 FE 4E 26
       data hash MD5: 32K
       B8 C0 04 39 CF 10 8A 7C 1C F8 77 DA 7F 97 01 C1>)
(   2,<2019-07-29 16:17:26.45 +0400>,<she>,<DPX200>,
      <Start of raw data processing
       efp BC_mod = 2 LB = 1 FT_mod = 6 PKNL = 1 PHC0 = -403.9774 PHC1 = 130.4 SI = 64K 
       data hash MD5: 64K
       73 41 DD A2 A5 85 14 76 62 7C F1 2A EF 08 EA 06>)
(   3,<2019-07-29 16:17:44.60 +0400>,<she>,<DPX200>,
      <pk PHC0 = -174.7832 PHC1 = 0 
       data hash MD5: 64K
       22 1C F7 BE 15 B8 C7 04 C1 95 2A 99 BD F1 FF EB>)
(   4,<2019-07-29 16:17:48.76 +0400>,<she>,<DPX200>,
      <abs ABSG = 5 
       data hash MD5: 64K
       BD 11 7E 7D 86 C1 FF CD 43 A8 E3 20 67 5B 18 A1>)
$$ ##END=
$$ 
$$ hash MD5
$$ 5D 21 2D 26 27 AA 61 1C 24 A1 A2 00 F7 55 FC FA
##$RELAX= 
##$RELAX= 
##$RELAX= 
##$RELAX= 
##$RELAX= 
##$RELAX= 
##$RELAX= 
##$RELAX= 
$$ Bruker specific parameters
$$ --------------------------
##$DU= <F:/spectra>
##$EXPNO= 1
##$NAME= <P31>
##$PROCNO= 1
##$TYPE= <nmr>
##$USER= <she>
##$AMP= (0..31)
100 100 100 100 100 100 100 100 100 100 100 100 100 100 100 100 100 100 
100 100 100 100 100 100 100 100 100 100 100 100 100 100 
##$AQSEQ= 0
##$AQ_mod= 1
##$AUNM= <au_zg>
##$AUTOPOS= <>
##$BF1= 81.014009
##$BF2= 200.13
##$BF3= 200.13
##$BF4= 200.13
##$BF5= 200.13
##$BF6= 200.13
##$BF7= 200.13
##$BF8= 200.13
##$BYTORDA= 1
##$CFDGTYP= 0
##$CFRGTYP= 5
##$CHEMSTR= <none>
##$CNST= (0..31)
1 1 145 1 1 1 1 1 1 1 1 1 1 1 1 1 1 1 1 1 1 1 1 1 1 1 1 1 1 1 1 1 
##$CPDPRG= <waltz16>
##$CPDPRG1= <>
##$CPDPRG2= <waltz16>
##$CPDPRG3= <>
##$CPDPRG4= <mlev>
##$CPDPRG5= <mlev>
##$CPDPRG6= <mlev>
##$CPDPRG7= <mlev>
##$CPDPRG8= <mlev>
##$CPDPRGB= <>
##$CPDPRGT= <>
##$D= (0..31)
0 1 0 0 0 0 0 0 0 0 0 0.03 2e-05 3e-06 0 0 0 0 0 0 0 0 0 0 0 0 0 0 0 0 
0 0 
##$DATE= 1564402643
##$DBL= (0..7)
120 120 120 11 120 120 24 19 
##$DBP= (0..7)
150 150 150 150 150 150 150 150 
##$DBP07= 0
##$DBPNAM0= <>
##$DBPNAM1= <>
##$DBPNAM2= <>
$$ [...]
##$SUBNAM3= <"">
##$SUBNAM4= <"">
##$SUBNAM5= <"">
##$SUBNAM6= <"">
##$SUBNAM7= <"">
##$SUBNAM8= <"">
##$SUBNAM9= <"">
##$SW= 501.770088973933
##$SWIBOX= (0..15)
0 1 3 0 0 0 0 0 0 0 0 0 0 0 0 0 
##$SW_h= 40650.406504065
##$TD= 32768
##$TD0= 1
##$TE= 0
##$TE2= 300
##$TE3= 300
##$TEG= 300
##$TL= (0..7)
0 120 53 12 22 120 120 120 
##$TP= (0..7)
150 150 150 150 150 150 150 150 
##$TP07= 0
##$TPNAME0= <>
##$TPNAME1= <>
##$TPNAME2= <>
##$TPNAME3= <>
##$TPNAME4= <>
##$TPNAME5= <>
##$TPNAME6= <>
##$TPNAME7= <>
##$TPOAL= (0..7)
0.5 0.5 0.5 0.5 0.5 0.5 0.5 0.5 
##$TPOFFS= (0..7)
0 0 0 0 0 0 0 0 
##$TUNHIN= 0
##$TUNHOUT= 0
##$TUNXOUT= 0
##$USERA1= <user>
##$USERA2= <user>
##$USERA3= <user>
##$USERA4= <user>
##$USERA5= <user>
##$V9= 5
##$VALIST= <valist>
##$VCLIST= <CCCCCCCCCCCCCCC>
##$VD= 0
##$VDLIST= <DDDDDDDDDDDDDDD>
##$VPLIST= <PPPPPPPPPPPPPPP>
##$VTLIST= <TTTTTTTTTTTTTTT>
##$WBST= 1024
##$WBSW= 4
##$XGAIN= (0..3)
0 0 0 0 
##$XL= 0
##$YL= 0
##$YMAX_a= 35063
##$YMIN_a= -46910
##$ZGOPTNS= <>
##$ZL1= 120
##$ZL2= 120
##$ZL3= 120
##$ZL4= 120
##$ABSF1= 250.885
##$ABSF2= -250.8851
##$ABSG= 5
##$ABSL= 3
##$ALPHA= 0
##$AQORDER= 0
##$ASSFAC= 0
##$ASSFACI= 0
##$ASSFACX= 0
##$ASSWID= 0
##$AUNMP= <proc_1d>
##$AZFE= 0.1
##$AZFW= 0.5
##$BCFW= 0
##$BC_mod= 2
##$BYTORDP= 0
##$COROFFS= 0
##$CY= -3
##$DATMOD= 1
##$DC= 0
##$DFILT= <>
##$DTYPP= 0
##$F1P= 0
##$F2P= 0
##$FCOR= 1
##$FTSIZE= 65536
##$FT_mod= 6
##$GAMMA= 0
##$GB= 0
##$INTBC= 1
##$INTSCL= 5.30512e-09
##$ISEN= 30
##$LB= 1
##$LEV0= 0
##$LPBIN= 0
##$MAXI= 10000
##$MC2= 0
##$MEAN= 0
##$ME_mod= 0
##$MI= 50
##$NCOEF= 0
##$NC_proc= -5
##$NLEV= 6
##$NOISF1= 182.463
##$NOISF2= 159.3651
##$NSP= 0
##$NTH_PI= 0
##$NZP= 0
##$OFFSET= 250.885
##$PC= 4
##$PHC0= -578.7606
##$PHC1= 130.4
##$PH_mod= 1
##$PKNL= yes
##$PPARMOD= 0
##$PSCAL= 0
##$PSIGN= 0
##$REVERSE= no
##$SF= 81.0140089999434
##$SI= 65536
##$SIGF1= 159.3651
##$SIGF2= -187.1042
##$SINO= 113.3802
##$SIOLD= 16384
##$SREGLST= <1H.CDCl3>
##$SSB= 0
##$STSI= 65536
##$STSR= 0
##$SW_p= 40650.406504065
##$SYMM= 0
##$S_DEV= 0
##$TDeff= 32768
##$TDoff= 0
##$TI= <>
##$TILT= no
##$TM1= 0
##$TM2= 0
##$TOPLEV= 0
##$USERP1= <user>
##$USERP2= <user>
##$USERP3= <user>
##$USERP4= <user>
##$USERP5= <user>
##$WDW= 1
##$XDIM= 65536
##$YMAX_p= 487759688
##$YMIN_p= -6788378
$$ End of Bruker specific parameters
$$ ---------------------------------
##NTUPLES= NMR SPECTRUM
##VAR_NAME=  FREQUENCY,     SPECTRUM/REAL,   SPECTRUM/IMAG
##SYMBOL=    X,             R,               I
##VAR_TYPE=  INDEPENDENT,   DEPENDENT,       DEPENDENT
##VAR_FORM=  AFFN,          ASDF,            ASDF
##VAR_DIM=   65536,         65536,           65536
##UNITS=     HZ,            ARBITRARY UNITS, ARBITRARY UNITS
##FACTOR=    0.620285442955139, 1,           1
##FIRST=     20325.1992029276, 0,            0
##LAST=      -20325.2073011374, 0,           0
##MIN=       -20325.2073011374, -6788378,    0
##MAX=       20325.1992029276, 487759688,    0
$$ Real data points
##PAGE= N=1
##DATA TABLE= (X++(R..R)), XYDATA
$$ [...]
44709 906978 2286378 2328746 957454 -279405 -484052 -251832 -160029 -108240 -293267 -1145399
44699 -1145399 -2057122 -1795877 -492223 287847 -249624 -1271474 -1883259 -2077991 -1905161
44690 -1905161 -1240527 -700181 -1246914 -2506623 -2990368 -2371914 -1943344 -2324657 -2416988
44681 -2416988 -1358736 92258 1006085 1584975 2025034 1555870 -128000 -1700442 -1838154
44672 -1838154 -1102969 -878507 -1193508 -973040 21331 807956 586166 -480526 -1794010
44663 -1794010 -2824800 -3134130 -2576308 -1572085 -804940 -603299 -752654 -817844 -635320
44654 -635320 -612224 -1287762 -2299303 -2320231 -730527 1236368 2080429 2182743 2864315
44645 2864315 3751130 3136206 1070499 -167333 616856 1879209 2018498 1632026 1706198
44636 1706198 1554562 424985 -506381 79922 1128647 769916 -519839 -683569 574463
44627 574463 1594036 1633884 1595502 1858747 1659875 906045 504174 494589 -87832 -1024443
44617 -1024443 -768774 729964 1260134 -381250 -2340369 -2474541 -1456246 -1294501 -2126089
44608 -2126089 -2513098 -2021006 -1459904 -1114462 -683027 -621135 -1589964 -2709327 -2351864
44599 -2351864 -794585 -69813 -793548 -1223727 -260789 704672 291384 -358625 553990
44590 553990 2409811 3112299 2349415 1676781 1647566 1198257 133476 -116246 912342
44581 912342 1451384 220097 -1306866 -1164058 -159407 -636499 -2543981 -3189273 -1275115
44572 -1275115 981710 890173 -1070808 -2176041 -1273063 -85996 -675932 -2854763 -4678584
44563 -4678584 -4797324 -3581964 -2146477 -1001970 34668 1063798 1786027 1877875 1232661
44554 1232661 -124531 -1819128 -2832394 -2244151 -623459 158452 -813345 -2161127 -2087010
44545 -2087010 -958962 -694438 -1806931 -2648356 -1951527 -652260 -296232 -758033 -788163
44536 -788163 -190306 -23157 -649687 -907693 169845 1659703 1727025 85773 -1455262
44527 -1455262 -1228017 237620 1107005 738137 186396 193462 27989 -911889 -1504687 -305586
44517 -305586 2020137 3213561 2349398 838358 278124 662562 1204619 1604664 1663660
44508 1663660 757037 -1175916 -2845302 -2962325 -1941747 -1204755 -1144036 -945293 -303351
44499 -303351 -40718 -683032 -1462754 -1384728 -617944 -122257 -283164 -654349 -920296 -1341847
44489 -1341847 -2018276 -2340717 -1744089 -715195 -379938 -1038206 -1722831 -1495411 -675349
44480 -675349 -329846 -868502 -1632917 -1712593 -784514 656596 1537969 971582 -738165
44471 -738165 -2108006 -2019230 -977649 -266807 -223211 -191438 52320 -98814 -927850 -1768297
44461 -1768297 -1868111 -1253645 -527328 -330186 -1006895 -2169192 -2682975 -1884469 -697032
44452 -697032 -569488 -1415589 -1844447 -1454862 -1344156 -1937418 -2007820 -764990 621657
44443 621657 853206 549977 933998 1523697 1003657 -214590 -344495 867341 1514263
44434 1514263 357861 -1314601 -1634070 -855168 -893002 -2575734 -4464635 -4572938 -2598308
44425 -2598308 -105379 1171749 803162 -401951 -1341276 -1267440 -55904 1560245 2305811
44416 2305811 1594928 316883 -244707 -57388 -100755 -738935 -1434910 -1982813 -2680865
44407 -2680865 -3151452 -2518133 -1175878 -745991 -1537817 -1776479 -481012 612818 -362427
44398 -362427 -2358787 -2983911 -2088982 -1536479 -1940015 -1965911 -877053 361456 898070
44389 898070 1130888 1497718 1598038 1073920 202659 -743091 -1638104 -1891356 -989843 203542
44379 203542 180133 -892233 -1187240 -75089 768696 29562 -1106629 -856113 360813
44370 360813 647001 -543114 -1877776 -2199949 -1760909 -1361294 -1316966 -1502806 -1703468
44361 -1703468 -1662521 -1186068 -355895 504949 996356 718812 -431154 -1801693 -2254219
44352 -2254219 -1330832 88290 662393 -43258 -1295057 -2032372 -1731623 -716427 117935
44343 117935 100353 -513899 -870996 -632221 -377617 -727108 -1454893 -1743893 -1076622 250014
44333 250014 1258581 1024964 -272216 -1182600 -579043 645232 458536 -1548779 -3431512
44324 -3431512 -3449045 -2218812 -1455033 -1615072 -2017283 -2452842 -3097449 -3255623 -2020123
44315 -2020123 -326168 -505615 -2986703 -4970554 -3736986 -287098 1907132 1354428
44307 1354428 1890 35211 955230 893012 -355498 -1189508 -733605 55410 94537 -307057
44297 -307057 -328483 -91357 -312638 -1049657 -1693809 -1912010 -1777137 -1200348 -118651 830802
44287 830802 757219 -178835 -710832 -68251 993944 1213746 445155 -224670 166289 1331442
44277 1331442 2032705 1430634 55397 -766870 -484779 89626 9788 -504496 -542301 151705
44267 151705 1057276 1833536 2524483 2893740 2463556 1356433 321732 -253402 -648340
44258 -648340 -977556 -850452 -162515 505603 692079 661376 786872 844427 407536 -366596
44248 -366596 -752718 -168563 1202560 2328996 2044382 281237 -1566159 -2059756 -1309132
44239 -1309132 -483370 -48472 459282 1022595 862868 -93274 -772683 -648599 -727742 -1927633
44229 -1927633 -3391032 -3550168 -2325065 -1126469 -863060 -952817 -454559 534283 1002437
44220 1002437 355265 -691256 -846341 66846 723716 132904 -774826 -464625 735211
44211 735211 1024588 -19945 -788483 -342886 78136 -671250 -1554797 -1093306 114495
44202 114495 460317 19483 140858 795015 502487 -921179 -1582737 -265871 1581942
44193 1581942 1764316 274272 -932817 -691744 94343 149476 -205541 336309 1816450
44184 1816450 2553010 1447411 -249619 -607168 189805 300386 -679668 -1036108 72754
44175 72754 853020 -581613 -3292278 -4720883 -3938852 -2193037 -868137 -421740 -953329
44166 -953329 -2353138 -3897139 -4728810 -4679413 -3981068 -2731806 -1426746 -1157044 -2128167
44157 -2128167 -2810865 -1939407 -572827 -583887 -1795672 -2440338 -1961729 -1392236 -1234155
44148 -1234155 -1034542 -992541 -1849496 -3003438 -2863593 -1470842 -678070 -1180847 -1476907
44139 -1476907 -549400 497459 519202 111778 97689 15815 -525741 -645233 167451 710389
44129 710389 3314 -797012 -201801 1029966 1030724 -306050 -1526171 -2088021 -2696285 -3446227
44119 -3446227 -3473152 -2527971 -1466096 -1097313 -1655762 -3145251 -4958129 -5524212 -3882496
44110 -3882496 -1439725 -532987 -1223287 -1270562 374696 1882023 1210638 -1018614 -2551647
44101 -2551647 -2460645 -1794311 -1712291 -2141506 -2345898 -2028254 -1505730 -1078739 -595918 168362
44091 168362 852419 735608 -134774 -623386 99233 1292909 1545571 610628 -521743
44082 -521743 -1129084 -1293211 -1049996 -229624 645853 511726 -695649 -1675670 -1547103
44073 -1547103 -1031802 -1088818 -1256171 -438175 1160753 2054381 1393023 -35836 -910866
44064 -910866 -874015 -665251 -1088441 -2087841 -2847774 -2795000 -2336470 -2279400 -2640423 -2656230
44054 -2656230 -2071945 -1613480 -1779642 -1995117 -1651479 -1209250 -1276799 -1241582 -159433 1286333
44044 1286333 1274170 -491245 -2102365 -2068414 -1274232 -1337145 -2143233 -2418061 -2053407 -2195280
44034 -2195280 -3070148 -3315508 -2005133 -138634 705836 419776 168930 598531 1161024
44025 1161024 1178480 802670 644376 857923 949114 469281 -284026 -482274 182698 911913
44015 911913 718965 -151084 -404369 490735 1414893 1054172 -380925 -1665803 -2334912
44006 -2334912 -2943747 -3691770 -3869892 -2991511 -1652833 -786352 -582059 -561190 -305394
43997 -305394 249028 872572 1067044 397980 -839364 -1623721 -1277373 -287295 290566
43988 290566 6089 -736475 -1321088 -1394785 -927988 -275405 -62313 -566802 -1268225 -1398576
43978 -1398576 -867093 -218513 228746 619054 869477 443347 -744994 -1703158 -1342673
43969 -1342673 25263 862044 247644 -1035360 -1668372 -1546856 -1634219 -2259890 -2526247
43960 -2526247 -1758233 -709837 -549294 -1118969 -1183734 -347633 257675 -460445 -2033306
43951 -2033306 -3003556 -2573845 -1172727 303239 1243758 1449386 1071384 570096 381634
43942 381634 407984 21126 -1168866 -2567845 -2918289 -1633067 322529 1300957 787575
43933 787575 -142033 -397093 -272343 -687365 -1555077 -1848319 -1154465 -222298 167734 60687
43923 60687 -175616 -473523 -857125 -1192582 -1440695 -1691989 -1810606 -1550903 -1041801 -535483
43913 -535483 196287 1315271 1918483 907660 -992757 -1637797 -419998 776450 443144
43904 443144 -382630 -99945 862460 1149528 884972 950976 843092 -485803 -2228960
43895 -2228960 -2563785 -1680746 -1566108 -2639691 -3041824 -1776158 -229210 266914 228946
43886 228946 383145 318889 -3319 568432 2178498 2848033 1361747 -458329 -447459
43877 -447459 508461 272274 -616005 150676 2299935 2758148 232903 -2795486 -3668205
43868 -3668205 -2768507 -1837729 -1145610 -126214 651612 223630 -745209 -564598 966704
43859 966704 2184878 1901810 900234 641633 1363253 2099546 2142800 1802464 1692172
43850 1692172 1757017 1422468 623962 148255 605875 1466139 1701955 1165391 598285 359045
43840 359045 8746 -679347 -1196563 -1184695 -1054213 -1205107 -1355861 -1251192 -1327119 -1908342
43830 -1908342 -2381000 -2088407 -1520748 -1510861 -1616868 -650213 1173465 2016345 836117
43821 836117 -1138872 -2091184 -1852334 -1542018 -1657015 -1650161 -1149472 -497717 2199 451849
43811 451849 731967 374043 -496765 -854711 -109536 807248 593020 -480147 -831521
43802 -831521 155870 1247423 1192052 381565 -158013 -485049 -1148538 -1490913 -288585
43793 -288585 1873132 2691609 1288357 -383206 -398053 344612 -157774 -1598716 -1855404
43784 -1855404 -532082 299835 -679347 -2114614 -2212019 -1281594 -825096 -1259529 -1842955
43775 -1842955 -2064480 -1911467 -1360766 -672552 -610242 -1336804 -1719018 -846808 412138
43766 412138 664207 146881 65205 282410 -409861 -1837053 -2365768 -1667679 -1496934 -2867313
43756 -2867313 -4328526 -4255634 -3243729 -2767987 -2789894 -2343320 -1488611 -942107 -473622
43747 -473622 573621 1637870 1552841 539291 -109118 -183772 -676527 -1731408 -2287007
43738 -2287007 -2029346 -1914716 -2249289 -2002714 -775543 235778 220350 117380 790602
43729 790602 1316076 601517 -548411 -775752 -621481 -1585423 -3226325 -3383577 -1440777
43720 -1440777 574979 752792 -362823 -962418 -354446 661609 1017204 268910 -1187157
43711 -1187157 -2322924 -2379575 -1805435 -1697875 -2197293 -2317766 -1642297 -1117249 -1545126
43702 -1545126 -2269531 -2237999 -1597918 -1213196 -1146975 -738565 90707 688640 766857 673407
43692 673407 525771 30481 -587125 -368503 1120407 2881436 3439583 2487364 1145916
43683 1145916 693916 1367374 2385154 2853999 2494929 1616102 666115 14848 9019 801318
43673 801318 1947889 2523245 2008327 971775 573791 1347067 2575705 2914051 1711947
43664 1711947 -138072 -858925 341594 2222127 2878053 1994245 877383 305743 -336792
43655 -336792 -1344812 -1657033 -710742 -11469 -1095927 -2778519 -2537458 -338298 1220880
43646 1220880 861347 380040 1487619 2985938 2712527 808236 -817349 -1353613 -1530669
43637 -1530669 -1684210 -1285525 -449586 -229213 -926296 -1372254 -551108 906125 1506918
43628 1506918 685454 -718727 -1513554 -1313972 -704857 -404755 -397021 -144024 369930 415499
43618 415499 -356706 -1238539 -1485490 -1380985 -1532455 -1751160 -1636229 -1693457 -2554569 -3416793
43608 -3416793 -2807496 -959418 136352 -558228 -1814089 -2150613 -1797378 -1747438 -2018320
43599 -2018320 -1974316 -1550144 -1045346 -329369 678141 1243188 612442 -761651 -1751821
43590 -1751821 -1986302 -1810276 -1216793 6115 1223233 1315877 299435 -481465 -107927
43581 -107927 847039 1372907 1312137 1069120 671678 -207830 -1535087 -2689250 -2962984
43572 -2962984 -2212697 -1104694 -560322 -684171 -538565 506134 1574815 1338747 84661
43563 84661 -445831 523266 1785085 2082821 1819433 1900263 1937611 963533 -667503 -1543880
43553 -1543880 -1211772 -623459 -520365 -596959 -517519 -573583 -813678 -543831 561109 1584672
43543 1584672 1417494 232315 -800638 -960178 -502272 10836 276313 235232 -343
43534 -343 -208020 -330550 -550304 -867251 -941774 -709318 -724469 -1333968 -1880552 -1483140
43524 -1483140 -433231 -10590 -886446 -2435489 -3709020 -4328974 -4210265 -3210549 -1593805
43515 -1593805 -305409 -129409 -733990 -1027594 -447588 425664 621107 -34677 -707268
43506 -707268 -654282 -280476 -550505 -1370521 -1464942 -339874 647050 210075 -740284 -432522
43496 -432522 823945 964365 -534617 -1757477 -1338884 -344636 -106904 -42373 835233
43487 835233 1759506 1451561 456850 288196 936403 1183737 949767 1325188 2365670
43478 2365670 2740758 1781667 290590 -867390 -1484044 -1207252 366343 2494945 3698158
43469 3698158 3689987 3448871 3166033 1928848 -55087 -915404 135087 1235917 446976
43460 446976 -1471389 -2349943 -1651668 -665156 -350173 -506149 -756024 -1039343 -1168258
43451 -1168258 -842611 -137867 569505 1010084 1036441 639666 200589 124018 68252 -556795
43441 -556795 -1182243 -543897 977171 1167916 -833272 -2836733 -2609376 -1125319 -913371
43432 -913371 -2306053 -3500879 -3586260 -3200021 -2579173 -1338142 -197662 -597358 -2152997
43423 -2152997 -2580956 -822807 1538577 2647897 2470816 1820554 1012575 416798 759723
43414 759723 1775680 1963034 834146 44651 953872 2334786 2122011 459252 -742370
43405 -742370 -608349 129309 917995 1820932 2258547 1298120 -421162 -913988 233904
43396 233904 884067 -537170 -2431427 -2236933 -249839 834206 -118345 -1391091 -1511650
43387 -1511650 -1472232 -2594411 -3868934 -3334604 -1226737 263501 105811 -579602 -703597
43378 -703597 -492816 -178343 729888 2004222 2207023 816357 -549501 -369753 521126
43369 521126 403537 -641596 -1214453 -986712 -784523 -751681 -281383 397455 354215 -279208
43359 -279208 -350418 342516 739832 470114 511988 1397324 2212924 2093059 1516752 1404495
43349 1404495 1869601 2456095 2793288 2577597 1690478 612749 -74223 -629865 -1566035
43340 -1566035 -2229935 -1455035 251318 926176 46930 -620977 95044 905111 354242
43331 354242 -675641 -460114 787026 1450376 1035223 394537 -46227 -588565 -1031766
43322 -1031766 -730222 105807 512362 287790 239700 741927 1095945 663835 -149143 -432091
43312 -432091 140359 970741 1110319 241570 -799999 -832641 206175 1196793 1462549
43303 1462549 1568593 1991608 2062433 1198785 248888 290296 734213 120839 -1494303 -2465323
43293 -2465323 -1898992 -684322 67812 348421 541899 451977 -279721 -1412150 -2317607
43284 -2317607 -2586376 -2141860 -1173793 -194405 230583 18255 -464722 -1022126 -1791728
43275 -1791728 -2688799 -3165892 -2833093 -2077665 -1787032 -2455183 -3616221 -4200972 -3578464
43266 -3578464 -2251226 -1321000 -1287603 -1703502 -1971332 -1926211 -1533468 -715745 194355 506903
43256 506903 117210 -247150 -182705 -263343 -900872 -1353534 -821504 73308 38286 -961747
43246 -961747 -1669785 -1403948 -911067 -1116702 -1842265 -2192604 -1768596 -1081905 -852116 -1123872
43236 -1123872 -1295986 -1112743 -1203898 -2076794 -2954634 -2639030 -1411666 -781436 -1168319
43227 -1168319 -1331202 -583229 73285 -97958 -153238 698339 1401508 841228 -4423 401068
43217 401068 1518454 1684157 910588 603686 1002547 1039236 479392 156592 204125 -23506
43207 -23506 -390000 -213491 126680 -240232 -748511 -156024 1007237 1118587 440987 712056
43197 712056 1628206 808091 -2002667 -3785217 -2635949 -474413 322828 374562 1286566
43188 1286566 2460365 2378008 1431155 1024324 1041677 480759 -324199 -283274 329701 341800
43178 341800 -228089 -338648 208763 673683 779955 789066 561185 -163554 -972290 -1388127
43168 -1388127 -1670389 -1975280 -1625947 -435070 308730 -356075 -1357547 -1345632 -994085
43159 -994085 -1525564 -2021011 -712252 1667059 2537612 1384024 367978 736177 1132916
43150 1132916 197093 -1376897 -2328848 -2564926 -2436554 -1818639 -815537 -110616 91979
43141 91979 279017 354331 -407383 -1675536 -1982859 -1015589 -314651 -829525 -1467147 -1165032
43131 -1165032 -709144 -1050552 -1334267 -376515 1021197 1111530 -178377 -1444673 -2084664
43122 -2084664 -2599655 -2955726 -2481329 -1445484 -1059973 -1598142 -1950971 -1454205 -804877
43113 -804877 -595900 -227132 824261 1619891 780474 -1539238 -3665408 -4273571 -3517562
43104 -3517562 -2347119 -1386764 -666719 8324 707344 1211564 1110314 249723 -889120
43095 -889120 -1558398 -1598722 -1583702 -1892904 -2051053 -1466536 -517293 -176524 -609562 -983133
43085 -983133 -897367 -1102623 -2175194 -3237325 -2958455 -1460177 -215865 -125757 -624212
43076 -624212 -802983 -534160 -181596 22870 -145635 -1032255 -2508887 -3624174 -3472087
43067 -3472087 -2333870 -1466445 -1636916 -2188813 -1869289 -539038 384201 -372770 -2045523
43058 -2045523 -2480097 -875816 1069860 1395338 339470 -486324 -628402 -955589 -1580831
43049 -1580831 -1378839 86077 1700715 2490994 2779826 2866229 1954486 -346077 -2536964
43040 -2536964 -2822707 -1652806 -1148545 -2165380 -3360738 -3323433 -2311595 -1387238 -856369
43031 -856369 -308757 371664 759467 493174 -282043 -1023458 -1198079 -738040 -174267 -103444
43021 -103444 -457505 -579058 -126841 421856 402994 -163536 -650135 -601549 -66735 766410
43011 766410 1760130 2480443 2196127 763299 -763998 -1105273 -324307 302281 121821
43002 121821 -89338 362888 722612 -96548 -1665369 -2544376 -2366559 -2133968 -2417456
42993 -2417456 -2550121 -1940213 -1042864 -513792 -319095 -166206 23344 450458 1293457
42984 1293457 1857297 1056661 -670374 -1290684 29039 1400655 824771 -869331 -1382614
42975 -1382614 -322678 751870 1086246 1315100 1410671 417818 -1230413 -1366591 771890
42966 771890 2797823 2075597 -780754 -2814602 -2379393 -424210 1436458 2653708 3443112
42957 3443112 3893210 3864465 3332817 2559808 1974156 1733352 1367489 325696 -950647
42948 -950647 -1193141 -2773 1321899 1354598 351642 -314453 26318 1073002 2586344
42939 2586344 4357403 5318157 4226892 1648286 -75655 409855 1717541 1566913 -406633
42930 -406633 -2634433 -3763968 -3700324 -2863026 -1665627 -820781 -1046712 -2062027 -2674849
42921 -2674849 -2291006 -1629762 -1488092 -1534750 -1030382 -140898 398171 597188 1136340 1958226
42911 1958226 1981243 625745 -1149007 -1895551 -1280426 -160002 498046 259885 -767815
42902 -767815 -1892661 -2044012 -773817 940388 1527343 598646 -598349 -663233 462706
42893 462706 1699440 2134576 1788654 1279057 1081047 1175835 1248405 1050422 503898 -384746
42883 -384746 -1423472 -2086601 -1893587 -1076480 -445289 -401436 -607506 -894326 -1739755 -3236720
42873 -3236720 -4341108 -4118482 -3198142 -2849423 -3009294 -2561834 -1381921 -578242 -586838
42864 -586838 -590883 -220623 -241197 -879068 -1010331 20948 1148034 1230283 677219 277502
42854 277502 -211648 -870021 -447488 1654279 3392423 2451864 -62735 -861728 792195
42845 792195 2214283 1457651 -278336 -1213311 -1503900 -1876798 -1831531 -888001 -56828
42836 -56828 -315109 -775812 -52731 1453119 2224432 1864874 1188531 732588 614333 1198472
42826 1198472 2359393 2677714 1085650 -1096295 -1598696 -497263 -106839 -1405652 -2580605
42817 -2580605 -1857695 -41913 896222 525026 -2507 165150 818021 1437110 1762918
42808 1762918 1729955 1462030 1271648 1306264 1348981 1193254 934283 672303 274085 -307672
42798 -307672 -805435 -1005245 -1071767 -1259245 -1522490 -1603631 -1324048 -714453 -65648 179416
42788 179416 -105786 -426781 -212374 414768 857264 905058 797641 549749 -14325 -545458
42778 -545458 -392576 226958 184970 -978587 -2220323 -2310573 -1342909 -313423 250795
42769 250795 524598 596213 186062 -834319 -2016095 -2479237 -1546992 443279 2068729
42760 2068729 2172346 1274383 853101 1203108 1129048 82808 -721848 -120766 1257442
42751 1257442 2117143 2338287 2459862 2256671 1329671 420015 496467 1016658 816763 338010
42741 338010 964089 2258421 2177938 486068 -421631 835733 2332472 1786237 -38698
42732 -38698 -909755 -714558 -1083672 -2222631 -2671989 -2097482 -1861135 -2395539 -2268148 -746003
42722 -746003 667415 510072 -389325 -380389 512417 1113760 1170134 1216304 1016219 -52410
42712 -52410 -1296754 -1181486 343406 1578388 1492592 956796 1053847 1528680 1664451 1550637
42702 1550637 1617313 1786468 1844083 1861612 1640011 695703 -527809 -585959 878103 2129357
42692 2129357 1655403 404541 213788 956464 1066025 230642 -452334 -677746 -1175389
42683 -1175389 -1757172 -1280273 73048 567738 -337096 -945976 19465 1472841 1822520
42674 1822520 1248761 833026 734326 641490 963225 2071126 3085255 2777162 1224697
42665 1224697 -438407 -1373319 -1338143 -470709 324134 -274768 -2194278 -3475020 -2773842
42656 -2773842 -1331327 -1064651 -1770588 -1953629 -1520353 -1566545 -1986168 -1500766 -62504
42647 -62504 790654 263801 -731057 -1260949 -1457170 -1585971 -1514724 -1458716 -1873002 -2300514
42637 -2300514 -1740783 -463131 46694 -653975 -1295243 -1005309 -536355 -682792 -972081
42628 -972081 -810968 -590918 -690332 -583446 60404 484610 58778 -608760 -739448 -593178
42618 -593178 -638439 -500214 214362 975571 1294354 1674829 2439356 2611500 1414520 26911
42608 26911 159564 1428067 1895684 963214 -78093 -406130 -758065 -1686038 -2336537
42599 -2336537 -1859421 -878187 -518320 -674293 -271372 1024912 2241161 2340856 1477162
42590 1477162 682493 515790 466848 -61872 -591671 -136749 1067496 1411164 42177
42581 42177 -1719799 -2027660 -948352 -132951 -413748 -1022288 -1176687 -1116127 -1190280 -1079746
42571 -1079746 -550845 -92856 -101202 -145118 207683 465992 -6228 -739802 -695832 120673
42561 120673 589463 93452 -752602 -1288603 -1792966 -2658161 -3313555 -2878079 -1560726
42552 -1560726 -505111 -273262 -276952 175381 985879 1633080 1796621 1376786 497012 -270914
42542 -270914 -341594 -51780 -400919 -1487913 -2114364 -1535413 -608901 -308755 -99765 915407
42532 915407 2041590 1830535 479789 -343790 -56215 149984 -586710 -1585643 -2007420
42523 -2007420 -2042681 -2117656 -2123428 -2011201 -2039037 -1937098 -988389 594096 1620737 1725195
42513 1725195 1815101 2189554 1842909 469218 -564537 -390593 -90798 -581103 -766788
42504 -766788 383492 1493526 753498 -925729 -1171804 199269 1273243 1288372 1221248
42495 1221248 1297992 591289 -644049 -849908 -12985 -128681 -1813490 -2813758 -1361735
42486 -1361735 957436 1469895 80403 -1167549 -1177600 -618490 -220212 98773 541763
42477 541763 1055932 1556981 1772041 1252837 272424 46598 1080669 1978565 1184929
42468 1184929 -570407 -1087358 168004 1345544 962776 -128171 -345006 210094 158004
42459 158004 -858778 -1536756 -700455 1142436 2470076 2509558 1820917 1251642 838031
42450 838031 41936 -1143414 -1807632 -1090796 669675 2137418 2406706 1939951 1831512
42441 1831512 2350961 2686445 2193970 1374540 1229519 2021929 3226996 4479524 5883072
42432 5883072 7421693 8799675 9969742 11059135 11578297 10606855 8235690 5951936
42424 5951936 4885095 4424911 3418505 2011746 1182290 951922 408415 -584946 -992013
42415 -992013 -175309 1161048 1995050 2179582 2195252 2258451 2058245 1146495 -452816 -1827219
42405 -1827219 -1738194 -139282 1316016 1128621 -71707 -502343 108540 271657 -745234
42396 -745234 -1707692 -1357993 -280832 102229 -470427 -1032822 -774957 232272 1282325
42387 1282325 1513062 628842 -476897 -447973 774160 1634456 917094 -723018 -1784458
42378 -1784458 -1744277 -1138571 -485936 14095 156246 -104767 -446127 -663602 -923997 -1074072
42368 -1074072 -414163 1122436 2273973 1861703 359954 -853843 -1264057 -1235090 -866103
42359 -866103 -107954 347125 -309524 -1580916 -2186632 -2001745 -2114751 -2829852 -3076795
42350 -3076795 -2230766 -1146599 -766074 -943674 -1335788 -2143343 -3040187 -2696242 -727152
42341 -727152 976899 581739 -757761 -282872 2281439 4179929 3569022 1896059 1262838
42332 1262838 1242207 96245 -1971964 -2908088 -1883128 -361781 173665 -56629 -245769
42323 -245769 -404772 -778136 -977709 -727214 -618822 -1060398 -1216600 -249527 941375
42314 941375 677648 -1014088 -2382972 -2489792 -2189327 -2161254 -1610686 43297 1537993
42305 1537993 1352410 173573 112533 1626357 2817124 2137165 413724 -588554 -588542
42296 -588542 -664557 -1230669 -1392044 -468126 810409 1188576 488711 -252823 -89817 839750
42286 839750 1585200 1310850 -10499 -1492859 -1925177 -802699 1167795 2814537 3619922
42277 3619922 3718113 3071394 1544268 -96823 -349661 1173397 2848977 2870811 1420207
42268 1420207 81037 -415896 -669836 -1038403 -966410 -216073 371182 -5859 -956872
42259 -956872 -1511211 -1405415 -1188286 -1339522 -1770024 -2070696 -1950922 -1494469 -1088838 -984251
42249 -984251 -949741 -591035 59355 562431 596689 164183 -534411 -1043638 -769772 264222
42239 264222 1057385 757077 -89474 -285312 214658 353684 -199037 -555728 -229816 52426
42229 52426 -269700 -613549 -444262 -352466 -953986 -1621908 -1429680 -637205 -61948 416875
42219 416875 1381706 2300051 1954058 496944 -375622 242010 1189504 1029418 137885
42210 137885 -31371 762752 1205360 442942 -617215 -621674 282313 719835 119508 -538579
42200 -538579 -299912 371847 498952 191238 321625 959089 1289230 1088181 1101252 1634096
42190 1634096 1828917 941389 -463760 -1276718 -1227178 -839410 -439253 89230 728072
42181 728072 1077629 751780 -176828 -1114299 -1385342 -960128 -603523 -908561 -1380249 -1086580
42171 -1086580 -59441 751184 874115 741468 626934 202600 -509730 -746206 -107961
42162 -107961 739093 1033583 923659 988862 1341746 1671561 1707823 1334759 700379 305338
42152 305338 425649 558486 219748 10682 721274 1626553 1264444 -101162 -673747
42143 -673747 -80335 -51636 -1450048 -2761379 -2645819 -1921550 -1616965 -1065323 332672
42134 332672 1309492 708808 -340034 -352080 -116154 -1081730 -2426714 -2273365 -845609
42125 -845609 128019 336443 644677 716563 -331711 -1465613 -887711 593499 399727
42116 399727 -1551297 -2502136 -1172306 630941 1407142 1934045 2776111 2739413 1334344
42107 1334344 263864 761622 1592254 1365835 836621 1155094 1699841 1521117 1268744
42098 1268744 1705614 1770113 222555 -1934763 -2778008 -2314882 -2006062 -2164183 -1878735
42089 -1878735 -1094810 -760664 -978406 -756805 249522 1183320 1364202 1067951 753177
42080 753177 459867 120959 -249502 -678273 -981014 -658131 312802 984642 559037 -354726
42070 -354726 -504639 233122 791248 512862 -85648 -214586 254646 883766 1190895 1021177
42060 1021177 734319 922603 1642985 2162996 1807489 768589 -284686 -1048119 -1580286
42051 -1580286 -1764925 -1302841 -163837 1245012 2284707 2421945 1664256 681872 120548
42042 120548 -126711 -460036 -634476 -143705 599254 572264 -304454 -1095314 -1418561 -1723155
42032 -1723155 -1835430 -942864 459817 527161 -1043072 -1977451 -735869 910781 512573
42023 512573 -1282951 -1820783 -345406 1512678 2591931 3155293 3120039 1685915 -821846
42014 -821846 -2634450 -2712356 -1842031 -1127547 -711258 -417998 -411438 -702749 -1023369 -1500491
42004 -1500491 -2423043 -3156016 -2561572 -888638 62514 -692624 -1942926 -2066817 -1211791
41995 -1211791 -715833 -1041994 -1365062 -976420 -190370 287443 356053 569636 1298138 2124741
41985 2124741 2364618 2077096 1997510 2326031 2357377 1768857 1395129 1885873 2415597 1900898
41975 1900898 843608 517098 742201 159997 -1332441 -2182813 -1567294 -524663 -72838
41966 -72838 295162 1308263 2375955 2505196 1898342 1501891 1512076 1340914 722512 -1427
41956 -1427 -465245 -466900 162525 1195039 1707890 871011 -917574 -2224428 -2092216 -1045021
41946 -1045021 -372108 -574167 -874326 -450482 220886 -64372 -1347141 -2155169 -1490586
41937 -1490586 -155892 716356 1376538 2372179 2718981 1126110 -1345788 -2085595 -635297
41928 -635297 561305 -217394 -1669120 -1892845 -1237604 -1191793 -1869741 -2302227 -2209584 -1873418
41918 -1873418 -1106022 33328 269073 -1370976 -3585039 -4146401 -2919923 -1735086 -1435054
41909 -1435054 -1048911 -100026 332311 -385490 -1150242 -922934 -410676 -694789 -1306652
41900 -1306652 -1111119 -329252 -111054 -462666 -203774 937513 1711446 1328879 716337
41891 716337 872521 1037420 -118159 -1993845 -2393638 -571101 1572817 2104117 1586358
41882 1586358 1739472 2515931 2288862 691728 -659525 -728698 -595994 -1452113 -2500750
41873 -2500750 -2293883 -1202434 -885259 -1671874 -2104741 -1231542 3363 149634 -873878
41864 -873878 -1836366 -1636947 -356679 855108 910126 44754 -333534 499846 1426136
41855 1426136 1044803 -97382 -146010 1336023 2796646 3110998 3003644 3345731 3477880
41846 3477880 2404606 634386 -508745 -800954 -1073156 -1606912 -1788675 -1280001 -536230
41837 -536230 -140808 -354470 -1167443 -2054240 -1966983 -513697 1075988 1238795 237414
41828 237414 -161593 743299 1654834 1337780 382269 173278 1062910 2392602 3552262
41819 3552262 4138004 3712787 2408002 1353091 1532111 2426719 2664414 1851681 873867
41810 873867 424637 194930 -230742 -488535 29974 1176189 2069635 2033045 1246963 478721
41800 478721 276120 513704 787485 1076170 1636882 2293722 2455662 2096287 2052808 2830566
41790 2830566 3708385 3777295 3414776 3804670 5194884 6566043 7040196 6794417 6496422
41781 6496422 6582684 7187806 8058691 8427235 7689841 6331156 5446063 5261136 4967568
41772 4967568 4149263 3378009 3055744 2694136 1890375 1050656 462556 -378403 -1596590
41763 -1596590 -2000140 -595327 1513336 2168673 983242 -248994 -143061 585338 566487
41754 566487 -217016 -813773 -972293 -1252529 -1643411 -1225108 396230 2134972 2598566
41745 2598566 1781602 821069 270467 -417450 -1480990 -1934453 -844284 1054888 1951936
41736 1951936 1000728 -983150 -2735178 -3658368 -3749576 -3268639 -2735870 -2636643 -2864790
41727 -2864790 -2879403 -2463907 -1836931 -1072473 -85931 804752 1084101 903873 935015 1206110
41717 1206110 983131 101504 -496681 -59991 873671 1212755 601354 -407594 -927440
41708 -927440 -253713 1489795 2938117 2499454 173499 -2332698 -3581605 -3696706 -3434891
41699 -3434891 -2996676 -2271291 -1372700 -411430 494311 716218 -330783 -1869975 -2336311
41690 -2336311 -1699993 -1644301 -2736494 -3232282 -1889283 -213511 -227898 -1430019 -1875323
41681 -1875323 -1189662 -507704 -233465 95916 236092 -502577 -1666178 -2046054 -1460614
41672 -1460614 -685643 -17219 583031 467442 -819202 -2083574 -1752209 -285460 502380
41663 502380 208872 -24475 114404 -256734 -1195306 -1655294 -1428110 -1399287 -1672229 -1398682
41653 -1398682 -684479 -622448 -1133874 -881038 260615 797034 227789 -117375 432361
41644 432361 736167 77659 -539070 -357517 -118660 -225623 342836 1979027 3176480
41635 3176480 2760569 1731201 1444245 1515767 994072 153750 -344296 -729715 -1187138
41626 -1187138 -1022256 -111740 264503 -543152 -1185237 -498824 466065 288000 -450462
41617 -450462 -469943 -68967 -126846 -158950 534959 1002886 142276 -1032416 -927417 -116808
41607 -116808 -66859 -134682 1260455 3133277 2849413 550486 -570604 923639 2594111
41598 2594111 2010407 241060 -180959 1055974 2180465 2088208 1386614 1130542 1561157
41589 1561157 2016370 1740875 940098 791952 1833177 2818775 2263429 725956 143710
41580 143710 1036851 1932518 1685861 818951 237529 87733 307918 938562 1445560 1076040
41570 1076040 285472 366774 1222161 1170566 -304243 -1396241 -747128 278541 -240700
41561 -240700 -1597174 -1506013 216933 1178535 -132159 -2167074 -2446412 -754688 878040
41552 878040 968245 282171 471600 1707132 2450063 1554403 -194454 -1145515 -878240
41543 -878240 -477607 -879997 -1716272 -1939985 -1046378 539837 1927829 2467289 2217882
41534 2217882 1747084 1394244 1016020 613124 642693 1230082 1627361 1154487 241056 -217294
41524 -217294 -116162 60699 247683 621917 805862 367982 -100983 442726 1934408
41515 1934408 3262642 3784559 3749564 3439222 3073431 3314222 4426075 5082447 3699448
41506 3699448 1090302 -37057 1265582 2819593 2454447 897064 374445 1599090
41498 1599090 3416122 4568020 4649921 3930469 3145607 2941532 2910963 1931623 -316
41489 -316 -1336111 -1145893 -543257 -819801 -1259074 -319876 1727171 3015871 2698842 1848265
41479 1848265 1697214 2268150 2991144 3618400 4103571 4267862 3967793 3270267 2416528
41470 2416528 1893406 2288569 3590252 4912920 5512834 5777022 6496186 7497839 8002934
41461 8002934 8208405 9259760 11271048 12522258 11498595 9022738 7300546 7102674
41453 7102674 6989251 5535538 3320687 1986724 1937213 2000380 1315998 548469 814507
41444 814507 2110347 3355875 3551798 2449086 573475 -911385 -935987 216213 929727
41435 929727 297962 -486083 180490 1813302 2451620 1524369 512705 556064 926055
41426 926055 476253 -612499 -1289168 -1004399 -46112 846397 910759 131005 -341194 502980
41416 502980 1813943 1807809 513240 -109992 720568 1312234 338864 -895716 -631859
41407 -631859 418034 259999 -1259070 -2501869 -2618468 -2187700 -1616346 -696908 305218
41398 305218 702954 550683 404498 45324 -1119351 -2494519 -2741306 -1872996 -1294973
41389 -1294973 -1506308 -1433553 -554992 -2529 -657051 -1597149 -1598955 -1050974 -1080728 -1570735
41379 -1570735 -1413499 -355272 661413 918892 673302 410617 182784 -114525 -402748
41370 -402748 -590723 -720336 -835149 -973091 -1231646 -1487131 -1177615 80714 1647486
41361 1647486 2297778 1768478 1213897 1618093 2341210 2053154 747001 -251391 -297751
41352 -297751 -271358 -940772 -1597391 -1232780 -282323 -41423 -766556 -1511807 -1654032 -1461001
41342 -1461001 -1229090 -984971 -1040825 -1655464 -2041787 -999811 1164237 2634500 2432647
41333 2432647 1496432 932086 648746 507643 1264092 3061243 4246717 3297492 1135570
41324 1135570 -10974 509212 1479247 1895301 1779697 1212785 184413 -530460 178063
41315 178063 2089527 3551987 3384025 2050711 797653 403638 853064 1464660 1305362
41306 1305362 169116 -946099 -999546 -234691 466828 1082655 2150488 3336462 3693878
41297 3693878 3247475 2917448 2852060 2306079 1335069 1045650 1717669 2129057 1364050 35671
41287 35671 -877104 -1194357 -998236 -247408 446197 64520 -1007506 -914869 883936 2297947
41277 2297947 1498256 -242163 -408264 1086503 2140967 1784274 1085392 827919 371299
41268 371299 -715980 -1604766 -1500176 -740677 437 542912 742931 296671 -476641
41259 -476641 -726119 -469679 -715822 -1525156 -1349747 539235 2261074 1663667 -379888
41250 -379888 -1024108 453895 1732146 996514 -589509 -969784 -121517 558003 697601
41241 697601 1100028 1904383 2177463 1373187 2565 -1265179 -2178797 -2525449 -2178693
41232 -2178693 -1647669 -1601888 -1733839 -1174062 -203871 -224349 -1507284 -2367404 -1527035 -82358
41222 -82358 218225 -257966 357918 2421566 4084665 3847206 2390852 1302625 1055288
41213 1055288 1055412 993588 1180278 1689727 1979154 1657851 1199350 1370385 1994134 1897460
41203 1897460 494899 -1086529 -1241081 30737 1267015 1686175 1886101 2130026 1488140
41194 1488140 -374013 -1900629 -1550748 -88355 563395 126612 -16755 726457 1426585
41185 1426585 1390872 1043325 717380 4151 -1137600 -1779350 -1198880 116148 1109310
41176 1109310 1185849 410347 -604553 -905377 -117664 778803 536050 -457850 -520123 872706
41166 872706 2267092 2350745 1612433 1144620 966463 574397 273406 744556 1724280 2199361
41156 2199361 1789594 1100878 704218 444168 -38306 -498926 -194109 1068693 2193176
41147 2193176 1706462 -310976 -1888385 -1412681 418076 1758990 2016357 1820282 1295437
41138 1295437 174328 -645287 229677 2218427 3062877 2154427 1454336 2233180 3083706
41129 3083706 2527482 1531859 1597452 2065530 1507572 530120 852220 2342629 3248520
41120 3248520 3015669 2789883 3216440 3644830 3613657 3474408 3413623 3330216 3743271 5335382
41110 5335382 7448684 8466219 7951051 7156826 7194547 7852807 8389595 8362452 7585366
41101 7585366 6397832 5950257 6925524 7990909 7034957 4151203 1822596 1689885 2636923
41092 2636923 2712480 1548526 85863 -833552 -684876 836056 3096907 4475949 3928501
41083 3928501 2103009 367131 -603960 -838879 -559414 -237776 -326165 -393240 537850
41074 537850 2237591 2998132 1946853 505158 437185 1435837 1962695 1671565 1441031
41065 1441031 1449770 866227 -503710 -1656390 -1807646 -1355708 -1080237 -1131856 -1111960 -609477
41055 -609477 501105 1851801 2673629 2549004 1957195 1580745 1317172 651238 -232287
41046 -232287 -593468 -349838 -207870 -425791 -349273 464685 1442518 1803847 1578087 1292053
41036 1292053 1115530 878457 607874 452623 207526 -535064 -1684457 -2499095 -2342017
41027 -2342017 -1414714 -541638 -269535 -384724 -405116 -296608 -345403 -435555 -56569 743036
41017 743036 1033027 214310 -861743 -773370 587028 1799582 1703825 680834 -130256
41008 -130256 -264493 -124261 -175783 -474317 -789793 -781254 -159040 954555 1861599 1826971
40998 1826971 892742 -24480 -8476 874131 1569880 1187696 169526 -11237 1382840
40989 1382840 3172010 3425179 1787666 -11387 -233221 878899 1669156 1207708 186927
40980 186927 -212846 308163 1140433 1652716 1731978 1586646 1361796 1058184 673126 248012
40970 248012 -197050 -598545 -695124 -187288 802516 1695913 2126953 2330454 2486288 2104935
40960 2104935 838039 -344160 77105 1957149 3170403 2206545 189342 -640867 207888
40951 207888 1266501 1375961 928850 841053 1388684 2295414 3097847 3193063 2305559 1100543
40941 1100543 563753 651387 470519 -50704 137596 1362498 2339613 2028490 1322307
40932 1322307 1716884 3088305 4134784 4495304 4920232 5488124 5212180 3787558 2497945
40923 2497945 2756620 4507520 6542618 7793912 7994862 7722323 8128850 9989497 12625981
40914 12625981 14366166 14448733 13868085 13912059 14503104 14554550 13416685 11317214 8830873
40905 8830873 6651191 5542663 5661562 5989899 5203284 3211051 1255620 385697 411662
40896 411662 574998 667455 1008971 1623057 2021417 1901411 1660761 1898155 2523964 2749369
40886 2749369 2092957 1068714 550955 684005 884764 831601 877004 1357642 2027026 2445657
40876 2445657 2535340 2482782 2458658 2679704 3346157 4208679 4581120 4119382 3226700 2395804
40866 2395804 1633001 911150 573758 651998 366298 -778745 -1790939 -1188685 853347
40857 853347 2451898 2331121 1227416 606792 857238 1333222 1529890 1517236 1537245 1681897
40847 1681897 1770930 1330710 122618 -1092783 -1005575 517532 1815221 1302997 -521549
40838 -521549 -1816657 -1774141 -1231058 -1065563 -1149705 -1093174 -930920 -613061 226047 1358224
40828 1358224 1683028 696993 -443543 -322965 763478 1364497 1085852 917567 1318103
40819 1318103 1443776 850501 621846 1739191 3292934 3690168 3141560 3412702 5070104
40810 5070104 6488712 6214289 5119237 5182655 6825139 8630149 9498571 9918964 10829618
40801 10829618 12159717 13152099 13605163 14005790 14541686 14703685 14078573 13012753 12121449
40792 12121449 11473171 10687860 9645852 8622404 7761796 6876471 5849637 4857131 4059600
40783 4059600 3365993 2602154 1698232 767542 278707 861722 2301959 3009745 1612589
40774 1612589 -829712 -1574191 260987 2336328 2357429 1286798 1524613 2910931 2954206
40765 2954206 899497 -932538 -580825 913872 1518973 1142434 961441 1048564 535098
40756 535098 -395737 -452610 758421 2011052 2070472 1144200 404276 636158 1598205 2391553
40746 2391553 2384597 1908843 1832325 2325538 2586854 2142435 1720849 2134778 2890097 2848894
40736 2848894 1899364 949893 471142 118581 -216900 -89002 538502 971863 796454
40727 796454 397029 123139 -220238 -571018 -178182 1232284 2515878 2356298 1167976
40718 1167976 698954 1678036 2852309 2748494 1539291 481755 138063 108629 231889
40709 231889 900770 2005670 2632271 2358110 2002669 2402368 3183435 3556545 3598713 3724945
40699 3724945 3575682 2748905 2110514 2761561 3940749 3780173 2268131 1521450 2588664
40690 2588664 3907903 3849982 2996244 2667385 2789123 2668403 2527187 2714606 2583869
40681 2583869 1748103 1332607 2271564 3417811 3219099 2312285 2374683 3194517 3172248 2206601
40671 2206601 1675996 1797098 1456332 672128 725580 1562243 1566983 484582 86725 1067899
40661 1067899 1680593 666379 -652774 -667233 96719 496634 1006040 2559472 4461904
40652 4461904 5314056 5091934 4641251 3969488 2735615 1725351 2044930 3173097 3419374
40643 3419374 2240651 778170 106590 103279 154143 61083 53634 434878 1272661 2225783
40633 2225783 2919270 3526030 4335818 4728369 3693072 1691979 617905 1155683 1614726
40624 1614726 530203 -890173 -429704 1991248 4432686 5537179 5488127 4888522 4200222
40615 4200222 3995321 4434344 4756958 4396507 4082670 4617313 5226049 4668439 3470679
40606 3470679 3311098 4398298 5175543 4650732 3463116 2560270 2276819 2789036 4010034
40597 4010034 4906581 4359616 2861708 1965946 1973547 1727303 863524 501164 1178198 1814728
40587 1814728 1573134 1287332 2006989 3253368 3796998 3384966 2760018 2497633 2535998
40578 2535998 2493857 2064155 1443693 1383002 2203450 2953129 2507054 1347195 987496 1656555
40568 1656555 2062016 1668136 1521307 2243654 2874962 2609829 2191574 2462093 2786973
40559 2786973 2157161 885694 38928 -45124 323740 970657 1634111 1751411 1349924
40550 1349924 1354814 2205807 3102501 3451256 3910629 4910815 5343042 4191483 2513714
40541 2513714 2150908 3104453 3820775 3650854 3402849 3614564 3764139 3287024 2258287
40532 2258287 1035619 81777 -44529 696223 1568062 2087426 2611866 3152537 2745740
40523 2745740 1253960 517040 1883193 3701995 3582495 2336516 2892005 5527252 7238975
40514 7238975 6349414 4777943 4585165 4931837 4173581 2819234 2381909 2802865 2991469
40505 2991469 2868561 3105599 3661823 4145048 4834548 5847776 6111664 4789108 3034742
40496 3034742 2604696 3237741 3228074 2278105 1833175 2531771 3259548 3210739 3157273 3861788
40486 3861788 4671647 4767018 4753241 5768025 7553483 8586071 8017853 6592579 5519993
40477 5519993 5113305 4842992 4326535 3809499 3687927 3922753 4190210 4438151 4878860
40468 4878860 5392780 5418400 4720501 3901506 3758980 4384432 5302516 6284610 7508639
40459 7508639 8943369 10065753 10381419 9972509 9322296 8671061 7757142 6372443 5069812
40450 5069812 4840382 5832307 6943189 7285370 7500718 8633137 10171231 10710760 10461942
40441 10461942 11195878 13189694 14289044 13232290 11962570 12694999 14197920 13488111
40433 13488111 10404212 7777808 7165087 7079198 5999156 4707476 4532402 5162488 5532246
40424 5532246 5504981 5414707 4989602 3887600 2513864 1410876 616263 314683 1092488
40415 1092488 2685175 3560557 2853451 1789626 2003582 3272135 4206515 4458649 4753891
40406 4753891 5195209 5121782 4594977 4584358 5415912 6171903 6033501 5402089 5269715 5978245
40396 5978245 6912640 7199449 6632812 5945015 5896957 6129253 5652070 4697288 4971207 7278362
40386 7278362 9962813 10976986 10729241 11343936 13482065 15494632 15717937 14172901 11878818
40377 11878818 9880751 9202156 10329530 12171723 12712234 11382645 9860593 9886372 11172948
40368 11172948 12196153 12272273 11975382 11984825 12384084 12925752 13327947 13314474 12763965 11813144
40358 11813144 10610917 9130215 7484031 6260000 6094809 6754837 7015261 6011955
40350 6011955 4670003 4887904 6748860 7604615 5367359 1977188 1349009 3858357 5627575
40341 5627575 4274755 2403431 3224865 5397635 5513760 3880389 3822361 5952564 7304083
40332 7304083 6466473 5642510 6523474 7661794 7542165 7182159 7773855 8378653 7982862
40323 7982862 7524476 7840022 7767220 6414327 5250367 5663659 6406112 5956581 5597678
40314 5597678 7330597 10200833 11668810 11558433 11681338 12363132 12394909 11987534 12752135
40305 12752135 14760439 16340462 16921757 17597754 18713733 19297929 19138151 19198839 19754143
40296 19754143 20188293 20666651 21802811 22770970 22243534 21155963 21676995 23186353 22472722
40287 22472722 18773148 15421834 15049456 16061626 15754764 14366302 13800984 14369195 15141063
40278 15141063 16055856 17466111 18667646 18820078 18457126 18470122 18506837 17853049 16920774
40269 16920774 16415699 16032125 15398681 15249199 16134227 16988529 16549846 15281038 14390883
40260 14390883 13943714 13486768 13455260 14169731 14427740 13039680 10976552 10053416 10224093
40251 10224093 10209305 10074426 10848901 12000805 11776332 10125976 9021104 9541313 10675842
40242 10675842 11385893 11881070 12312040 12073948 11198459 10890267 11852160 13265164 14011937
40233 14011937 13790782 12643935 10661113 8613945 7649160 7850936 8192262 8203983 8467322
40224 8467322 9215536 9898068 10539393 12024396 14474280 16824575 18637793 20763756 23399199
40215 23399199 25109263 24876987 23689109 22865952 22123085 20611404 18680523 17149411
40207 17149411 15824529 14210390 12802237 12185035 11686195 10503631 9405119 9567439
40199 9567439 10334215 10025111 8633384 7771160 8028948 8372902 8331665 8753008 9835911
40190 9835911 10322517 9572018 8819497 9247663 10146815 10232528 9685915 9525973 9793830 9791626
40180 9791626 9588481 9892421 10712202 11429853 12016860 12886180 13580089 12963304 10972678
40171 10972678 8951494 7858699 7312383 6906312 7195343 8452903 9537896 9277737 8299359
40162 8299359 8116746 8787883 8948564 8122123 7471438 7873504 8611244 8681083 8275654 8066991
40152 8066991 7917258 7374917 6839221 7089850 7974708 8637070 8898711 9373325 10183766
40143 10183766 10590547 10163291 9471523 9209388 9289898 9267715 9180201 9447337 10125486 10653809
40133 10653809 10400608 9396249 8466727 8430286 9100640 9517973 9426479 9876892 11684996
40124 11684996 13873461 14714593 14061835 13446670 13850904 14652862 15082595 15448553 16259280
40115 16259280 17168297 17640675 17937168 18623438 19637878 20530344 21127938 21373097 21063334
40106 21063334 20360745 19954573 20051994 19845772 18742013 17452195 16947353 16946521 16554165 15937920
40096 15937920 16107474 17189339 18120639 18087852 17239345 15976777 14627945 13905822 14529476
40087 14529476 16052327 17058361 16909041 16399912 16302118 16210037 15446238 14330081 13803603
40078 13803603 14238992 15170160 15868641 15840784 15168022 14602411 14797841 15257238 14804513
40069 14804513 13446830 12836755 14179691 16476355 17759187 17476848 16629883 15986992 15387132
40060 15387132 14755133 14635908 15360197 16456604 17268064 17626452 17659549 17430252 17074472
40051 17074472 16934739 17275905 18082373 19268858 20856871 22832554 25003481 27003862
40043 27003862 28280658 28245704 26816878 24729444 22896743 21479418 19964740 18077293
40035 18077293 16113716 14415549 13093247 12319736 12252720 12487609 12230759 11327897 10572273
40026 10572273 10674753 11470884 12465544 13506174 14426194 14694696 14153398 13597083 13802775
40017 13802775 14373572 14447705 14233896 14725017 15923767 16554587 15892196 14851957 14679088
40008 14679088 15334638 15844086 15666522 15046728 14429562 14153339 14416527 15015443 15402974
39999 15402974 15433662 15626148 16218338 16566121 16213244 15952839 16778552 18195547 18833388
39990 18833388 18571309 18649849 19566396 20414576 20826015 21982990 24662877 27598170 29186570
39981 29186570 29869348 31163714 32891911 33194252 31305584 28665038 26882474 25982952
39973 25982952 25215356 24386851 23640460 22816305 21788458 20787196 19867227 18822257 18143156
39964 18143156 19087900 21951513 25106338 26803932 27300555 28119619 29787580 31582877
39956 31582877 33168562 35040673 37349322 39609587 41812991 44612900 48016977 50962420
39948 50962420 52660819 53456372 53977036 54472135 55506347 58207949 63066527 69508405
39940 69508405 77604837 89234096 106399041 129339005 157855811 193657629 238821724
39933 238821724 291066585 341998923 381045840 400612567 397734103 373254212 331684060
39926 331684060 281146864 230865917 187184668 151979453 124517003 103685390 88223807
39919 88223807 76242826 65960728 56856340 49369505 43541615 38615093 33974432 29752456
39911 29752456 26216451 23118980 20106823 17425489 15731243 15334528 15960420 17079992
39903 17079992 18128703 18610610 18468105 18254121 18461336 18770285 18553292 18131497 18781851
39894 18781851 21151287 24263920 26635886 28007131 29384257 31506196 33812102 35047616
39886 35047616 34602573 33087941 31655869 30865873 30389025 29884222 29775958 30673242 32257003
39877 32257003 33529585 34259949 35351621 37397225 39585191 40576670 39916857 38086593
39869 38086593 35757250 33571615 32008269 30685377 28373798 24628976 20944983 19222809
39861 19222809 19393092 19696741 19151613 18460866 18385908 18575564 18529917 18630829 19470527 20858688
39851 20858688 22120341 22815309 22662266 21389066 19319014 17622826 17238719 17723970 17754608
39842 17754608 16694468 15235175 14476493 14676550 15041701 14741306 14026989 13987815 14995497
39833 14995497 15974650 15924376 15685654 17003383 19855284 22067171 22086727 20981333 20892769
39824 20892769 22438875 24614720 26569676 28340616 30130421 31954676 34102947 37208205
39816 37208205 41653262 47289791 53785362 60984226 69034833 78504874 90429554 106191681
39808 106191681 127418836 155804254 192553708 237892628 291131831 350238900 409817809
39801 409817809 459676462 487759688 486663170 457720230 409002963 350495592 291133055
39794 291133055 237724087 193787565 159183239 131982575 110576298 93596724 79288345
39787 79288345 66706326 56754976 50275677 45747326 40824441 35629650 32186632 30661130
39779 30661130 28720961 25194876 21904509 20675926 20578673 19655073 17795523 16232676
39771 16232676 15371374 14808781 14653539 15156286 15565167 14914735 13680589 13252890 13882780
39762 13882780 14422546 14141262 13661713 13862324 14685298 15295089 14947478 13736832 12887096
39753 12887096 13941338 16999555 20141653 21460118 21372696 21945881 24177274 27178238
39745 27178238 30074652 33312190 37497449 42031582 45699479 47902469 48591889 47658606
39737 47658606 45279417 42426970 40074818 38047471 35508155 32528464 30285016 29558008
39729 29558008 29912686 30731649 32210645 34665283 37539918 40098114 42811480 46997100
39721 46997100 52964762 59418998 64916146 68991725 71430698 71437206 68458904 63253497
39713 63253497 57160834 50643317 43487619 36207314 30135628 25986994 23204789 20918572
39705 20918572 18762811 16599239 14337881 12417987 11662426 12113446 12610282 12058748 10666507
39696 10666507 9459561 8992971 8982676 8852304 8245980 7305534 6705906 7008335 7744857
39687 7744857 7720671 6617837 5692391 6264873 7930525 8920868 8060906 5907772 4125348
39678 4125348 4050083 5603352 7330988 7817952 7216910 6857244 7215957 7207184 6023751
39669 6023751 4673884 4649870 5768445 6570048 6468762 6192021 6195422 5991785 5320791 4817019
39659 4817019 4985487 5371399 5343540 5112201 5401505 6453759 7763507 8571407 8420363
39650 8420363 7512480 6657249 6537420 6911864 6911237 6225951 5558969 5688976 6468272 7017371
39640 7017371 6647383 5387197 3857943 2843298 2783122 3475960 4363382 5179924 6183629
39631 6183629 7670462 9378629 10475189 10198804 8655932 6973527 6361888 6886848 7487966
39622 7487966 7372850 6933637 6967413 7522940 8054662 8252808 8068762 7352221 6264047
39613 6264047 5700796 6381400 7715698 8519343 8661531 8931458 9407787 9293270 8537945
39604 8537945 8210573 8724705 9017400 8327826 7664065 8406502 10233219 11577722 11690246
39595 11690246 11216323 11011152 11298219 11862425 12308315 12174259 11336369 10211479 9260775
39586 9260775 8661057 8724996 9872115 11568093 12186879 11000967 9639712 10258670 12673624
39577 12673624 14754303 15469328 15910680 17080211 18288660 18438410 17579771 16328684 14808196
39568 14808196 13128116 12027064 11947282 12087764 11457458 10436434 10211088 10916171 11417964
39559 11417964 10912483 9783203 8800814 8362302 8698545 9974148 11792703 13239190 13826494
39550 13826494 13953979 14150282 14385217 14507854 14853145 15828118 17134819 17947689 17836752
39541 17836752 17163823 16582999 16412444 16483653 16414196 16030335 15578027 15381143 15272843 14727500
39531 14727500 13780478 13397334 14404227 16232929 17314887 16777070 15288501 14140581
39523 14140581 13941187 14372230 14760996 14560362 13631575 12516471 12266437 13507297 15572506
39514 15572506 16866668 16274128 14143036 11869860 10652690 10678940 11318923 11862185 12029549
39505 12029549 11961326 11917795 12011468 12112613 12011438 11804090 12055793 13244260 14941135
39496 14941135 15992239 15881341 15540650 16223104 17781677 18789176 18375766 17226093 16621077
39487 16621077 17256757 19278034 22586000 26455248 29535112 31092098 31876203 32989227
39479 32989227 34258771 34594409 33643793 32037673 30092931 27505552 24657459 23083603
39471 23083603 23855895 26134464 28045156 28635320 28424523 28399410 29101604 30558789 32544052
39462 32544052 34743309 36774627 38039143 37775114 35777272 33049710 31016747 29842594
39454 29842594 28295630 25667877 22943891 21359111 20625064 19581328 17964680 16354562
39446 16354562 14842682 13137448 11761452 11603623 12157755 11770779 10111577 8912527
39438 8912527 9498014 10927472 11601068 11493018 11500050 11565489 11042178 10373623 10763389 12240763
39428 12240763 13455336 13520226 12904589 12389624 12241830 12558567 13357710 14149367 14448435
39419 14448435 14819540 16263044 18442476 19884788 20233001 20757658 22079299 23104958
39411 23104958 23239864 23967573 26743457 30785551 34809121 39669571 46833648 54838273
39403 54838273 59961974 60659393 58981499 57018249 54216799 49374199 43347763 38107104
39395 38107104 34261299 31108710 28406488 26657546 26071964 26467110 27916089 30442890
39387 30442890 33298324 35486527 36815812 37549326 37270564 35183245 31610381 28206886
39379 28206886 26296983 25608035 24998419 23996620 23216868 23425626 24582708 26014432 27419288
39370 27419288 29211091 31518831 33392253 33865500 33462230 33362132 33113612 30883880 26543285
39361 26543285 22634041 21007742 20214279 18099639 15539038 15009033 16215799 16149605 13700352
39352 13700352 11359852 11385790 12796360 13688886 14457529 16711833 20392115 24038251 27103188
39343 27103188 30041024 32547554 33564274 32932694 31439269 29202938 25573006 20859744
39335 20859744 16691352 14118746 12538357 11061316 9874388 9518716 9729933 9893553
39327 9893553 10034497 10435287 10678768 10063905 8897321 8432572 9230039 10247863 10076957
39318 10076957 8753440 7778554 8335966 9968963 11260653 11438860 10813908 9817123 8380094
39309 8380094 6577734 5220205 5086622 5825032 6334876 6211428 6136308 6750902 7844797
39300 7844797 8924241 9899820 10736169 11012783 10529401 9978012 10208984 10958302 11136724
39291 11136724 10473951 10016813 10596900 11559939 11751498 11336157 11730260 13678741 16128688
39282 16128688 17358290 16840700 15653396 15215368 15883437 16793303 16989345 16603230 16663579
39273 16663579 17624276 18532235 18200581 16900460 16030618 16119539 16198671 15547276 14990215
39264 14990215 15586718 16814146 17223144 16523673 15820843 15851141 16148252 16140471 15998180 15983010
39254 15983010 15843315 15345590 14669343 13800776 12266363 10040387 8044322 7060561 6685770
39245 6685770 6055964 5127053 4479594 4257644 4133940 4066296 4263221 4560805 4625668 4640865
39235 4640865 4960402 5176112 4467274 2961330 1818761 1750379 2344537 3137957 4334024
39226 4334024 5883893 6797569 6270049 4907110 3944449 3667903 3485132 3207330 3239729
39217 3239729 3621103 3905841 4089225 4649203 5401019 5321084 4089918 2978030 3370568
39208 3370568 4926159 6077102 6073244 5604959 5430353 5369616 5080690 5099322 6324183 8623620
39198 8623620 10635777 11209139 10680587 10350039 10855565 11620931 12083234 12827311 14771917
39189 14771917 17502356 19431254 19874391 20005199 21083015 22500164 22574803 20869284 18631393
39180 18631393 17021000 15964927 14960031 14054321 13598847 13706115 14371360 15606430 17125434
39171 17125434 18389593 19236757 19982514 20714175 21079349 20966943 20682489 20168661 18850340
39162 18850340 16660952 14411224 12663492 11120015 9686967 9078005 9470297 9616515
39154 9616515 8541246 7258686 7301128 8157547 7905495 6151588 4562098 4340097 4869044
39145 4869044 5252964 5574224 5915437 5579342 4290045 3111498 3114863 3841080 4001771
39136 4001771 3170744 2015399 1322705 1446544 2255312 3052553 3036897 2361229 2179911
39127 2179911 3121229 4359372 4813884 4556143 4234022 3800465 2890658 2051512 2418940
39118 2418940 4149371 6044380 6864451 6453374 5582842 5179733 5611074 6305113 6280799
39109 6280799 5411264 4708081 4842389 5041114 4331387 3284645 3278233 4302745 4898921
39100 4898921 4351402 3574927 3459486 3625336 3448321 3193412 3289619 3356398 2858417 2065850
39090 2065850 1515845 1161234 957365 1589916 3377902 4923402 4386883 2145732 703747
39081 703747 1528020 3292165 3952219 3361631 2781956 2720961 2589674 2076875 1590347 1436782
39071 1436782 1630496 2432753 3990862 5447925 5591057 4558758 3725200 3624455 3298652
39062 3298652 2199273 1321489 1570532 2268340 2374827 2041314 1721610 939032 -464722
39053 -464722 -940935 859477 3474895 4184287 2866162 1932733 2413400 2736017 1950923
39044 1950923 1411512 1967754 2018410 288084 -1498749 -1075364 683954 1100490 -141675
39035 -141675 -790811 251139 1512935 1597400 1055525 868150 829487 472254 319318 1102515
39025 1102515 2521923 3707583 4361658 4649115 4390043 3208408 1417434 115657 169026
39016 169026 1298320 2345412 2466292 1949832 1662977 1775900 1528292 458025 -703616
39007 -703616 -896013 -145367 493321 288245 -390579 -638010 4639 1168899 2094988
38998 2094988 2450326 2593616 2771075 2405770 971305 -655028 -961096 -70309 252033
38989 252033 -594193 -935235 357616 1615193 704980 -1627142 -2818458 -2054438 -587052
38980 -587052 899582 2738484 4195902 3596038 1180788 -415286 449968 2380584 3294317
38971 3294317 3156367 3183840 3739552 4354236 4855881 5299557 5498724 5472352 5577089 5578690
38961 5578690 4675235 3161077 2738189 4075318 5316248 4447218 2174502 888969 1482415
38952 1482415 2806653 3814874 4547245 5096507 5154204 4792319 4482096 4144637 3249506
38943 3249506 2006088 1377220 1639585 1933154 1621434 1193945 1301416 1640545 1466672
38934 1466672 797638 476388 1114373 2330932 3081662 2664469 1422282 375003 78171
38925 78171 87273 -204446 -535563 -139714 979916 1814643 1613041 896926 836046 1816516
38915 1816516 2968811 3109732 1957091 361936 -546304 -345255 491901 1220455 1555508
38906 1555508 1870450 2699620 3942212 4700327 4334928 3620092 4023458 5510063 6117452
38897 6117452 4642137 2772100 3025992 5187497 6735114 6654195 6488678 7082510 6831197
38888 6831197 4697801 2771189 3465553 5569364 5784459 3599221 1859003 2334690 3374463
38879 3374463 2886480 1458368 1009149 1819781 2581322 2591486 2349458 2302299 2357839 2654936
38869 2654936 3671581 5218838 6108534 5355484 3416264 1864704 1887436 3226081 4519547
38860 4519547 4560261 3235939 1417258 162804 104579 1308958 3295266 5127029 5890109
38851 5890109 5453351 4713087 4806602 5938822 7070659 6915179 5273055 3294856 2401873
38842 2401873 3064678 4630447 6031617 6467624 5768857 4585377 4052614 4756069 6111283
38833 6111283 7244043 8241482 9757975 11548705 12547684 12680519 13404681 15730606 18687533
38824 18687533 20720775 21882996 23537717 26352161 29713204 32896848 35698739 37884226
38816 37884226 38972947 38766451 37477626 35380506 32958493 31161786 30607182 30608786 30000267
38807 30000267 28943683 28803282 30012876 31335321 31859677 32550274 34729106 37787178
38799 37787178 39686319 39443625 37879390 35877698 33207361 29648869 26232095 24219094
38791 24219094 23235590 21597823 18659572 15789957 14457393 14201052 13456679 11900967
38783 11900967 10785935 10940327 11546829 11272509 9793659 7795253 6141221 5408152 5566959
38774 5566959 5772845 5162518 4154333 4090696 5228540 6185974 6008243 5547191 5784894
38765 5784894 6001454 5056713 3570173 3128166 3892450 4747180 5455146 6743612 8238362
38756 8238362 8288845 6383783 4132459 3169267 3423281 4135832 5303769 7200492 9365699
38747 9365699 10907392 11293473 10530583 9311245 9115889 11023532 14046654 15850372 15627045
38738 15627045 14972601 15262242 15625176 14644312 12788269 11648416 11558176 11511013 11047338
38729 11047338 10795806 11180986 11721360 11758065 11182383 10453324 10385169 11648166 13916895
38720 13916895 15818638 16280087 15598060 14720935 14014465 13349431 12817177 12562596 12340296
38711 12340296 11940596 11580807 11241148 10327147 8843960 8105896 9096774 10759653 11269284
38702 11269284 10537896 9970155 10021791 9681336 8481972 7413802 7368573 7975665 8500088
38693 8500088 8776179 8734262 8044308 6824507 5846082 5515895 5427201 5291917 5410330 5772839
38683 5772839 5682146 4900485 4293410 4633073 5537083 6269087 6770353 7116020 6807790 5669446
38673 5669446 4803831 5435547 7092803 8071603 7616429 6630127 6219646 6510057 7035394
38664 7035394 7391316 7215727 6335825 5352228 5384702 6683521 8008276 8033417 7050744
38655 7050744 6553061 7216027 8082420 7999387 7129948 6391515 5887515 4913198 3520943
38646 3520943 2935965 3817563 5027498 5125779 4503884 4783452 6297198 7545038 7411850
38637 7411850 6645898 6503933 6965677 7156514 6821088 6448302 6338504 6353740 6368808 6358118
38627 6358118 6237011 6052126 6013799 5993813 5524721 4735713 4569881 5390438 6148973 5923966
38617 5923966 5574310 6521330 8309969 8985980 7986634 7114409 8097324 10410022 12268486
38608 12268486 12889577 12947224 13359312 14360163 15489682 16036908 15730782 15189424 15263911
38599 15263911 15788695 15610479 14179217 12484084 11936301 12796555 14140857 14938477 14748988
38590 14748988 13819301 12990712 13162975 14395499 15786199 16493475 16468481 15956698 14941716
38581 14941716 13579612 12548397 12242580 12049848 11168525 9828883 8945659 8757935 8572644
38572 8572644 7808410 6635380 5569514 4997999 5115369 5786608 6414312 6430609 6032918
38563 6032918 6035435 6851064 7891096 8098655 6986206 5208257 4189102 4956048 7111174
38554 7111174 9090561 9570964 8467519 6634086 5099253 4656446 5460330 6643915 6965841
38545 6965841 6247164 5525624 5438078 5388077 4939499 4932902 6118195 7579009 7878385 7133704
38535 7133704 6529550 6329726 6011021 5984165 7254601 9291868 10131360 9080129 7698827
38526 7698827 7514939 8263879 9049905 9772268 10571569 11199408 11847419 13404641 16006014
38517 16006014 18492494 20145749 21620827 23179024 23579756 22250158 21136681 22363389
38509 22363389 24922885 25837804 24172338 21758658 20061102 18548901 16619343 15100290
38501 15100290 14875072 15505896 16275045 17435804 19311694 21033902 21416162 20655620 20059723
38492 20059723 20213981 20358311 19678817 18445633 17518274 17174905 16856946 15920252 14275220
38483 14275220 12262347 10226561 8422193 7105787 6396136 6147800 6258455 6896949 7947137
38474 7947137 8454101 7446714 5379542 3848880 3565986 3542063 2793636 1859371 1758483
38465 1758483 2283635 2464165 2177352 2086161 2293750 2302595 2191634 2562781 3199002 3024010
38455 3024010 1800926 782623 1041764 1993290 2341251 1936797 1841617 2692311 3729735
38446 3729735 3720236 2552443 1549344 2011460 3613854 4691544 4227413 3011213 2436591
38437 2436591 2689953 2824404 2293943 1574150 1307568 1591525 2216154 2958620 3449336
38428 3449336 3269155 2431734 1464640 888456 827993 1095252 1403745 1605074 1935578 2763085
38418 2763085 3793647 3981856 2812710 1288429 838814 1422565 1590348 522008 -811821
38409 -811821 -877992 543905 2144357 2597370 2011070 1700005 2461928 3441996 3275819
38400 3275819 2116594 1505266 2116384 2893850 2917710 2741740 2974118 2938284 2097527 1558646
38390 1558646 2428724 3627989 3267857 1559804 396485 545750 1279451 2303608 3755733
38381 3755733 4570794 3444700 1532181 1490608 3388671 4370679 3247058 2494319 4173320
38372 4173320 6565833 7003180 5863870 5280635 5429540 4712928 2793402 1106131 683457
38363 683457 1264257 2273473 3233308 3568294 3215699 2906296 2824221 1926121 -154723
38354 -154723 -1659511 -848145 1301527 2360852 1722933 763900 355757 232735 475398
38345 475398 1560118 2940788 3406090 2921234 2515863 2440055 2127452 1872170 2644205
38336 2644205 4116528 4740707 4053706 3137435 2536027 1626383 494093 436214 1796695
38327 1796695 3081459 3176690 2877680 3234606 3845606 3850913 3316602 2590762 1507323 239028
38317 239028 -281793 162746 403280 -242793 -736096 -207586 281692 -509647 -1661101
38308 -1661101 -1401090 47495 927584 755008 613379 820992 407873 -777716 -1332753
38299 -1332753 -344698 1272256 2156637 2016526 1215283 73705 -757654 -442702 688322
38290 688322 1040388 -2876 -759842 563373 3121544 4341629 3274060 1579934 1102014
38281 1102014 1780583 2408314 2376943 1981544 1664538 1654193 2006396 2486915 2650608 2409720
38271 2409720 2263729 2621138 3162953 3242939 2672643 1737607 693224 -293564 -876511
38262 -876511 -725521 10845 833905 1493381 2128100 2835389 3433554 3651649 3296702 2339314
38252 2339314 1154645 522229 938766 1989389 2797280 2964119 2613538 1776113 511063
38243 511063 -456643 -230063 827156 1066724 -439769 -2508859 -3111979 -1646998 587385
38234 587385 1860925 1502040 252894 -414016 379306 1895120 2408701 1196765 -547824
38225 -547824 -1216452 -664316 64620 435637 919126 1834132 2530186 2066172 381717
38216 381717 -1403693 -1837282 -473254 1496307 2293639 1478246 372848 234568 651855
38207 651855 493800 -93732 206176 1814342 3442796 3795556 3226200 2970748 3203240
38198 3203240 2756827 875448 -1467161 -2532554 -1833719 -541885 172934 452226 944136
38189 944136 1444566 1315482 843491 947258 1569065 1653941 946806 431502 499515 169220
38179 169220 -990894 -1624831 -621937 804101 742815 -513736 -1015746 -144091 829644
38170 829644 1052178 1042552 1077800 492540 -701293 -1118702 -11215 1232294 879371 -586910
38160 -586910 -1046473 336203 1983148 1997245 552502 -467182 69513 1218758 1422551
38151 1422551 672980 350555 1079355 1892842 1886193 1535256 1573766 1584360 861496 -84532
38141 -84532 -235223 203709 175677 -395016 -563904 -58763 400779 510591 705077 939863
38131 939863 599501 -97697 -94311 617676 593740 -813784 -2165042 -1889133 -380685 1002253
38121 1002253 2056838 3462393 4985455 5478941 4673664 3739828 3728469 4334663 4710246
38112 4710246 4904939 5772111 7541696 9184807 9583774 8911606 8219046 7883779 7397027
38103 7397027 6775252 7009933 8507376 10149198 10817293 10922857 11352981 11847345 11799425
38094 11799425 11829528 12863483 14204794 14333004 13252341 12164600 11113700 9109240
38086 9109240 6547868 5152578 5153221 4881325 3768794 3295342 3968826 3863738 1749801
38077 1749801 -463495 -351013 1578710 3014869 3154223 2960928 3089592 3354499 3578823
38068 3578823 3503450 2613532 1328933 1297816 3028575 4398634 3331731 967573 145274
38059 145274 1438852 2782900 2635756 1528064 660768 758360 2157357 4371564 5777636
38050 5777636 5331018 4250419 4334014 5164878 5064297 4329823 4902328 6736421 7310122
38041 7310122 5522507 3501040 3274768 3902256 3530055 2442338 2118773 2544824 2480320
38032 2480320 1746638 1472381 2282683 3582337 4520975 4665817 3929252 2736835 2024744
38023 2024744 2204254 2392023 1577053 318832 202431 1522382 2573484 1771540 -216369
38014 -216369 -1213006 -203851 1470485 1891100 999040 487355 1284468 2155429 1515162
38005 1515162 -108587 -646540 630155 2090509 1992557 698156 -82443 400020 1194401
37996 1194401 1011616 -239525 -1300045 -786723 1305649 3359097 3719270 2451535 1010391
37987 1010391 282008 -188793 -867054 -1168796 -396883 1016393 2048162 2426690 2622550
37978 2622550 2795822 2618510 2103042 1809929 2025308 2308089 2151251 1712019 1543561
37969 1543561 1773440 1881567 1379497 550946 275629 999841 2075330 2419502 1744993
37960 1744993 725802 -63381 -794155 -1683531 -2216310 -1713413 -440048 560491 799020
37951 799020 893374 1552657 2532262 3022980 2727810 2031005 1302497 664289 432198 1045943
37941 1045943 2242875 2955045 2581014 1841996 1670512 1719901 992659 -275528 -645260
37932 -645260 371806 1451562 1387944 779425 860413 1552512 1852519 1551455 1286591 1222749
37922 1222749 994759 844286 1472905 2632397 3158562 2750560 2481629 3000380 3395593
37913 3395593 2639629 1176973 133488 -268736 -489219 -531058 -189951 35024 -425853
37904 -425853 -909854 -255672 1121418 1405795 80251 -1060157 -513238 656428 556114
37895 556114 -521873 -678888 421450 1064924 444095 -2163 778625 1327293 -89222
37886 -89222 -2332617 -2631843 -585106 1154824 471519 -1680396 -2964515 -2500173 -1196809
37877 -1196809 -295526 -417874 -1318074 -1879812 -1016435 851869 1947823 1352866 255941
37868 255941 238745 1131389 1585950 1171622 691088 614828 341578 -744022 -2180436 -2751108
37858 -2751108 -1740293 169797 1345032 908980 -79004 150859 1687178 2843346 2737994
37849 2737994 2623969 3850128 5790597 7002760 7357843 7561693 7449381 6479778 5356240
37840 5356240 5299626 5934771 5754714 4694499 4290390 4888323 4665737 2400224 -391322
37831 -391322 -1412200 -608710 186471 -3677 -398956 -205493 127165 -55321 -222171
37822 -222171 714609 2566334 3665549 2955482 1506773 1044184 1482029 1274968 116225
37813 116225 -427510 478655 1425294 993875 19907 86246 934327 1159669 628187 315147
37803 315147 359610 215375 253722 1151070 2002420 1288082 -334194 -579301 835398 1542090
37793 1542090 233087 -1277540 -848686 1053653 2512116 2683289 1934202 848139 285212
37784 285212 1159915 3016246 4020896 3405711 2609731 2921118 3477967 3013110 2149773
37775 2149773 2189457 2711338 2310358 1043719 278107 466961 772747 727847 752156 1048167
37765 1048167 1281814 1374253 1526376 1534234 1069270 455145 182730 -64660 -818892 -1562879
37755 -1562879 -1316113 -346898 25827 -572666 -1056007 -644643 11665 -44179 -780435 -1557126
37745 -1557126 -2058821 -2271249 -2096263 -1586690 -1196109 -1232111 -1261288 -599046 611423 1319766
37735 1319766 848174 -100232 -261740 442702 755897 -17184 -853259 -568250 247045
37726 247045 128245 -892981 -1402080 -987750 -761679 -1206466 -1334121 -684015 -378149
37717 -378149 -1120458 -1759662 -1179897 -216083 -179374 -699228 -688939 -426876 -883264 -1739700
37707 -1739700 -1872733 -1259806 -725376 -333963 250129 357726 -804518 -2209330 -1957690
37698 -1957690 -111098 1342989 1403890 1024138 1004108 903356 499060 471131 975607 1146409
37688 1146409 666161 353022 628026 920953 1122971 1916662 2953233 2552721 309340
37679 309340 -1711640 -1706896 -549884 -35839 -183449 -21695 217211 -213766 -537264 644915
37669 644915 2727529 3575422 2734884 2100177 2847068 3604086 2708224 813837 -123348
37660 -123348 387844 1052292 963579 808113 1587329 2988055 3659605 2873609 1387095
37651 1387095 528505 724579 1237878 1272116 910670 746544 911752 922048 457080 -112492
37641 -112492 -187316 255519 583181 276142 -409366 -755876 -511721 -170471 -158913 -116816
37631 -116816 557058 1637892 2172316 1709063 848571 348657 241022 212775 357957 945665
37621 945665 1691794 1899929 1336175 487253 -101367 -322044 -268897 26620 376116 318480
37611 318480 -385995 -1295740 -1674359 -1305341 -645315 -206942 -131081 -403684 -1041944 -1768324
37601 -1768324 -1858328 -847422 651674 1328509 563615 -844294 -1541141 -1034565 -55056
37592 -55056 408156 204415 17890 324611 691142 500922 173931 829470 2426494 3177631
37582 3177631 1726963 -727455 -1736680 -766659 343568 185760 -476247 -351473 384018
37573 384018 760949 686967 773248 1100767 1243774 1145235 1048091 879913 530821 399484
37563 399484 834710 1351446 1231784 628024 258752 276712 265114 145539 285962 838317
37553 838317 1606204 2331477 2581301 1858441 497300 -207793 360315 1094282 785882
37544 785882 -41889 -262915 -208477 -789408 -1264778 -153129 1883481 2567912 1652712
37535 1652712 1434494 2886682 3908147 2805536 1140333 1172239 2351154 2570934 1531001
37526 1531001 547817 16964 -584674 -824435 146479 1441242 1191092 -439834 -1222684
37517 -1222684 -205312 1087025 1427059 1671390 2644106 3241577 2356467 1231158 1853856
37508 1853856 3767800 4504357 3048853 1096156 596125 1530334 2648947 3223203 3348482
37499 3348482 3339983 3539905 4159952 4777464 4589823 3709801 3472477 4638066 5960762
37490 5960762 5686164 4068942 3047066 3485135 4248094 4348357 4409982 5088045 5468919
37481 5468919 4539133 3327449 3813377 6030737 7976364 8438454 8224507 8199724 7812637
37472 7812637 6491295 5126050 4901240 5556670 6068833 6357975 6951180 7442250 6867098
37463 6867098 5556320 5032604 5692519 6036280 4940201 3447558 3200600 3986285 4168436
37454 4168436 3091088 1687859 844664 528217 675136 1520650 2536716 2431825 1115136
37445 1115136 414573 1543043 2884987 2052913 -442275 -1634274 -221736 1880346
37437 1880346 2691901 2769181 3384457 3888888 2835586 736533 -388856 46159 561994
37428 561994 102295 -427420 317787 2174200 3729680 3921026 2907297 1731478 1349724
37419 1349724 1737320 1983330 1522632 930906 999878 1480209 1536695 1096384 798715 849649
37409 849649 951564 1195431 1876686 2477384 2073928 880733 137802 226378 205058 -374567
37399 -374567 -560081 394209 1741438 2460635 2721976 3127164 3355816 2711023 1451973
37390 1451973 511669 239836 336619 709793 1487373 2359384 2735855 2541192 2261195 2246393
37380 2246393 2388218 2353353 1862770 1052602 769948 1895053 3951413 5132544 4404177
37371 4404177 2888205 2275811 2513185 2222211 1001147 -51325 -78402 563526 1339167
37362 1339167 2387120 3814456 5004723 5242294 4494213 3173911 1691321 620788
37354 620788 677619 1916242 3325660 3767244 3096851 2009583 1123681 648059 616534
37345 616534 923928 1327276 1828347 2769845 4093678 4919409 4584768 3779284 3685142 4123354
37335 4123354 3729452 2189929 1053357 1668401 3388993 4712939 5253543 5460519 5227355
37326 5227355 4270053 3425973 3915430 5330071 5915166 5055693 3972843 3589709 3275705
37317 3275705 2378242 1503409 1302382 1262726 838261 708450 1663184 3051180 3584786
37308 3584786 3105243 2450665 2096007 1931550 1903673 1987219 2019844 2229761 3144623 4340157
37298 4340157 4473292 3472166 3196805 4520219 5353685 3622657 863014 268552 1953789
37289 1953789 2976871 1878122 417050 467584 1692938 2944339 3807753 4031287 3280707
37280 3280707 2122599 1598205 1445276 556783 -527540 202632 2915413 5013599 4551341
37271 4551341 2684623 1662359 2074044 3090894 3849608 3695117 2580426 1902966 3218991
37262 3218991 5550273 6035126 3971645 1862652 1482566 1558649 805803 469092 1671512
37253 1671512 2679897 1496954 -632092 -1026508 453960 1802605 2132512 2088929 1905668
37244 1905668 1403006 1209545 1870696 2463207 2016846 1378060 1690914 2162651 1582195
37235 1582195 913281 1806016 3478037 3876194 3269680 3720864 5262562 5587747 3732846
37226 3732846 1389400 172475 -43184 279463 1137607 1993580 2061901 1884689 2618031
37217 2618031 3653726 3200679 1434676 623974 1599917 2502084 1826231 484334 -158296
37208 -158296 -300525 -663319 -1094995 -1213864 -1054943 -421653 935432 2059219 1496892
37199 1496892 -159940 -403221 1683106 3954690 4281453 3270587 2705743 2948631 3305180
37190 3305180 3593130 3893612 3799933 3199124 2914122 3481382 4135320 3956811 3199570 2654008
37180 2654008 2552385 2814658 3436455 3973860 3680398 2799117 2571845 3302425 3728427
37171 3728427 3154000 2783590 3754714 5094097 5057113 3620379 2245737 1763679 1756929
37162 1756929 1653935 1345425 927740 608675 637940 842767 673133 134464 80983 1094186
37152 1094186 2637630 3748299 3988121 3402253 2249662 1142011 775316 1197329 1885511
37143 1885511 2535271 3007667 2731192 1341444 -199232 -512175 181812 470965 141824
37134 141824 343842 1258651 1717867 1546031 1987348 3074182 3007947 1303920 128983
37125 128983 971322 2293198 2371145 2242717 3467479 4850407 4204745 2168224 1440952
37116 1440952 2825650 4557196 5270292 5334208 5283558 4959330 4424032 4197010 4442140
37107 4442140 5001951 5943768 7025311 7266612 6321178 5518792 6081246 7077852 6821815
37098 6821815 5572022 4940344 5123341 4768677 3420864 2141440 1616314 1390882 1162410
37089 1162410 1275323 1714928 1960162 1989295 2234021 2524538 2251311 1501984 898396 491085
37079 491085 -10092 -185357 624194 2000038 2819978 2720837 2122871 1306080 628007 893933
37069 893933 2062713 2474064 1150144 -76057 1000615 3132666 2981768 120862 -2196509
37060 -2196509 -1642518 523098 2129275 2871543 3286497 3148992 2294321 1476309 1288575
37051 1288575 1494904 2043858 3218242 4282605 3836598 2195631 1459960 2371291 3149674
37042 3149674 2501127 1636556 1906383 2492771 2190000 1658913 1959410 2380942 1813091
37033 1813091 1038901 1556340 3060022 4094253 4393740 4626410 4589520 3735715 2914513
37024 2914513 3455342 4826679 5271913 4640788 4563646 5762174 7178250 8035710 8832656
37015 8832656 9768806 9987647 9169787 8377808 8454427 8860109 8970116 9323046 10541807
37006 10541807 11996544 12701496 12878399 13522711 14888212 16487062 18284609 20745445
36998 20745445 23692439 26202122 27965051 29901798 32914339 36673623 40345637 44134938
36990 44134938 49247127 56297456 64543525 73033602 81921129 92145778 104248786 118106985
36982 118106985 133521360 150281527 167613382 184165156 198615769 209808303 216381477
36975 216381477 217109245 211969975 202369686 190002833 175881319 160608446 144973017
36968 144973017 129827397 115707349 102859121 91354888 81041535 71746559 63617336
36961 63617336 56817073 50920186 45310010 40239579 36584634 34248112 31829979 28496480
36953 28496480 25228617 23332488 22491457 21387004 19707973 18302268 17548855 16832090
36945 16832090 15760300 14786273 14214023 13494658 12131870 10696058 10212907 10751968 11247960
36936 11247960 10801760 9726246 9053757 9234815 9667887 9496119 8514217 7175260 6103844
36927 6103844 5870165 6761504 8198938 8736643 7460651 5332527 4358880 5336484 7105161
36918 7105161 8071602 7706267 6487400 5281447 4962812 5695314 6341111 5593230 3943384
36909 3943384 3274377 4082134 4653152 3867496 3139734 4043032 5419563 4974890 2962345
36900 2962345 1939828 2968659 4310302 4349027 3762379 3809944 4083034 3332788 1619598
36891 1619598 302706 221418 882867 1394864 1506960 1615603 2112055 2908864 3610494
36882 3610494 4086765 4587674 5107623 5078549 4190940 3116245 2689628 2666102 2160989 1162472
36872 1162472 608667 919278 1439372 1534246 1320555 1065644 750630 522120 714038 1109701
36862 1109701 1047461 569915 531750 1193254 1717957 1557196 1279141 1394162 1437243 1017596
36852 1017596 709791 903557 776928 -367860 -1598116 -1556723 -533305 91964 -45569
36843 -45569 -258807 -464603 -1157648 -1848974 -1334536 236158 1270284 1171955 1205897 2209006
36833 2209006 3069570 2595650 1537936 1365321 1996077 2214885 1721295 1302109 1280113
36824 1280113 1161624 760719 445326 168528 -631690 -1896907 -2633287 -2089077 -556568
36815 -556568 1264397 3015855 4458320 5104133 4532524 2793064 345984 -2019238 -3205448
36806 -3205448 -2465531 -384296 1376824 1757690 1271877 926053 780554 285921 -407092
36797 -407092 -487969 144749 507301 -65823 -841967 -642255 541520 1603327 1826751
36788 1826751 1547240 1232329 760754 82237 -157045 519382 1376235 1295514 481189 237317
36778 237317 976326 1686544 1786394 2161546 3436516 4410949 3646952 1875636 1171099
36769 1171099 1979497 2631053 1967368 885105 726809 1455704 2200271 2596137 2739840
36760 2739840 2551221 1999191 1464379 1239433 1084416 710762 190800 -451288 -1359988
36751 -1359988 -2178104 -2117285 -1239374 -722359 -1117874 -1342621 -394863 900171 1163299
36742 1163299 670572 703605 1218063 990983 18154 -144326 1086222 2119622 1425294
36733 1425294 -282285 -1137074 -544344 527117 1103380 1038594 563007 -90962 -580930
36724 -580930 -591577 -216412 96986 1930 -496282 -1083601 -1235186 -497726 1000908 2429522
36714 2429522 2965677 2660476 2365348 2705463 3295158 3201192 2193649 1215063 1289295 2177284
36704 2177284 2671184 2213280 1522540 1388127 1619885 1696584 1705674 1894789 1938717 1580042
36694 1580042 1465803 2259401 3315200 3460866 2851795 2681471 3102609 2949242 1779225
36685 1779225 668933 432623 496333 292987 358235 1002479 1219217 299564 -536710 212138
36675 212138 1758764 1960112 584120 -268718 686461 2095633 2084152 817866 -174981
36666 -174981 -322004 -361915 -784413 -1140205 -958720 -396936 261459 962312 1380809 826315
36656 826315 -682781 -1766467 -1009520 1173336 2850396 2837475 1804709 889273 188565
36647 188565 -719646 -1602959 -1902332 -1736079 -1580452 -1297974 -522316 258303 174089 -569297
36637 -569297 -926703 -698585 -618809 -634351 262593 1934957 2562293 1308737 30357
36628 30357 787887 2764493 3423388 2038418 239800 -581532 -521403 105462 1266447
36619 1266447 2036926 889218 -1863123 -3498474 -2087026 877647 2468037 2079727
36611 2079727 1549336 1965373 2255857 1312872 -61248 -292097 773974 1811458 1739905
36602 1739905 672507 -677380 -1791279 -2476691 -2721638 -2595825 -2103704 -1204933 -178642
36593 -178642 322302 44703 -255616 389486 1801016 2741002 2402886 1160152 -200508
36584 -200508 -1168584 -1292792 -308780 1048583 1364295 358598 -565819 -379793 76044
36575 76044 -186365 -245282 1260732 3362579 3714678 2206488 1227603 1800664 1855253 -313386
36565 -313386 -2867114 -2702707 247546 3065834 3724041 3005975 2567686 2826191 3326520
36556 3326520 3927100 4727852 5419141 5485285 4940029 4383812 4235297 4149610 3465734 2242774
36546 2242774 1438918 1674274 2194591 1814079 713752 297676 1131120 2124634 2190459
36537 2190459 1609167 1096840 631353 165705 465198 1900251 3138466 2584953 790437
36528 790437 -135138 501045 1110760 279163 -1267568 -1808668 -763727 1024313 2434335
36519 2434335 2836496 2264073 1468616 1457465 2437718 3476715 3649792 3248852 3334832 4215752
36509 4215752 4905935 4264795 2409146 759561 642272 1907908 3083389 2986302 2000932
36500 2000932 1471291 1953752 2572771 2285233 1293902 690116 909259 1237286 1036104
36491 1036104 785047 1279308 2186567 2333420 1493836 911622 1527209 2494285 2293437
36482 2293437 811209 -611782 -906024 -121001 1231837 2641555 3412210 3051901 2051166
36473 2051166 1453307 1567866 1949191 2541657 3622707 4513062 3843705 1676962 -13399
36464 -13399 187462 1376448 1973862 1965125 2298980 2971038 3123459 2592652 2105943 2133112
36454 2133112 2502004 2987373 3531199 4084608 4773937 5850477 7057229 7692593 7782408
36445 7782408 8337460 9861630 11663206 13410478 16070690 20162072 24467883 28120068
36437 28120068 32692891 40101352 49298660 57442683 63788055 69690307 74737241 75894366
36429 75894366 71566301 64088362 56679175 49792083 42200333 34222746 27764871 23721290
36421 23721290 21130071 18855926 16726972 14812974 12706241 10077364 7394906 5561493
36413 5561493 4936375 5007907 5067446 4971138 4991154 5059503 4658665 3588743 2331642 1410753
36403 1410753 915938 889582 1422542 1965239 1521319 275135 -9238 1639965 3545313
36394 3545313 3408191 1588803 633380 1729760 3376584 3775199 2989710 2254447 2331320
36385 2331320 3050516 3642682 3291922 2068024 1177700 1408305 1703742 571354 -1397166
36376 -1397166 -2018293 -546830 1406512 2202626 1858843 1118620 417501 204760 797886
36367 797886 1462801 1083340 94922 125650 1313151 1863403 976787 230258 967143 2195006
36357 2195006 2488175 2309036 2763627 3395487 3027056 1849927 979672 657744 461187
36348 461187 631167 1566143 2426547 1831464 -167900 -2085690 -2889744 -2809222 -2358654
36339 -2358654 -1606993 -547789 493821 970343 458425 -770580 -1464209 -515447 1305940
36330 1305940 1841857 404696 -1024306 -426070 1521424 2597833 2057625 1060864 642707
36321 642707 683350 685259 393333 -255083 -901725 -734563 481003 1679212 1672235 733564
36311 733564 169273 614143 1529651 2082498 1818666 810003 -267954 -643952 -515117
36302 -515117 -913885 -1999123 -2457475 -1401102 165042 788526 504500 197453 31968
36293 31968 -152723 166313 1270813 2057686 1467080 408634 523672 1510252 1509387 -81157
36283 -81157 -1951632 -2963005 -3203117 -2928857 -2073572 -1014713 -447839 -316651 -38994
36274 -38994 279198 117810 -176639 158303 727357 447943 -452137 -582743 354258 1109477
36264 1109477 870946 86786 -856140 -2027816 -2768475 -1998946 -246253 479651 -468647
36255 -468647 -1422689 -1078504 -311397 -269682 -409165 208843 1112391 1372009 1178074 1061334
36245 1061334 637003 -393119 -971212 -48160 1493480 1906923 1068297 293112 28610
36236 28610 -543312 -1593155 -2038147 -1335518 -515638 -664098 -1346034 -1437061 -926385 -896676
36226 -896676 -1810034 -2705603 -2488331 -1471849 -971243 -1494517 -2108568 -1853255 -1026285
36217 -1026285 -458056 -163946 342778 807220 474761 -463027 -829969 -125734 799180
36208 799180 1112790 1118158 1487969 2155014 2536652 2295617 1427769 144473 -932197 -1036033
36198 -1036033 -169787 736296 966475 826924 928525 1167376 917454 -44091 -1184540
36189 -1184540 -1674565 -1113140 35544 837876 939265 832319 710702 -156522 -1967561
36180 -1967561 -3140082 -2119788 2381 621640 -634517 -1404724 -259603 1349226
36172 1349226 1718953 1299471 1060334 444761 -1137322 -2327764 -1525507 435424 1443217
36163 1443217 1201553 1029162 1125461 386887 -1089172 -1586501 -322552 1429996 2334088
36154 2334088 2444755 2028116 560529 -2029822 -4320097 -4808353 -3743508 -2608906 -2239068
36145 -2239068 -2244849 -1971389 -1254494 -285717 705867 1483023 1747808 1282671 308996 -358787
36135 -358787 8141 943959 917391 -801525 -2840420 -3143281 -1457689 523667 1401899
36126 1401899 1389621 1241693 993616 372959 -277408 -233151 703358 1954985 2698632 2499438
36116 2499438 1629948 792372 317875 -165596 -907911 -1279617 -591309 610548 1074321
36107 1074321 610205 210256 306406 210105 -292486 -163581 1200146 2652609 2795215
36098 2795215 1928632 1295908 1056563 377956 -845609 -1763765 -1965634 -1834335 -1481169
36089 -1481169 -564309 653186 1252206 981717 555379 309164 -267167 -1179572 -1362007
36080 -1362007 -278606 977768 1180663 649603 329038 48028 -887528 -1922906 -1686038
36071 -1686038 -118187 1267665 1410040 717187 -108930 -934375 -1485122 -1076141 262506
36062 262506 1395623 1499174 1014372 644592 394013 249261 682783 1522186 1395497
36053 1395497 -416478 -2397065 -2509402 -953162 284560 276704 -60809 24357 13512
36044 13512 -593834 -1332391 -1748599 -2142021 -2593008 -2269034 -629221 1366342 2203520
36035 2203520 1629974 746742 470729 589385 374845 -346594 -945876 -705035 312968
36026 312968 1236566 1341823 828234 359339 104030 -218805 -490948 -142657 867594
36017 867594 1662997 1435121 460727 -225776 -13575 655028 788923 -67076 -1255349
36008 -1255349 -1677759 -1081081 -288602 30490 248728 957440 1803659 1891838 1040430 -65067
35998 -65067 -744600 -753343 -186866 403268 233072 -672504 -1213379 -790831 -382398 -905056
35988 -905056 -1352359 -207612 1865930 2726379 1976517 1406831 2013424 2648568 2204046
35979 2204046 1194616 349353 -615958 -1838690 -2458051 -1957831 -1076125 -520186 -67422
35970 -67422 329280 43512 -776694 -858622 114985 706147 74485 -627146 -468540 -426074
35960 -426074 -1191698 -1241422 697442 2860293 2716379 927287 332781 1595712 2528150
35951 2528150 1628802 -120006 -1157743 -1019950 63706 1450846 1886497 734186 -593998
35942 -593998 -153716 1654405 2544217 1621137 212072 -648510 -1380267 -2097895 -1876200
35933 -1876200 -594272 354729 126732 -413718 -453725 -522888 -1015650 -981085 342521 2012171
35923 2012171 2688823 2508130 2443001 2604570 2367177 1603976 734373 -24023 -555260 -426491
35913 -426491 546487 1604734 1713177 796646 -262970 -725006 -603628 -282702 47246
35904 47246 438925 787333 588702 -513959 -1872964 -2209441 -1311154 -566026 -972726
35895 -972726 -1489292 -697223 615964 413668 -1255088 -1967616 -395268 1845766 2603936
35886 2603936 1803947 659191 -272259 -1021169 -1300393 -946993 -575018 -748600 -1077225
35877 -1077225 -973991 -714340 -941585 -1646129 -2303557 -2501977 -1943819 -548945 909211
35868 909211 1115167 -157714 -1504861 -1655424 -981297 -555187 -592489 -688526 -794842 -1012362
35858 -1012362 -1088041 -991632 -1281878 -2010867 -2076167 -753301 857992 1156628 232425 -555378
35848 -555378 -693813 -749995 -775676 -125798 945873 1060234 -272051 -1590743 -1338251
35839 -1338251 -8607 570857 -221433 -1050594 -643680 354873 383254 -605462 -965280
35830 -965280 89092 1091235 546366 -563014 -230093 1203775 1315843 -626938 -2453543
35821 -2453543 -2449950 -1757660 -2013857 -2526993 -1817811 -600435 -821136 -2315541 -2793970
35812 -2793970 -1261636 576889 874170 -8237 -541183 -305302 -215404 -922845 -1826072
35803 -1826072 -1808433 -667183 527621 732420 297446 375359 1084663 1289121 419141
35794 419141 -691427 -1328270 -1979637 -3025134 -3589355 -2903379 -1746824 -1183870 -824058
35785 -824058 146251 1080065 788524 -264196 -551922 62407 311814 -199847 -561604
35776 -561604 -433316 -551780 -1128667 -1422242 -1227827 -1234706 -1589716 -1649336 -1439366 -1696590
35766 -1696590 -2095603 -1269626 767085 2079461 1626380 846658 1244976 2057555 1833588
35757 1833588 915694 524992 393557 -679790 -2357628 -2755579 -1007529 1596448 3243938
35748 3243938 3255845 1989474 227398 -969953 -730728 707867 1975472 1866232 474490
35739 474490 -1075952 -1794907 -1636526 -1317356 -1366390 -1386416 -549086 1090975 2310177
35730 2310177 2166288 1254932 837550 1034457 811674 -194801 -868089 -208386 981722
35721 981722 975180 -499383 -1773960 -1453528 -222009 314665 -42548 -64368 756707 1367316
35711 1367316 885062 -14912 -257207 23095 45579 -187843 -255189 -568578 -1808130 -3246710
35701 -3246710 -3142287 -1096338 1233822 2220638 1968285 1415701 834740 70089 -510379
35692 -510379 -363846 166411 2465 -1288170 -2714016 -2793925 -1295216 234801 136381
35683 136381 -1208608 -1726664 -502443 840281 558391 -533091 -416785 882017 1512266
35674 1512266 990416 781818 1351381 1140763 -455680 -1407115 -37274 2111289 2454372
35665 2454372 1147724 502018 1360236 2290399 2252376 2065076 2825882 4307822 5434150
35656 5434150 5447065 4355170 2919818 2208107 2501409 2829608 2285018 1409346 1346605
35647 1346605 2038014 2471613 2475586 2839300 3581631 3582569 2413177 1240092 1164986 1687941
35637 1687941 1715449 1310052 1351829 1851455 1765727 645252 -477171 -436926 345162 335876
35627 335876 -952280 -2190967 -2087206 -1155675 -694760 -657731 -9030 1027587 920923
35618 920923 -549661 -1511579 -834788 -9482 -704558 -1950446 -1689303 -61536 1016925
35609 1016925 917943 719022 851223 563573 -213811 -589531 -519468 -849954 -1264677 -379514
35599 -379514 1544643 2232610 683954 -1254854 -1742734 -1354317 -1308645 -1311289 -865889 -890681
35589 -890681 -2006152 -2794223 -1990019 -1016393 -1820849 -3313484 -2832355 -528697 780144
35580 780144 92731 -520778 315508 1199087 746105 -104706 -83907 268183 122964 158437
35570 158437 981423 1359577 110200 -1490363 -1414435 -128586 186305 -840932 -1438679
35561 -1438679 -856455 -472563 -1209862 -1963104 -1570264 -670818 -439072 -742122 -762459 -483952
35551 -483952 -338328 -63283 874454 2084381 2533129 1891778 844730 190604 230401
35542 230401 847203 1636340 2124614 2254081 2351459 2336599 1594150 161366 -711306 -76417
35532 -76417 1195633 1429511 268616 -1240548 -2285686 -2811863 -2712550 -1926068 -1327032
35523 -1327032 -2026698 -3501522 -3873225 -2570384 -1296896 -1553121 -2474728 -2228737 -596476
35514 -596476 1022668 1534090 953976 -236468 -1466157 -2069946 -1838210 -1422961 -1494711
35505 -1494711 -1742053 -1367044 -268265 924505 1659485 1684884 904301 -296255 -1061048
35496 -1061048 -1144179 -1386695 -2236440 -2514801 -924100 1745197 3401996 3386040 2852018
35487 2852018 2522322 1829539 626992 -13277 473249 1041535 662021 -65197 14886
35478 14886 786070 1200054 833900 82291 -776849 -1728022 -2447753 -2451820 -1824024 -1237618
35468 -1237618 -1216258 -1652192 -1961077 -1601182 -695933 -135669 -588178 -1463687 -1611064 -1051521
35458 -1051521 -960052 -1653252 -1870455 -765668 596230 805439 191815 62987 567532
35449 567532 716623 153216 -431358 -486180 -59642 761365 1758305 2116699 1258397 51369
35439 51369 -47972 926730 1491229 920874 74841 -250647 -370513 -561378 -233422 852574
35429 852574 1619259 988204 -535746 -1548878 -1495634 -897726 -322932 27106 58340 -98148
35419 -98148 19183 523595 742736 176953 -479940 -166509 916804 1483097 985365 307438
35409 307438 349064 753814 595895 -180734 -663432 -219484 618005 699945 -397769 -1762120
35399 -1762120 -2063880 -1071868 96231 401919 110597 127635 530890 618578 370816 827775
35389 827775 2480929 4074955 3950209 2280501 939127 984415 1300127 416498 -1096223
35380 -1096223 -1272286 343389 1804729 1375673 -109331 -652610 -136267 -345647 -1971844
35371 -1971844 -3310864 -2756976 -1300452 -1267358 -3238306 -5507082 -6348081 -5639366 -4250916
35362 -4250916 -2976868 -2388460 -2783910 -3689176 -3945415 -2815142 -764700 1073918 1926418
35353 1926418 1769379 1141949 749790 874879 1044015 662208 -27680 -216641 177443
35344 177443 308886 -181212 -442482 222985 1021842 637287 -873394 -2114939 -2149006
35335 -2149006 -1402404 -789838 -676269 -795884 -607647 312324 1715785 2594259 2229267
35326 2229267 1197107 617347 550359 77692 -1016763 -1758165 -1487106 -792623 -429602
35317 -429602 -304214 -192760 -457945 -1118022 -1105131 305500 1914856 1845074 162444
35308 162444 -1102818 -666419 527608 908132 293322 -319269 -263780 169611 303262
35299 303262 -180527 -930849 -1227575 -732470 171360 1029796 1909852 2781886 2848024 1559458
35289 1559458 637 -154190 858901 1001723 -499780 -1841888 -1321463 227656 1067969
35280 1067969 1311407 2184499 3365501 3191622 1405979 -272691 -667638 -542634 -882731
35271 -882731 -1256568 -820665 87785 370016 -396113 -1683991 -2755262 -3126614 -2736118
35262 -2736118 -2118156 -2010278 -2406838 -2442463 -1552723 -252668 589074 712484 331549
35253 331549 -338918 -900080 -691343 438454 1678658 2195364 2171011 2285333 2511940
35244 2511940 2214362 1327235 673620 921940 1715689 2094282 1567039 580445 -87254
35235 -87254 -307309 -700908 -1554237 -2079688 -1452426 -286066 12615 -595206 -576299 746174
35225 746174 1913710 1402772 -190566 -1212551 -1208434 -769833 -39699 963818 1192353
35216 1192353 -323723 -2455320 -3043190 -2054483 -1660706 -2791186 -3686887 -2740087 -870346
35207 -870346 172117 280855 301882 160910 -637060 -1483732 -1305933 -277724 509893
35198 509893 721015 836528 920184 639308 252365 285670 413129 -88917 -954381 -1294126
35188 -1294126 -1169807 -1354233 -1598949 -802036 852461 1610904 594595 -956091 -1552157
35179 -1552157 -1133930 -153424 1406272 2975583 2936165 826756 -1175198 -797170 1140506
35170 1140506 1976855 1010835 -81213 -332700 -609894 -1341251 -1473184 -610234 -159392
35161 -159392 -1050156 -2048681 -1890525 -1539223 -2351085 -3198939 -1896584 978846 2319552
35152 2319552 913301 -755758 -172678 1717664 2260915 972257 -208891 72361 1109933
35143 1109933 1641667 1352391 564591 -424268 -1209714 -1302521 -773889 -308777 -260905 -213143
35133 -213143 191800 618746 719260 838713 1370430 1871405 1665484 1065172 995764 1354386
35123 1354386 830671 -1114653 -2998067 -2979043 -1306911 -15810 -238071 -955858 -810798
35114 -810798 -108078 -140632 -1173884 -2224857 -2637344 -2718089 -2633198 -1798976 6135 1735433
35104 1735433 2121518 1228625 238408 -32149 270973 662744 786971 378780 -483031
35095 -483031 -1091464 -815957 -144259 -238315 -1288621 -2151222 -1977734 -1377173 -1369597 -1892497
35085 -1892497 -2124972 -1782758 -1194326 -387114 920150 2414322 3181225 2833365 1941763
35076 1941763 1115024 377640 -176955 92803 1472638 3014694 3440970 2741672 2049319
35067 2049319 1980813 2026934 1765394 1662703 2082869 2374840 1874298 1208114 1454042 2315309
35057 2315309 2448111 1632895 1188123 1772046 2189124 1297154 -105517 -560674 -200661
35048 -200661 -212918 -668888 -622919 -178975 -604582 -2073749 -3030126 -2510091 -1602081 -1625611
35038 -1625611 -2135894 -1938596 -1088573 -521360 -381249 -132684 59987 -486336 -1470190
35029 -1470190 -1648513 -666069 279232 80134 -829832 -1261323 -904363 -499652 -624919
35020 -624919 -939309 -782409 -185518 103698 -299352 -691542 -143659 1054911 1562580
35011 1562580 779392 -328769 -656741 -421801 -456141 -687139 -316225 801232 1915614
35002 1915614 2431528 2413348 2128714 1796980 1688961 1820666 1731150 1232429 1054075 1869254
34992 1869254 2971964 2987225 1774207 514644 -69345 -410122 -905959 -1263017 -1311507
34983 -1311507 -1321476 -1150256 -238987 1097044 1577505 768447 -162014 -216074 43713 -253367
34973 -253367 -767408 -802357 -714591 -1133460 -1472729 -677588 891707 1720181 1197798 162389
34963 162389 -670282 -1587008 -2831830 -3695408 -3299384 -1814829 -403987 -77846 -761397
34954 -761397 -1398188 -1030880 152205 1102714 1322992 1425252 1922336 2154182 1206932
34945 1206932 -526401 -1625410 -1362872 -377226 302562 195269 -600808 -1573012 -1947445
34936 -1947445 -1339612 -346945 55336 -261046 -508965 -168421 337849 283046 -473367 -1328587
$$ [...]
##END NTUPLES=NMR SPECTRUM
##END=
